module gitlab.com/gitlab-org/pubsubbeat

// Match upstream release Go version: https://github.com/elastic/beats/blob/v7.9.3/go.mod
go 1.14

require (
	cloud.google.com/go/pubsub v1.8.2
	github.com/elastic/beats/v7 v7.9.3
	google.golang.org/api v0.34.0
	google.golang.org/grpc v1.33.1
)

// Match upstream release replace: https://github.com/elastic/beats/blob/v7.9.3/go.mod
replace (
	github.com/Azure/go-autorest => github.com/Azure/go-autorest v12.2.0+incompatible
	github.com/Shopify/sarama => github.com/elastic/sarama v1.19.1-0.20200629123429-0e7b69039eec
	github.com/cucumber/godog => github.com/cucumber/godog v0.8.1
	github.com/docker/docker => github.com/docker/engine v0.0.0-20191113042239-ea84732a7725
	github.com/docker/go-plugins-helpers => github.com/elastic/go-plugins-helpers v0.0.0-20200207104224-bdf17607b79f
	github.com/dop251/goja => github.com/andrewkroh/goja v0.0.0-20190128172624-dd2ac4456e20
	github.com/dop251/goja_nodejs => github.com/dop251/goja_nodejs v0.0.0-20171011081505-adff31b136e6
	github.com/fsnotify/fsevents => github.com/elastic/fsevents v0.0.0-20181029231046-e1d381a4d270
	github.com/fsnotify/fsnotify => github.com/adriansr/fsnotify v0.0.0-20180417234312-c9bbe1f46f1d
	github.com/google/gopacket => github.com/adriansr/gopacket v1.1.18-0.20200327165309-dd62abfa8a41
	github.com/insomniacslk/dhcp => github.com/elastic/dhcp v0.0.0-20200227161230-57ec251c7eb3 // indirect
	github.com/tonistiigi/fifo => github.com/containerd/fifo v0.0.0-20190816180239-bda0ff6ed73c
	golang.org/x/tools => golang.org/x/tools v0.0.0-20200602230032-c00d67ef29d0 // release 1.14
)
