{
  "extends": [
    "config:base",
    ":disableDependencyDashboard",
    ":disableRateLimiting"
  ],
  "labels": [
    "dependencies"
  ],
  "assigneesFromCodeOwners": true,
  "packageRules": [
    {
      "matchUpdateTypes": ["major"],
      "semanticCommitType": "feat",
      "commitBody": "BREAKING CHANGE: {{{commitMessageTopic}}} {{{commitMessageExtra}}}"
    },
    {
      "matchUpdateTypes": ["minor"],
      "semanticCommitType": "feat"
    },
    {
      "matchUpdateTypes": ["patch"],
      "semanticCommitType": "fix"
    },
    {
      "matchPackageNames": ["kubernetes/kubernetes"],
      "separateMinorPatch": true
    }
  ],
  "gitlabci-include": {
    "fileMatch": [
      "^ci/.+\.yml$"
    ]
  }
}
