module gitlab.com/gitlab-com/gl-infra/ecdsa-bench

go 1.17

require (
	github.com/go-ole/go-ole v1.2.6 // indirect
	github.com/lufia/plan9stats v0.0.0-20211012122336-39d0f177ccd0 // indirect
	github.com/pkg/profile v1.6.0 // indirect
	github.com/power-devops/perfstat v0.0.0-20210106213030-5aafc221ea8c // indirect
	github.com/shirou/gopsutil/v3 v3.22.3 // indirect
	github.com/tklauser/go-sysconf v0.3.10 // indirect
	github.com/tklauser/numcpus v0.4.0 // indirect
	github.com/yusufpapurcu/wmi v1.2.2 // indirect
	golang.org/x/sys v0.0.0-20220128215802-99c3d69c2c27 // indirect
)
