42724858,1,3,86889900,2754333,14134580,master,false
31828298,1,4,64456762,14896453,19564054,release,false
19864176,1,1,57970937,19564054,11102887,develop,false
16453737,1,1,27779476,21974483,17991043,master,false
75954840,1,4,70812931,18771265,12283130,master,false
91881452,1,4,87521317,15418024,16596695,develop,false
84530168,1,1,91160888,16212164,10071290,dev,false
81412878,1,1,84287072,3289887,13733469,master,false
78155990,1,4,82577887,12763253,16871841,master,false
90042906,1,1,63997349,8661817,16707755,master,false
70580055,1,1,63637827,12935779,16025776,master,false
51702597,1,1,80215096,2910717,16902895,master,false
45804812,1,1,87433637,13219669,18771361,master,false
88540691,1,1,71724441,18798139,18944460,master,false
65383018,1,1,64345338,14008643,17962834,master,false
25168745,1,4,89564438,12106673,10608631,master,false
57061653,1,1,68114300,13706259,11184491,master,false
41712858,1,1,42255795,4042224,10759513,develop,false
41068363,1,1,60930144,12947498,15486097,dev,false
68156419,1,1,54228195,1220777,17386539,develop,false
45640347,1,6,93074672,7970825,17416770,dev,false
45882749,1,1,50882786,18732992,19564054,master,false
5238059,1,1,39693472,7764,10031125,master,false
80245228,1,1,54291867,18158574,14646115,master,false
34908329,1,3,30325961,12318171,12789152,main,false
46223771,1,1,79878779,13303233,11303435,dev,false
2705812,1,1,67943860,20336598,5830697,release,false
86882823,1,1,62108326,15978554,10289570,devops,false
70835337,1,1,63155691,8661817,18771369,master,false
87187144,1,1,68718905,13355564,13920165,master,false
9289375,1,1,57696557,1027129,4319294,develop,false
42467026,1,1,75350180,16707755,20642697,master,false
67563062,1,1,65188816,1944319,11650925,master,false
9876375,1,1,69089212,10827634,5532590,staging,false
50950000,1,1,92127027,14694606,18649904,master,false
41270068,2,4,81857672,11879439,10071290,master,false
79707515,1,1,86522729,20822870,18149625,master,false
17714954,1,1,41272433,13604670,17123582,develop,false
47358581,1,7,57187905,10966263,14218490,master,false
14986398,1,1,60450322,11650925,13772695,master,false
11084492,1,1,80938846,15034257,18306171,master,false
75787936,1,10,73821421,19765645,16103297,flux-sync,false
81784518,1,1,56935505,8107148,18719643,master,false
6353520,1,3,67649950,10286882,13471402,dev,false
52561536,1,7,89488233,8355606,16056229,master,false
10068691,1,1,64098908,1220777,12768054,develop,false
25705824,1,4,78921294,17386539,3980791,master,false
89235723,1,1,92060661,4380194,19037371,develop,false
78436972,1,1,48832963,10955556,19842883,master,false
40512087,1,4,56607498,11608184,15439288,live,false
73634917,1,1,51527862,9643340,10750366,master,false
60733311,1,1,61331237,10400496,14718308,develop,false
34731634,2,4,72826801,8634244,3980791,master,false
10938466,1,5,79074277,15362143,11863742,master,false
50433405,1,7,61821716,21674231,15321066,master,false
93025475,1,1,79713759,9127875,2153238,master,false
66904990,1,1,77659390,19842883,5999399,master,false
17077423,1,1,85375439,18944460,11650925,live,false
91359334,1,1,91325031,6088891,18492744,master,false
33781075,1,1,34472988,16006010,11184491,tmo/master,false
35631091,2,10,43923596,10071290,8836287,master,false
48131323,1,1,85243672,17518291,4774793,dev,false
62825225,1,1,75668098,16100290,11455330,master,false
79856745,1,1,80247144,7764,6167078,dev,false
63395304,1,1,85481115,8661817,20717381,master,false
51407232,1,1,61463250,20095278,16025776,master,t
1027658,1,1,76295890,12588610,13057862,master,false
62904297,1,6,46203405,16256355,19037371,dev,false
33293226,1,1,45480797,13442660,10759513,refs/merge-requests/117/head,false
55837325,1,1,41471197,2153238,1458656,master,false
49210801,1,1,48051441,21577703,6244924,master,false
9591517,1,1,79812203,3980791,10071290,master,false
23571249,1,10,67481808,11650925,20364899,main,false
43943767,1,1,45048182,13238984,19590512,master,false
32684759,1,4,93174347,14138394,18771369,develop,false
52168810,1,1,87907811,13876134,16512522,docker-run,false
89698700,1,1,42965978,12126621,14646115,dev,false
51997167,1,1,30819027,14954237,19564054,qa,false
25257002,1,1,55782215,8661817,8936452,master,false
77900578,1,3,93028024,13153707,15524528,master,false
18762957,1,1,42092525,21018043,22103320,master,false
32396350,1,6,31509878,7958817,21614356,master,false
76559530,1,3,72305799,13279733,20917581,master,false
7345141,1,1,48715028,15962971,12104837,ci/jekyll-paginate-categories,false
81871126,1,1,67782101,9210746,3673948,master,false
4124495,1,4,83552203,1353639,3170661,master,false
93156743,1,1,71250105,20429433,18139258,master,false
17937783,1,1,72414528,20717381,21674231,master,false
18970341,1,1,26599761,10031125,12947498,development,false
62410458,1,2,54767532,11650925,16596695,master,false
56717833,1,1,83242234,17386539,7970825,master,false
21837312,1,4,57565880,13057862,12947498,master,false
88308414,1,4,86651488,12811244,3518374,master,false
64568831,1,1,46372380,10588855,22445540,master,false
71908084,1,7,34612826,8723718,5830697,master,false
20379530,1,1,53029844,8699554,7682093,tienbc,false
52482917,1,1,69417636,11303435,12231680,master,false
6020499,1,4,52205496,14954237,15829294,master,false
63309607,1,1,53674233,12957156,16897839,v0.1.2,false
28858716,1,2,87064159,36528,20336598,master,false
12180960,1,6,92989432,13706259,931264,master,false
6131892,1,4,71674568,5004621,14281415,scheduled-vulnerability-scan,false
58342685,1,1,51438916,16025776,11225068,master,t
58025081,1,4,77010182,14382033,12153657,master,false
53334615,1,1,90400293,10031125,20747224,master,false
14114278,1,10,58823343,18111505,10750366,master,false
71250040,1,4,49745737,11879439,11224619,develop,false
32213668,1,4,75994476,13279733,10370635,v1.3.0,false
93090937,1,5,71137798,20822870,14831442,develop,false
27559575,1,7,82054478,10370635,19659609,master,false
73103843,1,1,55661159,15590234,20859818,master,false
70481979,2,4,89132057,7682093,11878443,production,false
93222955,1,1,89524166,8634244,17053607,master,false
67390507,1,1,57508567,7448037,5999399,production,false
42373871,1,1,74598851,8875187,7364318,develop,false
91585022,1,1,69010927,10400496,8468661,refs/merge-requests/190/head,false
54314390,1,4,85029210,1525395,5948559,dev,false
46308754,1,1,72123957,4158890,5192654,master,false
58178815,1,4,88091646,7818965,19656557,master,false
49653100,1,1,61879717,14503185,18710969,master,false
90408271,1,1,75615844,20822870,1220777,server-login-check,false
5149880,1,4,58052417,17455720,10400496,master,false
58098227,1,1,71964297,5291543,10370635,master,false
91525440,1,1,55358135,16791276,13545812,master,false
6918020,1,1,80465150,5101738,15076233,master,false
18444849,1,6,86159531,1458656,15829294,develop,false
80407091,1,4,77830596,12307257,16596695,master,false
64138067,1,1,55270288,18306171,3787913,develop,false
90789751,1,1,75878800,10469257,22524710,master,false
42945719,1,3,34050764,11102887,21894837,develop,false
39893538,1,4,63178730,7011066,13877458,development,false
52908938,1,1,50143281,4409640,21333976,master,false
87688116,1,1,82923957,23195763,11303435,master,false
65707733,1,1,61768227,15163485,10759513,master,false
88258500,1,1,67407149,5771540,8347005,master,false
86954840,1,4,73029509,23116044,21894837,dev,false
88148014,1,1,75025718,10370635,16707755,main,false
24663895,1,4,53296739,11278890,3980791,refs/merge-requests/127/head,false
52087281,1,4,67718075,7523128,8661817,test,false
87344983,2,4,52888091,13374079,5586052,master,false
81957656,1,1,36973199,5948559,16614360,master,false
14430384,1,4,77573858,16716972,15418024,master,false
46059828,1,1,64397193,17386270,10400496,develop,false
86337256,1,3,72338853,1458656,13900403,master,false
77343195,1,10,48256447,11552385,19659609,master,false
83749818,1,1,62494737,16596695,18000364,master,false
82274558,1,6,72985973,20061042,5657436,master,t
74171754,1,1,33697134,15718673,8707292,master,false
22585419,1,10,84013770,13921469,20082365,refs/merge-requests/362/head,false
37117276,1,1,67204456,20348161,10031125,QA,false
75461732,1,1,86695589,14880515,1409835,Dev,false
65878331,1,1,74690515,7898047,19564054,master,false
85270076,1,2,84868768,17150528,8517305,master,false
86505577,1,7,81448158,16100290,23106022,master,false
91305552,1,1,70591996,2039510,14252951,master,false
37922761,1,1,87472526,11278890,24510916,master,false
62494491,1,1,45726441,19564054,19216152,development,false
42861529,1,3,48958823,19406176,13264227,master,false
69087230,1,1,78587922,13252247,15590230,master,false
74507666,1,1,83820932,15245460,15133885,master,false
21070669,1,1,54881410,13238984,8836287,qa,false
47268672,1,1,74414923,17349538,22445540,develop,false
67316700,1,4,77258452,15971937,11650925,develop,false
50521357,1,1,55911177,12669736,19259439,master,false
92892905,1,1,60542638,17962834,278964,master,false
53511502,1,1,66605023,17053607,5357748,master,false
88702730,1,1,78546865,8206202,11650925,develop,false
15703150,1,1,63107701,8661817,1220777,master,false
31248627,1,1,53856636,12038432,16015538,master,false
17497607,1,1,49508931,3170661,7843004,master,false
41436947,1,1,86785471,19037371,20336598,development,false
39494035,2,4,88647419,13733469,7764,stable,false
923552,1,3,77772894,10031125,7341610,migration,false
62229377,1,1,72210583,7177377,11030940,master,false
14549779,1,4,92261907,19564054,16100290,master,false
72278802,1,6,92611837,3787913,12701348,master,false
83026537,1,1,62601826,4030139,14218490,master,false
70150137,1,1,63042798,16862655,20755047,master,false
50353624,1,1,56428750,16499844,14131114,master,false
53154510,1,4,90616335,5357830,16006010,master,false
80329704,1,6,31317192,19068260,18472978,develop,false
85754424,1,1,79763127,2307385,12957156,master,false
13776962,1,1,77176297,18944460,15396050,master,false
52402454,1,1,80602919,10031125,11184491,master,false
21230372,2,1,39355187,12947498,5351620,master,false
72742655,1,1,29760013,17945668,8836287,refs/merge-requests/172/head,false
68597872,1,1,36362733,5278497,5726083,master,false
89473155,2,1,91874653,15245581,18719643,master,false
2298886,1,1,65083254,13264227,15362143,master,false
65309732,1,1,56378211,7250278,5792353,master,false
71579573,1,4,45570371,7627474,6088891,master,false
82580231,1,4,55959884,1220777,14066284,master,false
21713644,1,1,60967649,12763253,6722790,develop,false
80664755,1,1,50307662,1812894,1220777,master,false
81247583,1,1,43225911,20917581,2132031,master,false
12500314,1,1,69709741,5532590,10457369,master,false
47866409,1,5,91355011,15415910,9737596,main,t
67722237,1,3,90747211,19566098,7540316,master,false
74274960,1,1,52960052,13279733,15985314,master,false
43777978,1,1,92711378,18306171,12038432,development,false
31612280,1,1,66265440,16212164,9737596,master,false
80926748,1,1,82644441,5830697,7423682,main,false
18053695,1,4,38159707,4603023,17386270,master,false
77428408,1,10,79281712,8169057,16862655,develop,false
26339579,1,1,80999621,11650925,10071290,master,false
58982244,1,4,62354797,20062848,13153707,master,false
61049090,1,1,73574478,13279733,8107148,master,false
66320418,1,1,89785784,15364919,278964,master,false
30089602,1,4,56672542,5771540,10095567,master,false
75306620,1,3,42483386,16715194,3004858,master,false
87500998,1,1,52151260,9823231,20624164,master,false
22781855,1,4,38257329,13488261,7069119,master,false
5057009,1,12,63761323,20082365,20822870,master,false
4251415,1,1,59681326,9991942,19659609,master,false
67994564,1,1,33010778,8875187,842546,refs/merge-requests/243/head,false
76797540,1,4,24814269,13706259,10400496,master,false
34049185,1,1,65640053,6246229,11878443,develop,false
77737677,1,1,47283741,14718308,13718755,dev,false
65952587,1,4,33317767,14134580,17196273,master,false
83922263,1,4,22808611,10071290,20747224,master,false
31143546,1,4,89454721,7279493,19564054,refs/merge-requests/161/head,false
61670015,1,4,89369939,20822870,17123582,refs/merge-requests/58/head,false
76965665,1,1,81662042,11439280,15590234,master,false
84198969,1,1,26161771,8634244,15944273,master,false
18180980,1,1,48444023,13736756,13303233,dev,false
64317681,1,1,60805269,8836287,10400496,alpha,false
27246213,1,1,46294811,21030794,11878443,devel,false
66730848,1,1,73979939,12588610,8865453,master,t
35535362,1,1,74825302,13985471,10071290,test,false
60043271,1,1,68659832,16499844,20000239,master,false
24458498,1,1,78606893,7682093,20822870,master,false
61409604,1,1,52419021,17991043,12823821,master,false
44552430,1,1,88053568,2153238,9209370,develop,false
63735730,1,1,81267283,4409640,13332995,develop,false
51140906,1,1,42873290,8836287,20822870,develop,false
80505275,1,4,63225460,9643340,10071290,master,false
20852085,1,1,92774620,3170661,16056229,flux-sync,t
19323831,1,7,41983037,11648585,20741933,staging,false
9487139,1,4,83002524,14954237,19564054,develop,false
90179721,1,1,85775764,10031125,14221865,dev,false
70312892,1,1,72705255,9643340,20822870,fixes,false
81161645,1,1,80328482,17742454,10071290,master,false
28757034,1,1,67131648,2167874,11650925,develop,false
30950517,1,4,76151725,19564054,19842883,master,false
16302427,1,4,48654015,12588610,11551150,develop,false
89417150,1,4,58585601,16499844,1331339,master,false
65550990,1,2,40503077,23432893,12947498,master,false
85418677,1,3,63893523,2153238,19564054,master,false
54215750,1,1,67831329,22591651,5830697,master,false
64852051,1,4,86983595,10457369,4408724,stage,false
42576263,2,1,50432957,8836287,16475376,master,false
85197736,1,1,92220554,11650925,3602577,master,false
78371503,1,1,37207022,19564054,20822870,master,false
34815495,1,1,67242870,19564054,12038432,master,false
78623499,1,1,31667340,12935779,16015538,main,false
38978614,1,1,81301051,15423347,18306171,master,false
87271136,1,10,84583065,8699554,1027129,master,false
18552111,1,1,41513196,18306171,17039647,dev,false
73816250,1,1,91135923,15396050,17386270,master,false
80152253,1,6,77089454,21030794,10031125,master,false
14002183,1,4,54550276,11650925,18267168,master,false
21570994,1,1,90966962,16596695,13718755,master,false
649651,1,1,86023411,13172553,10576125,master,false
43684595,1,1,62401282,22052359,2661973,dev,false
3688126,1,4,79468028,13733469,19669513,master,false
27451564,1,1,89742861,18267168,2015258,master,false
36341811,1,4,75477331,1409835,5357830,develop,false
71165750,1,1,30669558,639623,6138686,master,false
40210891,1,1,92669745,11401372,4603023,master,false
75870014,1,10,76211983,9673138,15120830,master,false
27137655,1,4,50532047,6249490,16893619,master,false
71685140,1,4,78865799,13083,20822870,master,false
62341451,1,1,86072875,8107148,12126621,develop,false
88384600,1,1,66944500,2015258,4603023,release/staging,false
53948867,1,1,51065234,11102887,7818965,master,false
9966646,1,1,75060742,12763253,19564054,master,false
88197088,1,1,66004594,16256355,12524147,master,false
92310329,1,1,90056187,13774818,15653017,development,false
41154893,1,4,85623537,18472978,19564054,master,false
29045913,1,1,87397150,17962834,10400496,master,false
85838252,1,1,89965550,11863742,19564054,master,false
32115538,1,3,48988820,8865453,19841135,refs/merge-requests/12/head,false
32016261,1,1,70714919,4158890,7682093,master,false
7670355,1,10,59527812,574576,3980791,master,false
31923914,1,1,80641544,10071290,24693947,master,false
33625684,1,10,91297194,20822870,22103320,master,false
49739350,1,1,78643040,12351014,18197420,develop,false
8251302,1,10,44579163,16871841,9737596,master,false
38432265,1,4,89067291,6722790,3980791,master,false
57592153,1,4,49261267,15163485,13279733,master,false
63575153,1,1,61278264,13591258,15322554,master,false
31713860,1,1,69927177,9044998,8661817,master,false
73717560,1,1,84574930,2868698,16987997,dev,false
23325651,1,7,83731969,11878443,17539485,master,false
83589711,1,6,83142118,17952906,8661817,development,false
39092121,1,4,68875627,11184491,4299748,main,false
63912516,1,7,61610068,12947498,13279733,refs/merge-requests/338/head,false
41366396,1,4,58758933,11650925,10020009,master,false
73899414,1,1,77499673,12283130,17053607,master,false
69182337,1,1,90831355,6296066,20822870,dev,false
57770124,1,1,59763658,7907223,3289887,master,false
22111060,1,1,53978291,11509294,5532590,master,false
56440008,1,1,48524941,9051729,9112622,develop,false
59707986,1,1,78057700,15433055,14574025,master,false
48633232,1,7,68043868,8723718,10608631,master,t
490252,1,1,46552388,18649904,9658792,dev,false
51803246,1,10,44813365,16512522,12947498,master,false
90936448,1,1,84763559,14694606,12811244,master,false
30556376,1,1,89940354,4620828,7916864,master,false
85930505,1,4,47455314,20364899,22103320,staging,false
42008711,1,1,46494809,19564054,13034390,dev,false
23221948,1,1,86852486,13972504,17349538,master,false
25492314,1,1,88711711,10457369,9899988,master,false
88915129,1,1,76940772,3683097,12307257,development,false
35099603,1,4,59356362,15905702,16499844,master,false
60394861,1,1,80067054,16348438,13920165,master,false
72010799,1,1,78401182,19564054,12126621,dev,false
1499278,1,2,80890689,17742454,8437520,master,false
79610993,1,1,73920924,18607505,9899988,master,false
84000147,1,1,61712529,20822870,6054271,master,false
61119323,1,1,65019039,19659609,19841135,master,false
16210749,1,1,84455220,21597552,20822870,master,false
22227856,1,1,70995791,16596695,1093649,master,false
92121680,1,1,91523402,13279733,5830697,master,false
49045463,1,6,53725071,18515327,12856299,master,t
47043052,1,7,88849835,11863742,11182940,master,false
3793485,1,10,57028280,5874574,7764,master,false
38710734,1,4,73398908,19564054,10276778,staging,false
59865915,1,1,59093932,15004257,15944273,develop,false
88654307,1,1,66686425,4380194,15944273,master,false
44249673,1,1,74660597,19061113,17991043,master,false
72925635,1,1,44897355,5830697,7523128,master,false
49827176,1,1,73722254,10870704,3752814,develop,false
87764591,1,1,62243082,14718308,8072139,master,false
70917717,1,1,86301298,10571767,17837452,refs/merge-requests/21/head,false
39708770,1,1,30073483,12947498,19786549,master,false
66652927,1,4,90097368,12957156,19786549,master,false
11884414,1,4,72069223,5357830,5830697,master,false
40799017,1,1,53429879,13179955,12763253,develop,false
74598608,1,4,79406325,16348438,20822870,master,false
16084737,1,1,71091024,19842883,278964,staging,false
1790939,1,3,30499318,13238984,18515327,master,false
1949317,1,1,68576872,4603023,10370635,server-login-check,false
76644873,1,4,39206260,1941944,12524147,beta,false
91184948,1,1,43544598,17461900,17386270,master,false
86729777,1,4,38605268,12038432,16103297,master,false
32773551,1,4,59805615,6144336,10227864,master,false
76721771,1,1,57626942,14885088,2717470,master,false
70404771,1,1,84895193,1137039,21174519,master,false
50613562,1,4,31198533,22674094,5771540,master,false
20266859,1,1,92318326,3050484,3427084,master,false
92201176,1,1,60021752,1093649,2218444,master,false
69894992,1,1,75292886,9737596,13223921,refs/merge-requests/66/head,false
65206889,1,1,84233063,1220777,19564054,master,false
5532933,1,1,58982273,21224203,16062873,master,false
69357296,1,1,60593691,9112622,11303435,main,false
87914824,1,1,29491553,20997873,16103297,master,false
27668821,1,10,80375618,1220777,5457755,master,false
22325336,1,1,75964517,12018013,18850175,remediation-handler,false
13050742,1,1,74353652,8072139,11650925,dev,false
22488823,1,1,79159156,13605072,10020009,master,false
13159982,1,4,69795316,18649904,11160640,master,false
64761484,1,1,76556135,8865453,12712453,master,false
26229997,1,1,29385335,12967718,16499844,master,false
63654494,1,1,61533903,5227896,12679731,master,false
804391,1,1,57411576,13562193,12957156,master,false
55097825,1,4,72879679,19564054,12856299,qa,false
73457835,1,4,56232809,7682093,16893619,develop,false
60810603,1,1,85324539,10289570,17518291,master,false
20494688,1,1,90585461,11455330,16707755,master,false
71336279,1,1,73104877,7050143,18306171,master,false
4477824,1,1,70901779,11102887,5948559,master,t
56629612,1,3,67523900,7970825,18771400,development,false
5627102,1,1,88392205,15978554,15133885,release,false
35448199,1,1,71204128,13741576,14059927,cleanup,false
73997007,1,1,62759034,22488821,19564054,master,false
79066528,1,1,40896036,12588610,8661817,production,false
52993319,1,1,68834569,12701348,5830697,develop,false
27346459,1,1,35039003,5830697,13264227,master,false
67810818,1,4,32523995,15433055,20917581,development,false
65120355,1,4,91599336,20868906,7235400,master,false
18660010,2,1,45165788,18366221,1220777,master,false
54037167,1,1,74232068,9261822,4409640,dev,false
59471566,1,4,47549367,17742454,9127875,develop,false
82487094,1,1,48189721,11878443,1161620,development,false
77508821,1,1,91555968,13279733,11969243,main,false
80829155,1,1,89659295,11650925,11650925,master,false
8532459,1,4,60408346,20822870,18149625,master,false
25613130,1,4,82241417,19564054,10977779,master,false
27029008,1,1,70197510,13083,16596695,master,false
13538556,1,1,46131176,278964,9051729,master,false
39589226,1,4,79644832,11863742,5771540,test,false
32859423,1,1,38786794,16212164,7764,dev,false
24767717,1,1,81961829,8723718,12796619,master,false
88599200,1,6,84670804,14646115,11184491,master,false
85123418,1,1,91434109,11269368,12947498,develop,false
74432207,1,4,63295959,13279733,13988554,master,false
13664843,1,4,70780549,278964,1220777,master,false
43158049,1,1,82265450,15428415,13153707,master,false
45441732,1,1,64652699,10031125,13946142,master,false
49385109,1,6,44721233,18771327,14855803,development,false
73021215,1,1,75388122,16862655,8107148,master,false
80998038,1,1,34954255,8206202,6296066,master,false
85659985,1,3,74958170,10071290,9105104,sandbox,false
20599033,1,4,31863777,9127875,10071290,development,false
34131166,1,1,50606252,16966396,8752955,master,false
50866593,1,1,49599460,8661817,1022183,master,false
55390769,1,1,80405610,6296066,9743872,master,false
58725274,1,4,67596016,11102887,21275234,master,false
36239351,1,4,53536352,872755,12935779,master,false
3908560,1,1,74454879,18771265,11650925,master,false
73284293,1,4,82815874,20916765,21377356,master,false
65462347,1,4,70449629,16212164,10608631,refs/merge-requests/165/head,false
79160760,1,1,33849071,19564054,17386270,master,false
78811376,1,1,50761203,14954237,17053607,master,false
6833834,1,1,87781309,17694264,11650925,master,false
30191089,1,1,52500437,18771335,10400496,master,false
31331949,1,1,44148261,1463727,16373950,develop,false
23923633,1,1,77598223,4649627,22488821,staging,false
86811670,1,1,78692709,17895052,17694264,refs/merge-requests/263/head,false
8739922,1,1,72771748,17425820,12463037,master,false
3459389,1,7,68927032,11303435,16707755,dev,false
48051300,1,1,89326165,9944608,11650925,master,false
48218234,1,1,88615101,19656557,11650925,master,false
74958861,1,1,24377635,10400496,20336598,rawhide,false
87027636,1,1,42185201,17349538,13774818,master,false
61745545,1,1,46960432,10977779,14059927,develop,false
68999741,1,4,48105230,11693388,13223921,13.0,false
45722944,1,1,79207493,11650925,842546,master,false
66470134,1,1,59297304,4785190,18719643,feature/MAAS-628-univariate-feature-screening,false
41821832,1,6,63344358,1409835,8756552,master,false
60651093,1,1,54652305,21120990,11439280,master,false
79777301,1,4,43062483,20590772,14896636,develop,false
73203362,1,1,88214491,9127875,10031125,master,false
12822639,1,4,65684138,9493875,12231680,master,false
82839796,1,4,44483695,1220777,11650925,master,false
40985095,1,4,87956422,5278497,5830697,refs/merge-requests/82/head,false
49911860,1,1,89866128,15829294,12957156,master,false
66993603,1,1,92405242,8468661,5414799,master,false
60216833,1,2,30966551,11776053,12934098,master,false
73547295,1,3,62870139,15718673,18589178,master,false
36053647,1,7,64595887,10400496,2263987,master,t
92710378,1,1,79543100,11650925,19216152,master,false
34218850,1,1,82329750,8025252,9402232,master,false
76185902,1,1,85520968,8936452,15944273,master,false
43487216,1,1,87157328,19068260,13920165,master,false
22682668,1,1,71418326,16062873,17518291,develop,false
48525094,1,1,90200877,1975139,19337402,refs/merge-requests/100/head,false
7238975,1,6,68352505,20341684,10400496,refs/merge-requests/44/head,false
4377939,1,1,71499421,14694606,13562193,master,false
75382992,1,1,27447138,8836287,20624164,master,false
51039584,1,1,49666386,8634244,16897309,master,false
90630885,1,1,66647872,16596695,1409835,master,false
72098400,1,4,88532554,14218490,11401372,master,false
65040997,1,1,62800114,16127000,13920165,master,t
63984963,1,1,70281611,17053607,12318171,develop,false
46411740,1,1,64043508,15524528,19564054,master,false
86574462,1,1,84607165,12038432,11269368,master,false
4598819,1,7,61073095,20590772,22487979,develop,false
5420926,1,1,64422575,19786549,1499421,master,t
57942375,1,1,73756990,16725585,4199951,master,false
13888395,1,1,58471453,20822870,14697670,refs/merge-requests/1/head,false
91829203,1,1,82163886,17386270,17386539,master,t
57670828,1,1,73894444,931264,8591259,master,false
30372766,1,2,79009331,11650769,10122210,dev,false
38220177,1,1,67277686,8634244,16862655,develop,false
56521876,1,1,74065819,8715855,19842883,master,false
48813197,1,10,87832552,16893619,14831442,develop,false
13280815,1,1,57786689,13179955,14138394,master,false
16820033,1,4,92816486,278964,16959773,master,false
46500131,1,4,71773643,11650925,5066481,master,false
74775630,1,1,50251542,14134580,15396050,master,false
39191402,1,10,78823902,15133885,20822870,v0.2,false
12047963,1,1,49099174,9044998,9526455,master,false
33205831,2,4,87747584,12351014,2328726,master,t
86652447,1,1,37673215,5830697,19564054,deploy,false
50174957,1,1,86261860,14751837,11401372,master,false
19574985,1,7,42606226,5830697,1093649,master,false
51217974,1,1,28885810,11776053,18649904,master,false
85590937,1,1,74879705,20182528,10571767,develop,t
47135032,1,1,71050241,13156124,7180740,develop,false
87842998,1,7,32896978,20822870,13972504,develop,false
84844822,1,4,34380487,16212164,13733469,prod,false
27776090,1,1,92103782,16987678,13179955,test,false
8153199,1,4,83677349,13153707,18771335,refs/merge-requests/252/head,false
12662046,1,6,70076999,7328457,3050484,master,false
89126315,1,4,79956175,10360040,19935081,dev,false
78250949,1,1,90714156,8661817,16966396,master,false
26012097,1,4,87554795,14218490,8661817,dev,false
14217304,1,4,57256061,11878443,9622379,master,false
29992781,1,1,85419480,10071290,1220777,master,false
10417980,1,12,65874270,20590772,13264227,master,false
74675424,1,1,88974681,1220777,14138394,master,false
28352667,1,1,93140952,21894837,16006010,master,false
58893999,1,1,58221646,20822870,5026105,v1.0.0,false
11229010,1,1,87622302,11738450,7126042,master,false
50093822,1,1,86178572,19564054,15322554,master,false
63485843,1,1,69179627,13733469,129022,master,false
62577379,1,1,40976965,15477889,4380194,staging,false
63145864,1,1,37813227,20000239,11650925,master,false
26622832,1,1,76437171,7764,15822554,develop,false
71836816,1,4,85910721,8904768,5742441,feature/init,false
10766068,1,1,60518246,10067065,8927683,master,false
72457030,1,1,67063612,10883868,15944273,master,false
33707223,2,3,50059189,2153238,19657321,master,false
66234292,1,1,66089603,15902049,11650925,master,false
36882302,1,3,78172333,15718673,16025776,master,false
27964698,1,1,40805952,5357748,13238984,flux-sync,false
44637535,1,1,39086335,24693947,4339844,master,t
91655009,1,1,66224183,2782551,17742454,feature/initial,false
66548127,1,1,47663866,22103320,9262912,master,false
69697063,1,6,85817432,7967696,7180740,master,false
1620175,1,1,46719713,2153238,13371350,master,false
14650635,1,1,61123523,11650925,12639622,master,false
33374845,1,1,85124719,14757011,7682093,master,false
44729091,1,1,71812299,8472678,12463037,develop,false
50258967,1,1,91732487,16464245,13718755,master,false
53597916,1,4,75727468,15362143,15819560,develop,false
78973620,1,1,60230920,20390364,15642544,master,false
88866590,1,4,79596843,8715855,16062873,master,false
7448365,1,1,83301796,20437043,5955623,master,false
17395070,1,4,66821500,15418024,22487979,develop,false
82666397,1,3,34849975,3050484,5830697,develop,false
44922247,1,1,87875144,17539485,19564054,master,false
3350015,1,4,64508304,12947498,16504692,master,false
4882694,1,1,41617240,14932055,18771335,v0.0.1,false
81686432,1,1,88688048,19564054,20741933,tienbc,false
47976508,1,1,76722122,16488083,13083,master,false
84368948,1,1,61170295,8481665,19564054,master,false
29753130,1,1,66469966,18530841,10400496,master,false
8343590,1,1,83365522,8468661,15905702,development,false
15287309,1,1,71543083,13057862,4319294,develop,false
14324503,1,1,68304649,20859823,5955991,master,false
67236587,1,4,91210444,12947498,14712152,master,false
29256304,2,1,89999112,15438327,18267168,master,false
62976821,1,1,59600987,3170661,13008697,master,false
7567369,1,5,76979315,16062873,15129530,master,false
52821870,1,1,90432243,11650925,12679731,staging,false
77817154,1,1,93247093,5026105,15034257,master,false
60312547,1,10,55821867,18928194,278964,develop,false
60889664,1,1,65925676,14218490,19406176,master,false
90517684,1,4,80724610,10031125,7818965,develop,false
91415140,1,1,83091062,6144336,18607511,master,false
82931134,1,4,25290043,12669736,13264227,master,false
49584931,1,1,46657625,1794617,10314925,master,false
72530457,1,1,91960493,11608184,12947498,master,false
9165191,1,1,69367623,18530841,13920165,develop,false
43586941,2,1,74026719,1353639,5830697,develop,false
87588282,1,1,76502094,8984880,5830697,master,false
25927212,1,1,84834273,5830697,1220777,main,false
65638452,1,1,81401310,15364919,8437520,master,false
89747043,1,1,92036227,14896636,12947498,master,false
8646364,1,4,37939456,9737596,10759513,master,false
89359385,1,1,83982527,19037371,10759513,develop,false
53236696,1,4,91381561,17386539,11551150,renovate/koober-eslint-config-4.0.x,false
47680894,1,4,82679804,5999399,2039510,master,false
67090428,1,1,69063465,4435291,10400496,master,false
4798646,1,1,89250283,17335547,17386270,master,false
68763718,1,1,74562810,16512522,11184491,master,false
91945568,1,4,65560941,15245581,6023433,tmo/master,false
76870506,1,1,49436608,10759513,15944273,qa,false
75706151,1,1,52078914,11650925,15202451,master,false
69818137,1,1,84533527,11102887,16596695,master,false
32952931,1,1,81079103,11102887,8836287,main,false
46868598,1,1,55701299,19564054,5977043,master,false
67634049,1,6,81616714,5892120,12947498,master,false
54515323,1,4,64763929,15415910,11030940,master,false
38318870,1,1,91014634,12038432,5999399,master,false
28668440,1,1,91254545,7682093,16902895,develop,false
39398986,1,1,63580941,22540193,23031481,master,false
83125039,1,1,83602056,11693388,11650925,master,false
40610315,1,4,89712478,16596695,12967718,master,false
33031658,1,1,66526063,8437520,15364919,master,false
58805457,1,4,86137108,4234509,9583804,master,false
77221862,1,1,71365483,18771403,5357748,develop,false
50710115,1,1,65770532,20822870,10966263,master,false
1366946,1,1,72369452,13279733,9737596,master,false
77582987,1,3,81817794,20917581,19659609,develop,false
70676867,1,1,85693741,8300911,8661817,development,false
57320466,1,1,87032806,1944319,15978554,develop,false
63236730,1,1,79988816,10588855,11030940,develop,false
80047458,1,1,67621275,7754522,4290054,master,false
28467788,1,1,73249585,12770709,17845867,refs/merge-requests/27/head,false
68680106,1,1,40208795,17679574,18306171,dev,false
64672269,1,4,51738595,8661817,13900403,master,false
86430076,1,10,75702111,10400496,9737596,master,false
50796546,1,1,67321073,4416572,16596695,develop,false
85497300,1,4,49167680,278964,10400496,master,false
19681655,1,6,85149854,3766787,5374378,master,false
23814478,1,1,45311116,21018043,16337918,master,false
20070544,1,1,90920088,20602116,17349538,master,false
45979987,1,4,32667708,22524710,15412023,master,false
89581854,1,1,42329983,20917581,17742454,flux-sync,false
79262051,1,1,73214340,10071290,7682093,master,false
59225654,1,4,86818126,21674231,1525395,k8s,false
59788363,1,1,52469787,18061898,8223134,develop,false
62736795,1,10,61033481,4158890,1027129,dev,false
43386164,1,4,35357038,13495863,17196273,master,false
42205959,1,1,45404813,9044998,18306171,master,false
84608038,1,6,81110801,11253168,22591651,master,false
79958613,1,1,66418828,8661817,15234674,master,false
38892068,1,4,64273856,23106022,8936452,master,false
56095592,1,1,41797229,18749411,1409835,develop,false
53769165,1,1,53619841,13279733,2153238,develop,false
57495363,2,1,82453696,17913041,10759513,master,false
86174212,1,10,57845423,16006010,14609935,beta,false
47758988,1,1,39808302,278964,10463077,develop,false
34391603,1,1,68087588,13227990,14954237,master,false
81507203,1,1,59000447,8107148,15438327,master,false
77040599,1,4,86487292,12195600,15829294,refs/merge-requests/12/head,t
55489151,1,1,84077418,20868906,19545103,master,false
52657099,1,4,75112227,7509390,12947498,sandbox,false
87107404,1,3,87204668,13676120,9737596,develop,false
89303893,1,1,53188212,8355606,13179955,master,false
16675501,1,1,77865550,20624164,15902049,master,false
331684,1,7,38505989,5742441,10290475,master,false
61259244,1,1,60678877,14451585,19451360,master,false
35329793,1,1,70329841,9737596,7137253,1.0.1,false
14789028,1,1,45839605,13733469,18267168,master,false
66827327,1,3,64715761,13877458,8707292,develop,false
60555889,1,1,85570710,11102887,14646115,master,false
81609225,1,1,88010096,2171143,9526455,master,false
12939326,1,1,48352699,8661817,13179955,master,false
51891591,1,4,32359229,13605072,18414454,master,false
7037363,1,10,69271974,18197420,19564054,master,false
60134520,1,1,74393297,11878443,3980791,master,false
93289017,1,1,37534398,7229675,11225068,develop,false
1247107,1,1,26789458,10608631,8904768,master,false
66129668,1,4,70957730,12669736,12153657,master,false
29901291,1,1,49835393,13279733,16596695,master,false
92591579,1,4,83929045,8936452,12935779,master,false
74076387,1,1,90033676,17386539,23432893,develop,false
25375613,1,1,76590465,7235400,16596695,develop,false
40611478,1,1,81695275,12712453,844095,development,false
72658610,1,1,92938590,11863742,2213419,master,false
38121102,1,1,74158108,14138394,18158576,master,false
90353621,1,1,48898577,10071290,15438327,master,false
55583095,1,2,66341535,15362143,4977691,develop,false
90871838,1,4,50687388,18488563,15486097,master,false
44025878,1,1,59851887,5374378,9583804,staging,false
75050970,1,1,61939510,8036813,2039510,dev,false
89019449,1,4,91486111,14646115,19564054,master,false
41624548,1,1,92487448,15412023,11648585,tmo/master,false
19441781,1,1,51830382,15683290,11650925,master,false
64488473,1,1,65496859,17053607,20336598,master,false
46579907,1,2,53347359,8836287,6315410,master,t
57403793,1,4,81513159,7967696,5955991,master,false
76094460,1,1,69678107,15842994,5830697,master,false
16966760,1,6,51627279,18771335,21894837,develop,false
81093442,1,4,58146128,17386270,14896636,master,false
5831165,1,1,37418360,18914599,2218444,master,false
2094167,1,4,33632554,5792353,19564054,master,false
30470812,1,1,77134563,19564054,12126621,deploy,false
10194217,1,1,89027796,8634244,10683085,dev,false
47612183,1,4,52341181,7818965,19564054,main,false
70073580,1,6,91809718,7523128,9487506,master,false
69997760,1,1,82205634,10750366,22103320,refs/merge-requests/83/head,false
26718861,1,2,90460602,8699554,20183851,master,false
62064318,1,1,86565566,1463727,18607511,master,false
15407007,1,1,75440250,13495863,16596695,develop,false
25065644,1,1,36762594,16716972,23191231,master,false
6616030,1,1,87360400,17270982,9209370,develop,false
36428343,1,1,43407203,11650925,2132031,master,false
3569001,1,1,77711825,15321066,8661817,refs/merge-requests/159/head,false
89819763,1,1,70021304,1525395,18267168,master,false
92828358,2,10,77905280,11225068,16212164,master,false
89179717,1,1,69832107,11648585,9127875,master,false
77976158,1,1,58406658,16512522,17518291,master,false
4974284,1,1,90357830,19564054,5196177,master,false
52321675,1,1,65829391,8723718,8107148,dev,false
89526878,1,1,81193037,18267168,18061898,master,false
46763268,1,6,41376969,13733469,13972504,refs/merge-requests/275/head,false
15079430,1,1,63858777,19564054,8661817,master,false
89647525,1,1,80549409,20341684,3591321,deployment,false
73375594,1,1,82137307,16966396,12947498,master,false
57855775,1,4,90481343,18771335,18589178,master,t
89933924,1,1,77970135,8661817,22488821,master,false
78059221,1,1,66114962,12140485,5948559,master,false
44361824,1,1,32216021,12038432,3980791,development,false
6249249,1,1,54443609,3787913,1146299,master,false
39290026,1,10,89413977,12318171,12126621,development,false
55012047,1,1,86725079,1220777,10824486,master,false
64225615,1,1,88369765,15642544,10966263,master,false
2596742,2,1,41687868,11650925,11876076,master,false
56265085,1,6,47814798,3980791,10400496,dev,false
63071009,1,10,90766630,10648159,17196273,master,false
55919091,1,4,67093481,7177377,12938847,acceptance,false
31050571,1,4,37999225,4977691,19409955,uat,false
37717412,1,7,78498957,4603023,15396050,develop,false
70233749,1,1,73442996,10437770,16464245,master,false
91057888,1,3,60768894,4402747,7180740,env/dev,false
19209523,1,1,92538673,18366221,9107320,master,false
51601851,1,1,58289113,16987678,8865453,development,false
7136053,1,1,88309085,16655356,8836287,master,false
68837489,1,1,72010546,872755,11102887,master,false
17837230,1,10,52827154,11896962,872755,master,false
23006186,1,1,87271345,19216152,10457369,master,t
30866016,1,4,28733839,19788618,10071290,master,false
54859699,1,4,74744210,13279733,7682093,master,false
2448120,1,4,60351196,17039647,15829294,staging,false
67167274,1,1,60893684,9112622,8107148,develop,false
36810366,1,1,33515229,11776053,5357830,master,false
8434655,1,1,47749692,17845867,16043921,master,false
83481268,1,2,69470196,11650925,16707755,master,false
78887398,1,1,42733678,5999399,7764,master,false
38015907,1,1,80800230,8836287,12231680,develop,false
18342480,1,1,85447743,20957397,4748943,develop,false
76475536,1,4,73685144,1941944,10031125,master,false
25805390,1,1,61664002,18749411,14896453,remediation-handler,false
77129009,1,1,63493343,1220777,11650925,master,false
92016403,1,1,72566671,3170661,7341610,master,false
26526429,1,1,53815999,1220777,19564054,develop,false
53078488,1,1,40605750,12947498,17615603,master,false
80583195,1,4,68614552,10400496,5955623,develop,t
76022832,2,1,51014060,15829294,11863742,master,false
49502925,1,1,38711435,11971927,16725585,master,false
36537854,1,1,82017725,10966263,16373950,master,false
62657386,1,2,35685350,3170661,7764,gitlabci,false
31421225,1,1,39963948,11879439,16893619,master,false
72834135,1,1,87219402,20822870,5374378,master,false
57244075,1,1,68503751,19566098,19669513,master,false
16550760,1,4,40369535,11812286,16987678,master,false
20162916,1,5,86212002,20859823,15234616,master,false
61191799,1,1,29160287,15823452,5357830,master,false
62144855,1,1,28292712,10457369,23203778,refs/merge-requests/21/head,false
5324432,1,1,66192913,20755047,17461900,tmo/master,false
36725163,1,1,89908788,10894877,18320610,master,false
37540065,1,1,66878803,13920165,11650925,master,false
947,2,1,90317108,15245581,15322554,main,false
47505337,1,1,52665049,11878443,11650925,v0.0.1,false
33955172,1,4,71591456,16862655,13900403,master,false
46669249,1,3,52603211,5101738,18944460,master,false
29465378,1,2,70122247,10300597,11878443,master,false
19969690,1,4,80671642,12947498,1944319,develop,false
40696598,1,1,85299109,22103320,278964,master,false
10608478,1,5,61239066,19545103,13223921,flux-sync-prod-us-east-1-kube-02,false
30671467,1,10,82539107,21030794,16841903,master,false
28263734,1,1,74289732,20717381,11045147,master,false
59396612,1,1,49050924,13733469,10469257,dev,false
92475276,1,1,55596990,19659609,12318171,master,false
15507961,1,1,81154803,7448037,16707755,master,false
54662137,1,1,83885151,4522530,10290475,master,false
58270746,1,1,69630587,11863742,19564054,master,false
45538154,1,1,84478874,6296066,14751837,master,false
31511805,1,4,23755439,18771335,14718308,develop,false
88441934,1,6,46033647,10608631,11650925,master,false
53424951,1,3,73652934,16596695,9209370,master,false
84449650,2,2,84152314,15379212,11650925,master,false
34467897,1,1,82731045,15133885,15412023,master,false
28561009,1,1,89585958,24510916,5101738,master,false
65794007,1,6,64913931,4042224,3980791,develop,false
56814045,1,1,85199062,7229675,19564054,master,false
59620740,1,1,65266431,15321066,5374378,master,false
55758734,1,4,68175133,10400080,10463077,feat/git-scripts,false
78705300,1,1,56493612,11650925,19061113,master,false
32577888,1,6,65130209,4042224,11738450,master,false
90238274,1,4,49906476,11184491,11878443,master,false
7982055,1,4,92870405,18944460,11648585,master,false
53859829,1,1,84373646,3170661,5101738,master,false
40410207,1,1,81041826,15962604,20061042,production,false
76280205,1,1,87107310,19564054,12798778,master,false
67908793,1,10,90242043,1220777,11513622,master,false
92074195,1,1,59056569,18850175,9526455,master,false
30759785,1,1,36583719,278964,20073159,jenkins-monitor,false
68230537,1,2,58022469,19216152,8699554,master,false
79341820,1,4,65323395,24510916,1220777,spf,false
90098177,1,6,84696058,4286271,19564054,develop,false
78541187,1,1,42381474,11269368,4042224,master,false
37444320,1,1,66774908,1220777,4409640,staging,false
83381340,2,1,71320331,11184491,19068260,master,false
56356524,1,1,58913556,12826921,2933231,flux-sync,false
68402020,1,1,51248539,11650925,19731527,main,false
55307142,1,1,70854883,2153238,13605072,development,false
169008,2,1,58704016,18158576,12153657,tmo/master,false
64068510,1,7,34272982,10071290,19659082,master,false
89075091,1,1,79345642,18771327,13238984,master,false
37829377,1,1,59576721,15642544,17386539,master,false
36633675,1,4,67881794,10031125,15163485,develop,false
90294842,1,1,35957687,16100290,9886902,master,false
51301901,1,4,38976875,15829294,1794617,master,false
53676143,2,1,53118253,17539485,18492744,master,false
26807370,1,1,59718011,844095,2039510,master,false
29365558,1,1,47976839,19564054,13227990,master,false
83212910,1,6,77466952,7222267,5357830,staging,false
58578247,1,1,56710873,8954170,19564054,refs/merge-requests/7/head,false
49993360,1,4,63940225,5454037,9526455,master,false
56189004,1,12,44063044,17518291,21614356,master,t
91775305,1,1,73533997,11776053,8661817,master,false
52245309,1,1,58640589,19564054,18719643,staging,false
15978597,1,1,88165119,10031125,20822870,master,false
61820056,1,1,72918127,7371774,5830697,main,false
67493010,1,6,88260167,10302362,4416572,master,false
11643134,1,1,69512694,8206202,7523128,stage,false
18852430,1,1,91054521,6135215,11115756,develop,false
26444016,1,4,88801598,9658792,20822870,master,false
68915405,1,1,74098418,8984880,17386270,master,false
71500701,1,1,89175599,12283130,5771540,master,false
92534314,1,1,60285132,6167078,11303435,dev,false
71077700,1,1,88922277,16655356,20183851,master,false
46952162,1,1,64962431,16512522,16596695,monitoring/website,false
56886753,1,1,60155883,16499844,11650925,refs/merge-requests/98/head,false
40901928,1,3,81739382,15829294,17106227,master,false
82036710,1,3,75776414,8158550,11776053,master,false
38612279,1,1,36900236,16897309,15477889,main,false
33548776,1,10,76757573,1409835,15433055,develop,false
69262037,1,1,66906025,20429433,2153238,master,false
29145030,1,1,89627790,14718308,5454037,develop,false
48415993,1,1,88956556,19564054,17845867,master,false
88080664,1,1,88441710,1027129,7215134,master,false
79443017,1,3,88578507,8223134,12712453,develop,false
33462682,1,1,54018656,13625492,9127875,dev,false
90995778,1,1,81128067,13604670,6296066,master,false
84764267,1,4,80516125,2782551,14706079,master,false
58648670,1,4,80191082,21224203,3774062,master,false
75139141,2,1,76651123,13264227,8206202,master,false
35848917,1,1,70227174,22404231,12524147,dev,false
58503530,1,1,85594847,13545812,10071290,master,false
3005509,1,1,38889462,16212164,11173617,master,false
45148217,1,1,81336340,18944460,9737596,refs/merge-requests/74/head,false
66050998,1,4,78363727,4234509,21864989,master,false
49303016,1,4,88186679,19564054,24510916,release,false
61591401,1,2,67368505,1295207,23432893,master,false
48715958,1,1,84411040,5357748,20916765,development,false
75629170,1,1,62056371,17241381,9526455,master,false
54938502,1,6,54362945,15245460,8707292,master,false
24873958,1,10,32057805,9127875,10071290,master,false
79523567,1,4,59964177,20390364,5830697,master,false
90738659,1,4,33088594,17053607,14134580,master,false
54119140,1,4,56300279,11650925,9944608,prod,false
19097066,1,1,70643406,19035132,2795319,dbc/hourlyTasks,false
74863678,1,1,88763755,6296066,7764,master,false
4014672,1,1,45643436,11173617,16716972,refs/merge-requests/73/head,false
1115635,1,1,47866629,17386539,13605072,master,false
54416450,1,1,71857785,7050143,10020009,master,false
24565282,1,1,84939323,5830697,12337511,master,false
71414769,1,1,35532389,1458656,13227990,development,false
32314523,1,7,63722647,7661737,18749411,master,false
91471207,1,1,38344055,13495863,20917581,master,false
92414440,1,1,58329239,12420363,17408733,master,false
41526332,1,5,32783543,10360040,10571767,develop,false
32483230,1,1,77212440,2153238,12811244,master,false
22891223,1,1,92356779,6023433,6135215,master,false
69604499,1,4,83655337,17386539,8107148,master,false
68076830,1,1,78439779,13946227,10071290,master,false
15829345,1,4,76882216,18771369,1687012,production,false
88811678,1,4,57737248,11650925,18158576,staging,false
9679446,1,4,86348695,8634244,13156124,master,false
9048896,1,1,67990744,17150528,8715855,master,false
17293486,1,1,81223698,11552385,12038432,live,false
40105106,1,1,62655113,1898964,14281415,dev,false
61492953,1,4,87685138,13279733,10683085,master,false
43039637,1,4,56088143,11969243,5018154,staging,false
40322430,1,1,84791995,15691755,6138686,master,false
84924129,1,1,72160420,8634244,842546,master,false
74363689,1,1,58085948,4380194,12917800,master,false
38802014,1,1,45965682,23106022,7235400,master,false
8065509,1,1,61985487,7243336,13083,develop,false
45255963,1,1,70403842,14281415,17970734,master,false
61987724,1,1,50936982,8707292,12318171,develop,false
33121353,1,12,54151720,18139258,11056748,production,false
21459313,1,1,85845838,15047260,19841135,master,false
35207731,1,1,76841632,10683085,19564054,master,false
69514265,1,4,40675690,20336598,2670515,master,false
4711644,1,1,41150684,11303435,15321066,master,false
46143787,1,1,55112295,7219688,12957156,develop,false
77661639,1,7,27964748,14609935,17386539,master,false
88971578,1,1,86936254,12770709,14564919,refs/merge-requests/110/head,false
48325614,1,1,91901207,2153238,10827634,dev,t
24259475,1,1,34163754,18530841,11650925,master,false
23108479,1,1,63799672,13279733,12104837,master,false
36143735,1,4,82788252,1458656,13098556,master,false
64946523,1,1,62917585,13153707,1148549,master,false
39993381,1,1,58549634,17039647,20822870,master,false
23459757,1,1,87329318,9112622,1220777,master,false
58428377,1,4,39515377,13955129,19841135,refs/merge-requests/13/head,false
87424532,1,4,65397529,5791155,13279733,dev,false
92646783,1,5,46902732,22509890,15133885,dev,false
34993339,1,1,90553449,6571870,7764,master,false
89869223,1,1,56130455,19593912,15590234,master,false
90686267,1,4,52699679,6296066,16100290,master,false
59561371,1,1,64681339,19564054,12811244,master,false
52743419,1,2,78732503,18771369,10400496,dev,false
38522699,1,1,47068939,19564054,17277533,master,false
92257603,1,4,59259021,18771361,14183709,develop,t
8845055,1,1,75150184,5830697,13279733,master,false
82117137,2,1,56796040,20624164,19564054,master,false
66394954,1,1,83191662,8723718,24693947,master,t
88757087,1,1,69561617,17386539,7916864,master,false
37633430,1,1,56858104,20574604,21894837,master,false
84089904,1,1,73296424,10955556,18177698,master,false
84699179,1,1,80164916,5792353,16475376,master,false
83292126,1,6,58493200,20822870,19564054,master,false
44816088,1,1,25747693,17694264,10608631,refs/merge-requests/104/head,false
12333681,1,1,77627490,18267168,18771335,master,false
39789745,1,1,84339805,1220777,15971937,refs/merge-requests/85/head,false
15609712,1,2,89101474,20390364,9105104,develop,false
54765457,1,4,40300742,1629512,2171143,master,false
59054456,1,6,64536942,11650925,16897309,acceptance,false
42292254,1,4,76799772,10966263,11650925,master,false
56982454,1,4,73491611,13674083,16596695,develop,false
17193474,1,1,51328472,8158550,17039647,master,false
23723329,1,1,83426490,5830697,14451585,0.0.3,false
6486506,1,6,92442625,12126621,18267168,master,false
35950936,1,1,91765664,10759513,19564054,develop,false
70998835,1,1,1503679,14223667,20917581,master,false
43861814,1,1,62189990,3980791,4380194,develop,false
57153331,1,6,43833316,15281251,20624164,master,false
68521665,1,10,55536404,14646115,9579389,develop,false
45357033,1,10,76053164,23195763,12934098,master,false
28081035,1,12,92574771,13264227,9741871,master,false
30282382,1,1,54067231,21012093,12947498,testing,false
14881777,1,4,72469782,23432893,19564054,master,t
82383676,1,1,71889208,20390364,13238984,master,false
61331291,1,1,43718397,17884550,20642697,master,false
9775784,1,1,64841493,17837452,2213419,master,false
48877827,1,2,86437409,11045147,16062873,refs/merge-requests/167/head,false
41925446,1,1,28571916,6488493,7250278,master,false
37337400,1,1,55043947,1941944,17386270,master,false
60970409,1,4,33208249,13083,4030139,master,false
64402648,1,4,59433612,10966263,10370635,master,false
34651943,1,1,36088820,10695263,8927683,master,false
92362266,1,4,52772491,11650925,7559229,master,false
80746942,1,1,68238387,16987678,36528,dev01,false
81318374,1,1,57870647,10894877,4603023,develop,false
3228521,1,1,81906567,15477889,2039510,master,false
44129836,2,1,76034929,13972504,10400496,master,t
86259225,1,1,90647429,7222854,11650925,master,false
27863060,1,1,78211267,13083,15905702,master,false
26120710,1,4,80845280,19564054,3289887,master,false
92949616,1,1,39583492,14706079,19564054,master,false
29550112,1,4,51964164,18139258,5227896,master,false
75544997,1,4,75835507,18649904,20840192,testing,false
60473156,1,4,72505263,18158576,17518291,master,false
63820492,1,6,60735824,278964,15353669,master,false
9379689,1,4,86099012,20448516,15234674,master,false
8943497,1,1,75244400,15163485,5374378,master,false
56010050,1,1,85650029,11102887,15245460,master,false
90462266,1,1,47156150,9643340,4603023,dev,false
42092810,1,4,66377738,13921469,15245581,develop,t
13408417,1,1,75514484,8472678,15819560,master,false
7874849,1,4,76363439,17962834,12947498,master,false
49125311,1,1,63451429,9422984,17416770,master,false
70771003,1,1,62449229,5830697,18607511,master,false
17597709,1,1,84317580,21333976,11102887,master,false
72181674,1,1,51186290,9737596,9737596,master,false
91249117,1,3,61392778,14718308,8634244,refs/merge-requests/686/head,false
85340275,1,1,69880893,15396050,13733469,master,false
36971249,1,1,40051516,12140485,15418024,prod,false
2902028,1,10,59914113,15823452,8107148,master,false
85029936,1,4,90512411,2039510,23432893,master,false
15192857,1,1,68774465,13498954,18607511,feature/MAAS-628-univariate-feature-screening,false
86015759,1,1,85978852,18492744,5357748,master,false
71755269,1,1,62567359,22591651,10776124,master,false
48963737,1,4,70695009,14574025,16006010,master,false
87976196,1,1,74530360,8264968,1220777,development,false
90574330,1,1,68964544,10071290,7843004,refs/merge-requests/326/head,false
82201257,1,1,64195910,21614356,19564054,development,false
69439193,1,1,76690352,20859823,20822870,develop,false
91135860,1,1,84504674,11269368,18771361,master,false
20972502,1,1,59150626,14694606,18771327,master,false
75223860,1,4,77535877,7764,14609935,master,false
89989519,1,4,83788154,12934098,12947498,master,false
6714115,1,1,52282098,17270982,13972504,develop,false
76378504,1,1,65452370,4748943,20061042,master,false
61898548,1,1,69242587,16897839,4030139,ci,false
68310110,1,1,66738558,19566098,12018013,master,false
84284837,1,1,46781601,14138394,12195600,master,false
83832711,1,4,80021284,12588610,9267158,development,false
35745298,1,2,78014207,18944460,15718673,master,false
34303194,1,4,86605273,7682093,12524147,master,false
34568183,1,4,50373286,129022,17386270,refs/merge-requests/48/head,false
43278671,1,4,75909111,7967696,12106673,dev,false
92776042,1,1,57359416,12038432,11044923,master,false
37210875,1,1,49304957,10506642,7250278,master,false
51505699,1,1,53932997,12588610,12313707,master,false
55675091,1,1,82305971,18320610,13652672,master,false
45044004,1,1,62969975,1525395,8670325,master,false
83670655,1,1,36213411,8661817,1458656,master,false
59947947,1,1,41080390,19564054,2153238,master,false
21967700,1,1,84731826,14513829,13545812,master,false
59315576,1,1,86371138,8468661,17425820,master,false
24359857,1,10,55421564,13156124,14038375,master,false
10305800,1,4,80288590,18771418,19564054,develop,false
72359909,1,10,62711947,13718755,20822870,master,false
59132545,1,1,74502183,14390900,10324279,master,false
11407868,1,10,75212127,9741871,2039510,develop,false
33863483,1,1,89211913,14221865,17386539,master,false
28961109,1,7,82861959,20917581,8836287,master,false
3111550,1,1,27176733,16614360,16959773,master,false
24978751,1,1,57316984,13733469,7222854,Dev,false
20724934,1,4,54938932,19564054,17386270,master,false
24021672,1,10,77399945,4743917,15829294,develop,false
21375095,1,1,68272097,11455330,8587778,master,false
29638135,1,10,90279074,14880515,11160640,develop,false
88022966,1,2,54815496,20822870,12038432,master,false
24121294,1,1,89820328,17386270,21333976,master,false
7785878,1,1,91658487,18749411,12763253,build,false
91716355,1,1,88891981,13252247,16018364,k8s,false
82756027,1,4,70510046,16499844,15971937,renovate/react-16.x,false
55192287,1,4,84104346,14138394,20822870,test,false
86099151,1,1,57094455,8661817,5830697,master,false
