false,6325349,622004,6702069,20,20,2
false,6395291,5016494,7904543,40,20,1
true,678099,2025462,6752404,10,20,1
false,6325349,1568286,7600891,20,20,2
false,6231920,451982,8264120,40,20,1
false,6406905,2164068,4242087,20,20,2
false,6188505,2796674,4243227,10,20,2
false,6406905,203097,6342126,20,20,1
false,4877639,1273544,7461301,20,20,2
false,32381,1478235,8130756,30,20,2
false,6231920,822482,4245000,20,20,1
false,1652603,1636476,8263824,20,20,1
false,6407488,4419691,5947173,50,20,1
false,6203598,5515967,7614840,20,20,1
false,6196862,4424186,4244343,20,20,1
false,6407488,760038,7968037,40,20,2
false,6231920,156555,5926797,20,20,2
false,6231920,7451105,7677416,20,20,1
false,6231920,1426644,4244859,20,20,1
false,6188505,814761,6420356,10,20,1
false,6407488,1322780,6394550,20,20,2
false,6407488,4947274,4240435,20,20,2
false,5193828,2070358,4241771,20,20,1
false,3258603,622004,6536713,20,20,1
false,6325349,239676,4255961,20,20,2
false,6406905,4727431,6054023,20,20,1
false,6407488,2003289,8230621,40,20,1
false,6407488,2434773,7334578,10,20,1
false,6407488,1915648,7137066,20,20,2
false,1113026,5016486,6145801,20,20,2
false,6325349,2164068,4241430,20,20,1
false,5596095,113291,7613890,10,20,1
false,6325349,464842,5938982,20,20,1
false,6231920,815589,6420350,20,20,2
false,6407488,5994024,4245949,20,20,1
false,6406905,2463292,4241082,30,20,2
false,6406905,1848571,8386156,20,20,1
false,6406905,2513050,6063802,10,20,2
false,6407488,696597,7101123,20,20,2
false,6406905,1950913,8340762,20,20,1
false,7714876,671544,4240063,20,20,2
false,6407488,2424749,7206357,20,20,1
false,1424203,967762,4245000,40,20,2
false,6231920,5736276,7755484,10,20,2
false,6325349,571616,7411283,20,20,2
false,6406905,5575198,4256767,20,20,2
false,6407488,967995,7768974,30,20,1
false,6407488,7710733,5342934,20,20,1
false,6406905,676449,8341627,20,20,2
false,6188505,250553,4241051,30,20,1
false,6188505,2006189,5879839,50,20,1
false,6196862,1673140,6502545,10,20,2
false,6406905,89169,7586658,20,20,2
false,6231920,2223833,5298898,20,20,1
false,6407488,5650320,6877253,50,20,2
false,6196862,1520027,7672093,20,20,1
false,6231920,1520027,8026217,10,20,1
false,6407488,1942094,8315852,20,20,1
false,6196862,493152,4241082,10,20,2
true,6231920,4745338,8315486,20,20,2
false,2995830,89696,7324946,20,20,1
false,6188505,1332215,8232988,10,20,2
false,6407488,1473357,4241168,10,20,1
false,6188505,642476,4242249,20,20,1
false,6188505,5809837,4421364,20,20,2
false,6407488,3139247,4244384,50,20,1
false,6407488,950586,5689944,20,20,1
false,6407488,4354126,8377219,50,20,1
false,6407488,16425,7284246,10,20,2
false,6406905,786435,4014257,20,20,1
false,6407488,2488610,6478098,20,20,2
false,6231920,2111274,4245428,20,20,1
false,6196862,2220690,7678861,10,20,1
false,6231920,2459304,6306659,10,20,1
false,6406905,544764,4240038,20,20,1
false,6231920,2803144,7325658,30,20,2
false,6406905,1569438,5981356,40,20,1
true,6407488,4242178,4242565,20,20,1
false,6188505,1448347,4193267,30,20,1
false,6407488,4482872,6517305,20,0,1
false,6406905,1514024,5305735,20,20,2
false,6406905,735751,4244269,20,20,1
false,6231920,967762,6468526,20,20,1
false,6407488,442404,7163587,30,20,1
false,6188505,2410991,5307058,40,20,2
false,6406905,25044,6357681,20,20,2
false,6406905,1245419,4243269,10,10,2
false,5596095,188434,8230342,10,20,1
false,1243277,5235762,8422841,20,20,1
false,6325349,879480,6053769,20,20,2
false,6325349,4242178,8025413,20,20,1
false,6406905,532095,7988420,30,20,2
false,6406905,2027386,7278271,20,20,2
false,1424203,840814,4241623,20,20,1
false,6196862,2531137,6434046,30,20,1
false,6325349,2433253,4245170,20,20,1
true,876346,647305,7877914,20,20,1
false,2992317,1396741,6303796,10,10,1
false,6407488,128076,6054034,10,20,2
false,6231920,1984874,8161707,40,20,1
false,6406905,1739693,4242482,20,0,2
false,4877639,2776311,8237382,10,20,1
false,6325349,860051,8178083,20,0,1
false,6231920,1795307,6054534,30,20,1
false,3497488,271715,8305140,20,20,1
false,6406905,114922,7994662,20,20,2
false,6407488,1520027,4242580,20,20,1
false,339496,231119,6054180,20,20,2
false,1257257,1514024,4242249,10,20,1
false,554356,1605889,4245543,20,20,1
false,6406905,6894762,5736276,20,20,1
false,1999740,4102389,8191980,10,20,1
false,6231920,1588486,8521401,20,20,1
false,6407488,1761894,5777916,40,20,2
false,6325349,5490772,4242010,10,20,1
false,6325349,100830,7672093,20,20,2
false,6231920,891652,5099019,40,20,1
false,6231920,2990254,8025413,10,20,1
false,1243277,6796005,7605956,20,20,2
false,4877639,2302309,6211092,20,20,1
false,6407488,703600,8116914,20,20,1
false,6407488,3346780,6454762,20,20,1
false,6325349,405077,6516076,20,20,1
false,6407488,1448347,8032501,10,20,1
false,6406905,3479582,8130756,20,20,2
false,6188505,7824685,4242686,10,20,2
false,6196862,1110114,7850718,40,20,1
false,6407488,43289,6828835,40,20,1
false,491780,5490772,6935224,30,20,1
false,6325349,1709112,6357681,20,20,2
false,6231920,2111274,4241866,20,20,2
false,6407488,1915648,4241521,30,20,2
false,6231920,1469424,7157056,20,20,1
false,186861,525215,8422841,20,20,1
false,7613115,1423835,4240188,20,20,1
false,6406905,1256842,7977083,20,20,2
false,4513747,4500868,4241842,20,20,2
false,6325349,931158,7298214,20,20,2
false,6325349,1416422,6120579,20,20,1
false,6325349,4559471,4242659,20,20,2
false,6407488,8137922,4350398,10,20,1
false,6196862,1520027,8026217,20,20,1
false,6406905,1543242,6356560,20,20,2
false,6231920,2498276,7988420,50,20,2
false,6406905,951801,4242512,20,20,1
false,6231920,6535018,4884187,20,20,1
false,2300404,4857134,7509405,30,20,1
false,1243277,1405698,3347448,20,20,2
false,6231920,671289,7366168,10,20,2
false,6406905,1998385,5324600,10,20,2
false,1802606,596541,4242040,10,20,2
false,6188505,1135148,4240063,20,20,1
false,6325349,7551311,4215214,50,20,2
false,6325349,3918923,7617505,20,20,1
false,6407488,526145,4240924,40,20,1
true,6407488,1133102,8181546,10,10,2
false,6188505,888729,8264072,20,20,2
false,6325349,5015694,7699613,10,20,1
false,8327916,427486,6902213,40,20,2
false,6406905,696597,7827513,20,20,2
false,6407488,4446774,4240231,10,20,2
false,6231920,81123,6189774,40,20,1
false,6406905,531852,4245293,20,20,2
false,6325349,370672,6054534,20,20,1
false,6196862,760038,7376529,10,20,2
false,1693145,5073390,8214432,20,20,1
false,6188505,3986408,5305686,40,20,1
false,6325349,2900812,4385188,10,20,2
false,6196862,8087159,5318201,20,20,1
false,6196862,565462,7829696,20,20,2
false,1257257,114922,4240772,10,20,1
false,6407488,882070,7614840,20,20,1
false,6203598,5522683,7932101,20,20,1
false,6231920,1615409,7742873,20,20,1
false,6203598,1984874,7395820,20,20,2
false,6407488,1520027,6740205,20,20,1
false,6231920,229043,6399101,30,20,1
false,6406905,3000187,6658867,10,20,1
false,6231920,7710733,7705459,30,20,1
false,6231920,1761498,7031865,20,20,1
true,6231920,3427769,4240435,40,20,1
false,6407488,681447,4241232,20,20,2
false,6407488,888729,6120127,20,20,1
false,7942630,4876134,5116366,20,20,2
false,6188505,1473357,7563359,20,20,2
false,6231920,2104363,4242187,20,20,1
false,6231920,703600,6303596,20,20,2
false,6406905,1367711,8177042,20,20,1
false,6325349,15139,7787935,20,20,1
false,6407488,2006189,7877914,20,20,2
false,6406905,1605384,5333880,10,20,2
false,6407488,5069201,4242090,20,20,1
false,6231920,1745412,4242629,10,20,2
false,6325349,2984197,4242485,20,20,2
false,6196862,774329,4241847,50,20,1
false,2055178,1910508,6554756,30,20,2
false,6406905,5016494,6036114,10,20,1
false,6188505,3524438,4240101,20,20,1
false,6406905,1543242,7395820,40,10,2
false,2968252,1950913,8454980,10,20,1
false,6231920,1709112,4245252,10,20,2
false,6406905,1784550,6221995,40,20,1
false,6406905,5016494,7605956,20,20,1
false,6407488,1866426,4241389,40,20,1
true,6407488,4552210,8326168,20,20,1
false,6406905,703574,7013011,20,20,1
false,6406905,4023034,8285720,20,20,2
false,1426644,137151,8186456,30,20,2
false,6406905,128076,7613890,20,20,2
false,6231920,756322,6053984,10,20,1
false,6407488,1405698,7901596,20,20,2
false,6407488,2685553,7206357,40,20,1
false,6407488,3768636,6263204,20,20,1
false,6196862,75881,4255961,20,20,2
false,6231920,5385060,5860980,20,20,1
false,6231920,822482,7705645,20,20,1
false,6407488,87767,8170667,20,20,1
false,262134,3911575,5860980,20,20,2
false,6188505,2339,8230621,20,20,1
false,6407488,3253728,7606694,20,20,1
false,6406905,81123,76017,20,20,1
false,6231920,84921,4244658,20,20,1
false,6407488,1998267,7672093,10,20,2
false,6406905,876346,7176927,20,20,1
false,6407488,726310,5633723,20,20,1
false,6406905,5019409,4242913,50,20,1
false,4098128,110892,4240861,50,20,2
false,6407488,3236117,7676370,20,20,1
false,6407488,5809837,7829696,20,20,1
false,6231920,1796406,4246011,10,20,1
false,6231920,680495,5548524,20,20,1
false,5185088,178901,6993738,50,20,1
false,4513747,5771073,6499593,40,20,1
false,5596095,304530,7896870,20,20,1
false,6325349,370672,6536713,10,20,2
false,6188505,2025462,4244459,20,20,2
false,6188505,1716167,7852784,20,20,1
false,6231920,473030,7927609,20,20,1
false,6406905,525083,7181268,20,20,1
false,6325349,1213626,3610845,20,20,1
false,6407488,1269711,5651214,50,20,1
false,6188505,3236117,6211092,20,20,1
false,6188505,7613115,5078413,40,20,2
false,6407488,1514024,6844423,20,20,1
false,6231920,671289,4242565,20,20,1
false,6188505,5016494,6439362,20,20,2
false,6196862,1795307,4243593,20,20,1
false,6406905,307014,6832334,20,20,1
false,6406905,591088,8233191,20,20,1
false,6231920,428558,7761940,20,20,1
false,6231920,1894997,8358114,20,20,1
false,6325349,4947274,5860980,20,20,2
false,6406905,1568286,6421055,20,20,1
false,6325349,3326989,4242406,10,20,2
false,6196862,1756549,7114121,20,20,1
false,6407488,5522683,4294198,20,20,2
false,6231920,470015,4845879,10,20,2
false,6406905,177258,4243345,20,20,1
false,6406905,1954316,8117633,10,20,1
false,6407488,1269711,8305140,20,20,1
false,6188505,7272118,7787376,20,20,1
false,6196862,759943,5307058,40,20,1
false,6406905,678484,5330223,20,20,1
false,6325349,5016494,4244469,20,20,1
false,6325349,25044,5228387,20,20,1
false,6406905,1673140,4241108,50,20,1
false,6188505,8087159,2984282,40,20,1
false,6407488,3763284,8438082,20,20,1
false,6407488,2482397,8231851,20,20,1
false,6407488,2250100,6063614,20,20,1
false,6325349,782625,6505029,20,20,1
false,6325349,7151036,4241261,20,20,1
false,6325349,2019644,6303596,20,20,1
false,6231920,4489551,4241060,20,20,1
false,6231920,967762,7204735,50,20,1
false,6406905,5223392,5634816,20,20,1
false,6407488,3524438,4737573,20,20,2
false,6231920,1534852,8341627,30,20,1
false,6406905,3658778,4241819,10,20,2
false,6231920,8164021,7787376,10,20,1
false,6188505,4176933,8163162,10,20,1
false,6407488,838256,6888959,20,20,1
false,6407488,4242178,4241866,20,20,1
false,6325349,92822,7089291,50,20,1
false,6231920,3815289,4555280,20,20,1
false,6188505,2324599,5651214,50,20,2
false,6231920,3439058,4244420,10,20,1
false,5596095,4014308,4242101,20,20,2
false,6231920,156555,7278271,40,20,2
false,6406905,1478235,5395805,40,20,2
false,6406905,473030,4241338,10,20,1
false,6188505,478298,7671589,20,20,2
true,6406905,471336,7195840,10,20,1
false,6231920,1950913,6828835,20,20,2
false,6407488,4546705,8377034,20,20,1
false,6231920,2401424,7445134,20,20,1
false,6188505,2304377,7994662,30,20,1
false,6406905,5852608,8430317,10,0,1
false,6231920,3438666,6053919,10,20,1
false,6231920,2780213,4243466,20,20,2
false,6406905,2351286,4240975,40,20,2
false,6406905,2514274,7671295,20,20,2
false,6188505,2090832,7852784,20,20,1
false,6407488,428558,5305686,20,20,1
false,6406905,2711020,4242474,20,20,1
false,6231920,1485692,4243503,10,20,2
false,6406905,5016494,8087999,30,20,2
false,6406905,7163358,8419376,20,20,1
false,6231920,6422478,7707736,10,20,2
false,6407488,1520027,4241151,20,20,1
false,6406905,1769032,7827513,20,20,2
false,6407488,2070358,6203071,20,20,1
false,6325349,550081,4241151,10,20,2
false,6406905,5803365,8048338,20,20,2
false,5403006,1709112,6420350,30,20,1
false,6196862,821138,5600471,10,20,2
false,6231920,1795307,8305140,50,20,1
false,6231920,7077996,4242519,20,20,2
false,6231920,817610,8454980,20,20,1
false,6325349,581951,7297844,30,20,1
false,6407488,6198285,6977556,20,0,1
false,6407488,40638,4244280,20,20,1
false,1257257,2481802,6499593,20,20,1
false,6231920,98103,6752404,40,20,1
false,6231920,1910508,6844423,20,10,1
false,1734193,566243,8188664,50,20,1
false,6406905,3206813,8419376,20,20,1
false,509805,1086019,5275848,20,0,2
false,6406905,1514157,4241876,20,20,2
false,6231920,785134,4245423,20,20,1
false,6407488,1984874,7627978,20,20,2
false,6325349,1796406,6494182,20,20,2
false,6196862,558751,6920470,50,20,2
false,6188505,2780213,7953956,20,20,1
false,6407488,1887528,5740243,30,20,1
false,6196862,665813,7783508,30,10,1
false,6196862,1543242,6995703,20,20,1
false,6406905,8164026,7440145,40,20,1
false,6406905,4495661,6388650,20,20,2
false,6203598,880174,8216577,20,20,2
false,6407488,964583,7536279,10,20,1
false,7942630,3893576,4240063,20,20,2
false,6407488,1980146,4241760,20,20,1
false,6406905,2909318,6195629,10,20,1
false,6188505,114922,7879061,50,0,1
false,5857107,69096,7101123,10,20,2
false,6407488,2552490,6086577,20,20,1
false,6231920,1478235,4240301,10,20,1
false,6407488,671544,7464009,10,20,1
false,6407488,114922,4242173,10,20,2
false,6196862,2694,8327391,10,20,1
false,6231920,785134,7568823,40,0,2
false,6325349,1954561,4383140,20,20,2
false,6407488,3526201,7128813,30,20,2
false,6231920,3577791,8364997,20,20,2
false,6406905,2014986,6028319,10,20,1
false,6188505,769922,4242187,20,20,1
false,6196862,2702343,7626810,10,20,1
false,6231920,1519935,7827971,30,20,2
false,6325349,4876134,4243593,20,20,1
false,357929,5400851,5813281,20,20,1
false,6406905,817540,4242580,40,20,2
false,6196862,200341,4240922,20,20,2
false,1391855,4475520,8386158,20,20,1
false,6188505,579615,4242043,20,20,1
false,3070862,107107,6283031,30,20,1
false,6196862,371826,8026286,20,20,2
false,6188505,579615,7114121,20,20,1
false,6325349,57932,6499593,20,20,2
false,722721,156555,6388650,10,20,2
false,3258603,4157253,6826498,20,20,1
false,6407488,229043,8315486,10,20,1
false,6231920,160624,8323655,10,20,1
false,6231920,1448347,7705645,20,20,1
false,6231920,170290,4245428,20,20,2
false,6407488,2006189,6826498,20,20,1
false,6406905,137151,8181546,10,20,2
false,595523,2055178,8229806,20,20,2
false,6406905,8153351,5533784,10,20,1
false,6407488,2974948,4245663,20,20,2
false,6196862,2486358,4232283,50,20,2
false,6406905,569612,4244269,30,10,1
false,6231920,6160020,4383140,10,20,2
false,6407488,1848571,6557174,20,20,2
false,6231920,4869382,7366168,20,0,2
false,6231920,471336,7553393,10,20,2
false,6231920,118308,5099019,30,20,1
false,6325349,1810750,8230621,20,20,1
false,4413715,1954561,5681351,20,20,1
false,6407488,5710618,7677529,20,20,1
false,6406905,2684069,6196333,10,20,2
false,6196862,2389166,7705645,30,20,2
false,1166769,1519935,4242982,10,20,1
false,6196862,4157253,7355334,10,20,1
false,6406905,790701,3852070,20,20,1
false,6406905,1784550,6058813,10,20,1
false,5515967,716190,8386156,10,20,1
false,6231920,5016494,7787935,20,20,1
false,6325349,7714876,4845879,10,20,1
false,3804581,5837064,4241065,30,20,1
false,6325349,5016494,7165216,20,20,1
false,6325349,5650547,3852070,40,20,2
false,6406905,1972747,4246106,10,20,1
false,6407488,7714876,8175791,10,20,2
false,6406905,2984197,7283298,10,20,1
false,6406905,769922,7101131,10,20,2
false,1257257,286177,6516227,20,20,2
false,6407488,250553,4240975,20,20,2
false,6407488,7824685,6877253,20,20,1
false,6231920,3908918,6697643,10,20,1
false,2070358,640570,4678121,10,20,2
false,6407488,470015,6157555,20,20,1
false,6196862,3003574,4244787,10,20,2
false,6406905,133370,6195629,10,20,2
false,1614863,1658500,6357681,10,20,2
false,6196862,445224,7852784,10,20,1
false,6188505,5710618,5379035,20,20,1
false,6325349,2679302,5379035,20,20,2
false,3324147,5906161,6568244,10,20,1
false,6407488,6160020,4421364,10,20,1
false,6406905,2281225,4242344,30,20,1
false,6196862,118308,8168961,30,20,1
true,6407488,956910,5228687,50,20,2
false,6406905,7555880,4245055,20,20,1
false,2489312,470015,4241108,20,20,1
false,1257257,51307,7554381,20,20,1
false,6188505,622004,4240381,10,20,1
false,6325349,1835727,4242198,20,20,1
false,6406905,814761,7334013,30,20,2
false,6231920,891652,8285720,20,20,2
false,6231920,1917432,7896870,20,10,2
false,6407488,1790878,7366114,20,20,2
false,6325349,1737122,6290298,20,20,1
false,6406905,7564831,6762414,10,20,1
false,6231920,1601926,5739966,40,20,1
false,6231920,114922,4240381,20,20,2
false,6406905,3917527,4242512,20,20,1
false,6407488,5718297,6801946,20,20,1
false,6231920,5016486,4244296,50,20,1
false,6188505,5718297,4244954,20,20,1
false,1113000,1095299,6003995,20,20,1
false,6196862,1615409,5300195,10,20,2
false,6325349,1237099,4243848,50,20,1
false,6325349,967995,7737666,20,20,1
false,6325349,2090832,4242198,20,20,1
false,6407488,1347135,4160444,10,20,1
false,6188505,1950913,8032577,20,20,1
false,1084676,3158852,7013011,20,20,1
false,6188505,2651331,6494182,20,20,2
false,85601,1676171,5846704,30,20,1
false,6231920,5710618,4244296,20,20,1
false,6196862,1448347,8414124,20,20,1
false,1257257,916264,3610845,20,20,1
false,2339,1673140,4241811,10,20,1
false,6406905,760038,8094632,10,20,1
false,6406905,1514024,4240729,40,20,1
false,6407488,4510452,8421182,30,20,2
false,6407488,370672,8229806,50,20,1
false,2489312,3514110,8206879,20,20,2
false,1135148,644481,6554756,20,20,1
false,6188505,455873,7394014,40,20,2
false,6407488,496467,7643976,20,20,2
false,6407488,5016494,7422649,40,20,1
false,6325349,2388094,5808970,20,20,2
false,4513747,3526201,7318303,20,20,1
false,6203598,114922,8315852,10,20,2
false,6407488,2323532,6425630,20,20,1
false,6188505,6160020,4243422,20,20,1
false,6196862,3206813,5860980,20,20,1
false,3281937,2690015,8086183,20,20,2
false,4513747,3206813,5221761,40,20,2
false,6407488,107107,4244817,50,20,1
false,6407488,956910,8116914,20,20,1
false,6231920,2033601,4286856,20,20,1
false,4603938,8137922,5923290,20,20,2
false,6188505,3707488,7755484,50,20,1
false,6203598,294096,6703407,20,20,1
false,6407488,5016486,4241431,20,20,1
false,6406905,3497809,7317566,20,20,1
false,6407488,57932,4241036,50,20,2
false,6407488,7151036,8163103,10,20,1
false,6406905,706409,7878482,20,20,2
false,6231920,2006189,7181268,10,20,1
false,6188505,2401452,7491596,50,20,2
false,6231920,471336,8160974,10,20,2
false,6406905,163582,6803331,20,10,1
false,6325349,203097,8255521,50,20,1
false,6203598,716190,7944478,20,20,1
false,6203598,2138376,5609189,20,20,1
false,6231920,876346,4241060,10,20,2
false,5816582,114922,7558505,20,20,2
false,6407488,1737122,7335236,10,20,1
false,6196862,114922,4240729,20,20,1
false,6196862,4544467,4241338,20,20,1
false,6406905,63502,6466183,30,20,1
false,6188505,71823,4241771,50,20,2
false,509805,2019644,7783508,20,20,2
false,6406905,1887528,4244343,40,20,1
false,6231920,3128464,6054180,10,20,2
false,43196,1605384,5352651,20,0,1
false,3258603,1796406,5890795,20,20,1
false,6407488,978471,6505029,20,20,2
false,2652165,1180104,8178083,20,20,1
false,6406905,1857023,5808970,30,20,2
false,6231920,1568286,5270671,20,20,2
false,6407488,724793,4244149,20,20,2
false,357929,3224369,5734385,10,20,1
false,1243277,3918923,4241543,30,20,1
false,5650320,1644234,7491596,20,20,1
false,6406905,558751,7097678,20,20,2
false,6231920,4111692,4243466,20,10,1
false,6325349,620158,4245543,20,20,1
false,4312178,6617711,8283855,20,20,2
false,6203598,5016494,7554381,50,20,1
false,7942630,1615409,7165699,20,20,2
false,6406905,2514832,7181268,20,20,2
false,6231920,1954993,4242152,20,20,1
false,32381,5223392,6709731,20,20,1
false,6406905,4559471,8095041,20,20,1
false,6231920,2182091,4242249,20,20,2
false,6407488,5016494,5307058,20,20,1
false,876346,370672,7747852,10,20,1
false,6325349,460364,7879061,20,20,2
false,856048,1601926,4244384,20,20,1
false,6188505,1527322,4244296,10,20,1
false,6406905,967995,5300195,20,20,1
false,6406905,2925119,4244594,20,20,1
false,6196862,5235762,7181268,20,20,2
false,6203598,1796406,6221995,20,20,2
false,6188505,1754223,8026217,30,20,1
false,6406905,199500,5792558,20,20,1
false,6406905,4746262,4246069,10,20,2
false,6188505,5809837,3893823,20,20,1
false,6203598,1520027,6054034,20,20,1
false,6325349,2812726,8263824,20,20,1
false,6231920,7748067,4831635,10,20,1
false,6407488,332580,5907676,10,20,1
false,6196862,716708,6221995,20,20,2
false,6203598,1514024,5533784,30,20,1
false,6196862,4077742,7304310,20,20,2
false,677170,3893576,7901596,30,0,1
false,6196862,4440851,5634816,20,20,2
false,6231920,5016494,4104296,20,20,1
false,6203598,470015,7114121,20,20,1
false,6406905,1954316,7938252,20,20,2
false,6407488,6617711,4245000,10,20,1
false,6407488,2639468,6506289,20,20,1
false,6407488,792047,7196185,10,20,1
false,6406905,407771,7938252,20,20,2
false,6325349,200341,4797735,20,20,1
false,6231920,1543242,8257026,20,20,1
false,6325349,967762,7613373,20,20,1
false,6231920,4879435,4246011,10,20,1
false,100830,5524339,5116366,20,20,1
false,3276782,1615409,5713379,20,20,1
false,6407488,5522683,7031865,20,20,1
false,6395291,558751,5932732,10,20,2
false,6325349,5710618,6535281,20,20,2
false,6231920,312137,4241749,20,20,1
false,6407488,5650547,4240299,20,20,2
false,6188505,107107,8316001,30,20,1
false,4877639,967762,8184222,20,20,1
false,6188505,2003289,6053934,20,20,1
false,6231920,917300,4350398,20,20,1
false,6188505,950586,4241198,20,20,1
false,6406905,2388094,8145433,30,20,2
false,279120,1644234,7692822,20,20,1
false,6188505,5037594,4241343,20,20,1
false,6231920,5200120,7366168,20,20,2
false,6406905,6004006,8237382,20,20,2
false,6231920,390664,7445134,20,20,1
false,6188505,4727431,7366168,20,20,2
false,6407488,1534852,6467553,20,20,1
false,6231920,87854,7127698,10,20,1
false,6407488,2249600,7568823,20,20,1
false,6325349,761231,6920470,20,20,1
false,6407488,122412,7832509,30,20,1
false,1257257,3514110,8130756,20,20,1
false,6188505,114922,4243503,10,20,2
false,6196862,2324861,4242913,30,20,2
false,6406905,1232740,6357105,20,20,1
false,6196862,426225,5846704,20,20,1
false,6325349,559361,6306659,20,20,2
false,509805,4259951,4240895,20,20,1
false,5343658,98103,6703407,30,20,1
false,6188505,2111274,7443671,20,20,1
false,6407488,22086,6503667,20,20,2
false,6407488,4869382,8130756,40,20,2
false,509805,1608032,5324600,20,20,2
false,6188505,820128,6304734,20,20,1
false,4513747,1950913,6400168,10,20,1
false,6406905,98852,7202758,20,20,1
false,6407488,2925119,6721995,50,20,2
false,6406905,604313,4350398,40,20,2
false,6407488,8137922,4240381,10,20,1
false,6406905,3980401,6806378,20,20,1
false,6188505,5610303,4240381,10,20,1
false,6406905,3562138,4244280,20,20,1
false,8327916,1950913,7385880,40,20,2
false,6203598,1998385,4240231,10,20,1
false,6231920,69096,4240427,20,20,1
false,6406905,525206,6759562,20,20,2
false,6231920,2027816,5883100,20,20,1
false,6406905,624587,5740243,50,20,1
true,6407488,114922,5275848,20,20,1
false,6231920,309634,4831635,10,20,2
false,6231920,5016486,7013011,30,20,2
false,6231920,1268072,76017,10,20,1
false,6407488,3514110,4241338,30,20,1
true,6231920,5852608,7608558,30,20,1
false,6231920,804242,7127698,20,20,1
false,6231920,1896380,8193098,50,20,2
false,6188505,542266,4242659,10,20,1
false,6406905,496467,8093709,10,20,1
false,6406905,470015,8184390,10,20,1
false,4098128,5796531,5308865,20,20,1
false,6196862,696732,6898259,20,20,2
false,6406905,104269,5681351,20,20,1
false,3381912,618191,6471319,20,20,1
false,6407488,8159687,6426318,10,20,2
false,6406905,1214876,4242418,40,20,2
false,6231920,352947,8145433,20,20,1
false,6188505,286117,5300195,20,20,2
false,6406905,1949851,7461843,20,20,1
false,6407488,114922,4243907,20,20,1
false,662390,1416422,7849710,20,20,2
false,43196,759943,5756034,20,20,2
false,6325349,3786883,6208732,10,20,1
false,6407488,2423212,4972236,20,20,1
false,6231920,7151036,7366832,20,20,1
false,6325349,157461,6388650,20,10,2
false,6231920,3917527,5836452,30,20,2
false,6407488,93650,7558505,20,20,1
false,6406905,390664,7676370,10,20,1
false,6231920,814761,6054017,40,20,2
false,3715468,5710618,6027087,20,20,2
false,6231920,445224,4246010,10,20,2
false,6407488,1095299,6058737,20,20,1
false,6407488,451982,5352651,20,20,2
false,6325349,4825630,7294680,20,20,1
false,6406905,671544,5533784,50,20,1
false,851454,4440851,4241151,40,20,1
false,6188505,5016494,4244979,10,20,1
false,6407488,2249600,6394550,20,20,1
false,6231920,1739694,4241811,50,10,1
true,6231920,1250720,4242629,20,20,1
false,6196862,558751,7944312,20,20,1
false,6406905,4838914,7799650,20,20,1
false,6407488,2780213,8116360,20,20,2
false,6406905,2780213,4245258,10,20,1
false,499570,4869382,8161707,20,20,2
false,6406905,57932,4243444,20,20,2
false,6231920,1954316,7554381,20,20,1
false,6196862,3918923,7827513,40,20,1
true,6231920,304530,6535173,20,20,1
false,6231920,1396741,7089291,20,20,2
false,6196862,602640,6664822,20,10,1
false,6406905,695248,5908520,50,20,1
false,6231920,180314,8113331,20,20,1
false,6406905,610064,4242485,20,20,2
false,6406905,427486,4242090,40,20,2
false,6231920,87767,5860980,10,20,2
false,6188505,8505240,8181906,20,20,2
false,6407488,1527652,6516227,20,20,2
false,6407488,2987988,4246990,20,0,1
false,6231920,1366881,8377219,20,10,1
false,6407488,1448895,8043737,10,20,2
false,6188505,332580,7705645,10,20,1
false,6325349,925365,6054534,20,20,2
false,6231920,1405698,4245392,30,20,1
false,6188505,4109400,5777916,10,20,1
false,6406905,876346,6535173,40,20,1
false,1970960,4389308,6535173,20,20,2
false,677036,4788488,7395820,20,20,2
false,6407488,1619313,7614840,10,20,1
false,6231920,2249600,4242101,10,20,2
false,6406905,879480,8230621,20,20,1
false,4457440,257611,4242982,10,10,2
false,6406905,6422478,7270634,20,20,1
false,6406905,3514110,7994662,10,20,2
false,38472,4668781,4242406,30,20,1
false,508913,3497488,7875300,20,20,2
false,6407488,681447,7606468,20,20,1
false,6406905,5811509,3850407,20,20,2
false,3512154,6280642,6658867,10,20,2
false,8311087,5771073,6235936,10,20,1
false,5403006,188434,6826498,10,20,1
false,6406905,5223392,8373823,20,20,2
false,6406905,642476,4240434,30,20,1
false,1908117,2090832,8230440,10,20,1
false,6196862,4646612,6195973,20,20,1
false,6407488,2351286,4241785,20,10,1
false,6231920,114922,6964732,20,20,2
false,6231920,1972747,8441276,20,20,2
false,6325349,1990323,7270634,40,20,1
false,6406905,15139,7600606,20,20,2
false,6231920,7824685,4243533,50,20,2
false,6406905,30178,4244658,20,20,1
false,6196862,1499560,4244954,30,20,2
false,6196862,956910,4014257,50,20,2
false,6325349,426039,7935360,10,20,1
false,6231920,637180,4245428,10,20,1
false,6407488,532095,4241866,20,20,1
false,6188505,1950913,7742345,20,20,2
false,6203598,38472,8414301,40,20,2
false,6325349,62351,8441276,50,20,1
false,6407488,562649,6426994,30,20,1
false,6196862,891652,4240929,20,20,2
false,6231920,470015,4312907,20,20,1
false,6196862,114922,6760808,30,20,1
false,6231920,63502,8168898,20,20,1
false,7460871,951801,4242043,20,20,1
false,6188505,1147653,6740205,20,20,2
false,6407488,1425365,8335790,10,20,1
false,6422812,1366881,6958270,20,20,1
false,6231920,703600,7849710,20,20,2
false,6406905,1473357,4972236,40,20,2
false,6406905,5496531,7835834,20,20,2
false,6407488,199500,6145801,40,20,1
false,6196862,372214,8513184,20,20,2
false,6188505,544764,7278520,50,20,2
false,6407488,6796005,5705702,20,20,1
false,6231920,774721,8160254,20,20,1
false,6231920,2339,6471319,20,20,1
false,6196862,2111274,5883100,20,10,1
false,6407488,977614,4245055,30,20,1
false,6231920,577229,7832509,20,20,2
false,6407488,888729,4245818,20,20,2
false,6188505,2053109,5470537,20,20,2
false,6406905,5771073,4242399,20,20,1
false,6325349,967995,7707736,50,20,1
false,6231920,1832199,7671295,10,20,1
false,6231920,615844,6145891,20,20,2
false,6406905,3438666,7678673,20,20,2
false,7845662,2055178,8385350,20,20,2
false,1372203,2062888,4243765,20,20,2
false,6406905,894340,4002474,10,20,1
false,6407488,1857023,7705459,20,20,1
false,6407488,2822565,6235890,40,20,1
false,7942630,1601372,8430317,10,20,1
false,6407488,1527322,8392651,20,20,2
false,6407488,2925119,6730332,20,20,1
false,6231920,7077996,8160254,20,20,1
false,7942630,5650320,7560381,50,20,2
false,6203598,75881,5808970,20,0,1
false,4513747,2281225,7376529,40,20,1
false,6231920,4364661,7600891,30,20,1
false,6406905,809887,5308865,20,20,1
false,6325349,5710618,7163587,30,20,1
false,6406905,2388094,2984282,20,20,2
false,6231920,84921,4286856,30,20,1
false,6407488,4440851,7462201,20,20,1
false,6188505,1347135,4024716,20,20,2
false,6231920,496467,7012546,10,20,1
false,6406905,2106652,6420350,10,20,2
false,6406905,5852608,6695966,20,20,1
false,6407488,2070358,7648056,10,20,2
false,6188505,2780213,4242992,20,20,2
false,2741139,2685553,6528085,20,20,1
false,6407488,6198285,7699613,20,20,1
false,6407488,4353974,7932101,30,20,1
false,6196862,229043,6257465,20,20,2
false,6407488,27893,7755484,30,20,1
false,6325349,2289076,6054034,20,20,1
false,6406905,3524438,6844423,20,20,1
false,6407488,925365,4243348,20,20,2
false,1950609,2015774,7383665,30,20,1
false,6231920,581582,4511184,10,20,2
false,6196862,7678290,7137066,40,20,1
false,6231920,471336,8214432,20,20,1
false,6407488,558751,4244447,40,20,2
false,6406905,2509933,6263187,10,20,2
false,6196862,312137,7277625,20,20,1
false,6406905,3514110,8113331,10,20,2
false,6406905,700583,4243348,20,20,1
false,6325349,2191,4246106,20,20,2
false,6407488,3346780,7097678,10,20,1
false,6196862,4037590,8160979,50,20,2
false,6188505,3393886,7693568,30,20,2
false,6407488,2423212,8419376,20,20,1
false,6231920,93971,4242903,20,20,2
false,6231920,1250720,7705459,20,20,2
false,6406905,2434773,8032501,30,20,1
false,6188505,4067262,4242290,10,20,1
false,6325349,2452042,4666821,40,20,1
false,6407488,1954316,5739966,10,20,1
false,6407488,5809837,6473604,20,20,1
false,6407488,894340,4240172,10,20,1
false,6231920,2055178,7737666,50,20,1
false,7727910,3796916,4240233,30,20,1
false,3258603,387675,7843712,50,20,1
false,6231920,5016494,8181546,20,20,2
false,6188505,1426803,7440145,20,20,1
false,157955,3893576,6383294,10,20,1
false,6407488,820128,7523557,40,20,1
false,6406905,644481,6053975,10,20,1
false,4920524,1832199,8521401,20,20,2
false,6406905,1632021,5756034,20,20,2
false,6406905,2498276,6408945,20,20,1
false,6406905,5343658,5836452,20,20,2
false,1207132,137151,4242474,10,20,1
false,6406905,696663,4243030,20,0,1
false,6406905,257461,7677416,20,20,1
false,2265462,2987582,6614798,30,20,2
false,6406905,532095,8233191,20,20,1
false,3944516,177258,4242519,20,20,1
false,2940728,732092,4240231,30,20,2
false,121963,114922,4511184,10,20,2
false,6406905,5809837,4241876,20,20,1
false,6196862,1396741,7693568,20,20,2
false,6231920,1949851,4240427,20,20,1
false,6231920,7555880,6063802,20,20,2
false,6231920,40638,4244979,10,20,1
false,6406905,254877,4497534,10,20,1
false,6406905,917261,6053826,10,20,1
false,6203598,3893576,7461843,20,20,1
false,6203598,69096,6189774,20,20,2
false,6406905,1180104,4240301,20,20,1
false,6407488,2565392,8160979,20,20,1
false,6325349,5490772,4326682,30,20,2
false,6406905,1478235,6721995,50,20,1
false,6231920,51745,6054034,10,20,1
false,6188505,6160020,4145888,10,20,2
false,6325349,1615409,6211092,10,20,2
false,5562088,5385060,6395309,30,20,1
false,6406905,1261313,6219701,10,20,2
false,6231920,2249600,7334773,20,20,2
false,6196862,4354135,5713379,30,20,2
false,6406905,390664,8043737,20,20,1
false,2998081,2550263,4385188,30,20,2
false,6188505,4467648,4241811,20,20,2
false,1786152,3244481,8377070,20,20,1
false,6407488,1519935,4240042,20,20,2
false,6407488,177258,7334578,50,20,2
false,1734193,509878,7677416,20,20,2
false,6188505,480238,4243269,20,20,1
false,6188505,3134763,7390615,50,20,2
false,6196862,4467648,6499342,10,20,1
false,6231920,1588486,8230342,20,20,2
false,5309081,3730567,6528085,20,20,2
false,6196862,703574,4241876,20,20,2
false,6407488,3730567,7693568,10,20,1
false,6407488,3244481,5782823,20,20,1
false,6231920,845184,5907676,20,20,2
false,6406905,471336,6208732,40,20,1
false,6406905,2443461,7500378,20,20,1
false,821138,579623,4240731,40,20,1
false,6407488,525083,8388008,20,20,1
false,4312178,2006189,7692822,20,20,1
false,6231920,5809837,8230440,10,20,1
false,904778,1416422,6812619,50,20,2
false,3258603,1256842,4242087,40,20,1
false,6231920,2987988,4241334,20,20,2
false,6354893,1250720,7791743,50,20,2
false,6407488,2164068,8169806,40,20,1
false,6196862,1416735,7944478,20,20,2
false,6407488,1157615,6222581,20,20,1
false,6188505,254877,8386156,30,20,2
false,6196862,2986834,7954673,20,20,2
false,6188505,1615409,4240435,20,20,2
false,6231920,644481,8358802,20,20,1
false,6231920,8505240,5729235,20,20,1
false,6406905,1347135,4240861,10,20,2
false,6196862,4381816,5270671,20,20,1
false,829502,192737,6601624,20,20,1
false,6407488,795056,4246073,20,20,2
false,6188505,888729,4241334,40,10,1
false,6325349,114922,4241948,30,20,1
false,6231920,62589,4241151,20,10,1
false,3991036,1514024,6054180,50,10,2
false,6407488,2220690,2003533,10,20,1
false,6203598,1887528,8116914,30,20,2
false,6407488,2773243,8314450,20,20,1
false,6196862,473030,4797735,20,20,2
false,6406905,2694,6658867,20,20,1
false,879480,479304,6902213,20,20,1
false,5403006,2925658,8087999,50,20,2
false,2365374,622004,7755484,20,20,1
false,6188505,6160020,8323655,50,20,1
false,6407488,1202652,4245055,40,20,2
false,6325349,2111274,5883100,20,20,1
false,6325349,113291,8160979,20,20,2
false,6196862,550081,6535869,20,20,1
false,6406905,89696,8373823,20,0,1
false,6406905,122563,7613782,20,20,1
false,4098128,2388094,6703443,20,20,1
false,6188505,133370,4243848,20,20,2
false,6203598,177258,4244280,10,20,1
false,6188505,2514832,4242421,30,20,2
false,6406905,99150,3058216,30,20,1
false,6406905,968916,7944312,40,20,1
false,6407488,5809837,4242418,10,20,1
false,6160020,38472,7829696,20,20,2
false,6216066,6617711,4326698,10,20,1
false,6188505,703574,6433389,40,20,1
false,6407488,2358611,4241065,30,20,1
false,3258603,4282925,4241546,20,20,2
false,1207132,663986,7461843,20,20,2
false,6231920,2007472,6053848,20,20,2
false,6407488,1868632,4312907,30,20,1
false,6406905,4242178,6658867,20,20,2
false,6196862,3913212,6357105,20,20,1
false,1255188,1619313,3499515,20,20,1
false,6325349,2215024,7111151,20,20,2
false,4992321,1954978,8439388,30,20,1
false,6407488,1698487,6370802,20,20,2
false,3715468,1528529,3058216,10,20,1
false,6406905,2834347,7364033,20,20,1
false,6196862,1761498,4242173,20,20,1
false,6196862,5015694,7440145,20,20,1
false,6325349,1527234,8025413,20,20,2
false,6325349,706409,4909880,20,20,2
false,1257257,205312,5298898,20,20,1
false,6407488,4259951,8104919,20,20,1
false,2992317,5610303,7988420,20,20,2
false,5403006,3648843,3852070,20,20,1
false,6406905,2093329,6471319,20,20,2
false,3258603,2055178,7127698,10,20,1
false,3512154,114922,7195840,10,20,1
false,6406905,1569438,4240434,20,20,1
false,1257257,2514274,5907676,20,20,2
false,6196862,5650547,4244962,20,10,2
false,6407488,2401424,6695966,50,20,1
false,6188505,5016494,8163103,30,20,2
false,6231920,93971,8327391,20,20,1
false,1508879,1890728,6121612,20,20,2
false,7942630,3983367,8326131,30,20,1
false,6196862,525083,8233724,20,20,2
false,6188505,5265254,7586658,20,20,2
false,1614863,98852,4245436,10,20,2
false,6188505,2464718,8304858,10,20,2
false,6407488,2514274,8086284,10,20,2
false,6231920,4037590,7451460,20,20,1
false,6407488,1425365,6053826,50,20,2
false,6203598,2388094,5330223,20,20,1
false,6406905,1534852,7558505,20,20,1
false,6325349,2305422,8414301,10,20,2
false,5596095,1430387,8263824,10,20,1
false,6196862,967376,3656693,20,20,1
false,2018486,4489551,7827971,20,20,1
false,6196862,1334568,6494182,30,20,1
false,6196862,1619313,6425630,20,20,1
false,6231920,5710618,6357105,20,20,1
false,2683776,663823,6170017,10,20,1
false,6188505,566243,7798353,20,20,1
false,6196862,6198285,4241199,20,20,1
false,6196862,978741,5808970,20,20,2
false,6231920,2324599,7604188,20,20,1
false,6325349,2684069,5734385,20,20,1
false,6407488,307014,5813281,10,20,1
false,6188505,114922,6695966,20,10,2
false,6406905,5994024,6357681,20,20,1
false,6196862,250553,5907399,30,20,2
false,6407488,7824685,7608558,30,20,1
true,6325349,4212810,7202758,30,20,1
false,6406905,1520931,4385188,20,20,2
false,1285745,89696,5938982,20,20,2
false,4513747,3763284,7568823,50,20,1
false,6406905,4212810,8001087,20,20,1
false,6406905,5037542,5498232,20,20,1
false,6406905,254877,5734385,20,20,2
false,6406905,3796916,4242399,30,20,2
false,6231920,2220690,7031865,20,20,1
false,1229129,820128,7443671,20,20,1
false,6231920,5016494,7850718,10,20,1
false,6231920,8137922,8104919,10,20,2
false,6231920,716708,7031865,50,20,1
false,271715,5016494,7608479,10,20,1
false,6188505,3224369,8095041,20,20,2
false,6188505,644481,6744153,20,20,1
false,6188505,2834347,6235890,20,20,1
false,6231920,2070358,7742873,20,20,1
false,6325349,842942,5813281,30,20,1
false,6325349,760038,4241603,20,20,2
false,6231920,1416735,8160974,20,20,1
false,6407488,2552490,8094632,20,20,2
false,6406905,1520027,5771073,20,20,2
false,6231920,931158,5634816,50,20,1
false,6325349,1490659,8364997,50,20,2
false,6406905,1562002,7932101,20,20,2
false,6188505,2086870,6662296,30,20,2
false,6231920,5016494,4240042,50,20,1
false,6231920,666262,7278271,10,20,1
false,6188505,2909318,6752404,30,20,1
false,4306885,1261313,4242476,20,20,2
false,6406905,471336,4243503,20,20,1
false,6407488,4495661,4242797,20,20,2
false,6231920,286117,6133523,20,20,1
false,6231920,2639468,7649386,20,20,2
false,6407488,4467648,8326168,20,20,1
false,6231920,2434773,4240552,20,20,1
false,6231920,114922,4245000,20,20,2
false,6203598,5069201,7178952,20,20,1
false,6325349,2033601,4240819,20,20,2
false,4378422,153395,7608479,20,20,2
false,6231920,978732,7988420,30,10,1
false,6231920,579615,8064928,30,20,1
false,6325349,735751,7748044,10,20,2
false,1585468,676027,4244959,10,20,2
false,6231920,5809837,7608479,40,20,1
