13792294,1128613,2018-10-02 14:18:57.327008+00,2020-05-19 15:09:07.69587+00,5
17014783,2849588,2020-07-10 01:25:35.628733+00,2020-12-24 13:57:43.114292+00,6
16434065,5226892,2021-04-21 15:41:23.048683+00,2020-12-01 19:27:24.366346+00,5
4529276,4125958,2021-05-06 06:06:04.738621+00,2020-02-20 11:04:51.193871+00,1
15099587,4010986,2019-05-23 17:57:17.229499+00,2021-01-27 08:16:57.109691+00,5
23959163,916904,2020-02-11 13:22:24.834683+00,2019-07-14 20:49:24.630969+00,1
16475376,1263493,2021-02-23 15:12:00.609029+00,2020-10-15 10:12:51.765509+00,5
4549090,1739094,2018-02-13 21:06:15.812203+00,2020-03-07 15:30:21.579022+00,5
7069119,1129372,2018-11-14 14:36:41.105313+00,2018-03-31 21:01:30.017969+00,5
4529216,3056166,2019-07-17 09:47:44.506065+00,2020-03-12 12:55:50.752367+00,6
12646193,3869483,2018-10-23 09:46:40.923243+00,2020-01-07 11:05:12.047626+00,6
4549077,100770,2021-02-24 18:51:25.284819+00,2021-05-04 13:17:38.637927+00,5
278964,253667,2021-03-03 07:10:35.855195+00,2018-11-21 12:13:24.561021+00,3
7444945,1602761,2020-12-21 04:18:26.214038+00,2017-09-03 21:32:43.34321+00,5
11286868,2703970,2020-01-10 16:53:23.153608+00,2021-05-08 03:10:36.640673+00,5
4529216,7942630,2020-04-29 16:31:46.444681+00,2018-03-05 15:25:21.507512+00,5
4529253,2079234,2019-05-13 11:23:05.13+00,2018-12-02 10:49:54.002451+00,5
15749122,1598228,2020-05-28 20:24:11.981201+00,2020-07-14 04:20:01.065274+00,5
25527359,1129372,2020-11-24 06:21:28.844002+00,2021-03-08 12:02:48.766089+00,5
5730893,4896270,2017-06-09 01:47:07.443894+00,2020-06-10 09:50:14.419913+00,3
4549096,5742511,2020-10-16 04:13:07.33746+00,2020-09-14 23:07:33.012806+00,5
4529249,3880924,2019-02-22 12:22:05.90756+00,2020-12-27 08:10:15.699997+00,5
10984709,1739094,2020-02-09 19:32:15.41964+00,2019-05-07 15:28:45.37822+00,3
13172553,1739094,2020-05-04 21:42:11.064636+00,2019-01-10 10:16:18.182793+00,5
8308825,1739094,2021-02-11 19:57:24.867215+00,2019-09-04 08:13:12.838103+00,5
17779882,753331,2021-06-09 17:51:29.944119+00,2019-03-19 14:17:48.871635+00,5
5116802,414055,2019-11-03 07:48:39.942083+00,2020-12-08 09:15:39.019879+00,6
16778784,8587917,2020-08-02 09:36:39.119375+00,2019-11-13 18:47:28.269222+00,7
12045153,354368,2019-04-10 14:50:32.118067+00,2021-05-10 13:35:03.777415+00,1
4549089,3265540,2019-12-05 12:45:47.888659+00,2020-01-15 18:39:49.794212+00,5
6264530,1739094,2020-09-21 13:02:57.60715+00,2020-12-07 14:28:57.805695+00,5
3768771,8587917,2019-10-11 15:13:33.425665+00,2020-10-29 20:14:26.791441+00,5
17852391,1128613,2018-07-29 01:44:38.706669+00,2021-04-24 08:57:15.212495+00,5
23683439,1739094,2020-11-23 12:41:36.37775+00,2020-12-18 20:46:28.163721+00,5
4549089,1739094,2021-05-17 14:13:33.765687+00,2020-07-01 09:42:07.66845+00,6
17041127,3536981,2020-12-13 14:15:13.755354+00,2019-08-07 05:51:14.060673+00,5
7516879,3131163,2020-03-14 23:06:51.687993+00,2021-03-22 09:56:28.239554+00,5
4667009,5226892,2018-04-03 11:15:37.159401+00,2018-04-14 23:05:05.051135+00,5
4549095,610057,2020-05-12 12:09:18.836366+00,2019-06-04 18:15:30.947894+00,1
4613540,4178893,2019-12-28 02:02:17.381088+00,2020-01-27 10:11:33.407504+00,5
24450109,3869483,2020-07-02 07:26:46.035191+00,2020-11-20 15:07:25.960948+00,5
14140484,1739094,2020-08-19 09:53:56.24033+00,2021-06-14 20:48:05.979174+00,5
18454837,4395617,2020-06-03 12:04:47.797737+00,2019-02-13 14:48:02.633461+00,5
7516879,1739094,2021-03-19 14:50:49.081582+00,2020-08-10 08:54:27.019327+00,7
2865214,1129372,2020-11-17 19:26:05.235613+00,2020-12-04 17:22:04.268204+00,12
22230136,2991687,2020-10-28 13:20:29.641515+00,2018-09-10 03:49:09.443479+00,5
1715577,253667,2018-02-03 05:11:56.828666+00,2019-06-25 04:07:04.189208+00,2
6167078,1739094,2019-11-18 12:28:07.175796+00,2019-12-09 17:42:02.810678+00,6
17740209,8587917,2021-01-14 10:01:04.219182+00,2020-11-06 12:03:25.699615+00,5
19919294,507326,2019-06-19 14:35:17.756003+00,2020-05-28 03:57:22.876312+00,5
10491793,2578846,2021-01-12 22:10:15.391+00,2019-01-31 10:59:26.999853+00,1
461215,3584089,2019-08-08 19:38:36.977838+00,2020-12-04 01:07:52.722332+00,5
25617260,1129372,2019-01-14 22:26:29.503402+00,2019-09-03 08:53:33.679569+00,1
16952208,8238246,2020-03-03 07:51:04.71125+00,2018-07-29 01:44:38.706669+00,5
16434065,3869483,2020-10-25 13:06:45.308798+00,2020-10-07 16:33:35.947721+00,5
18568770,1739094,2020-04-01 13:36:14.599335+00,2021-04-17 00:27:39.822538+00,5
12936562,3265540,2019-06-06 07:01:15.660234+00,2020-08-27 00:11:19.937093+00,12
14953873,3235026,2019-06-17 04:26:46.544401+00,2019-07-29 01:12:45.538057+00,5
13792294,5742511,2020-05-08 12:12:20.236519+00,2021-02-26 02:17:55.292581+00,5
10271072,2370920,2020-10-29 08:14:34.646315+00,2020-01-03 20:23:10.727695+00,1
20135003,2470820,2020-12-03 08:57:17.125773+00,2017-06-09 01:47:07.443894+00,5
25617174,1739094,2018-01-22 05:31:59.727485+00,2021-02-18 12:33:23.838052+00,1
7260567,4923581,2020-08-13 23:12:00.127925+00,2020-08-12 10:52:27.426217+00,1
9139330,1739094,2021-05-05 04:18:27.890069+00,2021-06-09 17:51:29.944119+00,9
15320119,3265540,2021-05-26 18:35:44.213774+00,2020-07-30 18:12:38.761505+00,5
278964,7985686,2021-01-25 18:34:30.156427+00,2020-08-21 15:42:58.717557+00,5
16434065,1570338,2018-05-21 17:15:14.027075+00,2020-02-24 19:54:59.050748+00,5
19665227,2454924,2019-04-25 11:59:41.790685+00,2018-10-23 10:04:12.693519+00,5
4549086,3313473,2019-10-04 15:39:37.436685+00,2019-02-06 11:08:56.392481+00,5
11498489,3381912,2019-11-28 18:48:47.709638+00,2021-05-21 08:01:34.417594+00,6
12646193,121963,2020-06-05 20:05:38.615957+00,2018-07-19 18:04:26.427925+00,5
23954639,3902422,2020-09-22 21:15:26.032127+00,2018-03-27 07:07:06.776245+00,5
24450109,3615924,2020-06-30 13:04:17.930262+00,2019-12-03 14:22:10.404642+00,5
26567126,3536981,2020-07-17 01:59:44.292931+00,2020-04-08 00:07:59.913968+00,5
26005919,5516915,2017-11-09 10:19:19.335675+00,2020-11-26 21:58:55.261147+00,5
13820678,3265540,2020-08-04 07:04:34.941997+00,2019-04-30 07:06:31.4032+00,5
6264530,5226892,2021-03-18 12:39:52.462184+00,2020-06-22 20:01:39.468614+00,6
13394630,2034023,2019-03-28 03:23:17.886403+00,2019-06-06 07:01:15.660234+00,5
5116802,1366762,2021-01-15 06:16:46.312909+00,2020-12-28 16:36:47.753547+00,5
17843452,1716116,2020-06-01 02:41:43.80042+00,2020-02-05 19:11:06.447+00,5
15872257,1739094,2018-11-26 10:48:55.295007+00,2020-11-19 08:56:18.299381+00,5
25615735,5226892,2020-08-05 17:33:17.662933+00,2021-02-25 11:54:10.368648+00,1
10479312,2704952,2020-11-25 14:26:07.302456+00,2019-12-08 13:06:23.336953+00,5
14218490,860017,2020-10-19 13:31:05.225083+00,2018-04-19 18:28:45.218231+00,5
23683439,3869483,2021-03-21 02:12:07.408425+00,2018-08-23 14:24:38.056547+00,1
17455720,5016494,2021-01-19 12:13:24.924975+00,2020-06-09 16:07:30.175458+00,5
14176654,4395617,2020-10-18 10:01:43.629109+00,2020-02-03 05:00:36.32799+00,5
12497750,5762266,2018-04-10 01:01:41.254832+00,2019-12-02 13:50:25.722335+00,5
16434065,4896270,2020-09-09 21:07:06.282494+00,2020-08-19 09:53:56.24033+00,5
13083,1739094,2020-03-31 18:25:37.935804+00,2017-11-22 06:27:07.409182+00,5
20167820,3265540,2020-08-14 15:12:49.913898+00,2020-03-10 07:34:10.625123+00,1
5771540,1407788,2021-04-08 15:03:55.93874+00,2019-05-09 06:41:22.354+00,5
6499005,1519935,2020-03-07 15:30:21.579022+00,2017-06-02 11:14:53.300152+00,5
21026519,2034023,2021-03-29 11:13:23.390641+00,2018-10-14 07:40:40.729351+00,5
4220535,5742511,2020-06-22 20:01:39.468614+00,2020-10-05 13:08:59.978861+00,5
4435291,1739094,2020-12-23 13:54:15.567999+00,2021-01-28 14:44:10.762442+00,5
13394620,3265540,2020-04-24 08:09:25.029689+00,2020-09-23 14:49:55.151778+00,5
1920341,3611213,2021-01-11 15:04:11.068409+00,2017-07-31 10:01:48.940659+00,5
11914626,7553590,2021-04-26 14:38:36.446191+00,2021-04-20 12:15:16.277991+00,6
4529276,1568208,2019-06-13 04:15:51.958134+00,2018-12-17 10:31:40.733533+00,1
2167874,3869483,2020-12-02 14:11:01.333711+00,2019-01-08 16:17:21.032783+00,5
24510916,3265540,2020-05-26 11:41:54.71006+00,2020-06-15 01:55:38.286982+00,5
17843452,3056166,2020-08-27 00:11:19.937093+00,2019-07-16 07:38:43.456479+00,5
3359718,7942630,2020-05-03 22:58:41.639531+00,2018-03-09 21:48:40.186617+00,1
5411317,3902422,2020-02-03 05:00:36.32799+00,2021-04-12 10:22:44.144084+00,6
4205665,2374717,2021-04-14 14:39:31.319734+00,2019-11-16 03:08:31.833261+00,5
15099587,3265540,2021-01-29 08:57:11.906393+00,2018-03-29 09:04:16.325907+00,5
23683439,8587917,2020-09-11 10:03:36.072715+00,2019-09-18 09:30:06.872425+00,5
4529216,124113,2020-08-23 23:38:16.397388+00,2021-02-14 11:07:00.98813+00,3
26005919,5037105,2020-09-20 07:00:20.135949+00,2021-01-13 14:21:39.841605+00,5
3391926,2172472,2020-09-18 13:45:12.673438+00,2020-03-31 01:40:53.032378+00,5
14231571,6489405,2021-03-01 10:14:22.203286+00,2021-04-29 09:55:57.216441+00,5
5116759,2265462,2019-10-25 08:59:41.920775+00,2020-12-23 13:54:15.567999+00,5
25527359,948336,2019-11-19 12:23:28.05543+00,2020-02-18 16:38:39.618655+00,5
278964,5867022,2019-05-19 18:15:49.494078+00,2019-08-05 22:51:33.652013+00,5
20303344,3536981,2020-03-30 04:47:31.270845+00,2021-03-05 15:20:06.366624+00,5
3854705,541093,2018-05-16 10:09:01.948825+00,2020-08-17 16:22:20.257793+00,5
15633187,2849588,2018-08-08 15:33:34.965137+00,2020-04-23 11:10:47.08439+00,5
20173240,1568208,2019-12-15 10:03:20.523305+00,2020-01-24 18:51:22.608944+00,5
311700,4415974,2018-02-28 10:08:54.610002+00,2018-09-21 15:19:58.228327+00,1
5457755,253667,2020-09-02 10:16:57.531624+00,2020-09-25 12:16:37.874695+00,5
4529250,3818839,2018-07-31 20:11:24.531994+00,2019-03-11 17:53:23.803718+00,5
12045153,3127345,2021-05-19 11:31:35.1079+00,2021-03-25 18:00:07.038798+00,5
5116706,1129372,2017-10-06 14:05:36.000946+00,2019-05-14 15:16:25.848378+00,5
2408601,3902422,2018-03-05 15:25:21.507512+00,2019-12-30 20:13:54.817299+00,5
7280694,1739094,2019-05-14 15:16:25.848378+00,2020-10-06 09:54:15.373884+00,1
3268192,533372,2019-09-18 09:30:06.872425+00,2020-04-30 13:29:48.718547+00,6
5502816,1739094,2020-11-18 14:50:04.032178+00,2021-04-15 07:13:18.113929+00,5
12242774,3902422,2021-04-14 04:10:04.720413+00,2021-04-27 16:20:57.011289+00,5
16434065,1950913,2019-04-19 09:57:13.921658+00,2021-02-01 18:33:46.857979+00,1
17775289,1739094,2021-03-25 18:00:07.038798+00,2021-03-10 11:28:29.041467+00,5
4549096,6454334,2021-04-27 16:20:57.011289+00,2020-02-11 13:22:24.834683+00,1
1219016,827279,2019-08-22 15:24:28.341+00,2020-06-22 04:45:17.522353+00,5
4529249,5226892,2019-10-01 08:34:21.86755+00,2019-07-02 00:00:38.734993+00,5
16420284,2698458,2020-11-26 21:58:55.261147+00,2020-08-31 03:27:17.628706+00,3
5116705,2079234,2020-05-25 12:06:26.999408+00,2020-06-18 10:20:08.482643+00,5
5854605,8587917,2021-05-26 08:38:27.751793+00,2020-07-24 19:55:54.12568+00,3
4549096,572018,2020-01-30 08:12:53.611559+00,2018-03-22 03:03:19.614493+00,5
12187367,7942630,2021-04-11 09:25:41.623884+00,2020-01-23 17:42:33.865301+00,6
19842883,2075378,2020-03-24 12:07:48.502908+00,2019-07-23 21:19:49.757136+00,5
24450109,4896270,2019-04-11 23:55:26.57564+00,2021-01-11 15:04:11.068409+00,5
10984709,3287313,2021-02-16 07:42:41.384129+00,2018-07-26 07:40:38.013654+00,5
11804874,3884590,2020-04-03 08:52:50.612076+00,2020-05-07 13:56:23.931371+00,5
22230136,2417385,2020-04-23 11:10:47.08439+00,2021-05-21 17:10:24.261804+00,1
11096787,435479,2019-03-07 08:22:17.00762+00,2021-03-30 14:12:19.012266+00,5
13225916,3265540,2019-11-22 08:43:32.274768+00,2021-06-11 10:19:54.60443+00,5
18454837,3056166,2020-07-09 08:03:59.871182+00,2019-06-29 14:44:07.309267+00,5
2408601,1739094,2020-07-28 15:21:49.257664+00,2020-10-12 16:23:41.392036+00,5
4667009,2102015,2021-04-08 02:22:38.08054+00,2020-05-23 13:53:26.907432+00,5
4529243,5189892,2020-06-04 08:18:03.711955+00,2021-04-03 06:35:43.838+00,5
5854605,2699456,2020-05-11 14:10:14.669544+00,2020-04-20 22:54:50.627933+00,5
14978726,289790,2019-05-03 11:01:00.623246+00,2019-03-13 08:29:47.332572+00,1
20177033,3265540,2021-05-25 03:45:42.110893+00,2020-01-31 08:08:50.690808+00,5
4529253,1129372,2018-09-01 03:04:07.308753+00,2019-12-17 13:24:49.975467+00,1
4549077,124113,2020-11-05 16:49:45.929954+00,2019-02-19 13:44:44.594957+00,5
13156124,1739094,2017-05-19 00:00:06.836702+00,2019-12-04 12:24:17.868646+00,5
5602303,419888,2020-03-05 14:22:23.957975+00,2018-11-13 00:45:23.21958+00,5
25617140,1739094,2019-04-17 16:08:46.75505+00,2019-07-22 14:40:28.479443+00,7
12936562,1265478,2020-12-16 00:13:39.392322+00,2019-10-08 09:38:17.43015+00,5
3044465,501986,2019-10-15 09:13:07.884557+00,2020-09-18 13:45:12.673438+00,1
18568770,424482,2020-10-11 23:01:47.791578+00,2019-10-25 08:59:41.920775+00,5
10479312,753331,2021-05-06 16:42:42.515419+00,2019-12-13 10:15:44.965722+00,5
12497750,3265540,2019-06-18 10:12:04.838796+00,2019-01-25 19:37:53.161644+00,5
5066481,1739094,2020-12-01 19:27:24.366346+00,2021-06-13 06:30:04.940877+00,5
6030593,7338840,2021-06-07 20:35:58.660253+00,2019-08-20 10:08:40.95169+00,5
3752814,1557436,2020-09-10 14:21:31.417+00,2019-04-25 11:59:41.790685+00,5
8250457,867613,2020-09-25 09:24:00.217035+00,2017-11-29 09:01:54.424489+00,5
4042224,3600891,2020-05-05 18:22:43.490715+00,2019-06-17 04:26:46.544401+00,5
2863353,4438551,2020-03-27 19:08:23.123702+00,2019-08-08 06:54:38.619473+00,5
564563,243488,2019-08-16 09:32:50.88159+00,2020-04-10 17:15:28.404196+00,5
8062778,5226892,2018-02-15 21:50:05.389+00,2020-11-02 11:45:08.921316+00,1
17642084,533372,2019-04-14 10:05:56.707924+00,2021-05-14 10:12:48.096037+00,9
15099587,76736,2020-12-24 13:57:43.114292+00,2019-11-27 16:48:45.838387+00,5
25997784,4997388,2020-12-18 20:46:28.147896+00,2020-10-30 15:24:10.91545+00,5
7684628,4247471,2020-07-06 07:27:06.732721+00,2018-04-17 15:41:11.005616+00,5
16434065,2454928,2019-06-10 08:39:30.439654+00,2021-05-13 15:17:49.439912+00,5
8661817,2102015,2020-11-20 15:07:25.960948+00,2019-09-09 00:38:08.741542+00,5
15099587,100770,2021-05-11 16:37:16.166585+00,2020-04-14 16:58:15.847965+00,5
4603023,3884590,2020-06-19 05:18:15.671491+00,2020-12-17 10:51:54.963864+00,6
1770376,3265540,2018-03-22 03:03:19.614493+00,2020-01-10 16:53:23.153608+00,5
4549095,3265540,2019-04-27 06:56:41.840543+00,2020-04-01 13:36:14.599335+00,1
5116762,6203598,2019-11-08 00:38:42.078519+00,2021-03-04 12:50:04.073695+00,6
5116762,1739094,2019-04-09 08:01:39.353982+00,2020-03-19 21:27:34.964584+00,5
15609276,4896270,2020-02-27 13:41:43.118019+00,2021-03-02 14:10:11.706498+00,5
6270072,4433020,2019-07-31 14:25:26.534331+00,2020-08-16 13:42:08.200587+00,5
1920341,1263493,2019-01-25 19:37:51.790478+00,2020-03-27 19:08:23.123702+00,5
12497750,1129372,2019-10-24 06:24:39.213227+00,2020-03-23 14:30:43.663194+00,7
4529278,2034023,2021-01-07 06:58:42.606605+00,2019-07-03 09:52:53.788424+00,7
7764,1702559,2019-03-13 08:29:46.525558+00,2020-11-05 01:29:31.863072+00,5
5116767,3265540,2021-05-27 19:49:09.168872+00,2021-01-18 17:54:30.714799+00,3
12918261,22413,2021-02-12 15:30:41.775583+00,2018-10-31 23:18:44.256514+00,5
14231571,1739094,2017-07-20 11:17:53.226154+00,2018-02-28 10:08:54.610002+00,5
12661097,1257257,2020-09-14 23:07:33.012806+00,2020-02-27 13:41:43.118019+00,5
8648829,2463288,2019-09-17 08:06:07.696098+00,2021-01-18 03:20:05.45107+00,5
25617279,179953,2020-10-05 13:08:59.978861+00,2017-05-25 17:34:23.278249+00,3
5825804,4896270,2021-01-15 23:12:07.755626+00,2018-03-24 14:14:26.213573+00,5
23683439,5742511,2018-08-27 10:47:11.674976+00,2020-01-30 08:12:53.611559+00,5
2167874,3869483,2020-10-01 05:27:05.540257+00,2019-10-20 15:56:33.724616+00,5
20301256,3536981,2019-02-26 15:20:49.802287+00,2017-11-25 21:02:42.863017+00,5
12646193,3056166,2020-09-07 00:11:29.498922+00,2020-05-06 16:01:20.869952+00,5
14750003,3536981,2019-06-25 04:07:04.189208+00,2019-05-06 07:15:25.088575+00,5
5116761,5005665,2020-02-13 07:03:59.41359+00,2021-04-03 07:04:22.993+00,5
16434065,6485791,2018-10-31 22:06:26.80199+00,2021-02-26 16:33:14.59129+00,5
10476374,583204,2020-12-11 15:07:43.946318+00,2017-10-20 09:24:22.700276+00,3
17852391,3265540,2020-09-04 14:57:25.523367+00,2021-05-05 04:19:08.365465+00,5
23683439,258734,2020-08-04 23:04:05.270908+00,2020-05-26 11:41:54.71006+00,5
4529278,724623,2018-12-05 19:23:03.550796+00,2019-11-05 22:45:37.409781+00,1
8339746,3265540,2018-12-07 13:16:26.915868+00,2020-10-27 22:55:45.456053+00,5
20135003,8587917,2019-05-01 20:05:25.658659+00,2021-05-20 03:00:49.301243+00,5
12936562,1581616,2018-03-24 14:14:26.213573+00,2019-04-12 00:29:56.225964+00,5
16001955,2406597,2020-12-08 09:12:50.386691+00,2021-05-04 03:26:59.02341+00,5
5116754,1739094,2021-05-12 10:17:31.080635+00,2019-09-06 12:35:50.033336+00,7
23683439,3536981,2019-01-08 16:17:17.393927+00,2020-09-07 16:20:47.150436+00,5
15872257,3728767,2021-05-14 10:08:47.247572+00,2019-09-30 07:14:38.71762+00,5
18454837,1128613,2019-06-11 14:40:11.728618+00,2018-10-07 13:20:46.45017+00,5
5116761,3585,2020-07-23 20:39:33.161357+00,2019-08-12 09:11:59.749479+00,5
10271072,2070334,2020-07-30 18:12:38.761505+00,2018-05-08 10:44:47.717659+00,5
10678630,1810526,2020-09-16 09:43:10.614558+00,2020-05-11 14:10:14.669544+00,7
3044465,5005665,2018-07-19 18:04:26.427925+00,2021-04-23 12:02:22.97898+00,6
4886184,713243,2019-01-07 02:38:48.639832+00,2020-03-18 04:51:05.86328+00,1
18076924,1739094,2019-09-05 10:25:13.148758+00,2021-05-31 02:02:25.141015+00,5
278964,1559737,2019-09-04 08:13:12.838103+00,2019-02-20 23:00:28.899561+00,5
24259619,4010986,2020-09-22 07:54:29.458045+00,2019-08-26 13:27:34.471812+00,5
17843452,8587917,2020-01-15 18:39:49.794212+00,2020-12-03 08:58:34.345704+00,5
12936562,3100668,2021-03-17 21:07:23.419447+00,2019-08-30 08:18:07.587285+00,5
16420284,1973779,2018-08-11 00:55:54.371839+00,2019-07-11 04:11:14.323478+00,5
6264530,2027574,2019-11-04 20:25:12.117865+00,2021-02-09 21:33:38.887933+00,5
17642084,2102015,2018-04-14 23:05:05.051135+00,2021-03-11 02:25:45.480613+00,6
16473332,804186,2020-09-14 09:06:23.039836+00,2021-02-22 23:55:55.226435+00,5
15609276,5037105,2020-08-12 10:52:27.426217+00,2019-07-26 09:13:13.872295+00,5
16420284,1739094,2021-05-02 06:36:10.12078+00,2019-10-27 13:34:49.748143+00,6
4529250,5652646,2020-04-21 17:15:41.910391+00,2020-08-05 17:33:17.662933+00,7
15769470,302038,2017-09-14 00:02:15.104662+00,2019-09-12 11:58:28.278927+00,5
19290285,5497197,2020-08-08 16:03:57.076531+00,2021-04-18 16:30:24.236143+00,5
14176654,947844,2018-01-13 04:42:18.310568+00,2017-07-14 10:42:05.132782+00,1
7764,2376417,2020-06-25 08:25:22.817884+00,2019-10-18 12:12:55.814447+00,5
15099587,1739094,2018-10-30 08:05:13.765034+00,2020-03-06 11:39:53.937056+00,5
5892120,4170843,2021-05-11 05:20:08.507179+00,2018-07-31 20:11:24.531994+00,7
4613540,1129372,2020-05-28 03:57:22.876312+00,2021-05-29 04:56:42.048459+00,6
20135003,2345386,2018-09-21 15:11:21.837885+00,2017-07-20 11:23:18.970972+00,5
12497750,424482,2021-03-01 21:36:27.529689+00,2020-09-07 00:11:29.498922+00,6
8699074,2849588,2020-07-14 16:51:57.541443+00,2019-06-21 07:10:04.335918+00,5
7287501,4649393,2021-04-16 10:07:54.534786+00,2020-08-02 09:36:39.119375+00,5
23683439,1739094,2021-01-18 17:54:30.714799+00,2018-01-22 05:31:59.727485+00,1
1304532,2849588,2018-08-17 12:08:39.312666+00,2019-12-05 12:45:47.888659+00,1
1390149,2435223,2020-05-06 16:01:20.869952+00,2019-09-25 09:50:26.520759+00,5
20459671,3880924,2019-07-25 00:54:45.371127+00,2021-02-04 13:12:09.838042+00,5
12936562,3265540,2020-03-04 16:30:20.514831+00,2021-05-11 05:21:10.780404+00,5
12104837,2303357,2018-02-23 08:09:04.184765+00,2020-11-24 06:21:28.844002+00,5
9975298,5497197,2019-08-05 22:51:33.652013+00,2021-06-01 07:45:52.932117+00,5
4435291,7942630,2021-02-21 12:06:35.599992+00,2021-04-30 14:20:56.779174+00,5
2887879,7517293,2020-12-15 10:04:11.249221+00,2018-12-28 11:26:09.405248+00,5
17775289,5851950,2020-10-31 23:21:38.378111+00,2021-03-16 04:35:37.323096+00,5
2865214,3066796,2020-02-20 11:04:51.193871+00,2018-08-11 00:55:54.371839+00,5
4053065,3869483,2020-10-21 11:46:36.39501+00,2020-01-14 19:38:27.644706+00,1
4529263,5037105,2021-06-01 07:45:52.932117+00,2021-03-14 16:04:27.189931+00,5
12703264,2034023,2020-07-20 22:15:36.879103+00,2019-01-22 16:18:02.750463+00,1
4549089,3265540,2021-03-30 01:45:50.967957+00,2020-05-27 08:53:31.529952+00,5
12497750,3371383,2020-03-03 20:53:50.529204+00,2018-09-19 10:28:39.740752+00,6
19161107,3369664,2020-01-09 15:20:05.707573+00,2021-04-14 14:39:31.319734+00,5
13380729,1739094,2019-11-20 11:45:28.687072+00,2019-07-04 13:14:01.086831+00,5
23683439,588215,2020-03-22 09:58:19.634044+00,2020-04-16 10:50:50.694788+00,5
16420284,2027574,2018-11-29 16:07:51.51246+00,2020-10-26 12:48:10.7838+00,5
5116706,7308587,2020-02-14 01:04:07.470656+00,2019-09-23 05:00:59.254777+00,7
22230136,3869483,2019-09-30 07:14:38.71762+00,2020-06-19 05:18:15.671491+00,5
3021573,2382929,2021-01-21 09:46:39.270774+00,2018-11-08 04:35:25.613255+00,5
12048922,3265540,2018-09-25 06:01:43.441186+00,2020-09-22 21:15:26.032127+00,5
12950919,1739094,2019-01-31 10:50:30.226119+00,2019-01-28 15:26:07.481132+00,3
4529288,2477447,2020-07-07 02:53:07.616165+00,2020-06-11 06:43:53.381689+00,5
4130920,533372,2019-11-13 18:47:28.269222+00,2020-06-24 12:04:06.012+00,5
18568770,97087,2021-04-26 03:04:16.261921+00,2021-01-29 23:02:49.331517+00,5
13792294,3443730,2020-01-21 19:14:13.606022+00,2019-07-17 09:47:44.506065+00,5
5116761,598828,2021-04-03 07:04:22.993+00,2019-05-28 03:22:18.097307+00,5
17406719,4863007,2021-02-01 02:41:53.269187+00,2021-04-09 20:56:19.866063+00,5
1652825,178117,2019-12-10 13:47:54.079396+00,2019-02-10 14:52:58.509436+00,5
7280694,6499434,2020-05-18 05:42:46.853707+00,2017-10-01 12:44:32.346662+00,5
15320138,969867,2021-01-20 05:37:18.113356+00,2021-02-05 07:46:29.631571+00,8
7764,1739094,2021-02-25 11:54:10.368648+00,2021-01-12 09:49:33.255676+00,5
12045153,6489439,2020-10-12 16:23:41.392036+00,2020-09-09 07:59:01.278214+00,5
4529276,3869483,2018-12-20 13:41:17.91652+00,2020-11-26 07:27:43.534889+00,5
7660899,124113,2020-11-22 09:46:40.215739+00,2020-04-06 09:46:53.53658+00,5
17601241,1739094,2019-08-04 05:25:10.716921+00,2021-03-28 17:20:54.846071+00,7
4529263,1568208,2020-10-27 09:24:54.111984+00,2020-10-29 08:14:34.646315+00,6
16473332,3265540,2021-01-21 20:46:56.375215+00,2020-06-29 16:03:57.244244+00,5
693269,5742511,2020-04-07 06:21:55.718756+00,2020-05-04 21:42:11.064636+00,6
12396962,5226892,2019-07-29 01:12:45.538057+00,2020-04-08 20:03:52.222669+00,5
278964,1598228,2020-06-22 04:45:17.522353+00,2020-06-11 20:32:52.408207+00,5
278964,1263493,2021-01-18 03:20:05.45107+00,2019-01-16 14:09:53.328012+00,7
5116761,1739094,2021-06-10 09:24:06.636847+00,2021-03-11 14:40:41.207284+00,5
1915107,5809837,2020-01-08 15:34:04.079+00,2020-08-31 19:26:51.1248+00,5
5825804,5226892,2020-09-29 02:52:07.952804+00,2019-03-25 09:53:08.911516+00,5
16180270,1739094,2020-06-23 14:57:47.994744+00,2020-11-12 17:40:29.016767+00,5
15683290,7985686,2018-10-14 06:02:15.016399+00,2019-12-06 11:16:05.936905+00,5
13789097,2191,2020-09-28 09:44:25.316496+00,2021-03-21 02:12:07.408425+00,5
4549089,1739094,2020-02-04 07:26:23.007719+00,2019-04-22 13:40:51.330715+00,5
3308420,2463288,2021-02-15 12:29:24.378491+00,2020-10-20 19:52:31.132001+00,1
1812894,8587917,2019-01-03 16:26:52.943847+00,2020-10-21 11:46:36.39501+00,12
14291478,3869483,2020-04-04 14:04:26.215278+00,2018-02-06 11:13:42.39554+00,5
13083,3265540,2019-11-05 22:45:37.409781+00,2018-09-13 18:25:00.950405+00,5
10262206,6499434,2019-10-29 22:31:13.445732+00,2021-04-08 02:22:38.08054+00,5
18176655,5226892,2018-02-26 11:38:55.567003+00,2021-04-08 15:03:55.93874+00,1
7222267,1739094,2018-12-02 10:32:24.752102+00,2019-05-03 11:01:00.623246+00,5
3610515,3265540,2020-08-31 03:27:17.628706+00,2020-04-09 15:42:33.790854+00,5
20135003,3902422,2021-02-26 02:17:55.292581+00,2019-09-10 07:08:31.122517+00,5
4834407,3040300,2017-12-03 06:41:13.675993+00,2017-12-03 06:41:13.675993+00,5
10902306,1417698,2020-06-08 07:18:42.217016+00,2018-11-06 09:44:38.895255+00,3
11017360,3265540,2019-10-22 04:45:53.069152+00,2020-06-23 14:57:47.994744+00,12
12936562,4896270,2020-01-31 08:08:50.690808+00,2021-06-07 20:35:58.660253+00,5
15636889,6499434,2019-11-12 16:33:56.566221+00,2018-02-08 16:20:34.583154+00,5
278964,663177,2020-01-16 16:40:27.150348+00,2021-04-12 22:23:21.219201+00,1
4549094,2471738,2020-07-15 12:36:37.482343+00,2020-10-16 16:48:01.343304+00,6
4549094,1988696,2020-02-21 07:59:54.765728+00,2017-05-19 00:00:06.836702+00,1
10491793,7985686,2021-03-10 11:28:29.041467+00,2017-11-15 13:05:48.290079+00,5
14176654,3265540,2019-09-27 13:26:04.538507+00,2020-02-16 22:45:46.465052+00,1
4529250,1950913,2021-05-17 02:51:25.417905+00,2018-09-25 06:22:15.022692+00,5
20135003,20694,2020-05-22 10:15:58.117303+00,2020-11-07 17:50:23.773327+00,5
2987043,2382929,2019-03-14 11:39:14.456171+00,2018-10-30 08:35:50.213835+00,3
4529288,3265540,2019-07-23 21:19:49.757136+00,2020-03-20 17:04:12.174586+00,6
18454837,5061015,2017-10-20 09:24:22.700276+00,2018-10-20 19:44:27.782304+00,5
25992522,2867531,2020-11-05 01:29:31.863072+00,2020-08-06 14:42:03.790586+00,5
3308420,1739094,2017-12-24 04:11:16.942155+00,2020-09-25 09:24:00.217035+00,1
20459671,867613,2020-05-07 13:56:23.931371+00,2018-05-02 19:56:15.73134+00,5
21565633,100770,2021-01-01 07:40:14.382962+00,2020-09-12 12:51:16.788238+00,5
9823231,1739094,2021-03-15 13:08:07.908906+00,2019-06-03 14:08:25.817251+00,5
12242774,7460871,2021-05-07 09:52:15.530183+00,2020-12-10 09:04:25.212935+00,1
278964,3073113,2020-11-27 15:43:08.246+00,2019-10-31 05:47:58.079536+00,5
14292786,1366740,2021-06-15 12:05:30.642092+00,2018-03-12 22:26:55.640976+00,5
16434065,5226892,2019-12-09 17:42:02.810678+00,2019-11-14 19:15:30.588658+00,5
14554853,177251,2020-02-06 17:27:39.726886+00,2020-01-19 23:31:20.839712+00,1
11056748,5762266,2019-04-05 07:16:46.471486+00,2018-05-13 19:37:52.265926+00,5
4529276,3265540,2020-11-24 20:06:23.617195+00,2020-07-02 23:28:06.130592+00,5
4549098,1231453,2019-05-25 18:46:54.164068+00,2020-11-22 09:46:40.215739+00,5
13382649,379090,2019-08-08 06:54:38.619473+00,2021-05-12 23:17:21.134729+00,5
20135003,3623799,2020-12-18 02:00:57.910942+00,2019-08-08 19:38:36.977838+00,5
1526831,4170843,2018-07-02 08:42:46.430599+00,2018-04-30 07:11:17.98297+00,5
16434065,1988696,2019-01-28 14:36:59.497671+00,2020-06-01 22:30:13.732237+00,5
4529276,3265540,2021-03-11 14:40:41.207284+00,2020-09-11 10:03:36.072715+00,5
19444843,598828,2020-07-23 04:36:53.492766+00,2020-08-20 19:37:08.044279+00,1
4311344,1739094,2020-05-18 20:57:23.605881+00,2019-08-16 09:32:50.88159+00,5
4529216,1739094,2021-06-04 12:45:03.278371+00,2021-03-17 09:05:29.458847+00,5
12661097,6489439,2021-05-23 10:15:16.213705+00,2018-04-22 18:44:35.499922+00,5
4529276,458202,2019-12-26 12:37:52.624761+00,2021-03-29 11:13:23.390641+00,5
16420284,598828,2018-03-19 21:20:35.823195+00,2018-05-21 17:15:14.027075+00,5
7682878,2704952,2021-01-07 20:37:59.751749+00,2020-03-14 23:06:51.687993+00,7
4549078,4073787,2018-09-13 18:02:31.49558+00,2018-06-09 17:26:29.026934+00,5
20177057,1129372,2020-12-21 19:31:12.99299+00,2017-10-06 14:05:36.000946+00,6
4312743,4896270,2019-12-08 13:06:23.336953+00,2020-02-13 07:03:59.41359+00,5
7509390,1739094,2021-05-31 02:02:25.141015+00,2021-01-20 05:37:18.113356+00,5
10576125,666473,2019-12-12 11:36:25.384235+00,2020-02-19 14:40:35.390727+00,5
16434065,3880924,2018-09-06 13:17:05.47654+00,2018-01-28 18:21:28.564323+00,5
25282237,4896270,2017-06-27 13:18:45.549818+00,2021-04-04 10:07:46.080534+00,5
15872257,3265540,2021-03-22 20:46:34.161609+00,2019-10-04 15:39:37.436685+00,5
12646193,533372,2019-01-16 14:04:44.337371+00,2020-11-23 12:41:36.37775+00,3
20135003,501986,2020-08-20 19:37:08.044279+00,2021-06-08 10:29:00.669596+00,5
18176655,335760,2020-10-07 16:33:35.947721+00,2019-10-03 12:34:56.9657+00,5
11776053,1257257,2019-08-19 08:49:12.021719+00,2020-03-16 13:45:47.769953+00,5
881991,4896270,2017-08-23 03:10:14.750084+00,2019-05-22 12:41:45.425395+00,7
17775289,4366278,2020-06-15 17:56:59.570408+00,2021-04-28 08:51:50.579714+00,5
4529288,4444258,2019-09-11 09:30:23.727937+00,2019-10-02 09:38:47.397534+00,1
14176654,137151,2020-01-12 23:56:44.053016+00,2020-05-14 03:29:46.501427+00,5
4958368,4010986,2020-05-19 15:09:07.69587+00,2021-05-17 14:18:15.233218+00,5
16434065,8587917,2018-04-24 22:46:25.591095+00,2019-11-25 13:26:15.351755+00,7
2732656,1588486,2019-01-22 16:14:51.488525+00,2021-03-31 06:48:11.211853+00,5
4529276,3869483,2020-02-26 15:14:41.98254+00,2021-01-04 19:53:22.216033+00,5
15034257,1129372,2019-06-23 15:00:06.874829+00,2020-07-27 22:46:01.326064+00,1
17852391,1602393,2021-04-22 19:31:08.361605+00,2018-04-12 06:39:20.652745+00,5
278964,1452866,2020-06-10 09:50:14.419913+00,2019-12-28 02:02:17.381088+00,6
23954639,3265540,2019-10-18 12:12:55.814447+00,2019-12-18 11:20:56.060212+00,5
4529253,1739094,2018-02-11 14:22:11.595477+00,2018-03-07 15:05:28.029164+00,5
4603023,3265540,2020-02-18 16:38:39.618655+00,2019-12-19 11:36:16.195111+00,5
2039510,1984357,2017-06-15 14:56:23.956842+00,2020-09-14 09:06:23.039836+00,1
8468661,4010986,2020-02-07 16:50:41.917811+00,2021-04-16 10:07:54.534786+00,1
6088891,1739094,2020-11-16 12:44:04.767869+00,2020-05-25 12:06:26.999408+00,12
3980791,100770,2021-01-26 14:30:55.256375+00,2020-06-08 07:18:42.217016+00,5
14292786,1739094,2021-05-21 17:10:24.261804+00,2020-08-27 17:31:34.853948+00,5
15814394,4366278,2017-06-22 08:01:33.651243+00,2020-10-07 02:15:42.17113+00,5
19284614,2045934,2019-11-16 03:08:31.833261+00,2020-10-01 05:27:05.540257+00,7
16461406,5851950,2019-09-06 12:35:50.033336+00,2019-09-16 07:37:56.744585+00,5
7743223,3869483,2021-01-05 14:49:19.024268+00,2020-10-31 23:21:38.378111+00,5
14743865,2963011,2019-01-29 17:23:40.511292+00,2021-05-25 03:45:42.110893+00,5
278964,7504310,2020-08-21 15:42:58.717557+00,2020-04-18 07:24:53.569742+00,5
3155904,6489239,2021-01-25 08:17:37.115742+00,2018-05-16 10:09:01.948825+00,3
3308420,5226892,2017-11-06 13:45:02.956462+00,2021-03-31 15:19:26.290978+00,5
4549080,3265540,2017-08-29 11:30:23.461994+00,2021-06-08 20:26:11.939104+00,5
1969388,469102,2021-02-02 12:59:08.932483+00,2021-04-27 07:03:55.3625+00,5
14291478,1201754,2020-06-09 16:07:30.175458+00,2021-04-05 11:49:14.089187+00,5
12045153,3265540,2021-05-10 01:58:26.928851+00,2019-05-23 17:57:17.229499+00,5
10902306,598828,2019-08-02 00:43:31.290983+00,2020-04-07 06:21:55.718756+00,5
19648480,5403006,2018-02-21 06:38:07.793913+00,2017-12-29 23:00:12.766996+00,3
13789097,1426633,2019-08-20 10:08:40.95169+00,2017-12-20 12:18:13.94172+00,5
16434065,4422746,2020-05-13 07:59:32.758427+00,2021-02-19 18:33:37.875655+00,5
4662166,2412020,2019-05-07 15:28:45.37822+00,2019-11-23 14:22:43.495384+00,5
7252523,1128613,2017-09-22 21:49:38.289312+00,2019-11-26 14:48:37.474986+00,5
15769470,5005665,2021-01-10 16:26:59.640846+00,2021-04-26 14:38:36.446191+00,5
4435522,1739094,2021-02-26 16:33:14.59129+00,2021-06-03 09:27:04.451976+00,5
16420284,3265540,2017-12-12 08:16:36.661509+00,2018-05-05 04:28:36.980395+00,5
3887144,3536981,2020-06-26 03:03:14.029078+00,2020-08-03 10:59:37.642+00,7
15971937,3869483,2020-06-12 18:20:37.236724+00,2019-12-16 14:43:10.667914+00,6
5116759,1273586,2021-05-05 14:47:14.935098+00,2019-01-24 10:45:40.527683+00,5
8745656,1739094,2019-04-07 19:41:00.189169+00,2019-12-23 02:10:59.632128+00,5
20699,3869483,2020-12-09 14:18:09.744727+00,2020-12-01 07:57:43.922957+00,5
10187007,2975900,2020-06-11 06:43:53.381689+00,2017-12-15 17:19:03.74224+00,5
17014783,2435223,2019-12-24 10:05:11.937033+00,2020-10-20 07:46:55.3395+00,5
25617120,4142511,2017-07-09 15:23:13.996385+00,2021-04-19 23:55:04.817314+00,5
15181668,2578846,2020-04-17 07:46:51.659051+00,2020-08-13 23:12:00.127925+00,6
4318384,4477392,2018-11-12 23:58:03.791726+00,2021-02-11 19:57:24.867215+00,5
12936562,2849588,2021-04-17 00:27:39.822538+00,2019-01-14 22:40:51.312074+00,6
12936562,4613299,2021-04-04 10:07:46.080534+00,2021-03-05 01:25:57.452057+00,5
9998079,3590031,2018-02-06 11:13:42.39554+00,2019-11-22 08:43:32.274768+00,5
4380194,3468682,2020-06-29 16:03:57.244244+00,2018-01-13 04:42:18.310568+00,5
19648480,1377904,2017-06-02 11:14:53.300152+00,2020-11-13 13:35:18.999558+00,5
7818965,1407788,2020-12-30 19:17:33.015815+00,2019-05-19 18:15:49.494078+00,5
4549094,3265540,2020-01-07 11:05:12.047626+00,2021-05-31 13:44:44.849765+00,5
2865214,1231453,2019-07-30 09:41:12.745+00,2019-08-04 05:25:10.716921+00,5
14588374,217015,2019-05-10 14:16:27.867576+00,2018-02-19 06:45:58.075011+00,5
12497750,1129372,2018-10-20 19:39:47.439434+00,2017-12-24 04:11:16.942155+00,6
19161107,1739094,2021-03-07 03:19:26.300972+00,2018-01-24 12:38:35.765387+00,5
1687012,20694,2021-04-18 16:30:24.236143+00,2017-12-07 02:18:00.451418+00,1
5524948,2055178,2020-12-28 16:36:47.753547+00,2021-01-07 06:58:42.606605+00,5
18454837,1128613,2020-09-08 12:31:14.884191+00,2020-10-22 19:56:39.210337+00,5
15099587,3265540,2018-04-12 06:39:20.652745+00,2020-05-05 18:22:43.490715+00,5
4053065,3258603,2018-05-18 13:15:54.229948+00,2019-06-26 09:35:58.056702+00,5
2030822,1739094,2020-11-19 08:56:18.299381+00,2018-06-19 16:11:07.616509+00,5
4505666,5742511,2018-01-28 18:21:28.564323+00,2019-04-24 02:35:11.666326+00,5
23683439,1615409,2018-03-12 22:26:55.640976+00,2019-09-11 09:30:23.727937+00,5
4549087,1739094,2021-04-24 08:57:15.212495+00,2019-11-01 06:55:57.26396+00,5
4529222,4359557,2017-12-20 12:18:13.94172+00,2021-05-11 16:45:42.66919+00,5
11096787,1366740,2020-02-12 09:04:42.618022+00,2020-01-08 15:34:04.079+00,5
12045153,7942630,2020-04-12 19:41:31.646822+00,2020-10-09 21:11:30.399986+00,7
4359985,2882487,2021-03-08 12:02:48.766089+00,2021-03-01 21:36:27.529689+00,9
5116762,421592,2020-08-31 19:26:51.1248+00,2020-07-27 05:10:19.672049+00,5
12447364,2477447,2018-12-17 10:20:24.199456+00,2018-08-08 15:33:34.965137+00,6
17775289,5867022,2021-02-22 23:55:55.226435+00,2019-07-30 09:41:12.745+00,5
14176654,3722746,2021-05-27 10:33:56.806665+00,2021-05-28 11:14:51.926914+00,1
11160640,1739094,2021-06-14 09:50:47.43762+00,2020-11-03 17:46:23.939113+00,3
14140484,6499434,2021-05-29 04:56:42.048459+00,2021-01-22 12:17:40.024697+00,5
16894325,3880924,2021-05-15 05:04:39.4635+00,2020-11-29 08:29:13.996475+00,1
4529276,4036857,2021-06-10 19:18:55.530227+00,2021-06-16 00:12:27.618042+00,3
17642084,4896270,2019-08-28 23:31:48.499134+00,2021-01-25 18:34:30.156427+00,1
17509904,3078133,2017-11-19 00:09:28.063557+00,2020-12-29 15:58:28.518691+00,5
17406719,2011351,2020-02-05 19:11:06.447+00,2021-06-17 01:23:30.57819+00,5
5405392,2849588,2020-02-14 21:35:06.361247+00,2021-05-12 10:17:56.493893+00,5
4549098,5226892,2019-11-30 09:32:16.00329+00,2017-06-15 14:56:23.956842+00,5
8355606,1129372,2019-09-10 07:08:31.122517+00,2019-06-13 04:15:51.958134+00,7
9457606,1277700,2019-09-03 08:53:33.679569+00,2021-01-04 06:36:46.151404+00,12
12646193,1739094,2020-06-28 20:23:19.620808+00,2021-06-10 19:18:55.530227+00,1
19699849,3902422,2021-03-12 10:24:38.849224+00,2020-09-26 17:58:17.346389+00,5
20878041,2747936,2020-04-14 16:58:15.847965+00,2021-06-02 09:45:22.99726+00,5
3044465,510442,2021-05-28 11:14:51.926914+00,2018-10-25 10:38:16.546949+00,1
4529243,1739094,2019-01-21 08:40:29.509664+00,2020-06-25 08:25:22.817884+00,5
13914485,3869483,2019-06-26 09:35:58.056702+00,2021-01-10 16:26:59.640846+00,5
16434065,3265540,2019-09-23 05:00:59.254777+00,2021-05-06 16:43:30.168979+00,5
5116767,1892863,2021-03-04 12:50:04.073695+00,2019-01-18 08:54:12.278875+00,7
15099587,1739094,2020-03-10 22:05:31.561655+00,2018-08-03 05:00:39.316428+00,1
14292786,1739094,2020-02-25 16:49:40.56435+00,2020-02-17 20:07:23.520814+00,1
16420284,2570165,2020-03-13 11:30:13.830249+00,2018-08-06 14:58:08.699644+00,5
16434065,5516915,2021-02-03 05:02:25.222871+00,2018-12-26 07:41:00.770439+00,7
9561343,2666484,2021-03-24 16:00:03.582282+00,2020-01-13 22:37:27.554593+00,5
15320119,1129372,2020-05-14 22:02:30.743037+00,2017-08-29 11:38:41.9326+00,5
15814394,4830742,2019-05-09 06:41:22.354+00,2021-02-01 02:41:53.269187+00,5
4549090,713243,2020-09-26 17:58:17.346389+00,2021-03-24 16:00:03.582282+00,7
23683439,1792180,2021-01-08 16:50:00.91818+00,2020-10-08 11:58:53.897252+00,5
4529249,1739094,2020-02-01 13:46:10.307473+00,2019-04-01 04:25:30.658599+00,5
4505666,2882487,2018-04-19 18:28:40.391256+00,2019-01-11 23:35:24.170872+00,8
4529243,3902422,2017-11-02 13:39:26.474383+00,2018-12-18 20:58:45.349851+00,5
4549090,8587917,2021-06-02 19:15:08.107871+00,2019-09-26 12:05:18.372211+00,5
12799969,2287637,2020-03-18 04:51:05.86328+00,2020-04-20 08:39:10.316906+00,5
12497750,2172472,2018-08-03 05:00:39.316428+00,2021-04-15 16:21:00.91208+00,5
20135003,3869483,2021-03-23 13:07:32.271274+00,2020-05-22 10:15:58.117303+00,5
3608833,748267,2021-03-26 11:13:03.551369+00,2019-04-03 17:54:44.790956+00,5
11214782,4671331,2020-11-12 17:40:29.016767+00,2020-09-25 11:40:40.027+00,5
10476374,1786152,2019-10-16 11:18:55.267385+00,2018-09-17 10:05:19.792262+00,5
19161107,915442,2020-01-23 17:42:33.865301+00,2020-08-24 14:57:49.398085+00,6
14176654,4392536,2020-02-22 08:23:38.903839+00,2018-04-24 23:02:42.535942+00,5
13893570,2865236,2020-01-27 10:11:33.407504+00,2017-11-19 00:09:28.063557+00,7
17843452,1739094,2021-02-01 18:33:46.857979+00,2019-05-21 08:25:55.564951+00,7
11017360,2139796,2020-04-13 20:29:15.42042+00,2019-11-19 12:23:28.05543+00,5
19718091,3258603,2020-12-14 14:08:13.575223+00,2020-09-08 12:31:14.884191+00,5
15633187,753331,2017-12-29 23:00:12.766996+00,2020-08-18 14:14:22.216352+00,5
12936562,3869483,2019-07-12 09:33:03.254093+00,2020-12-15 10:05:07.96361+00,5
4529233,3902422,2021-04-13 12:21:55.845005+00,2021-01-01 07:40:14.382962+00,6
14176654,4077474,2021-06-02 09:45:22.99726+00,2020-06-30 13:04:17.930262+00,5
8770358,1739094,2017-11-13 02:01:50.241263+00,2019-06-23 15:00:06.874829+00,5
5812532,222909,2020-07-08 12:44:41.575597+00,2018-04-03 11:15:37.159401+00,5
14291478,3265540,2021-03-16 04:35:37.323096+00,2019-04-10 14:52:21.100302+00,5
13893570,7942630,2017-07-14 10:13:39.383502+00,2020-01-17 14:04:09.211906+00,5
12936562,8707832,2019-03-04 11:59:36.149985+00,2018-11-28 01:07:31.453958+00,5
17852391,3265540,2018-05-31 08:34:19.332401+00,2021-01-29 08:57:11.906393+00,5
11286868,4997388,2019-11-01 06:55:57.26396+00,2021-04-22 08:15:10.280365+00,5
15099587,652505,2019-12-13 10:15:44.965722+00,2020-09-16 09:43:10.614558+00,5
17852391,3884590,2019-02-20 22:24:22.504406+00,2021-06-02 19:15:08.107871+00,5
15814394,5403006,2021-04-19 23:55:04.817314+00,2021-01-23 17:22:22.306987+00,1
19699849,5226892,2019-01-10 10:02:34.675673+00,2020-10-11 23:01:47.791578+00,5
2865214,4513747,2020-07-20 06:51:29.728578+00,2019-02-08 00:29:21.607814+00,5
1969388,76736,2018-04-05 10:24:49.577668+00,2021-02-24 18:51:25.284819+00,1
4529253,1739094,2020-12-22 15:49:25.572482+00,2020-12-11 15:07:44.21927+00,1
13593739,1798837,2020-03-19 04:22:15.037384+00,2020-05-18 20:57:23.605881+00,8
7684628,4433020,2019-08-13 14:13:51.490114+00,2019-09-19 10:39:13.256528+00,5
13192291,4896270,2020-09-03 03:20:18.873919+00,2021-04-01 15:35:51.899592+00,5
15814394,1129372,2020-04-16 10:50:50.694788+00,2020-12-16 00:32:16.163095+00,5
12045153,3265540,2018-02-08 16:20:34.583154+00,2018-06-04 12:41:42.477938+00,5
19731527,5037105,2018-03-09 21:48:40.186617+00,2021-01-19 12:13:24.924975+00,5
22756795,1739094,2021-01-04 19:53:22.216033+00,2021-03-23 13:07:32.271274+00,5
4529276,6395788,2018-07-23 19:05:59.034395+00,2021-01-06 11:19:00.488607+00,3
15099587,2666484,2019-12-06 11:16:05.936905+00,2020-09-15 14:32:16.955746+00,1
15814394,1588486,2019-12-30 20:13:54.817299+00,2020-06-28 20:23:19.620808+00,5
15970063,1799922,2020-05-01 18:08:09.427216+00,2020-08-25 12:03:34.449458+00,5
15814394,1739094,2019-04-16 09:54:23.098694+00,2020-09-17 03:12:10.147028+00,5
4549090,2849588,2019-04-01 04:04:08.429414+00,2019-12-11 12:10:33.408425+00,7
10576125,4553189,2019-10-10 12:18:41.360872+00,2019-08-02 00:43:31.290983+00,7
13192291,5042335,2019-07-18 12:57:04.061837+00,2018-01-31 12:56:32.374902+00,5
7322110,1786152,2021-04-07 11:13:55.18833+00,2018-09-06 13:24:10.682542+00,5
2325728,5226892,2020-08-10 21:55:42.990839+00,2021-02-19 04:56:55.241934+00,5
8599490,3536981,2020-07-31 15:06:33.788178+00,2020-06-26 03:03:14.029078+00,5
12497750,533372,2020-11-29 08:29:13.996475+00,2019-06-27 16:03:33.347599+00,5
13789097,1739094,2017-08-05 10:24:05.56176+00,2017-11-02 13:39:26.474383+00,5
1715577,3265540,2020-11-10 15:13:40.164827+00,2021-02-22 11:59:26.701627+00,3
5373657,509805,2020-05-10 01:29:45.575494+00,2021-01-26 14:30:55.256375+00,5
12045153,3814125,2017-09-26 15:50:38.939145+00,2021-02-07 23:25:53.160002+00,5
10902306,3869483,2021-03-31 06:48:11.211853+00,2020-06-26 20:20:21.382933+00,5
10080726,4950475,2018-05-02 19:50:58.110149+00,2019-04-09 08:18:20.433803+00,5
18039876,443319,2019-08-12 09:11:59.749479+00,2019-04-19 09:57:13.921658+00,5
3441829,1739094,2020-07-01 09:42:07.66845+00,2019-03-04 12:05:17.236553+00,5
12936562,1739094,2021-05-03 11:43:34.851983+00,2019-02-22 12:28:45.694544+00,6
21565633,2370920,2019-03-21 00:02:17.271091+00,2019-05-17 09:08:38.066917+00,5
15320138,3265540,2020-06-11 20:32:52.408207+00,2020-01-29 08:27:18.312277+00,6
12936562,713243,2019-09-09 00:38:08.741542+00,2021-03-09 07:54:55.098984+00,5
15320119,5149700,2020-07-14 04:20:01.065274+00,2018-11-03 07:31:44.056862+00,5
3177816,5867022,2019-11-14 19:15:30.588658+00,2020-11-18 14:50:04.032178+00,5
17642084,6487670,2018-10-27 11:34:13.379372+00,2019-08-09 15:03:43.074365+00,5
5524948,6487670,2020-06-26 20:20:21.382933+00,2020-12-21 04:18:26.214038+00,3
12936562,236208,2019-09-16 07:37:56.744585+00,2020-04-17 07:46:51.659051+00,5
4435522,111492,2021-03-12 22:37:29.84858+00,2018-08-27 11:19:46.752002+00,1
11804874,1739094,2020-07-13 08:05:56.069948+00,2020-08-13 07:05:05.944428+00,5
9864077,4362045,2019-05-28 03:22:18.097307+00,2018-12-12 08:44:03.97437+00,5
4549077,8587917,2020-03-06 11:39:53.937056+00,2020-09-02 10:16:57.531624+00,5
3391926,1739094,2020-05-29 16:35:49.235556+00,2020-01-06 11:21:11.791619+00,3
11286868,2986888,2021-04-12 22:23:21.219201+00,2020-05-18 05:42:46.853707+00,6
14291478,1334848,2019-08-07 05:51:14.060673+00,2018-02-23 08:09:04.184765+00,5
9383131,3265540,2018-01-16 08:24:29.025851+00,2020-02-05 01:50:23.428898+00,5
16434065,2570165,2020-02-16 22:45:46.465052+00,2020-03-04 16:30:20.514831+00,5
20034838,3265540,2018-10-16 13:47:59.941992+00,2021-03-03 07:10:35.855195+00,7
16107489,1739094,2018-08-29 13:46:58.284352+00,2019-09-27 13:26:04.538507+00,7
17852391,1950913,2020-06-02 16:31:12.668757+00,2020-01-21 19:14:13.606022+00,3
4549080,1892863,2021-01-20 15:55:19.436087+00,2021-01-21 09:46:39.270774+00,5
18299655,1141964,2020-07-27 05:10:19.672049+00,2021-01-08 16:50:00.91818+00,5
3268192,4422746,2021-05-25 15:16:30.667663+00,2018-11-23 03:30:34.250678+00,6
4549089,4896270,2019-11-21 10:07:36.490195+00,2021-05-18 16:59:13.381025+00,5
4529243,8587917,2020-05-23 13:53:26.907432+00,2019-10-23 05:03:29.268+00,5
20459671,827279,2017-07-25 23:29:17.085872+00,2020-12-18 02:08:13.406444+00,6
14292786,2103485,2021-03-17 09:05:29.458847+00,2018-10-09 14:36:25.624719+00,5
5116705,5226892,2021-04-22 08:15:10.280365+00,2020-11-03 04:10:45.850905+00,5
4549094,1739094,2021-06-16 00:12:27.618042+00,2020-09-03 18:15:27.553312+00,1
4529288,3604301,2019-02-06 10:51:42.412691+00,2020-06-04 23:47:15.899189+00,5
5116765,2345386,2017-08-17 07:30:10.040541+00,2020-08-11 16:10:30.854833+00,5
3752814,5037105,2019-02-13 14:46:15.17754+00,2020-04-28 07:33:14.238447+00,5
18695663,3235026,2020-07-03 21:54:07.445112+00,2019-03-08 19:35:55.096083+00,5
17014783,1739094,2020-10-09 21:11:30.399986+00,2020-02-04 07:26:23.007719+00,1
4529250,7553590,2021-03-24 04:25:20.281592+00,2020-08-28 16:13:25.838843+00,1
12935556,3265540,2021-03-19 01:35:32.868488+00,2018-07-04 11:40:38.354+00,1
10902306,43087,2021-03-02 14:10:11.706498+00,2019-01-21 08:50:39.101866+00,5
15320119,3265540,2019-07-20 03:14:36.641553+00,2020-04-03 08:52:50.612076+00,5
11650925,2102015,2020-10-22 19:56:39.210337+00,2020-07-09 08:03:59.871182+00,5
11650925,1358130,2018-11-28 00:28:14.988949+00,2020-04-21 17:15:41.910391+00,5
16434065,753331,2021-05-18 16:51:30.870744+00,2018-07-07 14:10:51.980847+00,5
6693912,3869483,2020-08-18 14:14:22.216352+00,2021-06-05 07:30:07.882498+00,7
22230136,1366740,2021-03-28 17:20:54.846071+00,2020-04-28 20:08:33.244452+00,5
5116765,3265540,2020-02-24 19:54:59.050748+00,2017-09-22 21:49:38.289312+00,5
7222267,1739094,2020-09-07 16:20:47.150436+00,2019-10-09 11:53:17.756226+00,5
8836287,2079234,2021-02-16 23:51:16.407927+00,2017-06-27 13:18:45.549818+00,1
984891,2352373,2021-04-01 06:44:57.974224+00,2019-03-15 16:49:46.713721+00,5
16043034,3880924,2019-10-14 06:58:50.355515+00,2017-11-13 02:01:50.241263+00,5
19444843,424482,2019-07-08 20:04:42.906816+00,2017-07-26 01:44:07.431616+00,5
4549077,4896270,2020-09-29 16:19:05.123215+00,2021-01-07 20:37:59.751749+00,5
278964,15140,2021-04-09 08:42:26.750534+00,2021-02-16 23:51:16.407927+00,5
4549098,1129372,2020-04-18 07:24:53.569742+00,2021-02-15 15:55:57.137+00,5
4549094,3536981,2021-01-29 23:02:49.331517+00,2020-02-25 16:49:40.56435+00,5
14231571,3056166,2020-01-02 12:49:22.058215+00,2021-02-21 12:06:35.599992+00,5
5116802,2470820,2020-01-03 20:23:10.727695+00,2021-05-26 18:35:44.213774+00,6
18568770,2345386,2021-04-06 07:36:52.255227+00,2020-09-17 18:21:03.750922+00,5
20173240,2270194,2020-01-28 09:48:44.794051+00,2020-10-04 10:34:54.252879+00,5
14503185,4125958,2020-09-25 12:16:37.874695+00,2020-08-23 23:38:16.397388+00,5
20135003,1739094,2020-03-09 10:28:30.63876+00,2020-10-25 13:06:45.308798+00,6
12048922,630012,2020-11-03 17:46:23.939113+00,2018-09-11 19:41:50.392242+00,5
4529276,3265540,2018-10-25 10:35:57.452973+00,2020-05-10 01:29:45.575494+00,5
16086928,2070334,2020-11-07 17:50:23.773327+00,2019-11-04 20:25:12.117865+00,5
21344397,1614863,2020-07-27 22:46:01.326064+00,2020-07-06 07:27:06.732721+00,5
4549096,2178724,2020-01-29 08:27:18.312277+00,2019-11-03 07:48:39.942083+00,5
21565633,1739094,2019-10-08 09:38:17.43015+00,2021-06-07 11:20:53.67972+00,1
18454837,4041675,2021-03-09 18:44:48.179602+00,2021-06-10 09:24:06.636847+00,5
3980791,1739094,2019-07-11 04:11:14.323478+00,2019-02-17 22:39:00.021+00,5
1492633,2876464,2018-07-17 14:57:47.182936+00,2019-11-30 09:32:16.00329+00,5
18454837,6512759,2018-10-09 14:36:23.104005+00,2020-02-21 07:59:54.765728+00,5
15871395,978743,2021-03-26 23:01:18.81014+00,2019-11-28 18:48:47.709638+00,5
7421222,4896270,2018-09-17 10:05:10.619285+00,2020-02-29 23:38:19.028282+00,7
3268192,134289,2019-11-26 14:48:37.474986+00,2017-10-28 21:34:38.116877+00,5
16894325,3869483,2020-03-11 15:47:16.944798+00,2019-06-18 10:12:04.838796+00,5
3751281,2849588,2019-11-09 15:11:29.766024+00,2018-07-13 15:27:00.464907+00,5
17041127,7517293,2018-08-14 14:39:38.641667+00,2020-06-01 02:41:43.80042+00,6
19161107,2709870,2019-11-27 16:48:45.838387+00,2021-04-14 04:10:04.720413+00,5
5423786,1263493,2020-01-24 18:51:22.608944+00,2019-08-21 12:34:12.666048+00,5
2941444,2079234,2017-10-25 07:20:59.868399+00,2021-04-06 18:48:23.64176+00,3
11513622,4896270,2018-04-22 17:48:13.506478+00,2020-01-16 16:40:27.150348+00,1
2716141,147005,2020-07-24 19:55:54.12568+00,2021-05-06 06:09:22.974339+00,1
11626928,1129372,2021-05-24 11:31:57.759876+00,2020-07-21 13:27:23.006668+00,5
10310073,4291409,2020-09-15 14:32:16.955746+00,2019-09-05 10:25:13.148758+00,5
15256738,1302695,2017-07-31 09:41:37.106071+00,2020-11-30 12:30:15.419855+00,5
3308420,4896270,2020-07-02 23:28:06.130592+00,2021-04-02 11:03:12.800128+00,5
16434065,1739094,2021-02-09 09:50:14.161593+00,2019-10-24 06:24:39.213227+00,5
15099587,3869483,2018-04-30 07:09:03.061902+00,2020-12-08 22:18:36.37221+00,5
5066481,3265540,2021-06-08 20:23:43.747722+00,2018-12-10 13:52:57.63957+00,5
23959163,1659309,2019-02-04 15:45:32.276701+00,2019-05-30 15:03:23.950099+00,5
4529216,1739094,2019-09-25 09:50:26.520759+00,2021-05-26 08:38:27.751793+00,5
4529288,4967333,2020-06-18 10:20:08.482643+00,2019-12-10 13:47:54.079396+00,5
4549096,5226892,2019-04-03 17:48:54.184157+00,2020-11-04 11:33:36.886587+00,5
25617201,540275,2020-04-28 20:08:33.244452+00,2018-06-13 01:45:38.581042+00,3
18454837,1690635,2020-12-27 08:10:15.699997+00,2020-09-24 12:36:07.517891+00,5
6005423,496614,2018-09-19 10:07:14.172271+00,2020-02-28 12:40:40.093438+00,6
4549080,1739094,2020-12-10 21:02:53.827268+00,2021-06-16 13:46:31.108876+00,1
23683439,2849588,2019-12-04 12:24:17.868646+00,2019-08-22 15:24:28.341+00,5
4529276,1739094,2020-07-07 19:12:53.305138+00,2020-07-02 07:26:46.035191+00,3
8745656,510442,2019-05-29 08:13:16.891317+00,2020-03-30 04:47:31.270845+00,5
21808725,3265540,2021-03-05 01:25:57.452057+00,2017-08-23 06:25:17.767004+00,5
5116762,1739094,2018-11-23 03:30:28.519377+00,2020-10-28 13:20:29.641515+00,5
15099587,1263493,2021-02-17 15:55:50.855104+00,2021-02-16 07:42:41.384129+00,9
4529222,390440,2020-06-17 13:58:51.744+00,2020-12-30 19:17:33.015815+00,5
5113253,1554703,2018-08-21 05:29:32.725891+00,2019-12-12 11:36:25.384235+00,7
10955556,100770,2019-03-18 09:54:43.887868+00,2020-04-25 14:23:38.368469+00,5
7898047,4950475,2018-06-19 16:11:07.616509+00,2020-11-25 14:26:07.302456+00,5
10576125,2178724,2019-08-14 16:29:14.09519+00,2020-07-28 15:21:49.257664+00,5
3706714,1317976,2019-10-03 12:34:56.9657+00,2021-04-22 19:31:08.361605+00,5
4549096,1213452,2019-05-06 07:15:25.088575+00,2020-08-10 21:55:42.990839+00,5
11182940,3866537,2019-04-02 11:20:57.92892+00,2020-09-21 13:02:57.60715+00,5
18176655,3258603,2020-06-01 22:30:13.732237+00,2021-03-16 15:26:53.364646+00,1
278964,4496733,2021-04-29 09:55:57.216441+00,2020-02-07 16:50:41.917811+00,1
278964,3040300,2020-03-19 21:27:34.964584+00,2018-11-19 16:06:53.615298+00,5
18176655,1739094,2019-11-06 19:27:45.304159+00,2020-06-15 17:56:59.570408+00,5
17014783,189551,2018-05-05 04:17:58.825055+00,2020-03-25 10:54:28.897484+00,5
12343325,1739094,2020-01-06 11:21:11.791619+00,2021-05-20 14:25:05.454763+00,5
7509390,1739094,2019-09-01 19:15:27.653791+00,2020-07-30 05:14:54.466501+00,6
13792294,753331,2019-10-27 13:34:49.748143+00,2020-03-11 15:47:16.944798+00,1
3673718,4896270,2021-03-16 15:26:53.364646+00,2020-03-10 22:05:31.561655+00,1
7540316,5016494,2019-05-30 15:03:23.950099+00,2021-04-19 12:07:33.592991+00,5
4529250,1739094,2021-03-05 15:20:06.366624+00,2019-04-14 10:45:43.145804+00,1
4549078,5425454,2020-01-21 01:09:02.91156+00,2018-12-05 19:35:00.33221+00,5
5116759,3265540,2020-11-04 11:33:36.886587+00,2019-04-07 19:49:19.801715+00,5
25617202,64248,2020-06-04 23:47:15.899189+00,2020-01-02 12:49:22.058215+00,5
17843452,18385,2019-06-29 14:44:07.309267+00,2021-02-11 07:01:26.121571+00,5
15099587,2709870,2021-04-20 12:15:16.277991+00,2019-02-04 16:05:50.805208+00,1
5116802,2178724,2021-06-11 20:14:18.720619+00,2019-02-26 15:26:35.076281+00,5
4549098,3265540,2020-09-17 18:21:03.750922+00,2020-04-15 13:52:30.358894+00,5
4563526,1739094,2020-11-03 04:10:45.850905+00,2021-04-29 22:03:26.070453+00,7
5116762,1739094,2019-10-02 09:38:47.397534+00,2018-09-30 02:39:08.339114+00,5
20135003,5742511,2020-04-02 11:31:37.09857+00,2019-07-10 00:00:28.898031+00,7
24450109,3869483,2018-06-28 14:25:12.79911+00,2021-05-25 15:16:30.667663+00,5
16461985,3265540,2021-04-12 10:22:44.144084+00,2020-05-01 18:08:09.427216+00,5
25149831,1263493,2020-10-09 08:31:35.293913+00,2019-11-20 11:45:28.687072+00,3
11626928,3265540,2019-12-17 13:24:49.975467+00,2020-10-27 09:24:54.111984+00,5
4630437,4896270,2020-12-10 09:00:19.164043+00,2018-10-16 13:48:03.222803+00,5
4667009,3884590,2019-03-19 14:13:52.743735+00,2018-06-06 11:52:25.568226+00,3
12104837,3066796,2020-12-07 14:28:57.345189+00,2020-09-30 10:51:18.998367+00,5
15412023,1739094,2021-03-09 07:54:55.098984+00,2020-07-16 08:22:23.354306+00,5
14462309,1598228,2020-05-20 11:23:59.96998+00,2017-09-26 15:50:38.939145+00,7
8062778,3869483,2018-08-23 14:24:38.056547+00,2020-10-01 20:20:14.010386+00,5
5948941,1739094,2018-08-06 14:58:08.699644+00,2021-02-23 15:12:00.609029+00,5
4205665,3287313,2017-10-28 21:34:38.116877+00,2020-08-04 07:04:34.941997+00,6
6305984,1702559,2019-06-04 18:15:30.947894+00,2019-10-15 09:13:07.884557+00,7
11510839,1739094,2018-03-02 11:25:11.110013+00,2020-03-19 04:22:15.037384+00,5
19161107,893264,2021-05-20 02:50:36.269383+00,2018-05-31 08:34:19.332401+00,5
15099587,5226892,2020-08-07 10:20:29.917273+00,2019-05-15 20:54:22.916305+00,5
17021235,6485791,2021-06-03 19:29:58.580746+00,2021-05-27 10:33:56.806665+00,5
11035489,1739094,2018-07-04 11:40:38.354+00,2018-07-02 08:42:46.430599+00,5
5116765,3165731,2021-04-28 08:51:50.579714+00,2017-11-09 10:19:19.335675+00,5
4886184,2849588,2020-11-02 11:45:08.921316+00,2020-02-22 08:23:38.903839+00,5
3204144,2034023,2020-12-29 15:58:28.518691+00,2020-12-14 14:08:29.742103+00,5
12242774,915442,2020-08-28 16:13:25.838843+00,2020-01-21 01:09:02.91156+00,7
10360040,652505,2020-01-13 22:37:27.554593+00,2018-12-07 13:16:59.80593+00,1
9154812,8169704,2018-12-28 11:09:55.074621+00,2020-02-23 23:25:08.034912+00,5
18454837,3056166,2020-04-10 17:15:28.404196+00,2020-05-03 22:58:41.639531+00,5
3836952,4379087,2020-12-04 17:19:55.702515+00,2019-04-16 09:54:23.098694+00,1
20644575,1416290,2021-02-19 18:33:37.875655+00,2019-03-01 14:12:00.16866+00,6
4549096,1690635,2021-03-25 08:37:53.240499+00,2021-01-05 14:49:19.024268+00,3
15985467,8587917,2021-02-07 23:25:53.160002+00,2019-07-08 20:04:42.906816+00,5
7764,5226892,2020-05-27 08:53:31.529952+00,2021-02-03 17:53:52.348141+00,7
13789097,3265540,2018-01-10 09:21:38.587296+00,2019-03-18 09:55:11.061924+00,5
25617120,3536981,2018-10-04 14:44:51.783155+00,2019-12-15 10:03:20.523305+00,5
20699,356397,2020-08-26 08:37:57.121522+00,2020-10-09 08:31:35.293913+00,5
25615735,3536981,2021-04-28 18:05:07.297709+00,2019-12-24 10:05:11.937033+00,5
4667009,1128613,2020-08-06 14:42:03.790586+00,2020-03-02 12:14:23.98671+00,5
11160640,43087,2020-08-10 08:54:27.019327+00,2020-05-08 12:12:20.236519+00,5
12045153,1739094,2019-04-22 13:40:51.330715+00,2020-11-16 12:44:04.767869+00,5
10182945,1129372,2019-08-30 08:18:07.587285+00,2021-03-19 14:50:49.081582+00,5
12836653,2374717,2021-05-20 14:24:33.716335+00,2020-07-07 19:12:53.305138+00,5
4435522,2030303,2020-10-23 15:11:55.313763+00,2020-07-17 01:59:44.292931+00,5
3672044,3265540,2019-02-15 05:13:00.001447+00,2019-03-05 16:59:49.974255+00,5
7380280,1318,2021-04-09 20:56:19.866063+00,2018-04-10 01:01:41.254832+00,5
14176654,3869483,2019-02-28 03:48:29.947078+00,2021-04-13 12:21:55.845005+00,5
17017582,1739094,2020-03-17 11:02:11.869398+00,2019-04-17 16:08:46.75505+00,5
21565633,921150,2020-09-01 15:42:55.701252+00,2020-11-17 08:52:16.901258+00,5
12497750,1129372,2019-11-25 13:26:15.351755+00,2021-01-20 15:55:19.436087+00,1
16646002,1598228,2018-12-26 07:34:56.534859+00,2019-07-20 03:14:36.641553+00,5
4529250,1598228,2020-03-27 01:28:56.67792+00,2020-06-03 12:04:47.797737+00,5
13792294,1739094,2020-11-09 22:41:08.053418+00,2018-07-17 14:57:47.182936+00,5
2887879,753331,2018-06-04 12:41:42.477938+00,2020-08-20 05:20:47.245941+00,7
5457755,3869483,2020-03-25 10:54:28.897484+00,2020-10-14 15:29:33.6402+00,5
25617260,3378936,2021-05-10 13:34:02.739334+00,2020-08-07 10:20:29.917273+00,5
5116761,4896270,2021-01-13 14:21:39.841605+00,2021-06-11 20:14:18.720619+00,1
4220535,1739094,2020-01-19 23:31:20.839712+00,2020-11-09 10:01:19.528507+00,5
12045153,4234615,2019-10-28 23:00:40.167044+00,2018-06-21 20:24:18.328733+00,5
19665227,5037105,2017-10-01 12:44:32.346662+00,2019-05-13 11:23:05.13+00,5
23954639,1739094,2021-06-01 16:39:40.830237+00,2019-09-17 08:06:07.696098+00,5
5116761,616900,2019-12-18 11:20:56.060212+00,2017-12-12 08:16:36.661509+00,5
13380729,1417698,2019-08-27 17:13:27.864123+00,2019-11-09 15:11:29.766024+00,5
4743917,4553189,2019-09-20 12:58:49.205344+00,2020-09-22 07:54:29.458045+00,5
4549089,3869483,2017-11-25 21:02:42.863017+00,2018-03-19 21:20:35.823195+00,5
14231571,1739094,2020-11-12 06:54:39.428903+00,2020-11-11 10:47:18.284886+00,5
4529250,1226327,2021-02-28 02:33:39.589982+00,2019-06-10 08:39:30.439654+00,5
469473,4896270,2017-10-17 01:55:17.600451+00,2020-04-24 08:09:25.029689+00,5
12420363,5226892,2019-02-07 23:52:08.68352+00,2020-06-09 00:33:54.820837+00,5
1652825,1973779,2021-02-22 11:59:26.701627+00,2017-07-09 17:44:26.099353+00,5
3837552,571616,2020-08-13 07:05:05.944428+00,2020-03-03 20:53:50.529204+00,5
12048922,4496733,2021-06-09 09:45:10.729829+00,2020-10-18 10:01:43.629109+00,5
25619635,598828,2021-02-09 21:33:38.887933+00,2019-04-05 07:26:06.731194+00,5
16420284,4422746,2017-11-15 13:05:48.290079+00,2020-08-14 15:12:49.913898+00,1
10984709,3265540,2021-02-15 15:55:57.137+00,2021-05-24 11:31:57.759876+00,5
15814394,4422746,2019-06-27 16:03:33.347599+00,2018-01-18 19:11:53.341142+00,5
12936562,306102,2018-11-19 16:06:52.945132+00,2021-02-10 13:57:51.170367+00,6
4529278,1739094,2021-01-27 20:45:38.126691+00,2020-02-09 19:32:15.41964+00,5
19731527,2463288,2017-09-03 16:06:49.095816+00,2017-10-25 07:20:59.868399+00,5
5686240,4845656,2021-01-23 17:22:22.306987+00,2020-11-19 22:21:59.57171+00,5
1219016,2876464,2019-02-17 22:38:13.797106+00,2017-08-11 13:45:57.707729+00,5
18510009,3265540,2018-07-07 14:10:51.980847+00,2019-02-01 17:12:12.820258+00,5
4529222,1469701,2018-07-11 07:56:52.997654+00,2019-09-13 14:49:07.640776+00,5
11286885,3066796,2019-01-24 10:33:15.984897+00,2018-04-07 13:06:50.396625+00,6
12242774,3265540,2020-11-19 22:21:59.57171+00,2020-11-15 06:55:07.347619+00,5
4529278,5037105,2021-06-17 01:23:30.57819+00,2021-01-15 06:16:46.312909+00,1
25617140,7553590,2020-08-11 16:10:30.854833+00,2019-11-21 10:07:36.490195+00,5
19551988,4283234,2018-05-10 17:12:39.866679+00,2020-02-12 09:04:42.618022+00,5
12432677,1739094,2019-07-03 09:52:53.788424+00,2020-10-23 15:11:55.313763+00,3
2244422,1263493,2020-02-19 14:40:35.390727+00,2020-09-04 14:57:25.523367+00,6
15320119,1739094,2018-03-14 23:21:38.934029+00,2019-02-12 08:00:00.145251+00,5
5116802,3869483,2020-12-08 22:05:15.931992+00,2018-10-27 11:47:12.450895+00,5
13394630,2102015,2018-11-03 07:14:07.492326+00,2018-09-01 03:08:09.503984+00,5
16434065,2570165,2019-02-12 07:28:35.852601+00,2020-07-03 21:54:07.445112+00,5
14932055,3265540,2020-03-12 12:55:50.752367+00,2021-03-01 10:14:22.203286+00,5
2959456,1739094,2020-09-17 03:12:10.147028+00,2019-07-25 00:54:45.371127+00,5
4529250,5073506,2019-04-30 07:06:31.4032+00,2021-03-12 10:24:38.849224+00,5
1458656,1772463,2020-10-22 07:52:57.668147+00,2021-02-15 12:29:24.378491+00,5
10695263,2650716,2020-03-26 09:13:09.514162+00,2018-05-24 07:28:44.823736+00,5
13043193,675239,2020-10-04 10:34:54.252879+00,2019-08-13 14:13:51.490114+00,5
10906564,1739094,2021-05-31 13:44:44.849765+00,2019-05-10 14:16:27.867576+00,5
15502567,134289,2021-06-07 11:20:53.67972+00,2021-03-17 21:07:23.419447+00,4
11804874,1739094,2017-05-25 17:34:23.278249+00,2020-12-16 15:40:18.684983+00,5
6271821,3869483,2019-09-19 10:39:13.256528+00,2021-03-22 20:46:34.161609+00,5
14176654,5742511,2020-10-13 10:44:55.888842+00,2020-11-12 06:54:39.428903+00,5
7898047,3265540,2019-10-31 05:47:58.079536+00,2021-05-23 10:15:16.213705+00,5
20135003,1739094,2021-01-28 14:44:10.762442+00,2021-02-02 12:59:08.932483+00,5
8109436,3265540,2021-06-13 06:30:04.940877+00,2020-09-28 09:44:25.316496+00,5
12497750,3265540,2019-07-04 13:14:01.086831+00,2020-07-17 23:33:35.620081+00,7
17940943,3902422,2017-09-08 22:09:31.422534+00,2021-01-14 10:01:04.219182+00,6
4653945,4137942,2018-01-31 12:56:32.374902+00,2019-02-28 04:08:48.781198+00,1
16427900,827634,2020-03-02 12:14:23.98671+00,2021-05-19 11:34:19.370724+00,3
20135003,1129372,2018-01-05 10:45:26.435999+00,2018-02-03 05:11:56.828666+00,5
7764,7942630,2020-07-22 09:27:33.54615+00,2018-12-22 15:00:06.998617+00,7
4549090,1739094,2020-10-01 20:20:14.010386+00,2019-09-20 12:58:49.205344+00,5
12045153,1702559,2020-06-15 01:55:38.286982+00,2020-04-27 10:25:32.239455+00,5
25617174,3869483,2019-03-15 16:42:16.697948+00,2021-03-09 18:44:48.179602+00,5
5532590,3675729,2021-04-21 03:16:08.71595+00,2020-03-17 11:02:11.869398+00,1
18568770,4379087,2019-07-06 06:26:42.318171+00,2021-04-21 15:41:23.048683+00,5
17601241,1739094,2021-04-30 14:16:37.393629+00,2021-01-12 22:10:15.391+00,3
15099587,7942630,2020-11-30 12:30:15.419855+00,2020-12-21 19:31:12.99299+00,5
15814394,2007625,2018-12-18 20:58:41.712051+00,2020-10-16 04:13:07.33746+00,5
18454837,5037105,2021-01-27 08:16:57.109691+00,2020-09-01 15:42:55.701252+00,5
4673136,4896270,2019-10-07 05:54:11.883258+00,2020-03-13 11:30:13.830249+00,5
4549096,3265540,2019-10-17 11:23:34.903817+00,2020-08-08 16:03:57.076531+00,6
2887879,3869483,2020-04-22 14:43:45.199014+00,2019-10-10 12:18:41.360872+00,1
7837234,1739094,2018-09-11 19:31:10.561875+00,2021-04-26 03:04:16.261921+00,5
20135003,147005,2020-11-11 10:47:18.284886+00,2020-07-10 01:25:35.628733+00,5
20135003,3396735,2020-09-30 10:51:18.998367+00,2020-04-22 14:43:45.199014+00,6
9112622,7942630,2018-10-07 11:30:06.152189+00,2019-10-14 06:58:50.355515+00,1
12497750,1739094,2018-04-07 13:06:50.396625+00,2017-05-12 08:32:57.630868+00,8
5955991,3265540,2021-05-21 08:01:34.417594+00,2018-11-29 16:09:30.435805+00,5
3607263,873002,2021-01-06 11:19:00.488607+00,2021-01-15 23:12:07.755626+00,1
18568770,5226892,2021-06-14 20:48:05.979174+00,2018-08-14 14:39:38.641667+00,5
14176654,3869483,2021-04-19 12:07:33.592991+00,2020-12-02 14:11:01.515661+00,5
12497750,1739094,2020-08-16 13:42:08.200587+00,2018-03-14 23:21:38.934029+00,7
12936562,1739094,2019-10-23 05:03:29.268+00,2019-06-11 14:40:11.728618+00,5
4549095,4422746,2020-11-06 12:03:25.699615+00,2019-03-07 08:27:16.156823+00,5
10490193,1739094,2018-06-06 11:52:25.568226+00,2021-04-21 03:16:08.71595+00,5
7050143,1739094,2021-02-11 07:01:26.121571+00,2020-07-20 06:51:29.728578+00,5
8661817,2034023,2019-06-03 14:08:25.817251+00,2019-06-19 14:35:17.756003+00,7
8308825,1739094,2020-11-15 06:55:07.347619+00,2018-12-04 08:15:11.55476+00,5
14907173,585769,2019-09-12 11:58:28.278927+00,2020-12-09 14:20:16.526646+00,5
15985467,2287637,2020-10-30 15:24:10.91545+00,2018-05-18 13:15:54.229948+00,5
12936562,3364711,2021-02-03 17:53:52.348141+00,2021-03-12 22:37:29.84858+00,6
20135003,4107455,2021-04-15 16:21:00.91208+00,2020-05-15 22:40:19.75236+00,5
19259439,5226892,2018-03-27 07:07:06.776245+00,2020-03-31 18:25:37.935804+00,5
3004858,3869483,2021-05-08 03:10:08.454374+00,2019-02-15 06:31:23.968319+00,1
5686240,3884590,2019-03-22 14:34:34.803892+00,2019-07-06 06:26:42.318171+00,5
4410571,3536981,2019-02-10 14:49:26.241619+00,2019-11-12 16:33:56.566221+00,5
18454837,3265540,2019-06-21 07:10:04.335918+00,2021-05-17 03:11:20.817964+00,5
17843452,3265540,2019-09-24 07:06:57.095228+00,2020-04-02 11:31:37.09857+00,7
6970505,4896270,2019-08-26 13:27:34.471812+00,2019-10-01 08:34:21.86755+00,6
17775289,1407788,2020-09-12 12:51:16.788238+00,2020-03-03 07:51:04.71125+00,5
4529250,1739094,2019-05-21 08:25:55.564951+00,2021-03-26 23:01:18.81014+00,5
3050484,4745402,2021-04-29 22:00:21.849569+00,2021-05-27 19:49:09.168872+00,5
4549098,1739094,2021-06-11 10:19:54.60443+00,2020-08-04 23:04:05.270908+00,5
13593825,5405166,2020-10-29 20:14:26.791441+00,2019-10-17 11:23:34.903817+00,5
14843381,4750351,2020-08-03 10:59:37.642+00,2021-06-15 12:05:30.642092+00,5
21333976,3056166,2021-04-27 07:03:55.3625+00,2019-04-27 06:56:41.840543+00,1
1006775,598828,2018-06-09 17:26:29.026934+00,2020-07-13 08:05:56.069948+00,5
4549087,2034023,2018-04-27 09:27:51.230478+00,2019-11-06 19:27:45.304159+00,1
4549078,1739094,2018-02-19 06:45:58.075011+00,2020-02-26 15:14:41.98254+00,5
278964,4010986,2019-12-11 12:10:33.408425+00,2021-05-15 05:05:20.63488+00,6
4667009,2708426,2017-11-22 06:27:07.409182+00,2021-06-04 12:45:03.278371+00,1
23954639,1129372,2019-11-23 14:22:43.495384+00,2018-08-17 12:08:39.312666+00,5
8343320,5405166,2020-03-20 17:04:12.174586+00,2021-05-10 02:26:00.03623+00,1
13792294,1129372,2021-04-01 15:35:51.899592+00,2021-03-15 13:08:07.908906+00,5
10463077,1739094,2019-05-17 09:08:38.066917+00,2018-03-17 00:07:19.211019+00,5
19161107,5042335,2021-04-23 12:02:22.97898+00,2020-06-16 16:15:13.119968+00,1
19672392,5042335,2020-05-14 03:29:46.501427+00,2020-01-28 09:48:44.794051+00,6
10491793,3568783,2020-04-08 00:07:59.913968+00,2019-09-24 07:06:57.095228+00,5
11605597,2185238,2017-11-29 09:01:54.424489+00,2021-02-05 21:49:03.181009+00,5
5116705,7942630,2018-12-04 08:09:35.794445+00,2019-03-14 11:41:53.834983+00,1
4458319,4997388,2018-12-10 13:47:13.25891+00,2020-05-28 20:24:11.981201+00,5
4549094,2232689,2020-11-26 07:27:43.534889+00,2019-01-01 07:52:52.944051+00,5
2747962,2030303,2021-02-24 08:33:37.718322+00,2019-08-28 23:31:48.499134+00,5
278964,3265540,2020-07-10 21:12:12.525654+00,2021-06-09 09:45:10.729829+00,5
19516486,3265540,2019-10-20 15:56:33.724616+00,2020-09-20 07:00:20.135949+00,5
11626928,8292579,2021-03-22 09:56:28.239554+00,2019-08-24 01:22:45.824409+00,5
11650925,3258603,2018-06-21 20:24:18.328733+00,2019-03-22 14:34:49.610666+00,5
7764,3265540,2021-02-05 07:46:29.631571+00,2017-06-22 08:01:33.651243+00,5
12936562,3265540,2021-02-04 13:12:09.838042+00,2019-08-27 17:13:27.864123+00,1
25443384,2433574,2017-09-19 06:57:14.807785+00,2018-05-10 17:12:39.866679+00,1
3677505,124113,2020-10-27 22:55:45.456053+00,2020-09-09 21:07:06.282494+00,5
12936562,5497197,2020-06-24 12:04:06.012+00,2019-03-26 14:54:53.066+00,5
3044465,3265540,2021-01-04 06:36:46.151404+00,2021-04-09 08:42:26.750534+00,5
8661817,136791,2018-11-16 10:43:02.879041+00,2018-06-15 16:33:53.681854+00,7
15814394,3398766,2018-03-07 15:05:28.029164+00,2021-05-18 08:07:57.510752+00,5
7222267,3869483,2020-06-16 16:15:13.119968+00,2019-05-29 08:13:16.891317+00,5
16420284,4125958,2020-10-07 02:15:42.17113+00,2017-10-17 01:55:17.600451+00,5
2171143,3869483,2019-09-13 14:49:07.640776+00,2018-06-25 19:06:12.851973+00,5
15590234,4950475,2020-04-27 10:25:32.239455+00,2020-11-05 16:49:45.929954+00,5
17430283,2412020,2021-06-05 07:30:07.882498+00,2020-03-26 09:13:09.514162+00,5
18176655,1129372,2018-11-06 09:43:28.20572+00,2019-07-18 12:57:04.061837+00,5
15099587,1739094,2021-01-12 09:49:33.255676+00,2021-03-18 12:39:52.462184+00,1
17642084,512150,2019-04-24 02:35:11.666326+00,2020-05-21 09:00:38.425111+00,5
5116765,4997388,2020-11-17 08:52:16.901258+00,2021-06-14 09:50:47.43762+00,5
4549096,1557436,2021-05-18 08:07:12.485389+00,2018-10-02 14:25:53.053897+00,5
14462309,1129372,2020-05-15 22:40:19.75236+00,2021-01-21 20:46:56.375215+00,5
311700,2599098,2021-06-16 13:46:31.108876+00,2019-10-29 22:31:13.445732+00,5
20135003,6489439,2019-07-02 00:00:38.734993+00,2020-10-22 07:52:57.668147+00,1
4549096,1739094,2020-04-28 07:33:14.238447+00,2020-05-14 22:02:30.743037+00,5
2865214,3869483,2018-04-17 15:35:14.767135+00,2018-01-10 09:21:38.587296+00,5
4549096,124113,2020-03-10 07:34:10.625123+00,2017-09-19 07:58:25.775833+00,5
10984709,2079234,2020-02-05 01:50:23.428898+00,2020-07-07 02:53:07.616165+00,5
12382130,4791248,2020-10-26 12:48:10.7838+00,2021-01-27 20:45:38.126691+00,3
278964,3869483,2018-11-08 04:22:40.528507+00,2021-02-03 05:02:25.222871+00,6
14231571,2849588,2019-12-03 14:22:10.404642+00,2019-08-19 08:49:12.021719+00,9
16434065,3902422,2020-09-25 11:40:40.027+00,2020-02-01 13:46:10.307473+00,1
12497750,1892863,2020-10-06 09:54:15.373884+00,2021-06-03 19:29:58.580746+00,5
20384641,5025927,2021-04-02 11:03:12.800128+00,2018-12-14 04:39:29.967254+00,5
2249206,3869483,2021-04-05 11:49:14.089187+00,2018-08-29 13:46:59.238419+00,5
16420284,1739094,2020-04-09 15:42:33.790854+00,2020-05-13 07:59:32.758427+00,3
20067921,1129372,2020-11-13 13:35:18.999558+00,2020-03-05 14:22:23.957975+00,5
3278486,1180394,2020-07-16 08:22:23.354306+00,2020-09-29 02:52:07.952804+00,5
8836287,1739094,2019-06-14 09:56:36.08477+00,2019-03-28 04:04:25.734665+00,5
12497750,4947745,2019-03-11 17:53:17.785686+00,2020-10-02 14:06:52.793762+00,5
10355535,8587917,2019-12-19 11:36:16.195111+00,2018-05-28 11:31:33.479466+00,5
10310073,2382929,2021-05-12 23:14:50.043729+00,2020-06-17 13:58:51.744+00,5
1116356,3265540,2020-10-15 10:12:51.765509+00,2020-06-19 20:29:56.276804+00,4
18061898,8577055,2021-02-18 12:33:23.838052+00,2018-06-28 14:25:12.79911+00,6
4529288,3265540,2021-04-06 18:48:23.64176+00,2020-04-04 14:04:26.215278+00,5
15099587,5742511,2020-03-23 14:30:43.663194+00,2018-02-15 21:50:05.389+00,5
17051534,2383710,2021-06-06 16:43:00.563158+00,2019-01-03 16:33:52.498985+00,5
2408601,100770,2021-05-04 13:17:09.492058+00,2021-04-01 06:44:57.974224+00,5
11650925,8587917,2019-10-09 11:53:17.756226+00,2018-01-16 08:24:29.025851+00,6
15320119,15139,2020-04-15 13:52:30.358894+00,2021-03-07 03:19:26.300972+00,5
12497750,1596274,2020-06-09 00:33:54.820837+00,2020-06-02 16:31:12.668757+00,5
15814394,1665674,2019-07-10 00:00:28.898031+00,2020-03-24 12:07:48.502908+00,1
13789097,1739094,2021-02-14 11:07:00.98813+00,2019-02-25 10:05:04.199504+00,5
15814394,3869483,2018-06-25 19:06:12.851973+00,2021-05-05 14:49:21.673685+00,5
14588374,2364948,2018-03-17 00:07:19.211019+00,2020-10-13 10:44:55.888842+00,7
4532395,3869483,2019-07-14 20:49:24.630969+00,2020-02-06 17:27:39.726886+00,5
19594670,10068,2021-02-08 15:48:57.156+00,2020-02-14 21:35:06.361247+00,5
14218490,357929,2020-09-09 07:59:01.278214+00,2017-09-14 01:22:09.643838+00,5
9567860,3884590,2020-02-23 23:25:08.034912+00,2020-07-23 20:39:33.161357+00,5
6264530,663986,2020-03-31 01:40:53.032378+00,2021-02-12 15:30:41.775583+00,5
278964,1129372,2018-03-31 21:01:30.017969+00,2020-07-15 12:36:37.482343+00,5
15320138,2372332,2018-06-13 01:45:38.581042+00,2020-07-22 09:27:33.54615+00,5
15683290,3265540,2018-12-12 08:42:11.086054+00,2018-02-21 06:38:07.793913+00,5
4549094,5497197,2020-04-20 22:54:50.627933+00,2018-10-04 14:55:41.535782+00,5
14384958,1489065,2020-04-06 09:46:53.53658+00,2021-03-25 08:37:53.240499+00,5
14176654,5497197,2019-03-26 14:53:02.920495+00,2021-03-30 01:45:50.967957+00,5
10902306,2092958,2021-01-22 12:17:40.024697+00,2020-01-09 15:20:05.707573+00,5
1391724,3265540,2019-11-11 15:15:05.873179+00,2017-11-06 13:45:02.956462+00,5
16473332,3265540,2018-07-13 15:27:00.464907+00,2017-07-03 17:22:22.364665+00,5
20459671,3193135,2019-03-29 12:08:43.252392+00,2018-09-27 09:42:26.114233+00,5
4549086,124113,2020-12-16 15:39:49.482942+00,2020-07-29 10:40:17.949402+00,5
12497750,2359567,2019-08-09 15:03:43.074365+00,2020-07-14 16:51:57.541443+00,5
25282237,4010986,2021-06-03 09:27:04.451976+00,2017-09-08 23:20:35.735244+00,5
13932223,3265540,2018-10-11 10:44:30.812519+00,2021-02-09 09:50:14.161593+00,1
17601241,429902,2020-10-20 07:46:55.3395+00,2019-05-31 21:10:28.159795+00,1
7764,598828,2018-09-30 02:38:41.351263+00,2019-01-29 17:24:32.419334+00,7
12497750,6512759,2018-09-04 11:33:09.917567+00,2019-05-25 18:46:54.164068+00,5
15099587,1614863,2019-05-22 12:41:45.425395+00,2020-12-06 18:55:46.663543+00,5
991785,3265540,2019-02-01 17:03:46.150087+00,2021-05-03 11:45:51.848884+00,5
16434065,971826,2020-09-03 18:15:27.553312+00,2019-05-01 20:05:25.658659+00,5
2865214,4950475,2021-02-05 21:49:03.181009+00,2018-07-23 19:05:59.034395+00,5
6845078,601879,2020-08-20 05:20:47.245941+00,2020-04-12 19:41:31.646822+00,3
23959163,3265540,2021-06-08 10:27:49.818011+00,2020-04-29 16:31:46.444681+00,5
4529253,4125958,2020-09-24 12:36:07.517891+00,2021-03-03 18:27:40.878691+00,5
4529263,1321034,2019-01-18 08:35:30.718544+00,2019-09-01 19:15:27.653791+00,6
4953732,1129372,2020-02-10 16:41:25.946316+00,2019-12-20 12:11:27+00,5
4549086,1739094,2020-12-01 07:57:43.922957+00,2020-08-26 08:37:57.121522+00,5
10940784,2849588,2018-01-18 19:11:53.341142+00,2020-01-22 18:57:29.123004+00,5
461215,2849588,2021-04-03 06:35:43.838+00,2021-02-28 02:33:39.589982+00,5
12646193,4896270,2021-03-31 15:19:26.290978+00,2018-11-26 10:49:17.837841+00,5
5116767,2729482,2019-03-05 16:57:11.312303+00,2018-02-11 14:22:11.595477+00,1
3608833,2045934,2021-03-03 18:27:40.878691+00,2020-07-08 12:44:41.575597+00,7
4549098,598828,2020-10-14 01:39:29.032521+00,2021-05-02 06:40:50.349419+00,5
2661973,3869483,2017-12-07 02:18:00.451418+00,2020-04-13 20:29:15.42042+00,1
5116755,236961,2021-05-04 03:11:11.855768+00,2020-09-03 03:20:18.873919+00,5
4549087,1739094,2019-12-02 13:50:25.722335+00,2020-07-20 22:15:36.879103+00,5
25617279,7739084,2020-07-21 13:27:23.006668+00,2019-04-02 11:25:36.242676+00,5
15871395,843030,2020-05-21 09:00:38.425111+00,2020-11-24 20:06:23.617195+00,5
13083,5037105,2020-11-09 10:01:19.528507+00,2020-03-09 10:28:30.63876+00,3
19648480,6489172,2018-05-28 11:31:33.479466+00,2020-07-31 15:06:33.788178+00,6
4549090,4997388,2017-12-15 17:19:03.74224+00,2019-03-21 00:02:22.096589+00,5
5116767,3163048,2020-04-25 14:23:38.368469+00,2020-09-29 16:19:05.123215+00,5
5085867,1739094,2020-08-27 17:31:34.853948+00,2020-02-10 16:41:25.946316+00,5
15099587,5629484,2019-07-16 07:38:43.456479+00,2020-03-27 01:28:56.67792+00,1
1652825,4422746,2020-02-28 12:40:40.093438+00,2019-10-22 04:45:53.069152+00,5
2262964,3265540,2019-05-31 21:10:28.159795+00,2020-07-10 21:12:12.525654+00,5
4529276,136791,2018-10-18 12:11:42.235788+00,2019-06-07 14:11:35.761246+00,5
11650925,2849588,2020-08-25 12:03:34.449458+00,2018-12-20 13:41:18.249208+00,5
4549094,3536981,2020-01-14 19:38:27.644706+00,2021-01-25 08:17:37.115742+00,5
6264530,1129372,2018-01-24 12:38:35.765387+00,2020-05-12 12:09:18.836366+00,5
4549095,5226892,2020-10-14 15:29:33.6402+00,2018-02-26 11:38:55.567003+00,7
11650925,4366278,2019-05-15 20:54:22.916305+00,2020-10-14 01:39:29.032521+00,5
3044465,3265540,2019-07-22 14:40:28.479443+00,2019-10-07 05:54:11.883258+00,5
12242774,510442,2017-08-11 13:45:15.721537+00,2019-10-28 23:00:40.167044+00,5
13083,1739094,2021-04-15 07:13:18.113929+00,2019-10-11 15:13:33.425665+00,5
24424440,4656195,2020-02-17 20:07:23.520814+00,2018-10-11 10:48:57.68178+00,5
12936562,3265540,2019-08-21 12:34:12.666048+00,2021-03-26 11:13:03.551369+00,5
3809312,3265540,2020-07-17 23:33:35.620081+00,2021-04-28 18:05:07.297709+00,3
13215075,204384,2019-03-01 14:11:57.069021+00,2021-02-24 08:33:37.718322+00,5
18076924,1739094,2020-02-29 23:38:19.028282+00,2021-03-24 04:25:20.281592+00,5
278964,1129372,2017-05-12 08:32:57.630868+00,2019-01-07 03:17:12.454968+00,5
23959163,1428425,2018-05-13 19:37:52.265926+00,2020-06-05 20:05:38.615957+00,5
7764,4671331,2018-11-10 00:06:11.138647+00,2018-03-02 11:25:11.110013+00,5
25617179,5226892,2020-01-17 14:04:09.211906+00,2018-11-16 10:43:03.545332+00,5
12045153,8587917,2020-09-23 14:49:55.151778+00,2020-06-12 18:20:37.236724+00,5
15079139,3536981,2018-07-26 07:40:38.013654+00,2021-04-11 09:25:41.623884+00,5
6387888,4422746,2021-02-19 04:56:55.241934+00,2018-04-05 10:24:49.577668+00,6
3391926,2704952,2018-09-27 09:27:59.724626+00,2017-10-11 13:14:41.801779+00,5
4549096,3398766,2018-03-29 09:04:16.325907+00,2020-12-22 15:49:25.572482+00,5
20135003,915442,2020-10-16 16:48:01.343304+00,2019-07-31 14:25:26.534331+00,9
1443144,3869483,2020-03-16 13:45:47.769953+00,2020-06-04 08:18:03.711955+00,1
4549096,1739094,2021-05-13 15:13:28.981052+00,2021-02-17 15:55:50.855104+00,12
11650925,1739094,2020-12-04 01:07:44.245386+00,2021-04-06 07:36:52.255227+00,5
5116705,4613299,2021-03-11 02:25:45.480613+00,2018-11-14 14:39:53.977952+00,5
17800352,5037105,2018-05-24 07:28:44.823736+00,2018-09-04 11:48:30.423463+00,5
13661872,1235342,2021-03-14 16:04:27.189931+00,2021-03-19 01:35:32.868488+00,5
3308420,8587917,2019-02-25 09:56:24.670778+00,2020-05-29 16:35:49.235556+00,6
25617251,3902422,2020-08-24 14:57:49.398085+00,2020-09-10 14:21:31.417+00,5
11509294,310631,2019-08-24 01:22:45.824409+00,2020-01-12 23:56:44.053016+00,5
4673136,753331,2021-02-10 13:57:51.170367+00,2020-11-27 15:43:08.246+00,5
4667009,1739094,2020-04-20 08:39:10.316906+00,2019-11-18 12:28:07.175796+00,5
5116706,8587917,2019-01-11 23:00:05.872009+00,2020-12-10 21:08:12.838834+00,5
7540316,1129372,2019-09-26 12:05:18.372211+00,2019-11-11 15:15:05.873179+00,5
4549086,5869402,2020-10-08 11:58:53.897252+00,2020-12-13 15:06:23.385658+00,5
17775289,2030303,2019-03-08 19:34:19.485622+00,2020-03-22 09:58:19.634044+00,5
11337637,3265540,2018-09-10 03:47:32.915943+00,2018-01-05 10:45:26.435999+00,5
14292786,1739094,2020-04-30 13:29:48.718547+00,2019-08-14 16:29:14.09519+00,5
12497750,4706134,2020-12-06 18:50:39.696742+00,2021-06-01 16:39:40.830237+00,6
17014783,5005665,2019-12-20 12:11:27+00,2021-05-07 09:52:16.407399+00,5
14176654,3869483,2018-12-22 14:59:36.032462+00,2019-06-14 09:56:36.08477+00,5
10369151,3007069,2019-06-07 14:11:35.761246+00,2017-08-05 12:23:06.543232+00,5
17852391,1739094,2018-11-21 12:08:34.895615+00,2020-11-10 15:13:40.164827+00,5
10902306,1739094,2017-10-11 13:14:41.801779+00,2019-03-29 12:35:23.34811+00,5
4529288,8587917,2020-04-08 20:03:52.222669+00,2020-10-19 13:31:05.225083+00,5
14057781,2849588,2020-06-19 20:29:56.276804+00,2020-11-09 22:41:08.053418+00,5
17940943,3265540,2020-10-02 14:06:52.793762+00,2020-07-23 04:36:53.492766+00,3
4529250,424482,2019-01-01 07:51:11.889807+00,2018-04-27 09:28:38.860951+00,5
9112622,5073506,2019-07-26 09:13:13.872295+00,2021-04-07 11:13:55.18833+00,7
5413420,1739094,2019-12-16 14:43:10.667914+00,2018-11-10 01:43:44.543889+00,5
14218490,2747936,2021-03-30 14:12:19.012266+00,2019-10-16 11:18:55.267385+00,5
19731527,2849588,2020-10-20 19:52:31.132001+00,2018-07-11 07:56:52.997654+00,5
6499005,533372,2019-12-23 02:10:59.632128+00,2021-06-06 16:43:00.563158+00,1
16420284,571616,2020-01-22 18:57:29.123004+00,2017-08-17 08:03:46.724416+00,5
4549098,3869483,2020-12-17 10:51:52.411476+00,2020-11-17 19:26:05.235613+00,5
12936562,5226892,2018-12-14 04:21:11.532654+00,2018-10-18 12:15:12.348528+00,5
4549090,1739094,2019-02-19 13:35:26.832296+00,2018-08-21 05:29:32.725891+00,1
5948559,8311087,2017-07-03 17:07:23.609629+00,2018-02-13 21:06:15.812203+00,5
12936562,7942630,2020-07-30 05:14:54.466501+00,2021-02-08 15:48:57.156+00,5
12799969,5405166,2020-08-17 16:22:20.257793+00,2020-02-14 01:04:07.470656+00,5
5423786,1226327,2019-03-25 09:53:07.120146+00,2019-11-08 00:38:42.078519+00,3
14292786,3265540,2020-07-29 10:40:17.949402+00,2019-12-26 12:37:52.624761+00,5
10290475,3265540,2018-06-15 16:33:53.681854+00,2020-05-20 11:23:59.96998+00,5
11286868,5189892,2018-05-08 10:39:43.392109+00,2019-07-12 09:33:03.254093+00,5
