278964,Project,3
5052314,Namespace,3
4829255,Project,3
6543,Project,3
9970,Project,3
5169210,Project,3
278964,Project,3
7739631,Namespace,3
250833,Project,3
9970,Project,3
6935877,Project,3
6543,Project,3
13083,Namespace,3
9970,Project,3
5169210,Project,3
9970,Namespace,3
13887855,Project,3
7739631,Namespace,3
6543,Project,3
20699,Project,3
9970,Namespace,3
6767280,Project,3
5892345,Project,3
11046417,Project,1
6543,Project,3
9970,Project,1
5911013,Project,3
4249178,Namespace,3
3521502,Project,1
9970,Project,3
5169210,Project,3
278964,Project,1
6543,Namespace,1
1100298,Project,3
250833,Project,1
11462748,Project,3
13083,Project,3
6543,Project,3
2769844,Project,3
278964,Project,3
6543,Project,1
12747866,Project,3
278964,Project,3
278964,Project,3
10771145,Project,0
10993694,Project,3
278964,Project,3
8439573,Project,3
5052314,Project,3
7938510,Project,3
11046417,Project,3
278964,Project,3
10731094,Project,3
9970,Namespace,3
19798607,Namespace,3
20051452,Project,3
9970,Project,3
7764,Project,3
278964,Project,3
8641662,Project,1
278964,Project,3
12511990,Project,3
6543,Project,1
5086770,Project,3
6543,Namespace,3
5152364,Project,3
9970,Namespace,3
240719,Project,3
9970,Project,3
11046417,Namespace,3
1916374,Project,3
7893505,Project,3
10963710,Project,3
20051452,Project,3
5152364,Namespace,3
9970,Project,3
6543,Project,3
9970,Project,3
5052314,Project,3
7583067,Project,3
6543,Project,1
19798551,Project,3
6543,Project,3
9970,Project,3
11599867,Project,1
3596325,Project,3
9970,Project,1
5998553,Project,3
15260496,Project,3
9970,Project,3
7739631,Project,1
9970,Project,3
4249178,Project,3
9970,Project,3
7764,Project,3
8641662,Project,3
5052314,Project,3
6543,Namespace,3
5169210,Project,3
10413699,Project,3
20853897,Namespace,3
2769844,Project,1
9970,Project,3
20853897,Namespace,3
4249178,Project,3
9970,Project,3
6543,Namespace,3
3472737,Project,3
8832743,Project,4
5892345,Project,3
250833,Project,3
6366722,Project,1
6543,Project,3
278964,Project,3
13083,Namespace,3
278964,Namespace,3
278964,Project,3
7701947,Namespace,3
5152364,Project,3
5152364,Project,3
6543,Project,3
9970,Project,1
13083,Project,3
5998553,Project,3
1702754,Project,3
6543,Project,3
10358808,Project,3
5193894,Project,3
7739631,Namespace,3
278964,Project,1
19596363,Project,3
5518815,Project,3
6385363,Project,3
2396494,Project,1
6543,Namespace,3
278964,Project,3
1100298,Project,1
6452476,Project,3
20079847,Namespace,3
6600201,Project,3
6697663,Project,3
5037261,Namespace,3
3596325,Project,3
278964,Project,3
4086854,Project,3
9970,Project,3
1100298,Project,1
1916374,Project,3
9970,Project,3
9970,Project,3
5998553,Namespace,3
5169210,Project,3
6668740,Project,3
3472737,Namespace,1
9970,Project,3
5152364,Project,3
9914558,Project,3
9970,Project,3
5037261,Project,3
9970,Project,3
8641662,Namespace,1
278964,Project,3
8439573,Project,3
9970,Project,3
10582521,Project,3
6543,Namespace,3
10360152,Project,3
278964,Project,3
17566435,Project,3
6543,Project,1
5892345,Namespace,3
5998553,Project,3
18202133,Namespace,3
6543,Namespace,3
4249178,Namespace,3
6543,Project,3
3924854,Project,3
6543,Namespace,3
5152364,Project,3
9970,Project,1
12035224,Project,1
278964,Project,3
14655294,Namespace,3
278964,Project,3
278964,Project,3
7583067,Project,3
3328513,Project,3
9970,Project,3
278964,Project,3
10795756,Project,3
11046417,Project,3
19798607,Project,3
6543,Project,3
278964,Namespace,3
1100298,Project,3
10582521,Project,3
7701947,Project,3
278964,Project,3
9970,Project,3
9970,Project,3
7617423,Project,3
11082998,Project,3
3730788,Project,3
8363046,Project,3
11494671,Project,3
6543,Project,1
9970,Project,3
6543,Namespace,1
278964,Namespace,3
1670091,Project,3
4249178,Project,3
12747866,Project,3
5169210,Namespace,3
7617423,Project,3
2769844,Namespace,3
13083,Project,3
21842751,Project,3
9970,Project,3
9970,Project,3
6543,Project,3
10963710,Namespace,0
278964,Namespace,3
5152364,Project,3
278964,Project,3
9970,Project,3
63904,Project,3
1916374,Project,1
5193894,Project,3
9970,Project,3
278964,Project,3
6543,Project,3
6543,Project,3
3730788,Namespace,3
278964,Project,3
11494671,Project,3
9970,Project,1
3596325,Namespace,3
4086854,Project,3
6543,Project,3
5152364,Project,3
9970,Project,3
36189,Project,3
9970,Project,3
20853897,Project,3
9970,Project,3
14359602,Project,3
1916374,Project,3
18202133,Project,3
9970,Project,3
5152364,Project,1
278964,Project,3
5892345,Project,3
3596325,Project,3
278964,Project,1
6452476,Project,3
16698962,Project,3
6543,Project,3
10731094,Namespace,3
10424088,Namespace,3
5052314,Project,3
5998553,Project,2
9970,Project,3
278964,Project,3
9970,Namespace,3
13083,Project,4
9970,Project,3
21842751,Project,3
4261682,Project,3
9970,Project,1
278964,Project,3
20098734,Project,3
3596325,Project,3
20445729,Project,3
6543,Project,3
9970,Project,3
9970,Project,1
7827956,Project,3
6543,Project,3
5669232,Namespace,3
5911017,Project,1
1670091,Project,3
6543,Namespace,3
6452476,Project,3
278964,Project,3
10413699,Project,3
4249178,Project,3
5998553,Project,3
10993694,Project,3
9970,Project,3
250833,Project,3
278964,Project,3
8862481,Namespace,3
6543,Project,3
278964,Project,3
5052314,Project,3
4249178,Project,3
10987667,Project,3
63904,Project,3
3774636,Project,3
3774636,Namespace,3
9970,Project,3
13083,Project,3
4249178,Project,3
9970,Namespace,3
4261682,Project,3
7899575,Namespace,3
1100298,Namespace,3
9970,Project,3
20051452,Namespace,3
15462818,Project,3
4249178,Project,3
12298515,Project,3
9970,Project,1
278964,Project,3
6543,Namespace,3
10424069,Project,3
6543,Project,1
2372665,Project,3
6543,Namespace,3
12298515,Project,1
6452476,Project,3
5169210,Project,3
6543,Project,3
7938510,Project,3
13083,Project,3
10771145,Project,3
9989493,Project,3
10731094,Project,3
6543,Project,3
4561197,Project,3
5169210,Project,3
9970,Project,1
6543,Namespace,3
12035224,Project,3
278964,Namespace,3
6543,Namespace,3
8943308,Namespace,3
10731094,Namespace,3
21842751,Project,3
5911017,Project,3
1670091,Project,3
5052314,Project,3
5160638,Namespace,0
1916374,Project,3
8363046,Project,3
13083,Namespace,3
13083,Project,3
5052314,Project,1
36189,Project,3
5998553,Project,1
13083,Project,3
6543,Project,3
5169210,Project,3
5169210,Project,3
4249178,Project,3
278964,Project,3
250833,Project,3
20470289,Project,3
278964,Project,3
12298515,Project,3
16341341,Project,1
9970,Namespace,3
278964,Project,3
6543,Namespace,3
5052314,Project,3
6543,Project,3
11208293,Project,3
4249178,Namespace,3
6543,Project,1
278964,Project,3
5152364,Project,3
6543,Project,3
1100298,Project,3
278964,Project,3
5892345,Project,3
5169210,Project,3
3472737,Project,3
20051452,Namespace,3
5052314,Project,3
5160638,Namespace,3
9970,Project,3
6543,Namespace,3
5169210,Namespace,3
9970,Project,3
278964,Project,3
1100298,Project,1
63904,Project,3
10285321,Namespace,3
6366722,Project,3
5169210,Project,3
9970,Project,1
9970,Project,1
278964,Project,3
5169210,Project,3
13083,Namespace,3
6543,Namespace,3
6543,Project,1
5037261,Project,1
240719,Project,3
7764,Project,3
3521502,Project,3
4249178,Project,3
6385363,Project,3
9970,Project,3
6543,Project,3
5052314,Namespace,3
6543,Project,3
7764,Namespace,3
9970,Project,3
5152364,Namespace,3
9970,Project,5
278964,Project,3
13083,Project,3
9970,Project,3
5152364,Namespace,1
1916374,Project,1
10360152,Namespace,3
6543,Project,3
9970,Project,3
5052314,Project,3
7893505,Project,3
7893497,Project,3
278964,Project,3
6543,Project,3
21842751,Namespace,3
278964,Project,1
278964,Project,3
12384606,Project,3
10424088,Project,4
278964,Namespace,3
7583067,Project,3
6543,Project,3
6543,Project,3
9970,Project,3
6543,Project,3
278964,Namespace,3
5152364,Project,3
6697663,Project,3
9970,Project,3
9970,Project,3
22907321,Project,3
7764,Project,1
9970,Project,1
9202919,Project,3
278964,Project,3
8363046,Project,3
5892345,Namespace,3
5152364,Project,3
240719,Project,3
6543,Project,3
1916374,Project,3
6543,Project,3
6543,Project,1
8917485,Project,3
5698111,Project,3
9970,Project,3
5152364,Namespace,1
278964,Project,3
6543,Project,3
278964,Project,3
6543,Project,3
6543,Project,3
9970,Project,1
10358561,Project,3
8862481,Project,3
10582521,Project,1
9970,Project,3
10360152,Namespace,3
10358808,Project,3
9970,Project,3
5152364,Project,1
10993694,Project,3
4249178,Project,3
5169210,Project,1
13887855,Namespace,3
6543,Project,3
7583067,Namespace,3
13083,Namespace,3
11462748,Namespace,3
9970,Namespace,3
278964,Project,3
3106457,Project,3
6543,Project,3
9970,Project,1
10993694,Project,3
5169210,Namespace,3
278964,Project,3
7899575,Namespace,3
5052314,Namespace,3
7701947,Namespace,3
10989965,Project,3
10360152,Project,3
3774636,Project,3
11208293,Project,3
13887855,Project,3
3596325,Project,3
7764,Namespace,3
3472737,Project,3
1100298,Project,3
9970,Namespace,3
7899575,Namespace,3
13887855,Namespace,3
9970,Project,3
7433065,Project,3
9970,Project,3
6543,Namespace,3
6543,Project,3
5052314,Project,3
278964,Project,4
2372665,Project,1
20051452,Project,3
5169210,Namespace,3
5152364,Namespace,3
7739631,Project,3
36189,Project,3
278964,Project,3
9996904,Namespace,1
8439573,Project,3
5169210,Project,3
5169210,Namespace,3
6543,Project,3
7899575,Project,3
19596363,Namespace,1
11082998,Project,3
6452476,Project,3
7827956,Project,3
12298515,Project,3
278964,Project,3
6543,Project,3
278964,Project,3
13083,Project,1
9970,Project,3
9970,Project,3
9970,Project,3
9202919,Project,3
5998553,Project,3
7583067,Project,3
13083,Project,3
10358808,Project,3
6935877,Project,1
5911017,Project,1
6254133,Project,3
278964,Project,3
278964,Project,3
15260496,Project,3
36189,Project,3
19798551,Project,3
6543,Project,3
4249178,Project,3
12298515,Project,3
1702754,Project,1
18529459,Project,3
9970,Project,3
6452476,Namespace,3
2396494,Project,3
4829255,Project,3
9970,Project,3
9970,Project,3
6543,Project,3
5892345,Project,1
10424069,Project,1
19354476,Namespace,3
9970,Namespace,3
18202133,Project,3
8862481,Project,3
7281003,Project,3
5169210,Namespace,1
7938510,Namespace,3
7893497,Project,1
5152364,Project,3
6543,Project,3
6543,Project,3
278964,Project,3
7899575,Project,3
3282096,Project,3
13083,Namespace,3
4261682,Project,3
5152364,Project,3
9970,Namespace,3
9970,Project,3
9970,Project,1
6543,Project,3
6543,Project,3
6543,Namespace,3
278964,Project,3
6543,Project,3
278964,Project,3
10845344,Project,3
9970,Project,3
6543,Namespace,3
5169210,Namespace,3
6543,Project,3
278964,Project,3
1891092,Namespace,1
6543,Project,3
3521502,Namespace,3
20445729,Project,3
6543,Project,1
4249178,Project,3
3106457,Project,3
9970,Project,3
6600201,Namespace,3
5152364,Project,3
5052314,Project,1
5055105,Namespace,3
9970,Project,3
663693,Project,3
5778500,Project,3
6543,Project,3
10731094,Project,3
6543,Project,3
20470289,Project,1
6543,Namespace,3
5052314,Project,3
5152364,Project,3
9970,Project,3
5152364,Project,3
278964,Namespace,3
63904,Project,3
1670091,Project,3
6543,Project,3
6543,Project,3
6543,Namespace,3
1100298,Project,3
9970,Namespace,3
8943308,Project,3
20051452,Project,3
18529459,Project,3
3716322,Project,3
20445729,Project,3
9989493,Namespace,3
6543,Project,3
10360152,Project,1
5034914,Project,3
3730788,Project,3
278964,Project,3
10963710,Project,3
38421,Project,1
7899575,Project,3
9970,Namespace,3
9970,Namespace,1
278964,Project,3
278964,Project,3
3282096,Project,3
10989965,Project,3
8876290,Project,3
6543,Namespace,1
8832743,Project,3
8862481,Namespace,3
19798607,Namespace,3
1062656,Namespace,1
10845344,Project,3
9970,Project,3
1670091,Project,1
9970,Namespace,3
278964,Project,3
9840800,Project,3
9970,Project,1
5998553,Namespace,3
20853897,Project,3
10731094,Project,3
10993694,Project,3
9970,Project,3
6543,Project,3
7899575,Project,3
5998553,Project,3
278964,Project,3
10358561,Project,3
13611731,Project,3
5034914,Namespace,3
9970,Namespace,1
5052314,Project,3
4249178,Namespace,3
10360152,Project,3
6543,Project,3
278964,Project,3
7739631,Project,3
7611858,Project,3
10845344,Project,3
5052314,Namespace,3
13083,Project,3
13611731,Project,1
5169210,Project,3
12511990,Project,1
10989965,Project,3
3730788,Project,3
278964,Project,3
6543,Namespace,3
5169210,Project,3
19534091,Project,3
9970,Project,3
9970,Project,3
10731094,Project,3
278964,Project,3
5055105,Project,3
278964,Project,3
278964,Project,3
6543,Project,1
6543,Project,3
278964,Project,3
9684684,Project,3
3521502,Project,3
2396494,Project,3
8943308,Project,3
22907321,Project,1
9970,Project,3
3774636,Project,1
20098579,Project,1
20337821,Namespace,3
5037261,Project,1
278964,Project,3
10174980,Project,1
6543,Project,3
6366722,Project,3
10731094,Project,3
10987667,Project,3
9970,Namespace,3
13083,Project,3
20051452,Project,3
6543,Project,3
7764,Project,1
5052314,Project,3
6452476,Project,3
20079847,Project,3
6543,Project,3
278964,Project,3
5152364,Project,3
4086854,Project,1
7059645,Project,3
278964,Project,3
12384606,Project,3
16341341,Project,1
6767280,Project,1
13611731,Project,3
13083,Namespace,3
9970,Project,3
5169210,Project,3
278964,Project,3
278964,Project,3
9970,Namespace,3
5998553,Project,1
5034914,Project,3
6543,Namespace,3
6543,Project,3
1100298,Project,3
9970,Project,3
4829255,Project,3
278964,Namespace,3
9970,Project,3
17566435,Project,3
9970,Project,3
9970,Project,3
6543,Project,3
6543,Project,1
10580326,Project,3
5169210,Project,3
278964,Project,3
9970,Project,3
8363046,Namespace,1
6543,Project,3
6254133,Project,3
8363046,Namespace,3
5152364,Project,3
278964,Project,1
3774636,Project,3
9970,Project,3
6543,Project,3
278964,Project,3
9970,Namespace,3
9970,Project,1
278964,Namespace,3
6543,Project,3
20699,Project,3
6543,Project,3
7281003,Namespace,1
3774636,Project,1
6254133,Project,3
6543,Project,3
278964,Project,3
9970,Project,2
9970,Project,3
20853897,Project,3
6543,Project,3
9970,Project,3
5998553,Project,3
6543,Project,3
6543,Namespace,3
9970,Project,1
5052314,Namespace,3
9970,Namespace,3
1670091,Project,3
5169210,Namespace,3
8876290,Project,3
6543,Project,1
13996671,Project,3
6697663,Project,3
278964,Project,5
5169210,Project,3
5911017,Project,3
278964,Project,3
6543,Project,3
1100298,Project,1
9970,Project,3
6543,Project,3
6543,Namespace,3
9970,Project,3
8338830,Namespace,3
7938510,Project,3
6543,Namespace,3
6543,Project,3
6543,Namespace,3
6543,Namespace,3
6543,Namespace,1
6543,Project,3
19534091,Project,3
9996904,Project,3
6543,Namespace,3
9970,Project,3
5169210,Project,3
9970,Project,3
278964,Project,1
5998553,Project,3
278964,Namespace,3
278964,Project,1
278964,Project,3
22907321,Project,3
9970,Project,3
7739631,Project,3
20853897,Project,3
7281003,Project,3
6543,Project,3
7899575,Project,3
10987667,Namespace,3
5052314,Project,3
5892345,Project,3
9970,Project,3
6543,Project,1
6543,Project,3
278964,Project,3
6543,Project,3
20699,Project,3
6543,Namespace,3
5086770,Namespace,3
5052314,Project,3
13083,Namespace,3
6543,Project,1
13083,Project,3
13083,Project,3
6543,Project,3
9970,Project,3
3502812,Project,3
9970,Namespace,3
278964,Project,1
6543,Project,3
3521502,Namespace,3
6543,Project,3
9811711,Project,3
7583067,Project,3
278964,Project,1
5086770,Project,3
20098579,Project,3
16489475,Project,3
13083,Namespace,3
1670091,Project,3
6543,Namespace,3
278964,Project,1
7764,Project,3
10845344,Project,3
6543,Project,3
6543,Namespace,3
13611731,Namespace,3
9970,Project,3
9970,Project,3
278964,Project,3
6543,Project,3
1670091,Project,1
278964,Project,3
278964,Project,3
278964,Project,3
6543,Project,3
6543,Project,3
5518815,Project,3
16341341,Project,3
8439573,Project,1
16489475,Project,3
5169210,Project,3
5998553,Namespace,1
17566435,Project,3
11410993,Project,3
5998553,Project,3
10424069,Namespace,3
6543,Project,3
6543,Project,1
13083,Project,0
13083,Project,3
4249178,Namespace,3
18202133,Project,3
21059019,Project,1
6543,Project,3
9970,Project,1
7701947,Project,1
5052314,Namespace,3
9496937,Project,3
9970,Project,3
9970,Namespace,3
6366722,Project,3
11046417,Project,3
6543,Project,1
7764,Project,3
5892345,Project,3
6543,Namespace,3
7281003,Project,3
500013,Project,3
7466455,Namespace,3
6543,Namespace,3
10413699,Project,1
63904,Project,3
7701947,Project,3
7827956,Namespace,3
6543,Project,1
10389148,Project,1
7893497,Namespace,3
6543,Project,3
4261682,Project,3
10987667,Project,1
6543,Project,3
8917485,Project,3
5778500,Namespace,3
9989493,Project,3
9970,Project,3
9970,Project,3
10845349,Project,3
6543,Namespace,3
5037261,Project,3
4829255,Project,3
5052314,Project,3
11208293,Namespace,3
3730788,Project,3
10771145,Project,3
9970,Project,3
4249178,Project,3
278964,Project,3
1670091,Namespace,3
5998553,Project,3
20699,Project,1
6543,Project,3
10285321,Project,3
6600201,Project,3
6543,Project,3
5911017,Project,3
11082998,Namespace,3
278964,Project,3
9970,Project,3
7466455,Namespace,1
1670091,Project,1
1702754,Project,3
5169210,Project,3
10580326,Project,3
278964,Project,3
16489475,Project,3
6543,Project,3
5193894,Project,1
9970,Project,3
5911017,Project,3
6543,Namespace,1
6543,Project,1
278964,Project,4
22907321,Project,3
10989965,Namespace,1
7764,Namespace,4
278964,Project,3
9970,Project,3
10582521,Project,3
6543,Project,3
3924854,Project,3
4249178,Namespace,3
5034914,Project,3
5034914,Project,3
16698962,Project,3
278964,Project,3
278964,Project,3
20853897,Project,3
5052314,Project,3
9970,Project,3
278964,Project,3
7583067,Namespace,3
5778500,Project,3
10580326,Project,3
278964,Namespace,3
6543,Project,3
11599867,Project,3
278964,Project,1
6600201,Project,3
4249178,Namespace,1
7764,Project,3
6385363,Namespace,3
5152364,Project,3
6543,Project,3
5892345,Project,3
9970,Project,3
