70272874,MergeRequest
34024193,Issue
56119927,MergeRequest
27617380,Issue
10928574,MergeRequest
51987309,Issue
77433563,MergeRequest
6911228,Issue
51730363,Issue
32201860,MergeRequest
81068318,Issue
25729490,Issue
45658333,Commit
83371821,MergeRequest
87557341,Issue
32859992,Issue
65799324,Issue
63642274,Issue
3405487,Issue
41102006,MergeRequest
33301117,MergeRequest
53868050,MergeRequest
77107970,MergeRequest
642753,Issue
7827652,Issue
26434318,MergeRequest
72351571,MergeRequest
26233358,MergeRequest
70994559,Issue
20215135,Issue
60205647,Commit
41936568,MergeRequest
25478267,MergeRequest
7697959,Commit
51479771,Issue
50891281,MergeRequest
27694504,Issue
4098373,MergeRequest
64701895,MergeRequest
80568007,Issue
47745800,Issue
18613038,MergeRequest
20017198,MergeRequest
17562751,Issue
30530516,MergeRequest
15870407,MergeRequest
46625229,MergeRequest
28529650,MergeRequest
27894824,MergeRequest
90413926,MergeRequest
67685856,Issue
37098180,Issue
81616090,MergeRequest
26825737,MergeRequest
57508382,Issue
18195563,MergeRequest
53656889,MergeRequest
24175295,Issue
82226814,MergeRequest
78037471,MergeRequest
72188937,MergeRequest
70140165,MergeRequest
62198309,MergeRequest
75128948,Issue
64455535,MergeRequest
53558736,MergeRequest
52519824,MergeRequest
15785615,MergeRequest
14880518,MergeRequest
88476254,MergeRequest
51242749,Issue
60333846,MergeRequest
3201984,MergeRequest
90666410,MergeRequest
65461601,Issue
66227609,MergeRequest
71368527,Issue
20425749,MergeRequest
19625069,MergeRequest
84369159,MergeRequest
71522343,MergeRequest
74571776,MergeRequest
45542524,MergeRequest
9577323,Issue
36100405,MergeRequest
43851239,Issue
28966154,MergeRequest
10100876,MergeRequest
36579203,Issue
983246,Issue
14367474,MergeRequest
34631029,MergeRequest
35699373,MergeRequest
25040950,Issue
31505179,Commit
49048857,Commit
5344332,Issue
61856927,MergeRequest
13945773,MergeRequest
63540039,MergeRequest
7245085,Issue
67547817,MergeRequest
74831302,MergeRequest
93015152,MergeRequest
2340138,MergeRequest
15268910,MergeRequest
36684736,MergeRequest
88733654,MergeRequest
19274096,MergeRequest
87832049,Issue
41263169,MergeRequest
12800714,MergeRequest
8160145,Issue
53320373,MergeRequest
6174848,MergeRequest
71873,MergeRequest
31626536,MergeRequest
67967859,MergeRequest
70720950,Issue
78610837,Issue
17493922,MergeRequest
75484881,MergeRequest
208740,MergeRequest
69871260,Issue
22600293,Commit
4664778,MergeRequest
25115257,Issue
29026208,Issue
64349782,MergeRequest
83811418,MergeRequest
13743633,Commit
541453,Commit
77912429,MergeRequest
11126263,MergeRequest
43733758,MergeRequest
2494164,MergeRequest
34144013,MergeRequest
4501661,MergeRequest
13606461,Issue
18880379,MergeRequest
80907466,MergeRequest
51124773,MergeRequest
34303,Issue
40787929,MergeRequest
53183181,MergeRequest
61658191,MergeRequest
52649993,MergeRequest
33966859,Issue
29707833,Issue
90042778,Issue
70865056,MergeRequest
79452163,MergeRequest
9006038,MergeRequest
10269754,MergeRequest
3928507,Issue
25854963,Commit
4004803,MergeRequest
70333185,Issue
72949413,Issue
39458427,Issue
63858653,Issue
38228739,Issue
5685278,Issue
27770366,Issue
47132016,MergeRequest
37688656,MergeRequest
16107485,MergeRequest
69139259,MergeRequest
87429448,MergeRequest
50397109,MergeRequest
18111812,MergeRequest
7628718,MergeRequest
15119866,MergeRequest
20763220,MergeRequest
4327460,MergeRequest
60433482,MergeRequest
79191213,MergeRequest
16660662,Issue
6022476,Issue
80105800,MergeRequest
8024865,Issue
24895071,MergeRequest
88205195,MergeRequest
23886516,Issue
26773088,Issue
63970005,MergeRequest
32142901,Issue
50660793,MergeRequest
16577998,MergeRequest
42957085,MergeRequest
38355472,MergeRequest
60890035,Issue
80009887,MergeRequest
29648548,MergeRequest
43165513,Issue
10329318,MergeRequest
14647285,MergeRequest
49892214,MergeRequest
25926001,MergeRequest
22944360,MergeRequest
85110150,MergeRequest
47478622,MergeRequest
24031471,MergeRequest
26291005,Issue
54088052,MergeRequest
3498826,Issue
14962033,Issue
10043938,Issue
59431603,MergeRequest
22412647,MergeRequest
28409882,MergeRequest
12122763,MergeRequest
30868614,Issue
5618266,Issue
42069444,Issue
75414212,Issue
78528110,Issue
59956871,MergeRequest
53955043,MergeRequest
35838381,Commit
69570908,Issue
8362871,MergeRequest
79356452,Issue
17681051,MergeRequest
5037737,MergeRequest
18815954,MergeRequest
32969448,MergeRequest
4962248,Issue
17232811,MergeRequest
23974430,Issue
46750848,MergeRequest
113701,Issue
61297171,Issue
76303362,MergeRequest
47012526,MergeRequest
6330545,MergeRequest
24310251,MergeRequest
69369979,MergeRequest
72276333,MergeRequest
26725757,Issue
68922813,Commit
34995916,MergeRequest
30640800,Issue
28101705,Issue
37426755,Issue
50177023,Issue
74108101,MergeRequest
24815922,Issue
3683208,MergeRequest
21301603,MergeRequest
80727603,Issue
9762808,MergeRequest
33610522,Commit
80641934,MergeRequest
78692962,MergeRequest
44666602,MergeRequest
53077262,Epic
57755878,MergeRequest
55704071,MergeRequest
8860539,MergeRequest
56458627,MergeRequest
49815934,MergeRequest
2601349,MergeRequest
81138976,Issue
35189714,Issue
75811543,Issue
59001787,Issue
16317114,Issue
11290037,MergeRequest
4587804,Issue
1232060,MergeRequest
9078973,MergeRequest
68545246,MergeRequest
12882619,MergeRequest
76730395,Commit
9365436,MergeRequest
9972472,Issue
48246698,MergeRequest
2213604,Commit
25214063,MergeRequest
55239823,MergeRequest
70574785,Issue
44292205,MergeRequest
8701816,MergeRequest
76809695,MergeRequest
73196464,MergeRequest
18760006,MergeRequest
58650113,MergeRequest
7766126,MergeRequest
23691341,Issue
13673718,Issue
11674150,MergeRequest
4255704,MergeRequest
16829352,Issue
33908388,MergeRequest
46884718,Issue
13878308,Issue
30477500,MergeRequest
59534263,MergeRequest
72095334,Issue
72503802,MergeRequest
75571171,Issue
43979513,Issue
42209162,MergeRequest
9700628,MergeRequest
23188462,Issue
76458826,MergeRequest
34749846,Commit
32385404,MergeRequest
27482584,MergeRequest
28178859,MergeRequest
32258980,MergeRequest
76094288,MergeRequest
34204050,MergeRequest
29534041,MergeRequest
14592435,MergeRequest
5414548,MergeRequest
52753109,MergeRequest
68340549,Issue
56368815,Issue
93373378,Issue
73969396,Issue
84256941,MergeRequest
33244381,Issue
71587586,MergeRequest
24751303,MergeRequest
78444678,MergeRequest
3120942,MergeRequest
52205264,MergeRequest
86846246,MergeRequest
71294698,Commit
29287306,MergeRequest
73279103,Issue
34822697,Issue
9506113,Issue
159995,MergeRequest
84600691,Issue
34512587,MergeRequest
15692170,MergeRequest
2934210,MergeRequest
29194245,MergeRequest
68857467,MergeRequest
49952359,MergeRequest
34877378,MergeRequest
48124888,MergeRequest
82838428,MergeRequest
5197912,MergeRequest
21218663,MergeRequest
77567788,MergeRequest
47897163,MergeRequest
63403764,Issue
50764890,Issue
88323292,Issue
22324153,Issue
84726766,Issue
44543614,MergeRequest
34692300,MergeRequest
39312755,MergeRequest
32446489,MergeRequest
33656079,Issue
73522676,MergeRequest
33069216,MergeRequest
16032096,MergeRequest
89931590,MergeRequest
54773559,MergeRequest
77261844,Issue
76957878,MergeRequest
91217213,MergeRequest
32803729,Issue
45780097,MergeRequest
41638106,MergeRequest
55107710,MergeRequest
21512386,MergeRequest
32696370,Commit
5272270,Issue
30288338,MergeRequest
91900305,MergeRequest
63741470,Issue
26044983,MergeRequest
8232004,MergeRequest
54024011,Issue
45281718,MergeRequest
20279275,MergeRequest
92579040,MergeRequest
31777184,MergeRequest
42856048,Issue
74902051,Issue
23608877,MergeRequest
21626407,Issue
27004459,MergeRequest
67405032,MergeRequest
29775814,MergeRequest
84154217,Issue
21800865,MergeRequest
90934855,MergeRequest
46129286,MergeRequest
48923908,Issue
29969344,MergeRequest
13028412,MergeRequest
76878546,MergeRequest
42505190,MergeRequest
8637796,Issue
75247441,MergeRequest
85602177,MergeRequest
52310778,Issue
3299264,MergeRequest
35339792,Issue
71673041,Issue
87937796,MergeRequest
10822012,MergeRequest
74508455,Commit
25291516,Issue
36922308,MergeRequest
6553421,Commit
51596748,MergeRequest
18404222,MergeRequest
15561066,Issue
50998900,MergeRequest
54273652,MergeRequest
56000544,MergeRequest
29596601,Issue
40367596,MergeRequest
4744266,MergeRequest
435378,Issue
25678612,MergeRequest
93173918,Issue
68079619,Issue
19199061,Issue
19550102,Issue
86449428,MergeRequest
61541980,MergeRequest
86979475,MergeRequest
77507320,MergeRequest
27837671,Commit
7121257,Issue
61759617,Issue
35469807,MergeRequest
6849180,MergeRequest
5553986,Issue
12945883,MergeRequest
14439366,Issue
56718431,Issue
87708529,MergeRequest
41778574,MergeRequest
28752184,Issue
10582348,Issue
90184191,Issue
89805092,MergeRequest
33427736,MergeRequest
21365103,Issue
6251849,Issue
22847854,Issue
70202985,Issue
1470129,MergeRequest
60087635,MergeRequest
45885810,Issue
68793973,MergeRequest
46012949,MergeRequest
17299745,Issue
26566085,Vulnerability
38783717,Issue
13528489,MergeRequest
62718285,MergeRequest
73600937,Issue
17418496,MergeRequest
85944714,MergeRequest
19772948,Issue
75730492,MergeRequest
57854858,Issue
23333020,MergeRequest
75893653,Issue
39593934,MergeRequest
90792751,MergeRequest
7894316,Issue
61202712,MergeRequest
77175859,Issue
24482779,MergeRequest
22090447,MergeRequest
21859969,MergeRequest
25786732,MergeRequest
72598352,Issue
20979113,MergeRequest
10181510,MergeRequest
72773624,MergeRequest
77775180,MergeRequest
30705488,Issue
76211932,MergeRequest
54635782,MergeRequest
15951379,MergeRequest
68991518,MergeRequest
86711925,MergeRequest
83004155,Issue
31688545,MergeRequest
22175601,Issue
20617225,Issue
57071706,MergeRequest
70403250,Issue
67842672,Issue
71450774,Issue
70483005,MergeRequest
71063626,MergeRequest
1334634,MergeRequest
44946059,Issue
15188310,MergeRequest
1108606,MergeRequest
13098289,MergeRequest
87116473,MergeRequest
32079488,Issue
1959573,MergeRequest
76539242,MergeRequest
61411366,MergeRequest
18042553,Issue
75349411,MergeRequest
2821420,MergeRequest
33500228,MergeRequest
26949002,Issue
85233196,Issue
71216092,Issue
47275432,MergeRequest
83654566,MergeRequest
5793602,Issue
40637563,Issue
30230338,Issue
92870365,MergeRequest
77626176,MergeRequest
42673314,Issue
45424037,MergeRequest
66956791,MergeRequest
60550821,MergeRequest
75659288,MergeRequest
27222787,Commit
29858575,MergeRequest
7958107,Issue
79698366,Issue
3597566,Issue
20844264,MergeRequest
11935828,Commit
12638061,MergeRequest
38080941,Issue
13176979,MergeRequest
64862844,MergeRequest
79018061,Issue
36221496,MergeRequest
92055582,Issue
19060550,MergeRequest
35255887,MergeRequest
83249971,MergeRequest
48377703,MergeRequest
65149221,MergeRequest
24966547,Issue
67124560,MergeRequest
78762997,Issue
83944536,Issue
88610299,Commit
16999352,Issue
18276456,MergeRequest
33359184,Issue
30764795,MergeRequest
13809647,Issue
81303601,Issue
66372982,Issue
30018594,Issue
11845132,MergeRequest
3769687,Issue
42339209,MergeRequest
12445120,MergeRequest
69939284,Issue
50527909,MergeRequest
56242145,MergeRequest
71836698,Issue
69662948,Issue
7060200,MergeRequest
43594514,Issue
40061359,Issue
19348066,MergeRequest
80176080,Issue
20543359,MergeRequest
51866907,Commit
68675220,Issue
32560851,MergeRequest
19475087,Issue
62376609,MergeRequest
30934471,MergeRequest
91363094,MergeRequest
20908812,MergeRequest
75044713,MergeRequest
15351626,Issue
82576137,Issue
14114186,MergeRequest
59100563,MergeRequest
4893118,Issue
80497237,MergeRequest
54162884,MergeRequest
86182052,MergeRequest
27550122,Issue
27065801,Issue
28013789,MergeRequest
80981909,Issue
83528054,MergeRequest
6782217,MergeRequest
21946889,MergeRequest
30186869,Issue
92448136,MergeRequest
24656674,MergeRequest
78122909,Issue
57971235,MergeRequest
63296482,MergeRequest
7186436,MergeRequest
27141581,MergeRequest
66526582,Commit
9904874,MergeRequest
53433127,MergeRequest
70802550,MergeRequest
6471337,Issue
89672854,Issue
49369484,MergeRequest
17765684,Issue
17070832,Issue
20700529,Issue
34086264,MergeRequest
55606011,MergeRequest
35963455,MergeRequest
89088450,Issue
41000897,MergeRequest
16733375,MergeRequest
15631303,MergeRequest
16927718,MergeRequest
25613467,MergeRequest
59851774,MergeRequest
78853724,MergeRequest
22717284,MergeRequest
5936717,Issue
54350077,MergeRequest
48540399,MergeRequest
48676997,MergeRequest
732195,MergeRequest
15491916,MergeRequest
62615794,MergeRequest
34571700,MergeRequest
27949441,Issue
10653398,MergeRequest
350236,Issue
52112165,MergeRequest
70069846,MergeRequest
76154823,Issue
66079672,MergeRequest
40511559,MergeRequest
44207037,Issue
18545602,Issue
3841744,Issue
77705182,MergeRequest
74743413,MergeRequest
18348390,MergeRequest
23402075,Issue
19406705,MergeRequest
58903538,MergeRequest
43454781,MergeRequest
16253114,Issue
74433945,MergeRequest
13326076,Issue
68207946,MergeRequest
7310090,MergeRequest
41388182,MergeRequest
76599333,Issue
35538719,MergeRequest
4411079,MergeRequest
26357831,Issue
34941540,MergeRequest
8293054,Issue
82425956,MergeRequest
32024617,MergeRequest
16469821,Issue
89536232,MergeRequest
30993554,Issue
55906513,Issue
80248185,Issue
46232426,Issue
33192785,Issue
24243305,MergeRequest
91761386,MergeRequest
14020697,Issue
31278575,MergeRequest
26503008,Issue
13456446,Issue
70934329,MergeRequest
19685638,MergeRequest
31386011,MergeRequest
22791666,MergeRequest
80406411,Issue
89303632,MergeRequest
23266938,Epic
57169001,MergeRequest
79612241,MergeRequest
9307321,MergeRequest
72425640,Issue
56605058,MergeRequest
72701815,Commit
15038419,MergeRequest
32917589,MergeRequest
25984625,Issue
83693638,Issue
58452427,MergeRequest
79857503,MergeRequest
10730639,Issue
28825794,MergeRequest
9150825,MergeRequest
66657059,MergeRequest
74275852,MergeRequest
21154236,Commit
86066699,Issue
78213528,Issue
31334582,Issue
64565090,MergeRequest
74651970,MergeRequest
18483152,MergeRequest
55817440,MergeRequest
9237767,MergeRequest
62080953,Issue
57382187,MergeRequest
29472768,MergeRequest
31960237,MergeRequest
3,MergeRequest
92321823,Issue
29113808,MergeRequest
39180224,Issue
54461557,MergeRequest
72015696,Commit
76033705,Issue
6099827,MergeRequest
14713210,MergeRequest
74195295,MergeRequest
67255415,Issue
24608426,Issue
29908384,Issue
22540700,MergeRequest
13388771,Commit
82692772,Issue
40873114,Issue
52412310,MergeRequest
81493110,Issue
25425138,MergeRequest
25540720,Issue
26648955,MergeRequest
70006459,Issue
88967447,MergeRequest
54891531,Issue
9641812,Issue
63076279,Issue
73020326,Issue
21061273,MergeRequest
51351303,MergeRequest
46355165,Issue
26176235,Issue
88053504,Issue
8785388,MergeRequest
19141462,MergeRequest
36388932,MergeRequest
34454880,MergeRequest
20151254,MergeRequest
6404920,MergeRequest
21433401,MergeRequest
81747722,Issue
60660299,MergeRequest
56951688,MergeRequest
49158157,MergeRequest
29352807,MergeRequest
4819600,MergeRequest
35414111,MergeRequest
59751820,MergeRequest
90308368,MergeRequest
23827431,MergeRequest
24699020,MergeRequest
49254393,Issue
69806381,MergeRequest
23121814,Issue
39751227,MergeRequest
78298854,MergeRequest
57275120,MergeRequest
73826813,Issue
69283203,MergeRequest
9835792,Issue
32754324,Commit
49598574,Issue
24097541,MergeRequest
58551462,Issue
84845534,MergeRequest
44798116,Issue
48804394,MergeRequest
6623395,MergeRequest
39022938,MergeRequest
69506340,MergeRequest
91610247,Issue
12338525,Issue
12235671,MergeRequest
37555927,Issue
74354348,MergeRequest
60989020,MergeRequest
75965204,Issue
80814218,Issue
24542664,MergeRequest
30118511,MergeRequest
77838379,Issue
9428137,MergeRequest
8434750,Issue
30415689,MergeRequest
25363858,MergeRequest
10491202,MergeRequest
17143267,Issue
47637134,Issue
32633148,Issue
39913387,Issue
33714559,MergeRequest
92722965,Issue
7369685,Issue
38650319,Issue
73106464,Issue
89187433,Issue
29412909,MergeRequest
11572143,Issue
22025799,MergeRequest
30353027,Issue
81223125,MergeRequest
49503644,MergeRequest
10400301,Issue
31832323,Issue
38894890,Commit
1633094,MergeRequest
62949357,Issue
32502614,Issue
53777241,Issue
5115215,MergeRequest
73759518,Issue
6990320,MergeRequest
12732930,Issue
74051812,Issue
85721212,Issue
38525253,MergeRequest
27296716,Issue
69073000,MergeRequest
30588618,Issue
13244694,Issue
37275593,MergeRequest
17915875,MergeRequest
56820389,MergeRequest
23000211,Issue
14800508,Issue
92193686,MergeRequest
69733225,MergeRequest
5487976,MergeRequest
844547,Issue
8947014,Issue
23756557,MergeRequest
34389838,MergeRequest
82357097,Issue
71752809,Issue
31890536,Issue
84960242,Issue
73677513,Issue
22249631,MergeRequest
41500578,Issue
54998608,MergeRequest
12542673,Issue
79769283,Issue
64090173,MergeRequest
17350234,Issue
37828509,Issue
81401835,Issue
55360129,Issue
31559327,MergeRequest
6694821,Commit
30072391,MergeRequest
37950701,MergeRequest
36797557,MergeRequest
79113259,Issue
31160874,Issue
63178404,Issue
23550959,MergeRequest
18955511,Issue
70640434,MergeRequest
22474188,MergeRequest
52863587,MergeRequest
8503452,MergeRequest
78383409,MergeRequest
20086892,MergeRequest
17843481,MergeRequest
87242919,MergeRequest
48017979,MergeRequest
59213453,AlertManagement::Alert
86575720,MergeRequest
79285630,Issue
19946835,Issue
78924931,Issue
85340469,Issue
90533906,Issue
20477041,Issue
81876580,MergeRequest
33550385,MergeRequest
87381288,MergeRequest
77972702,MergeRequest
61091922,Issue
64209340,MergeRequest
21713079,Issue
31945111,MergeRequest
71129738,MergeRequest
273110,MergeRequest
24368730,Issue
58191814,MergeRequest
52976448,MergeRequest
3031752,MergeRequest
20351083,MergeRequest
83132115,MergeRequest
61968637,Issue
79921463,MergeRequest
79534162,MergeRequest
85836315,MergeRequest
14194956,Issue
69434473,Issue
62832082,MergeRequest
50036751,Issue
46498542,Issue
88837240,MergeRequest
31078661,MergeRequest
65309493,MergeRequest
33129028,MergeRequest
17621790,MergeRequest
23478535,MergeRequest
14515810,Issue
58308440,MergeRequest
64990202,Issue
65644316,MergeRequest
72854377,MergeRequest
28310815,Commit
74982725,Issue
73886859,MergeRequest
71917874,MergeRequest
60776089,MergeRequest
7439798,Issue
43023520,MergeRequest
34278168,Issue
44111254,MergeRequest
76381198,Commit
50103074,Issue
81999345,Commit
84069491,MergeRequest
23072016,MergeRequest
8084813,MergeRequest
85460054,MergeRequest
14268451,Commit
84477778,Issue
49697932,Issue
77370449,Issue
73456495,MergeRequest
33779214,MergeRequest
28641144,MergeRequest
58076693,MergeRequest
91047867,MergeRequest
50274859,MergeRequest
59329001,Issue
62501351,Issue
18682227,MergeRequest
22656584,Issue
35115109,MergeRequest
59632310,MergeRequest
73372564,Issue
15413246,MergeRequest
58771378,MergeRequest
8562785,MergeRequest
34332383,MergeRequest
11027674,Commit
82117348,Commit
43332832,MergeRequest
31450753,Commit
91481002,Issue
57624536,MergeRequest
26109475,MergeRequest
45097537,MergeRequest
66796422,MergeRequest
21570177,Issue
28901960,MergeRequest
2697746,MergeRequest
31221671,Issue
77029537,Issue
80340732,MergeRequest
7519974,Commit
27409704,MergeRequest
55500316,Issue
40230048,MergeRequest
12032421,Issue
65930146,MergeRequest
69214822,MergeRequest
89394992,Issue
35051503,MergeRequest
33023280,MergeRequest
17985918,Issue
32330885,MergeRequest
76673272,Issue
33855121,MergeRequest
16186149,Issue
24420819,Epic
86303113,MergeRequest
19869297,Issue
