468092,CommitStatus,tags
194702420,CommitStatus,tags
70157086,CommitStatus,tags
108446739,CommitStatus,tags
204483713,CommitStatus,tags
700085872,CommitStatus,tags
616123134,CommitStatus,tags
516212048,CommitStatus,tags
251153043,CommitStatus,tags
650986029,CommitStatus,tags
445335069,CommitStatus,tags
244871877,CommitStatus,tags
741353706,CommitStatus,tags
658629427,CommitStatus,tags
770076500,CommitStatus,tags
201640228,CommitStatus,tags
150541148,CommitStatus,tags
803778899,CommitStatus,tags
708422331,CommitStatus,tags
191461555,CommitStatus,tags
425717692,CommitStatus,tags
521628316,CommitStatus,tags
739084110,CommitStatus,tags
94092754,CommitStatus,tags
242420616,CommitStatus,tags
348257699,CommitStatus,tags
244027791,CommitStatus,tags
476701622,CommitStatus,tags
396785847,CommitStatus,tags
613667142,CommitStatus,tags
705542173,CommitStatus,tags
284763633,CommitStatus,tags
594619197,CommitStatus,tags
818256230,CommitStatus,tags
71128344,CommitStatus,tags
766780569,CommitStatus,tags
98463347,CommitStatus,tags
295479291,CommitStatus,tags
117022514,CommitStatus,tags
626860348,CommitStatus,tags
765449336,CommitStatus,tags
219727145,CommitStatus,tags
151510438,CommitStatus,tags
699340041,CommitStatus,tags
428687291,CommitStatus,tags
524423677,CommitStatus,tags
827033337,CommitStatus,tags
286446444,CommitStatus,tags
509016066,CommitStatus,tags
483734817,CommitStatus,tags
493601199,CommitStatus,tags
748175903,CommitStatus,tags
131424616,CommitStatus,tags
380133942,CommitStatus,tags
675301767,CommitStatus,tags
308795393,CommitStatus,tags
335614584,CommitStatus,tags
103036780,CommitStatus,tags
293659335,CommitStatus,tags
633981832,CommitStatus,tags
225321398,CommitStatus,tags
211677600,CommitStatus,tags
515581404,CommitStatus,tags
472434060,CommitStatus,tags
179706596,CommitStatus,tags
65862052,CommitStatus,tags
324050599,CommitStatus,tags
659965296,CommitStatus,tags
84633870,CommitStatus,tags
740599555,CommitStatus,tags
637241837,CommitStatus,tags
30655759,CommitStatus,tags
757589205,CommitStatus,tags
657230402,CommitStatus,tags
640212179,CommitStatus,tags
438168658,CommitStatus,tags
164815225,CommitStatus,tags
781106804,CommitStatus,tags
483077614,CommitStatus,tags
488957844,CommitStatus,tags
269878565,CommitStatus,tags
809196880,CommitStatus,tags
768782999,CommitStatus,tags
258423788,CommitStatus,tags
811806226,CommitStatus,tags
533567696,CommitStatus,tags
448574624,CommitStatus,tags
165769135,CommitStatus,tags
660819863,CommitStatus,tags
636420838,CommitStatus,tags
719935162,CommitStatus,tags
632547846,CommitStatus,tags
625552748,CommitStatus,tags
366344646,CommitStatus,tags
143646139,CommitStatus,tags
15035006,CommitStatus,tags
45191256,CommitStatus,tags
795411516,CommitStatus,tags
535150102,CommitStatus,tags
341028979,CommitStatus,tags
566880732,CommitStatus,tags
722142571,CommitStatus,tags
538454825,CommitStatus,tags
525229610,CommitStatus,tags
213710533,CommitStatus,tags
331398937,CommitStatus,tags
301681620,CommitStatus,tags
638764653,CommitStatus,tags
612314534,CommitStatus,tags
417622088,CommitStatus,tags
80245375,CommitStatus,tags
582667687,CommitStatus,tags
423462611,CommitStatus,tags
652888878,CommitStatus,tags
416080061,CommitStatus,tags
19506063,CommitStatus,tags
808567132,CommitStatus,tags
755554232,CommitStatus,tags
198705058,CommitStatus,tags
409454071,CommitStatus,tags
134123108,CommitStatus,tags
89392663,CommitStatus,tags
341944102,CommitStatus,tags
298271769,CommitStatus,tags
621202331,CommitStatus,tags
91740822,CommitStatus,tags
646690847,CommitStatus,tags
17654026,CommitStatus,tags
569717057,CommitStatus,tags
517919048,CommitStatus,tags
495834928,CommitStatus,tags
176692266,CommitStatus,tags
447881420,CommitStatus,tags
585604526,CommitStatus,tags
528496038,CommitStatus,tags
443775869,CommitStatus,tags
377620894,CommitStatus,tags
156594357,CommitStatus,tags
583983341,CommitStatus,tags
542976498,CommitStatus,tags
819089460,CommitStatus,tags
146623992,CommitStatus,tags
499788819,CommitStatus,tags
543742453,CommitStatus,tags
207000695,CommitStatus,tags
774676179,CommitStatus,tags
746606361,CommitStatus,tags
800744269,CommitStatus,tags
522292114,CommitStatus,tags
367295608,CommitStatus,tags
791795753,CommitStatus,tags
713484088,CommitStatus,tags
807217551,CommitStatus,tags
661548310,CommitStatus,tags
457604813,CommitStatus,tags
236465332,CommitStatus,tags
519437277,CommitStatus,tags
77067266,CommitStatus,tags
289875306,CommitStatus,tags
704878723,CommitStatus,tags
802187771,CommitStatus,tags
81185838,CommitStatus,tags
449954780,CommitStatus,tags
573116222,CommitStatus,tags
111705610,CommitStatus,tags
199688300,CommitStatus,tags
687000078,CommitStatus,tags
378424069,CommitStatus,tags
545254185,CommitStatus,tags
825130048,CommitStatus,tags
799986104,CommitStatus,tags
790410558,CommitStatus,tags
188763425,CommitStatus,tags
694796917,CommitStatus,tags
523677897,CommitStatus,tags
729533468,CommitStatus,tags
694192540,CommitStatus,tags
212732358,CommitStatus,tags
496685390,CommitStatus,tags
578256461,CommitStatus,tags
455216753,CommitStatus,tags
581893572,CommitStatus,tags
365370856,CommitStatus,tags
90645577,CommitStatus,tags
749548671,CommitStatus,tags
357797330,CommitStatus,tags
454504246,CommitStatus,tags
133239082,CommitStatus,tags
261902129,CommitStatus,tags
680428789,CommitStatus,tags
549472001,CommitStatus,tags
432185836,CommitStatus,tags
330007981,CommitStatus,tags
829050201,CommitStatus,tags
668299565,CommitStatus,tags
370439240,CommitStatus,tags
731586656,CommitStatus,tags
61382267,CommitStatus,tags
419105671,CommitStatus,tags
382046753,CommitStatus,tags
200747390,CommitStatus,tags
817624294,CommitStatus,tags
742729885,CommitStatus,tags
767449915,CommitStatus,tags
784345222,CommitStatus,tags
598291908,Project,tags
407495564,CommitStatus,tags
67778291,CommitStatus,tags
662196174,CommitStatus,tags
248452218,CommitStatus,tags
772824892,CommitStatus,tags
162009234,CommitStatus,tags
439208440,CommitStatus,tags
624852514,CommitStatus,tags
34027868,CommitStatus,tags
37464340,CommitStatus,tags
678150973,CommitStatus,tags
400886349,CommitStatus,tags
227797392,CommitStatus,tags
371123051,CommitStatus,tags
220636880,CommitStatus,tags
50788233,CommitStatus,tags
306775900,CommitStatus,tags
82359641,CommitStatus,tags
421008576,CommitStatus,tags
100856134,CommitStatus,tags
142738897,CommitStatus,tags
552145750,CommitStatus,tags
440898189,CommitStatus,tags
104261661,CommitStatus,tags
376805567,Ci::Runner,tags
581151517,CommitStatus,tags
230537196,CommitStatus,tags
816327733,CommitStatus,tags
427032874,CommitStatus,tags
76094063,CommitStatus,tags
634851288,CommitStatus,tags
674575314,CommitStatus,tags
692816392,CommitStatus,tags
209774885,CommitStatus,tags
807824138,CommitStatus,tags
49597233,CommitStatus,tags
189521004,CommitStatus,tags
226149021,CommitStatus,tags
12997203,CommitStatus,tags
233532396,CommitStatus,tags
701564744,CommitStatus,tags
696652347,CommitStatus,tags
531357406,CommitStatus,tags
14010672,CommitStatus,tags
101906334,CommitStatus,tags
559495031,CommitStatus,tags
459017560,CommitStatus,tags
355154826,CommitStatus,tags
786440922,CommitStatus,tags
178486331,CommitStatus,tags
7219477,CommitStatus,tags
290763842,CommitStatus,tags
630908100,CommitStatus,tags
368858093,CommitStatus,tags
648867736,CommitStatus,tags
560163366,CommitStatus,tags
267279572,CommitStatus,tags
467840952,CommitStatus,tags
11894450,CommitStatus,tags
436126091,CommitStatus,tags
663660756,CommitStatus,tags
610289262,CommitStatus,tags
174699787,CommitStatus,tags
735615778,CommitStatus,tags
813664688,CommitStatus,tags
486762874,CommitStatus,tags
714937468,CommitStatus,tags
411117799,CommitStatus,tags
412763390,CommitStatus,tags
682313269,CommitStatus,tags
590855387,CommitStatus,tags
736979497,CommitStatus,tags
494289498,CommitStatus,tags
700803311,CommitStatus,tags
171952131,CommitStatus,tags
280387644,CommitStatus,tags
401761155,CommitStatus,tags
779081116,CommitStatus,tags
645961125,CommitStatus,tags
773420594,CommitStatus,tags
238857038,CommitStatus,tags
105173271,CommitStatus,tags
518578786,CommitStatus,tags
129016865,CommitStatus,tags
520117840,CommitStatus,tags
2849,CommitStatus,tags
338216694,CommitStatus,tags
390240477,CommitStatus,tags
140903540,CommitStatus,tags
532064116,CommitStatus,tags
577640868,CommitStatus,tags
576915618,CommitStatus,tags
69086697,CommitStatus,tags
616860507,CommitStatus,tags
475988651,CommitStatus,tags
368074939,CommitStatus,tags
495060037,CommitStatus,tags
356015704,CommitStatus,tags
114944453,CommitStatus,tags
568217619,CommitStatus,tags
738418825,CommitStatus,tags
181695533,CommitStatus,tags
391075889,CommitStatus,tags
628256459,CommitStatus,tags
712090522,CommitStatus,tags
453839367,CommitStatus,tags
252912407,CommitStatus,tags
504211600,CommitStatus,tags
385561913,CommitStatus,tags
546185328,CommitStatus,tags
375169602,CommitStatus,tags
333404569,CommitStatus,tags
685162590,CommitStatus,tags
675977693,CommitStatus,tags
631664645,CommitStatus,tags
389293545,CommitStatus,tags
508250687,CommitStatus,tags
697885598,CommitStatus,tags
744738488,CommitStatus,tags
274531102,CommitStatus,tags
282167195,CommitStatus,tags
641830394,CommitStatus,tags
785818657,CommitStatus,tags
667553162,CommitStatus,tags
558734501,CommitStatus,tags
821209419,CommitStatus,tags
774126368,CommitStatus,tags
38780467,CommitStatus,tags
434436183,CommitStatus,tags
53901003,CommitStatus,tags
727398189,CommitStatus,tags
463643027,CommitStatus,tags
571804224,CommitStatus,tags
20372662,CommitStatus,tags
529209188,CommitStatus,tags
739848647,CommitStatus,tags
73081655,CommitStatus,tags
439988475,CommitStatus,tags
753597834,CommitStatus,tags
551563096,CommitStatus,tags
95144349,CommitStatus,tags
715628242,CommitStatus,tags
599084150,CommitStatus,tags
83477106,CommitStatus,tags
624089958,CommitStatus,tags
681718222,CommitStatus,tags
405901307,CommitStatus,tags
256173679,CommitStatus,tags
825770589,CommitStatus,tags
547567071,CommitStatus,tags
364595110,CommitStatus,tags
523008455,CommitStatus,tags
339041123,CommitStatus,tags
121526970,CommitStatus,tags
814324262,CommitStatus,tags
491397517,CommitStatus,tags
424170412,CommitStatus,tags
645004651,CommitStatus,tags
747473114,CommitStatus,tags
732152166,CommitStatus,tags
544485279,CommitStatus,tags
638028393,CommitStatus,tags
787773224,CommitStatus,tags
597594062,CommitStatus,tags
798602033,CommitStatus,tags
396067390,CommitStatus,tags
830338837,CommitStatus,tags
671090887,CommitStatus,tags
548172493,CommitStatus,tags
793987943,CommitStatus,tags
514514536,CommitStatus,tags
74981064,CommitStatus,tags
449252463,CommitStatus,tags
349173621,CommitStatus,tags
505573824,CommitStatus,tags
217800516,CommitStatus,tags
252059894,CommitStatus,tags
654845758,CommitStatus,tags
122608611,CommitStatus,tags
66796579,CommitStatus,tags
430242819,CommitStatus,tags
771441813,CommitStatus,tags
187537383,CommitStatus,tags
481599060,CommitStatus,tags
639496553,CommitStatus,tags
371931842,CommitStatus,tags
732820966,CommitStatus,tags
247594909,CommitStatus,tags
759546059,CommitStatus,tags
185399637,CommitStatus,tags
603317374,CommitStatus,tags
237697211,CommitStatus,tags
56078285,CommitStatus,tags
414380045,CommitStatus,tags
552849491,CommitStatus,tags
711265600,CommitStatus,tags
129885514,CommitStatus,tags
392883618,CommitStatus,tags
487548131,CommitStatus,tags
431381543,CommitStatus,tags
686349357,CommitStatus,tags
506261266,CommitStatus,tags
228900444,CommitStatus,tags
695933025,CommitStatus,tags
160233737,CommitStatus,tags
672457498,CommitStatus,tags
446987525,CommitStatus,tags
321381135,CommitStatus,tags
374407047,CommitStatus,tags
381103071,CommitStatus,tags
459822345,CommitStatus,tags
245673543,CommitStatus,tags
815073822,CommitStatus,tags
23875800,CommitStatus,tags
444550160,CommitStatus,tags
386396272,CommitStatus,tags
502552825,CommitStatus,tags
404398045,CommitStatus,tags
611025476,CommitStatus,tags
550850322,CommitStatus,tags
764798629,CommitStatus,tags
307866294,CommitStatus,tags
563000315,CommitStatus,tags
709776094,CommitStatus,tags
602567085,CommitStatus,tags
503403202,CommitStatus,tags
303465753,CommitStatus,tags
593750492,CommitStatus,tags
707737914,CommitStatus,tags
435240517,CommitStatus,tags
193635501,CommitStatus,tags
766123510,CommitStatus,tags
619753446,CommitStatus,tags
513702313,CommitStatus,tags
43862162,CommitStatus,tags
403429637,CommitStatus,tags
276546184,CommitStatus,tags
560863411,CommitStatus,tags
411978258,CommitStatus,tags
758873842,CommitStatus,tags
192703787,CommitStatus,tags
202583341,CommitStatus,tags
677539955,CommitStatus,tags
788384064,CommitStatus,tags
169870779,CommitStatus,tags
352382671,CommitStatus,tags
155626902,CommitStatus,tags
137910928,CommitStatus,tags
726649174,CommitStatus,tags
254671724,CommitStatus,tags
492906820,CommitStatus,tags
393721596,CommitStatus,tags
442409822,CommitStatus,tags
511366982,CommitStatus,tags
775754807,CommitStatus,tags
299904013,CommitStatus,tags
644149119,CommitStatus,tags
29457918,CommitStatus,tags
669649097,CommitStatus,tags
785113583,CommitStatus,tags
521000319,CommitStatus,tags
789817072,Ci::Runner,tags
832286640,CommitStatus,tags
554199060,CommitStatus,tags
57057893,CommitStatus,tags
135979985,CommitStatus,tags
157424504,CommitStatus,tags
478327173,CommitStatus,tags
112954197,CommitStatus,tags
782018893,CommitStatus,tags
138879790,CommitStatus,tags
8879344,CommitStatus,tags
684527364,CommitStatus,tags
649499675,CommitStatus,tags
52937816,CommitStatus,tags
526930022,CommitStatus,tags
78114469,CommitStatus,tags
748878000,CommitStatus,tags
761404805,CommitStatus,tags
10926402,CommitStatus,tags
728840095,CommitStatus,tags
695399553,CommitStatus,tags
358619661,Project,tags
58105614,CommitStatus,tags
826428826,CommitStatus,tags
345412881,CommitStatus,tags
823187608,CommitStatus,tags
648118856,CommitStatus,tags
206162441,CommitStatus,tags
406684566,CommitStatus,tags
831646951,CommitStatus,tags
704290638,CommitStatus,tags
222526583,CommitStatus,tags
456118171,CommitStatus,tags
689146889,CommitStatus,tags
317238379,CommitStatus,tags
663034655,CommitStatus,tags
600529654,CommitStatus,tags
392048226,CommitStatus,tags
183549101,CommitStatus,tags
262780967,CommitStatus,tags
32880425,CommitStatus,tags
72036131,CommitStatus,tags
683847169,CommitStatus,tags
827672909,CommitStatus,tags
606750285,CommitStatus,tags
608140131,CommitStatus,tags
752406943,CommitStatus,tags
703663051,CommitStatus,tags
712865514,CommitStatus,tags
710518970,CommitStatus,tags
462009624,CommitStatus,tags
226940682,CommitStatus,tags
473895774,CommitStatus,tags
601146981,CommitStatus,tags
125513841,CommitStatus,tags
272707622,CommitStatus,tags
605993024,CommitStatus,tags
479082746,CommitStatus,tags
590215683,CommitStatus,tags
55020943,CommitStatus,labels
796072326,CommitStatus,tags
299131067,CommitStatus,tags
59328032,CommitStatus,tags
629548829,CommitStatus,tags
9919829,CommitStatus,tags
387384009,CommitStatus,tags
418391857,CommitStatus,tags
2919825,CommitStatus,tags
492154355,CommitStatus,tags
124360860,CommitStatus,tags
650289120,CommitStatus,tags
737699602,CommitStatus,tags
816943171,CommitStatus,tags
642611193,CommitStatus,tags
297412189,CommitStatus,tags
714114981,CommitStatus,tags
466344226,CommitStatus,tags
356862541,CommitStatus,tags
595407973,CommitStatus,tags
555665264,CommitStatus,tags
653506459,CommitStatus,tags
679642156,CommitStatus,tags
255415924,CommitStatus,tags
408379984,CommitStatus,tags
195707162,CommitStatus,tags
196762585,CommitStatus,tags
159317545,CommitStatus,tags
750229301,CommitStatus,tags
167775074,CommitStatus,tags
530660728,CommitStatus,tags
153657218,CommitStatus,tags
618262254,CommitStatus,tags
666757273,CommitStatus,tags
628925453,CommitStatus,tags
527726438,CommitStatus,tags
468676891,CommitStatus,tags
537800528,CommitStatus,tags
777754223,CommitStatus,tags
127196310,CommitStatus,tags
822493650,CommitStatus,tags
273666866,CommitStatus,tags
792594750,CommitStatus,tags
572493957,CommitStatus,tags
601818742,CommitStatus,tags
421777946,CommitStatus,tags
819891278,CommitStatus,tags
31643897,CommitStatus,tags
107391124,CommitStatus,tags
575544152,CommitStatus,tags
304539373,CommitStatus,tags
709046562,CommitStatus,tags
832982021,CommitStatus,tags
540082453,CommitStatus,tags
281304209,CommitStatus,tags
746012025,CommitStatus,tags
426361537,CommitStatus,tags
215652750,CommitStatus,tags
154615013,CommitStatus,tags
402528897,CommitStatus,tags
556471566,CommitStatus,tags
797810703,CommitStatus,tags
824497077,CommitStatus,tags
175764751,CommitStatus,tags
106253537,CommitStatus,tags
810513250,CommitStatus,tags
264562706,CommitStatus,tags
565383055,CommitStatus,tags
210743123,CommitStatus,tags
35065212,CommitStatus,tags
168769734,CommitStatus,tags
510571021,CommitStatus,tags
432920453,CommitStatus,tags
415246308,CommitStatus,tags
126290921,CommitStatus,tags
427909385,CommitStatus,tags
576249945,CommitStatus,tags
687734250,CommitStatus,tags
809871628,CommitStatus,tags
162877591,CommitStatus,tags
332455988,CommitStatus,tags
799282373,CommitStatus,tags
596093814,CommitStatus,tags
719034928,CommitStatus,tags
383875411,CommitStatus,tags
15790059,CommitStatus,tags
536922494,CommitStatus,tags
557181929,CommitStatus,tags
512002850,CommitStatus,tags
754873349,CommitStatus,tags
451520973,CommitStatus,tags
382888562,CommitStatus,tags
362014855,CommitStatus,tags
234819329,CommitStatus,tags
622562547,CommitStatus,tags
250207959,CommitStatus,tags
87880952,CommitStatus,tags
829719459,CommitStatus,tags
2144130,CommitStatus,tags
532813640,CommitStatus,tags
605312327,CommitStatus,tags
485248285,CommitStatus,tags
725898961,CommitStatus,tags
702974817,CommitStatus,tags
327565476,CommitStatus,tags
132366561,CommitStatus,tags
294549274,CommitStatus,tags
326133737,CommitStatus,tags
147495007,CommitStatus,tags
501878204,CommitStatus,tags
643357059,CommitStatus,tags
240610736,CommitStatus,tags
148557754,CommitStatus,tags
353418794,CommitStatus,tags
743968382,CommitStatus,tags
654191620,CommitStatus,tags
232491814,CommitStatus,tags
813039114,CommitStatus,tags
460521936,CommitStatus,tags
815747517,CommitStatus,tags
207951288,CommitStatus,tags
623257146,CommitStatus,tags
820592081,CommitStatus,tags
480807973,CommitStatus,tags
318139021,CommitStatus,tags
115980344,CommitStatus,tags
118039036,CommitStatus,tags
48595997,CommitStatus,tags
804416362,CommitStatus,tags
40015382,CommitStatus,tags
756276899,CommitStatus,tags
186427086,CommitStatus,tags
141794121,CommitStatus,tags
823861161,CommitStatus,tags
678814232,CommitStatus,tags
395436121,CommitStatus,tags
223380765,CommitStatus,tags
599868595,CommitStatus,tags
770758715,CommitStatus,tags
615350781,CommitStatus,tags
96023265,CommitStatus,tags
608872261,CommitStatus,tags
721168278,CommitStatus,tags
557983499,CommitStatus,tags
805251094,CommitStatus,tags
429533680,CommitStatus,tags
479896099,CommitStatus,tags
750959177,CommitStatus,tags
359459008,CommitStatus,tags
64718357,CommitStatus,tags
300810755,CommitStatus,tags
635626397,CommitStatus,tags
475267689,CommitStatus,tags
592251161,CommitStatus,tags
93036200,CommitStatus,tags
681069055,CommitStatus,tags
21815415,CommitStatus,tags
573811528,CommitStatus,tags
570360221,CommitStatus,tags
470065549,CommitStatus,tags
86814073,CommitStatus,tags
256909936,CommitStatus,tags
172748832,CommitStatus,tags
641037405,CommitStatus,tags
633218791,CommitStatus,tags
583326226,CommitStatus,tags
702220623,CommitStatus,tags
450723153,CommitStatus,tags
376027963,CommitStatus,tags
73990774,CommitStatus,tags
539110936,CommitStatus,tags
720519006,CommitStatus,tags
769458531,CommitStatus,tags
763436419,CommitStatus,tags
474591738,CommitStatus,tags
512834619,CommitStatus,tags
384741861,CommitStatus,tags
554881336,CommitStatus,tags
268185260,CommitStatus,tags
698543991,CommitStatus,tags
469332024,CommitStatus,tags
617584172,CommitStatus,tags
591459699,CommitStatus,tags
734894993,CommitStatus,tags
349984641,CommitStatus,tags
764158022,CommitStatus,tags
416847972,CommitStatus,tags
470715798,CommitStatus,tags
346304530,CommitStatus,tags
571174050,CommitStatus,tags
745367463,CommitStatus,tags
337388677,CommitStatus,tags
743393083,CommitStatus,tags
647408103,CommitStatus,tags
85779578,CommitStatus,tags
757584,CommitStatus,tags
166756687,CommitStatus,tags
342821276,CommitStatus,tags
596914252,CommitStatus,tags
587132504,CommitStatus,tags
437484683,CommitStatus,tags
197642931,CommitStatus,tags
205334568,CommitStatus,tags
139913261,CommitStatus,tags
288233364,CommitStatus,tags
446161354,CommitStatus,tags
733476611,CommitStatus,tags
536013705,CommitStatus,tags
546898058,CommitStatus,tags
46484650,CommitStatus,tags
716312997,CommitStatus,tags
322238952,CommitStatus,tags
693478526,CommitStatus,tags
671751741,CommitStatus,tags
564583718,CommitStatus,tags
136902556,CommitStatus,tags
229685504,CommitStatus,tags
270913553,CommitStatus,tags
821817810,CommitStatus,tags
363670575,CommitStatus,tags
611614755,CommitStatus,tags
627558524,CommitStatus,tags
692140053,CommitStatus,tags
828430029,CommitStatus,tags
490717617,CommitStatus,tags
782804313,CommitStatus,tags
119357453,CommitStatus,tags
347302921,CommitStatus,tags
587977799,CommitStatus,tags
275528717,CommitStatus,tags
673875434,CommitStatus,tags
780419715,CommitStatus,tags
501167898,CommitStatus,tags
453024603,CommitStatus,tags
789063384,CommitStatus,tags
261035976,CommitStatus,tags
626260439,CommitStatus,tags
99646503,CommitStatus,tags
291716386,CommitStatus,tags
158226765,CommitStatus,tags
208871473,CommitStatus,tags
312244699,CommitStatus,tags
656398198,CommitStatus,tags
488250437,CommitStatus,tags
464338945,CommitStatus,tags
278504321,CommitStatus,tags
120475107,CommitStatus,tags
320352091,CommitStatus,tags
314228797,CommitStatus,tags
793261029,CommitStatus,tags
405133578,CommitStatus,tags
218762927,CommitStatus,tags
292730849,CommitStatus,tags
609608861,CommitStatus,tags
717652480,CommitStatus,tags
310409157,CommitStatus,tags
730197357,CommitStatus,tags
778485535,CommitStatus,tags
791094241,CommitStatus,tags
567569160,CommitStatus,tags
812394723,CommitStatus,tags
324974138,CommitStatus,tags
443104124,CommitStatus,tags
305609730,CommitStatus,tags
762724411,CommitStatus,tags
398324716,CommitStatus,tags
734085271,CommitStatus,tags
717009904,CommitStatus,tags
4907952,CommitStatus,tags
659292384,CommitStatus,tags
452285953,CommitStatus,tags
316159366,CommitStatus,tags
607511891,CommitStatus,tags
685728454,CommitStatus,tags
796717671,CommitStatus,tags
296481598,CommitStatus,tags
221644858,CommitStatus,tags
216673642,CommitStatus,tags
456915676,CommitStatus,tags
350813080,CommitStatus,tags
224453407,CommitStatus,tags
339974160,CommitStatus,tags
831027596,CommitStatus,tags
436823121,CommitStatus,tags
683147919,CommitStatus,tags
63701054,CommitStatus,tags
760799289,CommitStatus,tags
652098551,CommitStatus,tags
114017629,CommitStatus,tags
360399717,CommitStatus,tags
621823688,CommitStatus,tags
574684028,CommitStatus,tags
728216232,CommitStatus,tags
302530666,CommitStatus,tags
265506391,CommitStatus,tags
313237810,CommitStatus,tags
253756490,CommitStatus,tags
309510076,CommitStatus,tags
689934143,CommitStatus,tags
465584076,CommitStatus,tags
36122913,CommitStatus,tags
604324278,CommitStatus,tags
665885945,CommitStatus,tags
563697780,CommitStatus,tags
777080033,CommitStatus,tags
464946577,CommitStatus,tags
394619276,CommitStatus,tags
768101199,CommitStatus,tags
351627060,CommitStatus,tags
725191322,CommitStatus,tags
110582433,CommitStatus,tags
289037541,CommitStatus,tags
776418449,CommitStatus,tags
190440146,CommitStatus,tags
246560965,CommitStatus,tags
471444733,CommitStatus,tags
413582405,CommitStatus,tags
361251616,CommitStatus,tags
97138649,CommitStatus,tags
314986797,CommitStatus,tags
525993755,CommitStatus,tags
60377419,CommitStatus,tags
697284656,CommitStatus,tags
161125150,CommitStatus,tags
706307971,CommitStatus,tags
410267462,CommitStatus,tags
243318517,CommitStatus,tags
1330330,CommitStatus,tags
504949242,CommitStatus,tags
7924966,CommitStatus,tags
630270352,CommitStatus,tags
285739484,CommitStatus,tags
497357311,CommitStatus,tags
614455069,CommitStatus,tags
665142397,CommitStatus,tags
283121477,CommitStatus,tags
323199769,CommitStatus,tags
509861070,CommitStatus,tags
152705398,CommitStatus,tags
562280401,CommitStatus,tags
458263168,CommitStatus,tags
279529000,CommitStatus,tags
41295917,CommitStatus,tags
541489816,CommitStatus,tags
589407405,CommitStatus,tags
516930763,CommitStatus,tags
568964720,CommitStatus,tags
690783395,CommitStatus,tags
498056998,CommitStatus,tags
548832419,CommitStatus,tags
668998935,CommitStatus,tags
580465108,CommitStatus,tags
794719455,CommitStatus,tags
811185306,CommitStatus,tags
170935222,CommitStatus,tags
498849514,CommitStatus,tags
806562525,CommitStatus,tags
249313940,CommitStatus,tags
462594617,CommitStatus,tags
266450172,CommitStatus,tags
477491301,CommitStatus,tags
135024802,CommitStatus,tags
550171390,CommitStatus,tags
399865199,CommitStatus,tags
362819897,CommitStatus,tags
260182305,CommitStatus,tags
783564319,CommitStatus,tags
753024156,CommitStatus,tags
542261286,CommitStatus,tags
343671965,Ci::Runner,tags
655632598,CommitStatus,tags
231639083,CommitStatus,tags
42665249,CommitStatus,tags
128044657,CommitStatus,tags
500541987,CommitStatus,tags
379139292,CommitStatus,tags
145584755,CommitStatus,tags
369663618,CommitStatus,tags
473180999,CommitStatus,tags
241482871,CommitStatus,tags
578999913,CommitStatus,tags
676731012,CommitStatus,tags
397588607,CommitStatus,tags
756931237,CommitStatus,tags
268996096,CommitStatus,tags
507096373,CommitStatus,tags
184447234,CommitStatus,tags
805864389,CommitStatus,tags
203605936,CommitStatus,tags
16666253,CommitStatus,tags
534240408,CommitStatus,tags
354321743,CommitStatus,tags
801544800,CommitStatus,tags
336523525,CommitStatus,tags
51836775,CommitStatus,tags
664370960,CommitStatus,tags
123465811,CommitStatus,tags
775178704,CommitStatus,tags
271760334,CommitStatus,tags
177621767,CommitStatus,tags
553502393,CommitStatus,tags
802903245,CommitStatus,tags
311292773,CommitStatus,tags
670360804,CommitStatus,tags
372925036,CommitStatus,tags
579647179,CommitStatus,tags
618910198,CommitStatus,tags
329011998,CommitStatus,tags
149659724,CommitStatus,tags
724436617,CommitStatus,tags
484503900,CommitStatus,tags
130670000,CommitStatus,tags
673193829,CommitStatus,tags
787200203,CommitStatus,tags
263745801,CommitStatus,tags
182566450,CommitStatus,tags
239785828,CommitStatus,tags
259346347,CommitStatus,tags
334420755,CommitStatus,tags
482375065,CommitStatus,tags
180696274,CommitStatus,tags
754274547,CommitStatus,tags
486013464,CommitStatus,tags
441680907,CommitStatus,tags
388263145,CommitStatus,tags
620468984,CommitStatus,tags
283897795,CommitStatus,tags
758229780,CommitStatus,tags
425022457,CommitStatus,tags
736296800,CommitStatus,tags
47562322,CommitStatus,tags
420244956,CommitStatus,tags
730796718,CommitStatus,tags
399071138,CommitStatus,tags
18567004,CommitStatus,tags
344634770,CommitStatus,tags
319157164,CommitStatus,tags
561621851,CommitStatus,tags
706949200,CommitStatus,tags
277605585,CommitStatus,tags
529870257,CommitStatus,tags
588713681,CommitStatus,tags
657837863,CommitStatus,tags
751673195,CommitStatus,tags
27576704,CommitStatus,tags
742096105,CommitStatus,tags
287364647,CommitStatus,tags
760248874,CommitStatus,tags
489891062,CommitStatus,tags
592965365,CommitStatus,tags
467055546,CommitStatus,tags
79142013,CommitStatus,tags
373651299,CommitStatus,tags
586333661,CommitStatus,tags
163767870,CommitStatus,tags
433730402,CommitStatus,tags
144582697,CommitStatus,tags
540837359,CommitStatus,tags
566169752,CommitStatus,tags
584918803,CommitStatus,tags
62548669,CommitStatus,tags
612974805,CommitStatus,tags
109593808,CommitStatus,tags
173630945,CommitStatus,tags
779781372,CommitStatus,tags
422481926,CommitStatus,tags
772185984,CommitStatus,tags
214710804,CommitStatus,tags
718340437,CommitStatus,tags
461301025,CommitStatus,tags
761996902,CommitStatus,tags
257722849,CommitStatus,tags
688516201,CommitStatus,tags
723780350,CommitStatus,tags
691410665,CommitStatus,tags
