7144843,2019-06-23,1
9638916,2019-11-20,11
5024100,2020-09-04,1
10306780,2020-03-22,1
6136341,2020-01-21,1
7059436,2019-12-14,5
3017204,2019-12-23,1
6759570,2020-03-23,12
5416351,2020-08-06,27
11065653,2020-07-14,2
11995718,2019-04-10,3
1019305,2020-05-02,15
12668506,2020-07-06,6
4177507,2019-12-12,1
5678548,2020-04-22,3
9317860,2020-09-01,15
5336217,2020-09-23,1
5336217,2019-08-13,4
17016153,2019-12-29,2
13973032,2019-03-22,1
7734911,2020-08-19,1
15743125,2020-08-30,7
12252140,2020-06-29,2
9638916,2020-08-05,7
11334197,2020-10-11,1
6878568,2020-03-11,1
5024100,2020-05-26,1
7106678,2020-08-04,1
15721394,2020-08-03,2
7849341,2020-06-23,2
9647487,2019-05-16,2
11334197,2019-04-11,1
9199739,2020-09-03,20
14729131,2020-02-07,4
10984699,2019-07-15,4
15744109,2020-02-10,1
4418153,2020-04-15,6
5407698,2020-08-26,2
7645168,2020-08-08,1
13973032,2019-09-06,31
8964747,2020-07-18,112
12017940,2020-03-07,1
303847,2020-09-29,16
12860658,2020-09-01,1
9647487,2020-04-13,2
5416351,2020-03-28,8
6759570,2020-05-18,1
15713898,2020-08-01,1
8287632,2019-07-29,27
10760263,2019-04-15,1
10246401,2020-03-24,11
9831408,2019-11-28,1
10100067,2019-11-29,1
8964747,2019-08-28,1
11154154,2020-07-14,3
4106439,2020-09-15,1
12668506,2019-08-01,4
5062432,2019-06-10,2
6836590,2020-04-07,2
5457327,2019-09-04,3
6863858,2020-08-03,1
4177507,2020-01-09,2
7421097,2020-09-29,4
9657413,2020-01-30,10
10246401,2019-06-01,2
5336217,2019-08-12,2
5823170,2019-03-11,2
12825398,2019-08-04,4
6878568,2020-02-16,1
12226350,2020-05-08,1
7914458,2020-09-02,1
8979204,2020-10-04,2
12017940,2019-12-05,2
8755568,2020-09-01,6
6570223,2020-03-04,9
11616589,2020-05-18,53
5416351,2020-08-17,56
11154154,2020-06-18,1
7370506,2020-10-04,2
9179586,2020-07-30,1
11928803,2019-08-15,43
12849133,2020-05-27,19
6962044,2020-02-25,1
10532325,2020-09-08,1
7421097,2019-07-08,2
5336217,2020-09-11,1
4371396,2019-04-26,18
3263276,2020-07-29,2
5416351,2019-06-10,2
10984699,2020-04-25,1
11785221,2020-01-02,2
11154154,2019-09-18,1
10100067,2020-03-24,2
11616589,2019-07-14,1
11928803,2020-03-20,2
6570223,2020-06-01,1
7144843,2020-07-23,1
5678548,2020-08-16,1
11334197,2020-10-13,1
5823170,2020-06-10,6
8755568,2020-02-18,1
12511751,2019-07-18,1
12546342,2020-07-10,6
6962044,2020-03-18,14
10246401,2019-11-07,1
472139,2020-04-05,56
7059436,2020-08-23,6
10532325,2019-03-21,2
11348529,2020-07-24,2
13973032,2020-10-05,1
10529701,2020-02-03,2
11096172,2019-10-02,4
15713898,2019-05-08,2
11020561,2020-01-06,12
9559088,2020-09-30,1
12825398,2020-10-02,3
12226350,2019-10-21,2
9377874,2020-09-10,2
472139,2020-05-19,1
9221013,2020-04-07,1
10277346,2019-08-03,2
5024100,2020-08-27,6
11928803,2020-08-05,7
5133181,2020-03-13,1
15752162,2020-10-19,1
3263276,2020-09-04,46
10654995,2020-06-24,1
3915849,2019-09-12,1
9317860,2019-09-23,4
10660773,2020-06-27,1
11785221,2019-11-26,1
6759570,2020-02-18,1
15715580,2019-09-21,29
11154154,2020-01-11,2
11958157,2019-12-26,2
11995718,2020-02-07,1
11482016,2019-04-30,25
14928079,2019-07-16,1
15752162,2020-05-26,1
10532325,2019-11-22,89
11995718,2019-04-29,1
4306944,2019-12-10,5
6136341,2019-11-06,17
5336217,2020-10-08,1
9559088,2020-07-27,2
13973032,2020-04-24,34
5024100,2019-12-09,86
1206455,2019-10-15,1
5015677,2019-09-29,6
8109731,2020-08-31,129
7849341,2020-06-07,1
10633622,2020-07-25,1
7144843,2020-10-15,3
5678548,2019-08-01,2
7949217,2020-06-19,1
15252527,2020-05-03,13
12849133,2020-07-07,1
12546342,2020-07-23,2
14928079,2020-09-08,3
10532325,2019-11-28,2
10487179,2020-06-25,1
10654995,2019-12-30,10
15754307,2020-06-11,8
9831408,2020-08-29,31
4418153,2019-10-26,3
8001899,2019-09-05,1
6759570,2019-04-28,15
7849341,2020-09-14,3
11616589,2020-08-19,2
7370506,2020-03-08,7
11527768,2019-05-29,2
12135343,2020-07-20,7
10309159,2020-07-13,2
7914458,2019-11-30,1
7144843,2020-02-14,2
13973032,2020-08-19,4
3000079,2019-05-19,6
14600951,2020-03-10,3
9377874,2019-10-06,2
15752162,2020-04-24,15
11334197,2019-12-12,36
5290875,2019-07-11,4
14078196,2020-07-20,2
7108072,2019-07-21,4
9657413,2020-03-02,1
1946888,2020-01-09,19
11109383,2020-02-12,45
7949217,2019-12-20,2
17016153,2020-08-27,4
7949217,2020-08-18,1
6836590,2020-04-18,2
5678548,2020-06-30,3
12668506,2020-05-15,1
5925800,2020-09-24,2
12860658,2020-03-16,18
15713898,2020-04-04,1
12252140,2019-09-26,4
11785221,2020-05-22,38
5416351,2020-05-21,8
11928803,2019-03-20,3
15715580,2019-11-16,1
8109731,2020-03-10,9
303847,2019-12-10,2
7144843,2020-04-13,1
11527768,2020-02-13,8
10529701,2020-01-14,1
12668506,2019-09-02,2
9180592,2020-10-06,1
7949217,2019-07-13,6
5416351,2020-09-21,6
11365747,2020-09-03,86
12668506,2019-11-19,2
10573105,2019-11-22,6
1946888,2020-05-14,1
7378064,2020-01-15,4
4371396,2020-10-15,1
7685545,2020-08-27,1
12825398,2019-12-09,1
15252527,2020-07-07,1
10532325,2020-09-09,1
7378064,2020-05-23,199
7144843,2020-03-13,1
11365747,2019-07-03,2
9199739,2019-08-04,1
11334197,2020-03-27,2
7650492,2020-05-15,2
7650492,2020-10-14,1
9657413,2020-08-29,3
10984699,2020-08-06,1
14600951,2020-02-21,1
3000079,2020-08-01,8
2338717,2019-06-05,1
7144843,2020-08-25,2
12825398,2019-12-09,2
17016153,2019-04-04,130
9240965,2020-02-11,3
15721394,2020-08-04,3
6836590,2019-12-27,2
12849133,2020-10-20,1
5416351,2020-09-24,3
7378064,2020-10-12,2
5015677,2019-03-26,2
7645168,2020-01-02,1
11334197,2019-09-15,3
5925800,2019-09-15,3
5823170,2020-06-26,159
11958157,2020-06-06,8
7416118,2020-09-21,1
11482016,2020-08-01,1
14928079,2020-10-02,350
9497392,2019-11-19,68
12906346,2020-02-11,106
7370506,2020-08-02,1
10306780,2020-03-28,2
5416351,2020-07-11,6
11616589,2020-09-26,2
11527768,2020-07-08,1
9487506,2019-05-10,29
10306780,2020-08-16,5
11096172,2020-07-22,4
11096172,2019-11-13,20
10654995,2019-08-11,1
10532325,2020-03-28,1
15713898,2019-06-18,2
8967944,2019-11-14,1
5133181,2019-04-10,1
9377874,2020-08-06,17
9497392,2019-12-10,34
8755568,2020-09-23,6
4639595,2020-05-18,2
11350654,2019-12-03,6
10487179,2020-10-06,20
13973032,2020-05-09,2
15715580,2020-04-17,2
9317860,2020-10-15,6
11365747,2019-07-19,7
14078196,2020-06-05,2
11928803,2019-08-22,13
11154154,2020-05-20,7
8755568,2020-07-20,2
13973032,2020-03-15,4
10532325,2019-06-11,3
9487506,2020-10-17,1
12906346,2020-10-06,6
7560096,2020-03-01,5
4177507,2019-09-06,10
12668506,2019-06-17,2
7849341,2020-09-10,4
6065397,2020-05-07,1
15754307,2019-03-29,48
7370506,2020-09-29,2
15752162,2020-04-28,2
9700835,2019-06-01,2
11365747,2020-10-12,2
8964747,2019-12-30,17
5024100,2020-02-20,1
15252527,2019-11-16,1
7734911,2020-06-16,1
303847,2020-09-18,3
5925800,2020-09-14,4
5416351,2019-10-08,2
9982199,2019-09-20,1
4106439,2020-08-01,1
9700835,2020-04-06,1
303847,2020-10-07,2
12849484,2019-06-07,21
14729131,2019-04-04,1
3263276,2020-02-18,11
4106439,2020-02-18,6
10984699,2020-06-03,3
6964955,2020-08-14,10
12252140,2020-02-04,1
14729131,2020-03-13,8
4281111,2019-04-11,1
6136341,2019-04-11,1
11154154,2020-09-21,1
10277346,2020-08-25,1
11527768,2020-09-18,7
9831408,2020-10-14,1
6962044,2020-06-14,10
12849992,2020-10-06,3
11065653,2020-08-04,126
11109383,2020-07-03,2
9199739,2020-08-10,2
11527768,2019-04-11,2
15754307,2020-07-23,2
7106678,2020-01-06,1
10573105,2019-06-15,1
7849341,2020-06-16,1
9682011,2020-10-05,7
7560096,2020-08-22,6
15721394,2020-04-08,2
15713898,2019-10-01,1
7849341,2020-06-28,65
12849484,2020-03-01,190
7685545,2020-02-24,6
11928803,2020-07-18,1
924167,2020-01-27,1
5133181,2020-07-31,11
6570223,2019-12-26,7
472139,2020-06-28,3
11154154,2020-06-10,1
5678548,2020-05-14,1
7421097,2020-10-16,124
7144843,2020-09-04,2
7108072,2019-10-22,14
2338717,2019-04-01,3
4418153,2019-04-22,42
6878568,2019-09-09,6
4177507,2020-02-27,1
12679664,2020-03-02,6
8679850,2019-08-06,2
9497392,2020-01-05,51
12252140,2020-07-01,42
12017940,2019-03-20,9
6065397,2019-12-26,1
3915849,2020-01-28,1
10633622,2020-03-24,1
10246401,2020-07-28,1
6964955,2020-08-30,6
7215991,2020-07-01,1
1206455,2019-07-20,1
7849341,2020-06-10,4
7378064,2020-03-19,1
6955981,2019-11-26,1
4106439,2020-04-09,4
4418153,2020-05-13,1
5416351,2019-10-27,2
6836590,2020-08-27,1
9638916,2019-07-23,1
6570223,2020-03-05,9
7914458,2020-03-22,30
11109383,2020-09-08,3
7370506,2019-10-01,1
10654995,2020-03-29,1
17016153,2020-05-04,12
10654995,2020-06-29,2
11020561,2020-09-03,5
5729889,2019-07-10,2
8979204,2020-06-12,4
9682011,2020-09-21,1
7421097,2019-12-09,3
6878568,2020-10-20,2
12546342,2020-01-02,4
12860658,2020-10-17,1
5823170,2020-10-15,5
1946888,2020-06-05,2
9180592,2019-12-24,1
5062432,2020-04-10,1
10532325,2020-10-13,174
6863858,2020-04-18,22
7370506,2020-09-17,1
12860658,2019-08-23,1
7106678,2019-03-18,2
14928079,2020-09-17,2
2338717,2019-06-21,2
11350654,2019-08-02,1
4371396,2020-05-20,2
7370506,2020-07-26,70
10984699,2020-02-04,42
10760263,2020-06-10,2
9682011,2020-10-16,2
11482016,2020-09-10,2
15252527,2019-09-04,2
9179586,2019-07-05,2
15744109,2019-08-13,2
9179586,2020-09-17,5
10246401,2019-03-09,1
2338717,2020-01-06,1
472139,2019-03-20,2
15713898,2020-06-24,1
8287632,2019-10-22,1
11958157,2020-10-16,25
7215991,2020-09-30,1
12849133,2020-02-06,1
7059436,2020-01-22,2
12252140,2020-08-24,1
9240965,2020-02-21,1
11616589,2020-03-15,3
11928491,2020-03-21,3
5457327,2020-02-24,1
5925800,2020-09-02,2
6759570,2020-06-08,2
5336217,2020-10-11,2
6136341,2020-08-26,10
8679850,2019-07-24,1
11928803,2020-10-07,158
1019305,2020-03-03,2
6863858,2019-09-24,18
12668506,2020-10-14,2
8755568,2019-08-06,8
11154154,2020-01-27,4
5856890,2020-05-26,1
11109383,2020-08-04,1
4639595,2019-03-22,1
14729131,2020-03-04,1
4177507,2019-10-16,1
4106439,2019-11-05,3
9240965,2020-04-14,9
7560096,2020-01-30,8
11288963,2020-08-19,28
9240965,2020-04-14,1
4418153,2020-07-22,23
7734911,2020-03-02,5
10390691,2020-04-28,5
11020561,2020-03-25,1
12849992,2020-05-04,2
924167,2020-06-12,4
10306780,2019-08-03,1
7849341,2020-04-05,2
5336217,2019-10-07,1
3263276,2020-07-09,13
7416118,2020-08-23,3
6136341,2019-09-27,1
14600951,2020-08-24,3
10277346,2020-04-07,1
11334197,2020-02-05,4
4106439,2020-02-15,1
11096172,2019-03-24,2
12252140,2020-02-16,33
7307654,2020-04-30,1
10573105,2020-06-03,14
9221013,2020-10-15,5
3017204,2019-10-14,18
3915849,2019-08-03,6
10633622,2020-07-23,1
11154154,2020-03-14,3
7370506,2020-04-23,256
10309159,2019-10-25,1
1206455,2019-05-19,2
15721394,2020-02-08,124
4306944,2019-04-19,4
15713898,2020-04-14,3
10390691,2020-05-09,12
9240965,2020-06-16,68
5678548,2019-12-17,6
7849341,2019-03-26,1
15754307,2020-01-14,6
15752162,2020-10-09,52
15788203,2020-10-18,1
8001899,2020-10-07,2
7849341,2019-05-06,2
472139,2020-10-20,72
10309159,2020-05-26,3
8755568,2019-07-04,1
7914458,2019-12-07,2
4306944,2020-07-02,2
6863858,2020-06-24,20
15754307,2020-06-14,14
15175419,2020-06-09,13
15715580,2019-05-08,9
7560096,2020-03-05,13
12017940,2020-03-11,13
11785221,2019-05-23,2
7215991,2020-04-05,3
9559088,2020-09-22,16
3000079,2019-03-18,3
10246401,2019-11-23,1
9221013,2019-11-12,20
7307654,2019-09-21,2
5416351,2019-08-08,3
15721394,2020-04-08,1
11995718,2019-12-21,2
10573105,2019-06-14,3
4306944,2020-02-18,1
10760263,2020-10-06,72
9559088,2019-03-12,94
4177507,2020-05-16,1
7215991,2019-06-03,2
5823170,2020-02-14,6
11350654,2020-05-04,16
7215991,2020-04-16,2
7421097,2020-01-01,6
12668506,2020-10-13,8
7914458,2019-05-27,1
9179586,2020-07-24,1
8679850,2019-11-20,1
7949217,2020-01-24,7
10660773,2020-06-30,12
5457327,2020-09-18,1
12906346,2020-06-04,10
11527768,2020-10-09,1
5024100,2019-12-21,4
12511751,2019-08-18,4
10309159,2020-04-29,6
12017940,2019-04-04,2
15715580,2020-03-09,6
4306944,2020-09-04,1
12668506,2020-04-12,8
10984699,2020-07-03,5
13973032,2020-05-10,1
11154154,2020-01-10,1
1946888,2020-03-22,3
11109383,2019-12-14,6
7370506,2020-09-28,1
1946888,2020-07-21,1
9240965,2020-06-29,8
5823170,2020-08-08,4
6964955,2020-06-05,1
3017204,2019-12-18,15
11348529,2019-10-07,2
1206455,2020-09-29,8
7059436,2020-10-11,1
12860658,2020-06-18,3
10487179,2020-10-20,2
15175419,2019-04-23,1
6836590,2020-04-15,24
1946888,2020-07-22,5
11020561,2019-04-04,1
12546342,2019-06-12,4
11096172,2020-08-21,15
5024100,2020-09-03,8
14600951,2019-08-12,6
5457327,2019-04-23,2
11365747,2020-06-19,2
5948941,2020-05-17,2
8964747,2020-09-06,94
7416118,2020-09-22,6
1206455,2020-05-12,6
7560096,2020-02-27,11
303847,2019-07-24,4
12825398,2019-11-12,2
10532325,2019-09-03,4
7685545,2020-01-17,5
11958157,2019-06-20,2
5792462,2019-12-25,54
10633622,2020-08-02,11
10487179,2019-07-10,6
7370506,2019-08-06,1
3263276,2020-04-08,6
12860658,2020-04-08,17
9497392,2020-01-27,1
532380,2019-03-13,1
10760263,2020-02-05,4
7421097,2019-09-03,7
11288963,2020-02-01,1
10760263,2019-04-06,14
9221013,2020-06-11,58
5792462,2020-10-15,1
9356178,2019-05-03,4
6570223,2020-10-03,1
4639595,2020-03-12,2
6570223,2020-03-23,2
9657413,2019-08-04,21
5856890,2020-04-02,1
15744109,2019-10-02,2
2338717,2020-09-11,2
12929570,2020-01-20,1
12679664,2020-04-28,1
15721394,2019-05-22,1
9982199,2019-12-21,1
11154154,2020-02-28,2
5823170,2020-06-27,1
11288963,2019-10-24,1
10277346,2020-03-10,5
10760263,2020-02-25,19
4371396,2020-03-23,7
9982199,2020-01-31,1
11096172,2019-10-17,5
11995718,2019-09-17,6
15713898,2020-08-03,1
1946888,2020-03-24,2
10100067,2020-06-30,1
10309159,2020-02-11,2
11928803,2020-10-20,16
8967944,2020-06-18,1
7370506,2020-08-03,8
4177507,2020-01-14,1
5792462,2019-04-28,2
12849484,2020-08-31,3
10309159,2020-08-11,1
10760263,2020-08-27,12
5336217,2020-02-21,2
7307654,2019-04-14,28
11365747,2020-08-20,26
10306780,2019-11-16,3
13973032,2020-05-18,1
10984699,2020-07-01,6
12226350,2020-09-18,6
5792462,2020-08-02,3
11785221,2020-02-03,2
4371396,2019-05-01,1
15175419,2019-09-28,4
8964747,2020-04-19,4
7421097,2019-11-24,2
6863858,2020-09-15,6
12546342,2020-08-08,2
5675090,2020-03-12,1
12849992,2019-11-25,36
10309159,2020-03-22,6
5729889,2019-10-30,1
9831408,2020-01-17,1
11928491,2019-11-30,1
7949217,2020-07-22,17
3263276,2019-06-18,1
9638916,2020-01-22,1
6962044,2019-09-23,11
10529701,2020-02-03,1
10760263,2019-11-08,3
10277346,2020-09-09,1
7059436,2019-05-19,1
7650492,2020-06-03,4
9317860,2020-02-17,34
12252140,2020-08-20,4
11096172,2020-09-14,7
12546342,2020-02-23,1
12849484,2020-07-10,1
11096172,2020-01-09,6
15744109,2019-03-19,51
9638916,2020-05-21,11
9982199,2020-09-21,20
12825398,2019-11-20,2
9356153,2020-08-03,35
8287632,2020-05-14,6
4106439,2019-11-29,4
12546342,2019-07-23,1
15715580,2020-10-20,7
6863858,2020-07-02,1
15743125,2020-06-19,1
14600951,2019-09-26,6
11350654,2020-08-06,4
10487179,2020-06-07,23
5062432,2019-08-03,5
3263276,2020-04-30,1
12135343,2020-06-11,2
8964747,2020-03-29,5
9317860,2020-03-04,5
6836590,2020-07-13,2
7560096,2020-06-25,1
9199739,2020-05-15,1
5729889,2020-01-04,1
12226350,2020-10-08,4
11288963,2019-06-24,9
7685545,2019-08-26,2
10573105,2020-10-15,1
5678548,2020-02-26,2
12849133,2020-09-29,48
9638916,2019-09-08,4
13973032,2020-04-22,1
15175419,2019-03-29,40
5416351,2019-10-04,1
5678548,2019-04-11,1
12668506,2020-07-26,1
10573105,2019-07-24,2
472139,2020-08-02,2
924167,2020-10-09,27
9487506,2020-08-24,12
9180592,2020-01-23,1
5024100,2019-11-14,3
9199739,2019-09-21,3
8001899,2020-01-27,9
11020561,2020-04-27,12
14078196,2020-02-13,3
6136341,2019-04-29,6
11350654,2019-05-07,2
5856890,2019-05-27,2
5015677,2020-05-14,1
15721394,2019-05-19,4
15752162,2019-09-19,18
9638916,2020-06-22,1
4639595,2019-06-07,2
14600951,2020-08-01,335
11350654,2020-06-25,2
7106678,2020-09-27,2
303847,2020-06-13,2
9180592,2020-09-09,3
12906346,2020-10-19,1
5062432,2020-10-08,1
11527768,2020-10-02,2
10487179,2020-03-20,1
11109383,2020-05-14,1
5133181,2020-04-07,44
5133181,2019-10-31,4
9638916,2020-04-25,2
15754307,2020-04-27,1
9221013,2019-04-03,1
3000079,2020-09-25,1
5925800,2019-05-11,1
8964747,2020-08-18,48
12849133,2020-02-29,2
15721394,2019-08-03,1
5062432,2019-11-26,2
4106439,2020-02-24,8
11109383,2020-10-12,1
6136341,2020-10-08,18
8755568,2020-03-02,24
9356153,2020-03-31,11
9682011,2020-07-13,17
9831408,2019-08-14,5
9487506,2019-04-07,1
15252527,2020-10-16,1
15715580,2019-07-23,2
9221013,2019-09-30,68
6570223,2020-09-24,37
9831408,2019-08-09,20
8967944,2020-05-12,1
7416118,2019-06-13,12
5416351,2020-06-09,2
1946888,2019-10-06,6
11313714,2020-07-22,6
12546342,2020-06-23,6
4177507,2020-06-01,12
10529701,2019-07-05,1
10277346,2020-01-22,53
9497392,2020-10-02,1
8109731,2020-02-04,6
11365747,2020-07-22,8
9700835,2020-09-21,2
4306944,2020-10-05,4
11965278,2020-06-16,2
9377874,2020-03-31,1
5948941,2020-05-11,5
3017204,2019-10-07,9
4306944,2020-08-19,1
3000079,2020-01-09,1
5407698,2020-07-30,2
12849133,2020-04-02,1
10633622,2019-05-19,1
4106439,2019-08-22,1
11334197,2020-10-09,6
4371396,2020-03-23,1
5407698,2020-07-08,8
12668506,2020-08-01,1
10532325,2020-09-09,11
11965278,2020-09-30,1
12849992,2019-06-17,29
7416118,2020-10-07,2
9657413,2020-05-19,2
10660773,2020-06-27,4
11154154,2020-02-17,3
8001899,2020-04-11,1
10309159,2020-06-25,9
7914458,2020-04-15,3
7914458,2019-08-21,2
5856890,2020-10-08,2
7650492,2020-08-28,2
6964955,2019-09-07,2
11154154,2020-07-22,192
5675090,2020-02-10,5
12252140,2019-06-28,1
8679850,2020-04-10,3
9377874,2019-07-24,1
7059436,2020-04-15,10
12668506,2020-09-29,82
6863858,2019-08-04,35
10390691,2020-04-12,8
3000079,2020-08-17,47
8964747,2020-04-08,5
8755568,2020-07-02,1
4418153,2020-04-11,1
5729889,2020-10-06,6
11995718,2020-03-11,11
4106439,2020-07-29,2
12860658,2020-05-20,1
12825398,2020-09-11,2
11958157,2020-03-29,36
9657413,2020-04-21,6
9317860,2020-10-16,1
5675090,2020-02-22,44
6836590,2020-04-17,2
8755568,2020-07-20,2
5024100,2020-04-16,16
15715580,2020-05-21,4
7059436,2020-03-31,1
9831408,2020-01-17,1
15754307,2019-08-03,3
14600951,2020-07-01,1
10654995,2019-09-12,1
13973032,2020-01-26,2
12668506,2020-05-29,1
7106678,2019-05-16,10
11288963,2019-09-18,1
9831408,2019-08-06,39
5678548,2020-03-07,2
8001899,2019-04-03,8
9356178,2019-03-19,33
4306944,2020-09-30,4
6065397,2020-05-08,10
7416118,2020-03-29,1
12906346,2020-01-08,9
15721394,2020-06-09,15
11616589,2020-01-20,1
4177507,2020-10-01,1
924167,2019-07-16,4
8979204,2020-04-16,5
6136341,2019-04-24,5
5407698,2019-08-03,4
11928491,2020-01-30,1
9982199,2020-07-17,5
11482016,2020-05-23,1
9647487,2020-05-04,5
7914458,2020-01-02,1
8964747,2020-02-21,51
10573105,2020-03-04,1
6964955,2020-09-21,3
15743125,2019-08-02,4
10573105,2019-12-10,8
6759570,2019-06-04,1
8964747,2020-06-17,19
5015677,2020-02-17,2
5133181,2020-10-08,1
12135343,2020-01-18,2
12511751,2020-08-15,11
11958157,2020-03-06,1
12825398,2020-07-26,1
8979204,2020-07-10,1
4306944,2020-01-19,3
12860658,2020-05-22,5
1946888,2019-05-10,1
14928079,2019-09-06,7
8109731,2019-12-28,6
9221013,2019-08-02,1
12860658,2020-10-12,17
11109383,2020-07-30,1
15721394,2020-05-24,1
4639595,2019-05-25,8
8287632,2019-08-28,1
924167,2019-05-13,6
11154154,2019-06-27,9
2338717,2019-04-08,84
11995718,2020-03-05,1
9356178,2020-10-02,2
9831408,2020-08-19,2
8755568,2020-04-09,1
11527768,2020-03-19,8
12226350,2020-05-14,14
10100067,2019-03-25,1
11288963,2019-04-20,1
8967944,2020-07-24,1
6136341,2020-08-07,1
5856890,2020-05-10,4
9377874,2019-06-18,3
15713898,2020-06-19,2
7421097,2019-07-02,26
9377874,2020-09-07,2
6964955,2020-06-26,87
5062432,2019-11-18,144
5290875,2020-10-15,1
5948941,2020-02-27,8
7949217,2020-06-24,3
10306780,2020-09-16,1
6836590,2020-02-12,1
12546342,2020-01-13,24
6065397,2020-07-06,1
5062432,2019-10-06,17
9487506,2020-04-06,3
9317860,2020-06-07,11
9221013,2020-08-11,10
9356178,2019-04-02,1
6955981,2020-02-24,27
12511751,2019-04-13,9
15744109,2019-12-01,1
5792462,2019-07-25,2
4306944,2020-01-23,1
4371396,2020-04-04,2
15744109,2019-04-04,74
9487506,2020-04-12,4
7378064,2019-03-08,2
5133181,2020-04-08,2
7685545,2020-08-07,14
6962044,2020-05-26,20
4177507,2020-05-11,1
6962044,2020-08-09,1
12511751,2020-09-17,4
4106439,2020-10-20,1
9638916,2020-10-13,1
9356178,2020-03-31,6
4639595,2020-08-27,6
9487506,2020-10-14,1
15713898,2020-01-17,1
11995718,2020-06-07,4
11020561,2020-07-20,1
12679664,2019-03-25,428
5290875,2020-09-01,22
12135343,2020-09-30,21
15752162,2020-03-16,16
5416351,2020-10-14,2
12849992,2019-06-19,1
10100067,2020-05-26,1
11995718,2020-04-30,2
12017940,2020-01-23,1
8679850,2019-04-25,20
10532325,2020-09-18,24
10532325,2019-04-30,7
9497392,2020-09-06,5
8109731,2020-08-30,1
6878568,2019-03-14,1
10529701,2020-09-14,1
12135343,2020-03-15,12
15752162,2019-11-15,2
9317860,2019-05-28,7
10633622,2020-04-03,9
9559088,2019-08-02,6
8679850,2020-08-04,6
5675090,2019-12-10,3
12679664,2020-07-14,2
17016153,2020-10-17,2
4418153,2020-05-27,1
7215991,2020-02-28,9
5290875,2020-02-18,1
9638916,2020-09-22,1
6964955,2020-04-27,4
4177507,2019-06-16,8
11928803,2020-04-15,2
9487506,2020-07-09,13
4639595,2020-04-30,3
9682011,2020-04-28,3
303847,2020-06-21,1
7307654,2020-10-17,3
4639595,2019-08-03,1
5457327,2020-06-27,32
7106678,2020-10-14,2
15175419,2019-05-22,3
11109383,2020-09-02,1
6570223,2020-01-29,10
4177507,2020-03-31,2
10633622,2019-05-08,32
5792462,2019-05-13,3
7645168,2020-02-06,3
15744109,2020-04-06,6
15788203,2020-06-27,2
14600951,2020-10-16,2
7849341,2020-09-29,2
15721394,2020-05-30,1
3000079,2020-09-10,5
12825398,2020-10-09,1
5925800,2020-05-21,1
5133181,2020-08-16,1
11350654,2019-08-30,5
7215991,2019-08-05,1
3000079,2019-08-02,15
9179586,2019-05-07,14
12668506,2020-03-04,8
7059436,2020-02-14,2
10306780,2020-03-12,1
6955981,2019-12-22,1
8964747,2020-04-21,12
10760263,2020-06-30,4
15713898,2020-02-25,10
10390691,2020-07-29,61
11965278,2020-08-17,1
10633622,2019-11-16,1
9317860,2019-07-12,3
6863858,2020-02-19,1
10660773,2019-03-30,2
14928079,2019-12-07,8
5336217,2020-07-26,1
15788203,2020-02-19,1
10487179,2020-01-25,2
8755568,2020-10-15,1
7914458,2020-08-05,223
9356153,2020-02-26,1
10633622,2020-09-30,2
6570223,2019-09-17,9
6570223,2020-09-04,10
11288963,2020-08-06,1
9240965,2020-10-04,15
12135343,2020-09-30,1
12226350,2020-04-26,4
6759570,2020-10-18,4
