0,125828,7205993
0,3219128,10883266
0,0,15432458
0,1059061,23627227
0,293600,17321227
0,41943,8613970
0,482344,2242499
0,125828,5943812
0,1866464,5269664
0,0,10565158
0,671088,25373014
0,254746,14719003
0,1751121,18221727
0,503316,22267727
0,188743,22319912
0,0,22645434
0,2631925,15510559
0,0,11599720
0,52428,11360077
0,6627000,13088596
0,471858,4645157
0,6207569,17567175
0,265232,24112732
0,2768240,18812416
0,188743,11954796
0,220200,17937343
0,167772,4673242
0,440401,11841944
0,912261,17724375
0,52428,12149808
0,52428,20489594
0,7214202,15279055
0,265232,4145779
0,6134169,11445059
0,115343,917637
0,419430,25088792
0,167772,15997689
0,167772,16889453
0,346030,21081871
0,450886,12861227
0,230685,22562406
0,146799,7152181
0,0,7975048
0,2243951,11811862
0,199229,25190063
0,188742,252797
0,0,17240310
0,220200,10060799
0,136314,17025257
0,83885,4617042
0,0,4399280
0,146800,315938
0,125829,14054211
0,136314,20008981
0,2359295,3635612
0,52428,20705549
0,0,4284613
0,408944,20338135
0,94371,13790345
0,0,8318603
0,1835008,24553923
0,283115,23308361
0,482344,16996468
0,0,194554
0,146799,9658778
0,1845492,10003167
0,4162846,19744636
0,408944,6225245
0,1394605,7399524
0,398458,7371093
0,52428,21785636
0,335543,16208409
0,251657,4562660
0,7130316,16077533
0,188743,25759454
0,566230,11221836
0,2369781,1120411
0,136314,1678499
0,1709178,21681657
0,1048575,16255777
0,178257,15538185
0,660602,25948770
0,104856,14105108
0,671088,14971994
0,220200,8053880
0,0,6174403
0,975175,12014553
0,0,19551475
0,775946,17185755
0,807402,14481084
0,870318,20363951
0,0,6736551
0,1132462,15923734
0,3355443,18041256
0,293600,21159137
0,0,20573679
0,146799,14235572
0,754974,17483013
0,272629,13117506
0,52428,17749395
0,188743,24391975
0,125828,5696494
0,262144,13622624
0,545259,2155538
0,136314,12913474
0,503316,24470587
0,2977955,25562635
0,325057,1505660
0,0,26846174
0,136314,25508421
0,786432,20732606
0,241172,19635230
0,146800,7178873
0,3114270,16104651
0,136314,18299995
0,5033164,18015555
0,1205862,3948055
0,786431,9021497
0,1174404,23001021
0,0,13329557
0,283115,27329247
0,283115,3350608
0,367001,5390908
0,52428,26034428
0,1646264,9301986
0,136314,6711883
0,1572863,9182770
0,220200,1416562
0,0,6069237
4403,178257,18447119
0,167772,10535966
0,587202,2700214
0,0,25011406
0,125828,24846925
0,2988440,590246
0,293601,13001565
0,104857,26434653
0,1258291,6390575
0,136314,1732543
4409,220200,973789
0,0,7342152
0,52428,439872
0,1709178,17078507
0,629145,18371427
0,125828,19577460
0,450886,20863079
0,157286,13708192
0,0,14290156
0,178257,10457891
0,2610954,6549684
0,254746,26457855
0,985661,11985778
0,1038090,3919449
0,2055208,15793178
0,125828,18171309
0,62914,6656875
0,2432696,9373442
0,262144,19048364
0,534773,13541947
0,136314,22191635
0,335543,23053841
0,2778725,21598612
0,254746,6363745
0,136314,19796961
0,503316,11870810
0,503315,4226809
0,52428,15255186
0,5861539,16338293
0,744488,25111759
0,1394606,13735487
0,0,17826177
0,157285,17776437
0,52428,10768215
0,1855979,16441295
0,1216348,11723702
0,335543,18522721
0,265232,26303790
0,4026531,8966982
5192,4078959,1271623
0,545259,5472581
0,3198156,20971216
0,367001,21023942
0,1583349,9791878
0,136314,20116917
0,503316,11169296
0,167772,24769472
0,314572,1817559
0,188743,5804220
0,209715,27382771
0,713031,3299098
0,167771,26762737
0,1835008,19471302
0,367000,15049623
0,5295308,10652098
0,7004487,1846411
0,4435476,27060963
0,136314,13515808
0,52428,27196500
0,52428,17698780
0,52428,10089263
0,262144,8185394
0,1887436,18708435
0,4456447,10969206
0,209715,21971167
0,251657,24900326
0,4466933,20414648
0,524287,14695765
0,356515,12533453
0,0,8210662
0,503316,12970855
0,0,24280044
0,241172,20143232
0,52428,3976116
0,618659,25842783
0,167772,19689724
0,1090518,17853954
0,461373,6601623
0,734003,19235900
0,146800,4590207
0,2778725,20034565
0,377487,11535928
0,2873098,15693011
0,1551892,7478770
0,713031,15026010
0,335544,18424256
0,1876951,16840317
0,0,7066016
0,0,5861840
0,0,5725237
0,2327837,25061198
0,2747268,9211875
0,1468005,22487526
0,1006632,14080444
0,387973,24445793
0,272629,7673569
0,115342,18917771
0,209715,27222344
0,367001,5331917
0,597688,13225094
0,0,6306448
0,125828,3693564
0,1142947,6857039
0,146800,16389240
0,1017117,17132973
0,0,21865306
0,545259,13436554
0,1289747,23196905
0,587202,15231595
0,167771,773877
0,492829,11474110
0,4309647,13490489
0,0,25920247
0,335544,26818071
0,52428,11027609
0,1205862,22169010
0,734003,23846597
0,167772,10709339
0,367001,21494513
0,146800,16544259
0,94371,14562935
0,178257,17267990
0,901775,849605
0,796916,16570097
0,6134169,5615406
0,1761606,22537175
0,0,8264413
0,2558525,26141500
0,104856,15947152
0,492830,8426102
0,293600,17403473
0,5599395,15718713
0,146800,25618172
0,283115,10484154
0,52428,8027928
0,398458,8104094
0,115342,8290494
0,314572,19983667
0,2936012,11923885
0,859832,16364195
0,52428,25265354
0,0,26225673
0,1709178,21520585
0,8241807,1985567
0,335544,8478383
0,220200,14507901
0,325057,27551936
0,346030,26952357
0,2264924,15745182
0,513801,27597756
0,83886,2669504
0,859831,25590546
0,209715,19908060
0,1447034,17882340
0,0,3273147
0,199228,15354834
0,2621440,23979975
0,377486,24743506
0,734003,24874227
0,167772,8771972
0,146800,2354690
0,398458,5672396
0,0,23248626
0,4320132,14846728
0,21118320,2875370
0,408944,5991852
0,5620367,21299385
0,251658,21240127
0,115343,22347867
0,136314,14371546
0,786431,19388013
0,975175,21353454
0,0,5055179
0,1488977,15769251
0,136314,9632310
0,230686,13899658
0,1835008,17160769
0,167772,16864657
0,1981808,18948710
0,576716,5417892
0,241171,17908942
0,1195376,8718812
0,1111490,19882255
0,304086,26063113
0,1908407,2731029
0,272628,3463965
0,199229,26197630
0,52428,23368828
0,1080032,7562367
0,1709178,24136830
0,377486,4892384
0,5788139,23682138
5144,692059,21213347
0,1929379,4535120
0,136314,22293631
0,0,24956609
0,52428,7726065
0,880803,20943526
0,7172259,23570706
0,136314,12066948
0,1614806,22749384
0,335544,6629929
0,146800,10682163
0,0,23399369
0,199228,19023916
0,52428,4425624
0,136314,18325258
0,0,4255771
0,52428,27280848
0,209714,21330345
0,367001,20286678
0,419429,14401256
0,5043650,10824860
0,157285,5499011
0,1195376,2213906
0,807402,7784515
0,146800,22617050
0,1226833,7590129
0,660602,1759612
0,786431,1651717
0,4697620,27118951
0,157286,13359247
0,178257,19207451
0,0,21269248
0,482344,18194964
0,1184890,25427121
0,83886,2124819
0,513802,9871996
0,262143,18346954
0,178257,27091360
0,2998927,16914581
0,1059060,14316962
0,5242879,3493685
0,1772093,23901137
0,335544,1151038
0,933231,3665574
0,94371,8799647
0,146800,25316293
0,335543,3862409
0,251658,5164422
0,52428,23598535
0,41943,14156623
0,262144,6044202
0,2222981,5137991
5192,241172,27141567
0,4047503,8910898
0,0,7426066
0,555744,4197383
0,1027604,11751836
0,335544,15459741
0,2306866,17428661
0,0,6017894
0,576716,17541058
0,52428,16157944
0,367001,6121946
0,52428,2762767
0,692060,16232555
0,1184890,16675805
0,6270484,15099481
0,2086666,21572514
0,199229,740891
0,1824521,13820899
0,650117,9976356
0,1814036,22972103
0,188743,18093966
0,52428,9051088
0,283114,19933226
0,146800,14921621
0,0,4727087
0,5263851,4509148
0,146800,9566703
0,125829,9104716
0,0,10347737
0,314572,27302394
0,880803,12457530
0,1426063,5364938
0,0,16311845
0,5305794,22404693
0,52428,3520158
0,83886,20810160
0,1038089,6808568
0,985661,1241341
0,2694839,9267902
0,0,7453300
0,1530920,14028087
0,2044722,6252629
0,241172,22588511
0,492830,26565970
0,828374,4369451
0,209714,10593860
0,1562377,1622104
0,146800,2984906
0,146799,26114773
0,146800,21838708
0,146800,18891611
0,136314,161701
0,7654604,5243846
0,0,16965565
0,2432695,15407068
0,0,8587784
0,0,14454408
0,167772,12887204
0,0,23927324
0,901775,7616834
0,188743,22777326
0,754974,14823275
0,0,7948816
0,985661,9434563
0,157285,20679200
0,167771,4092837
0,254746,3436266
0,94371,18499510
0,5096079,20254954
0,6039797,6443982
0,136314,3129962
0,912261,8826705
0,220200,14181842
0,4236247,13144854
0,178257,23819032
0,265232,26482848
0,0,25678207
0,188743,24307287
0,367001,22031212
0,1709178,24085906
0,377486,21412269
0,2589981,1790720
0,125829,24611167
0,293601,17803145
0,293600,16520025
0,1048576,8879666
0,1876951,16780481
0,880803,24581643
0,209715,6280121
0,1541406,7012962
0,1635777,21916166
0,2516582,6685645
0,1405091,19102878
0,209714,132416
0,1363148,17591667
0,52428,10373440
0,199229,4861587
0,0,3185877
0,52428,6761479
0,2652896,13029032
0,933232,2819080
0,0,17293788
0,52428,21133295
0,0,22432315
0,4225760,10032955
0,8482979,13250309
4406,136314,1478081
0,1751121,11085309
0,157286,23222434
0,1677721,496840
0,254746,25978332
0,21118320,3041634
0,2170551,2295055
0,241172,23142563
0,964689,6962946
0,265232,7315531
0,3701473,8157825
0,1656749,13462799
0,356515,131
0,346030,10232771
0,597687,22889845
0,157286,9846118
0,0,19443914
0,283115,20602976
0,1918893,19127546
0,576716,17212264
0,0,3580125
0,52428,15151070
0,4372561,9740977
0,356515,15844406
0,1331691,12292110
0,398458,24163718
0,450887,20060652
0,146800,25812466
0,209715,15616489
0,3565158,26088233
0,220200,8373137
0,178257,8641283
0,2956983,4806645
0,503316,27481949
0,52428,20546957
0,52428,12638537
0,587201,4916313
0,125829,21108610
0,52428,18759320
0,1384120,15818556
0,7822376,20227645
0,52428,1091219
0,618659,16022352
0,859832,15563905
0,734002,13875135
0,293600,1001832
0,262144,6574942
0,52428,286071
0,52428,22459835
0,954203,345257
0,0,18248489
0,157285,627225
0,1761607,8560364
0,262144,22058535
0,1478492,24983682
0,0,15380711
0,377487,1958335
0,5840568,19717953
0,765459,3888133
0,52428,21628505
0,2023751,13677283
0,125828,19772743
0,136314,7534297
0,859831,27407455
0,241172,6525111
0,2841640,15302893
0,503316,6418502
0,2747268,15124154
0,167771,23337425
0,125829,6883459
0,52428,27528677
0,52428,10739394
0,0,27619590
0,796916,17962850
0,251658,9076832
0,681574,22511772
0,0,18473226
0,52428,9241238
0,0,24061249
0,1583349,7258876
0,429916,5005895
0,0,20997881
0,41943,7039289
0,265232,27006817
4417,367001,22003777
0,335544,10853096
0,838860,12558696
0,545258,21467813
0,0,26332807
0,104856,12181452
0,262143,5030623
0,2233466,4119914
0,0,659292
0,597687,15074591
0,870318,4752879
0,377486,1033043
0,0,12744776
0,0,18116897
0,1614806,24524788
0,429915,27506292
0,157286,14537656
0,178257,14946685
0,4393533,24190207
0,1719664,18974452
0,828375,5831333
0,167772,19497595
0,2663383,9764756
0,0,17454835
0,975174,18864523
0,52428,12401138
0,0,9468239
0,3502243,26899822
0,0,19074996
0,482344,24795005
0,157286,25705926
0,188743,24335647
0,440401,10996778
0,5630852,12614238
0,671088,12264549
0,1174405,24929221
0,3921674,26509845
0,146800,8852444
0,146800,25240556
0,52428,7232785
0,104857,23429660
0,136314,4006064
0,94371,11567664
0,136314,19606626
0,283115,1874715
0,283115,1179629
0,178257,4312067
0,2160066,22700167
0,356515,19001019
0,220200,2383904
0,230685,10143042
0,178257,12481317
0,0,19415318
0,146800,24819681
0,73400,16132757
0,3774872,18574159
0,377487,10940832
0,136314,16597412
0,461372,14210056
0,492830,10171248
0,178257,19179749
0,0,23516202
0,125828,9155392
0,5012192,21549665
0,52428,26707296
0,167772,12692655
0,52428,19363980
0,1635778,23540703
0,1593834,4173252
0,146800,21186062
0,387973,1559947
0,146800,3832942
0,52428,5193902
0,765459,25164800
0,765459,9924838
0,5138022,27032935
0,796916,8746226
0,912260,12345872
0,167772,3548082
0,754974,18837263
0,650117,8531810
0,157286,18601235
0,734003,13277127
0,293601,5445560
0,1279261,6938244
0,2254438,11899403
0,492829,3098807
0,1048576,26927451
0,136314,5778072
0,0,5751643
0,492829,15485995
0,21118320,11143123
0,335543,14614196
0,52428,3408245
0,0,13951726
0,0,9605736
0,83886,27250492
0,377487,17988039
0,744488,8236722
0,0,3155953
0,0,27431598
0,838860,11249617
0,146799,13302661
0,146800,1591462
0,1195375,25537700
0,346029,14641429
0,0,13763481
0,314572,2900810
0,2107636,15971578
0,314572,10286871
0,0,24215885
0,262143,5528702
0,6952058,19314381
0,660602,16754785
0,178257,16182974
0,775946,18549788
0,265232,14745588
0,0,12039324
0,94371,26595047
0,136314,4341752
0,387973,12210672
0,0,14895003
0,587201,19827427
0,188743,1703472
0,94371,4700721
0,52428,373622
0,283115,3749033
0,0,7699935
0,220200,24035301
0,146800,15667558
0,786431,26410721
0,0,3378729
0,0,8130714
0,136314,9129598
0,335543,23729604
0,136314,2614789
0,146800,12508255
0,880803,16417909
0,713030,9717491
0,1918894,26275540
0,146800,25136663
0,8105492,709643
0,230686,20626261
0,146799,12720084
0,870317,8345569
0,3932159,21891542
0,429916,4064083
0,1730149,13410121
0,0,18066336
0,524288,23485651
0,880803,20440000
0,6039797,6911096
0,167771,14261901
0,167772,21709106
0,115343,18143306
0,0,11275032
0,639631,15179530
0,146800,26623881
0,0,14131854
0,136314,5968360
0,0,26791842
0,734003,17670114
0,398458,13649389
0,241172,8505238
0,52428,14427892
0,1509949,19525941
0,167772,21051317
0,94371,22243232
0,933232,22726305
0,597687,3069533
0,0,16285628
0,325057,11504632
0,0,24691006
0,1384120,12803785
0,178257,22943205
0,0,10116194
0,167772,1902297
0,0,20311560
0,146800,14001191
0,398458,25648336
0,5316280,10625222
0,524287,17345739
0,0,22216711
0,52428,5081792
0,0,5644178
0,136314,23278865
0,356515,15869943
0,0,12834311
0,377487,26737552
0,461373,32141
4402,513802,13199615
0,1793064,20916514
0,5295308,11195162
0,0,886451
0,838860,24496899
0,1090518,3607916
0,4057988,2847875
0,796916,7644755
0,52428,3012775
0,555745,17374413
0,1971322,26536308
0,0,15328885
0,597687,23456637
0,377487,5588181
0,1960836,12121581
0,262143,5888145
0,1195376,819957
0,1352663,65959
4416,146800,9951082
0,0,26249569
0,933232,5301151
0,0,16701732
0,136314,25892405
0,209715,21734312
0,4131388,3244610
0,6228541,19261065
0,1593835,11113954
0,0,3805333
0,985661,13978338
0,4078960,3325675
0,0,17512811
0,2631925,17106769
0,0,9406349
0,1363148,6336585
0,880803,7890788
0,272629,12373828
0,304087,23655463
0,3271556,27576172
0,251657,25480584
0,52428,24718286
0,146799,9501565
0,136314,1929144
0,283115,23789899
0,471859,11667752
0,943717,4036164
0,73400,8002564
0,2936012,13596229
0,157285,8668625
0,0,10258800
0,5997854,23952889
0,587202,20654624
0,0,14797049
0,734003,19661078
0,1294058127,21943359
0,367001,16648977
0,293601,6988384
0,314572,11635798
0,220200,2266103
0,0,4481833
0,377487,6198295
0,293600,20171012
0,0,3720871
0,9395240,5215433
0,408943,2186181
0,723517,9899056
0,136314,4834209
0,734003,21656657
0,125828,11388185
0,6427770,2096439
0,136314,14669461
0,167772,3216100
0,199229,25215164
0,283115,16622475
0,0,6097950
0,9489612,945915
0,3512729,10427715
0,136314,13848738
0,367001,15589826
0,0,22111736
0,1583348,26358703
0,545259,20199858
0,52428,11330637
0,52428,17053710
0,3166699,1532543
0,167771,7918985
0,1090519,18398432
0,3145727,20087533
0,2841640,7123620
0,1918894,20390611
0,440401,21760015
0,136314,2793605
0,702545,21438210
0,0,224390
0,356515,22915381
0,555745,11058413
0,0,12096448
0,220200,16050807
0,2181038,25400998
0,52428,7815533
0,545259,10908885
0,52428,20757663
0,482344,13928123
0,283115,1445863
0,262144,12320266
0,524287,19960234
0,1478492,24638600
0,272629,23761731
0,241171,8693360
0,482344,26386795
0,356515,4779607
0,0,24365319
0,1363148,14871104
0,283115,2324274
0,367001,18653996
0,398458,21382686
0,199229,26873317
0,2359296,17619211
0,597688,14998390
4253,199228,22674387
0,702545,6785017
0,314572,12238282
0,1405091,7505825
0,188743,23083589
0,367001,18626741
0,52428,15640415
0,398458,25452530
0,8441036,8451549
0,136314,18785759
0,304086,22142323
0,52428,2015487
0,167772,9343965
0,429916,6833898
0,167771,1356871
0,52428,10201849
0,754974,24249248
0,73400,13174442
0,597688,14770742
0,335544,5557004
0,5809111,12432285
0,167772,6499004
0,251658,12586550
4405,209715,23171506
0,671088,26980775
0,786432,18734030
0,254746,12943427
0,408943,25343783
0,786432,13385244
0,3303014,8993923
0,734003,10510292
0,849345,25867812
0,0,22861911
0,178257,6471353
0,0,7286565
0,0,22084155
0,1205862,8940568
0,2642411,23027332
0,2369781,20836910
0,0,9818266
0,293601,16726473
0,52428,11302659
0,52428,20783013
0,576716,26006593
0,5389680,26169030
0,83885,19854552
0,52428,26680438
0,3261071,13058752
0,52428,2068287
0,482344,27459746
0,639631,14342513
0,419430,10797581
0,167772,8078067
0,450887,23873682
0,0,5917462
0,0,6148466
0,5389680,15204387
0,440401,8397800
0,199229,23113810
0,157285,24662782
0,954203,4977797
0,891288,12668470
0,1069547,1062206
0,367000,1212286
0,2558525,4951028
0,4844420,22833697
0,136314,2041174
0,2149580,23704649
0,3376414,2957862
0,1656749,3777637
0,775945,12773779
0,188743,25290795
0,1793064,5111148
0,1793064,25035186
0,356515,19288478
0,870318,11692478
0,671088,20516839
0,209714,16494176
0,254746,15895894
0,880803,11780487
0,199229,24007082
0,178257,7093374
0,0,25784230
0,104857,22804509
0,6920601,20891942
0,220200,16805399
0,660602,4452101
0,3261071,10399643
0,629144,27169085
0,94371,24420830
0,335543,16466075
0,0,2928999
0,650116,2642053
0,272629,526856
0,293601,10316052
0,1793064,18680549
0,125829,16941568
0,293601,26653742
0,251658,25733407
0,0,468099
0,1059061,19339607
0,136314,27355483
0,136314,559051
0,146800,21810497
0,5200936,20465026
0,335544,7755360
0,136314,18273905
0,5337251,19151690
0,136314,13568234
0,241172,9689252
0,555745,11416957
0,461372,1327748
0,283114,17646068
0,167772,14587735
0,838860,9534795
0,199229,22376482
0,52428,1386367
0,1027604,1301273
4262,209715,97392
0,0,404724
