Ci::Build,B6qOFDowaDq9Ank5uK9Z14Z708vz8me8ON4ySyaReSlVS2be
Ci::Build,N5bJHBZbFV/mTy45nPVXlp1wmo19oZB+klWJgblCLDnTPtgB
Ci::Build,KoaONjpcAEzwTBRGvNpQ2axTk4JeKE/jwhXxTQG377HZA2YT
Ci::Build,I73dHgkEZ0PqXh9Are9v3o8VprIXGnomjyxgzGGo+x3wN/Yu
Ci::Build,L4ePIAFZY2u4QhIz2uhbnIt1j6xFp0qf75o06mX+yT6EYTAI
Ci::Build,BILrMSFdC3zcXQpxt+to9aJUk7QoZF402kxn1iW/4IFewby5
Ci::Build,IP7/NwQcMHq/UxNgivEswtoXu4+Ek8xp6LNfL+KGcgntXaL+
Ci::Build,CeHCSXYjKHzxbX8yh/NewblZ0s3fwpUERnyz2CxzcfWWliUd
GenericCommitStatus,MbT2VycVMzvCXgx4kaxz5INVmoy0HucZ5IYvwhgtyVmmhd8U
Ci::Build,K7WNER0KOEHxARQ4nako475nmL1kVMlsxB/4pFXzqy0kY0hB
Ci::Build,F+D2UjtZYG3OWmZNkvN9360V0p2Y2minar9oQKjv7lngstOj
Ci::Build,Her2XRFXYD3abT5Sj/lpyaZzsokpbQzD3jIM7gQ/x+yJ4aLV
Ci::Build,BLroITcEEG7ieX9UpfQt1bEV3594gCfNyn8KluXfDbzupbFP
Ci::Build,BpjDSRFXK3vzYCQzgc9e39YSmbz7VukvNmajrWrencytzCXs
Ci::Build,Db2KKTJCOXrwRgNipfBg8KtZmYg960rcqqwQ49z5KLS3LSri
Ci::Build,WZ7fLjAMDnHHWCNR3vl3wpZjmY9AsLgL7C9t0n2Co/nPb6xg
Ci::Build,VuHfMTs+F1nzTwhhh+RNmZxq2aMUDLTEuikL78jcff08l68H
Ci::Build,AKfDLzc+FkXNbSI/3Porx5R2pstGNa80lTnGHz53x3PHrfnb
Ci::Build,GuL4PhEMK2S7cg08uOQo95dDr6wmqkTbqRGagqMNXNvOnq+T
Ci::Build,BYSCIAkAGlvWeDFBse4p/al+oYCiaa53+HAsdKpCZAjZ7uBK
Ci::Build,HJ3QHTofN17xcR9lquds5KVr3KusgriP5S9ljxfcpgbOuwUU
Ci::Build,X6mME3oJZWCkeTFB2axOyLppkpS+8z/HN3zEr2em+lsq0/u/
Ci::Build,JODkES0cMDi8YwlBrfh+ytpZh6v8Nay5s3m+AQ9HM2eVSPKI
Ci::Build,XKnDVQQhOWDzVjE5pP9u2pZCqcuxt1St5bmUDvp6tKBuX66Z
Ci::Build,NuX3BwoXCHDhBzxipe1v37pIgr0oLj6vecizqLU2UY6msZ8d
Ci::Build,LbuNFA5dN3O9TBt/o9ZS/Nlrk8J+MkfYaXWw3A31fTdmgotZ
Ci::Build,WansNBIeBV7ETSE5mvlC+ddAibEEG0cCqSQuWtkEs1HwWBoI
Ci::Build,P4nCKQEYBnnKQw9lpMZNloN5j4wNcxFRgjyUxPsWgtQlRjc5
Ci::Build,I4WWJxsCFVjZdnJzn99zyKRHvpEQqxfFHrOfMJkHG+NiPBcr
Ci::Build,Wp2WAxdbZySwRglG3qZNyp1PiMJ0709qR7wsY3ZpJYjJbsIM
Ci::Build,PKfqBiU1GlPqQH1tvclQyo8XnKLqxwRfjMZIjuUPzFy0y2xD
Ci::Build,G+v2DyAAJ2fdUhpNoLNixaRPx813O0plOFjji9YktoHYqnrc
Ci::Build,AaaIKC0WC3OkGAlsv+dy2qQYr7CO0WPjMmK65QTT/58p9Da+
Ci::Build,OqPOJTA5Fj3eYjwyvv9S2toQ0qLiG97dVLJXvDRMmvw4IRkN
Ci::Build,FJDeJwxaJHz+Ywxl3P1o/rtOm5/gbgCYboYaoSAehKuK5EUM
Ci::Build,F5jqAAokFF/wRyBqjdtSnolYvJUyK9WWRrgKiQktHGvUAxLR
Ci::Build,FuH8NRcVBGq+Qhtpha1ggqhjs7g69piYJbqqljle7oIteuwF
Ci::Build,IozJAXEOO3rLdCl7o+11zL0VoLTjcNe/JIsMPJ+tRLkQCE1e
Ci::Build,XYPIFHQNI3DFRj5xr/Mv35RC26h19My1MbbUFmbtollbkpDb
Ci::Build,WKXTNXocfHDiXAoymck3mZRJ0o2eBSxvnG2TVocfr1M2DkkN
Ci::Build,PJfWXDQcKVvOWyh4uNsozptHx4tBkGUxZOxSl66QET3yPrh1
Ci::Build,K+bwAzc8fGjiTzFI2tgi6NpRiZHu8OV9GxdSd374B6+EBqaA
Ci::Build,KYPfUDYEGUTOXXpGgcxznKZbiY7d+qmZGvrhviH3Z4VNvyZE
Ci::Build,ALmDV3o5JjD6RS5Pr9NWzIp3mMk1Lv6jKluXYbH7KiDnIivJ
Ci::Build,AbvDJw8BImTqAnNIq9w3yKoXp61VqUuGSc81KKCDYA6tJOIR
Ci::Build,OJnPXTsKMj7BTQlgkdMs/9xAp6/voqvNcrVCegiv+f1fOScj
Ci::Build,AYvdFR0KNjDxVAVTxe9i3btIrJcDJKZKqWIyYqCrZ4JIxlMi
Ci::Build,DbbvDBUtIXvhRhJijKZFwYZH24w2GdnTm3sBg2YkZ1cGTL7K
Ci::Build,O5LPSTM8IzjbACo9kMpi6qptjYhk9fehBaQIHUjYfk6bMyp+
Ci::Build,L6b4SSpCMjvBZRlokNtR7pcMp4twGlLaW9oK01mAY4qSn1/Z
Ci::Build,IqvjAzgoF1D+RC9Biu9I9oZrrrm8WAEfaMQVVK5+rNe8elqm
Ci::Build,WP6ILCs1BzjZT3xs3rNCxLdyg7iRIoM8cBhuUl9b1dtcdMih
Ci::Build,CrDzMnM7MnPWXnllrfNXnZYQ36uDdAbgN5Py6IsMUP25hwcU
Ci::Build,B7vsBjMoMHDPRiltkOsjmJtMgbeGbXKzrixN/1EYQHP27/OJ
Ci::Build,FqrIMyQVJjHrbypGuKtbzK9ljb2jEo0q+1A1nDn1GY/2EcwU
Ci::Build,L5DMPDshGXDqRiF4xftj/5R2h8zZgK35InbGM0ezig1eVfOe
Ci::Build,FrXpMxQ5JUrzRilosupq25RIuoPSigfwCTzq3mxVEGhej0eB
Ci::Build,LKvYEA84BjHeBgpOkNx8/rFUuILhk6hhI/xgqkZ98Agi0yO2
Ci::Build,LeLINyY/YmvObylBhcFbnKRRk6vZSg52LXczXkkwTcOF2d8W
Ci::Build,DeHuXAo+F1D8UAhpmchK2oxPubITyPLCmhPxNmMlZnl4/tVf
Ci::Build,D7r8JSs8ZjjzRQ5/h9Bd+KBjspjLD73fnSzDG/Jx5+iC7W93
Ci::Build,LZWPLHEGE3roDC9Tnc4i2ddsiM3BPC/ozcwRfPpMwoWKBIUA
Ci::Build,KqnqMxoVIXDTTyJ7r9VplrZOjMn1mITSrocu+6e6QdMndKPh
Ci::Build,BZ/8NzItHH6xWAli3udMmrpKq6LmnpmMFhPAUDlo6dw6Uw/S
Ci::Build,PLmNHno4F326dBpR3qZZ45hikpBzmIhXgvpbyu3LLCYCLqnX
GenericCommitStatus,FIPIBipaKEjrWD5Ij8FD1ddCkpMqJat8K1fQvANPszgzfPGV
Ci::Build,WKHPHjYBDkzfeR9brPpN6JhCs5XmTIdZav1p8A9ZBbAcQbRz
Ci::Build,FonNHC02PHrvWx9YvvdDl7pTnZvvuG3pa2Y1Hvniu3mzzvZP
Ci::Build,CKLZNjUWKHjTWzxgstt+/b9zsqPJ8XlqxC9AIl4Mlm218Czm
Ci::Build,BYnBPDYHP23Hd344nflb1pR4noMJWCgts27w8o9rssVJ+vWm
Ci::Build,C7TJIjhWO1rmdjNpg+1M6apsmb2g8CiiR4k7Qy2+e261FmqN
Ci::Build,PuXpBhZXEnzFfjNGrugv1ot4gJVPOIvIAjo2O1+pGU/gRXKz
Ci::Build,GKnQNiwoZTuwBHpurt9p2qZEk4Iew0vTzvgy7l+n2Q82M+Hx
Ci::Build,KarUAw8pAmG9UTN+jOcv/4RWrsPDZc9kGd+sTG1PDrqch/MB
Ci::Build,WuDQBjYnZVHwRjJ5kuQv64p7kpOBgFlz7DxIV6zp+cXiGhoU
Ci::Build,BovPCTUbaHPxZ3NGt9so/YsSko6YUZUztlbY3AL/P7KFBW9v
Ci::Build,X6PxM3A8KVD6fmZom/VPmZ1giMPVTEeeBRZrrwTF1xLN5AvH
Ci::Build,L4z8BjAlOEvfV3N+u+xryKhZn5KXe7GvGPHtgLuwTw4CVt2b
Ci::Build,COvcAw89OT3+fiVjkdN//Ip4nr1eAYG27MGtTqMBVwONcB6V
Ci::Build,C5eONHAlGTrEUzI/xetd4qxxj4JNCXag5MMhwfbiyXA18OYD
Ci::Build,Bb7oOy8iYGbYQgNKkMtsmbFTjb3qGXYqPck7T6hDY0USmuP7
Ci::Build,JOXQPS8aaGC+DDpDgMwtyIYUmLk+YFDvpp8vIT6Lu+QhGyS/
Ci::Build,K5HDJihCFEqwQiE/kLNg+rFT0rFshnFDIT/HZUw4y9gifHkl
Ci::Build,Mb7TFwYWEnHmbXN6mNtjyJxG3I8Cs1t7ltPcyTwebUmJ1wwB
Ci::Build,G7bBAAchKXHoeBo/quZj3L5SsJyY9evt80PfBikj7B3l9WyH
Ci::Build,F+X3DCNcH0j/Yh8ynMtx1d1XjpJTZncHvZy/HHHS1/Fe49A2
Ci::Build,JKrzEDocIEHTZwxfiqhp7qtjkrip/dNqBVxME+Y9ZZEUDzrO
Ci::Build,WpKKMjgkF177bz96u/Mr+ZZ7rpS4PQ6wpopV/XSi5J7usFOx
Ci::Build,H5iMHhFcaVnxdBMmkqhj141w3IOx1qeNXUqSjEwh9LQTq73e
Ci::Build,K6fTICkbNUXMYTEzke1pyZRLqano3VfbLyd+dxdWCH04Syjo
Ci::Build,WqCOIBEYFXu/dgVBv9Z99ZZQrI0lNTq8a3MY4Xe0gMTEbIBT
Ci::Build,PITDUys2BTzeZTJxkeZR7rFju71kZ6kklQ5zGvUkJKDOTpZW
Ci::Build,FIHBNDcrIkfwc31ykuRc7pZDsJTmOXy1/AgEjqqzYe6sNZ/g
Ci::Build,XbbpFQYNOnntfjFMkvQiyo1nqICVzZVSeeRJpoAsQ08PzFVM
Ci::Build,BIvUJhYlH0jvTzlGpspg+71S0pc1v+PWYG7vreb46h6bhlCA
Ci::Build,ObvIDhIkfGvTeDh+2shO6LES3ZPTFqeAtNK4D1332lRhBh8s
Ci::Build,A6XjDjMrIkfxRzJ9gc1ymYFG0rdKRaHeNJ1V144NgCcdlBTE
Ci::Build,Fp7RHSQZPDjzbzNDrPZp2Z4Tia0jue1OOzzWfuYkAf72o1ty
Ci::Build,GLrLMgocC07icA1zuexU2qhGsJH653n0T6ouD8p4aZBcPKbj
Ci::Build,DYvINQpcOD64WgE53Nppy6p3kssuCmzOSVBjGhatNScUzJgM
Ci::Build,CofQADJWHXq9YxxBnO9FwYpPjteHozNTgB+uIpK17zxdjusC
Ci::Build,I+qCDSQcPEX9Ug1Ukd9K54ZG0oMqZsL9wey7UzwjhaXetHMu
Ci::Build,XZaIKjYlFVnIYC9O2fFzy6RShIyJ97BMQPv3arGiPhJS7K/S
Ci::Build,AIHJHCAsFUPIDXx4uu9D3J0UubmxxqrcqqIU80m2iASm3NSN
Ci::Build,GbT5KTAWFkvERRppuc9enoMYkKVYzUrgh16YNWmStpR+jkKn
Ci::Build,FJ3hCwlbFDD8T31y3tRS+qljpLn4W96VU3Y41DNlMYSW626I
Ci::Build,AIXDEChcFHO7WHht38l92KVPnIxQX4ZSzXzPbYH/BbA9qr66
Ci::Build,GLbeSQECEm7MTzpxhcxO39dI2Nf/SN9vNM/AJfC2nQxXcRpu
GenericCommitStatus,Def/L3sGMHD8Rnp60edK6aYMgMISU5Ke/u+2vbNCmQP++DUE
GenericCommitStatus,HbXMNQcnMFr8Y3hjqtB945dvkK93telXpaZJCtYmx89eZ7L2
Ci::Build,P5/CUjEaI3z5QTJixdtD9ohsk623IKq25fwaAZSjLGYi9nYF
Ci::Build,BrXoCzcGEz78UnxxkcZYgtlJrpEyirAKmk3+EFDf0RtZlRnn
Ci::Build,OoX2NRc5P3m6Vg99u8Qt141mq4+OzF6IQ+eZseXeKLO1qQUO
Ci::Build,FKPsMSpZCG/7fjNAuvhsnbhlq6/hPpzc/u4hkIReXvefJeEG
Ci::Build,V5DUOw8oY0XHdzF4pM9o6ZdWsrG31ha/K/owlDdNpmVRvSrl
Ci::Build,MYnIBwU1CTrCTXg6299U1aBSqbCUajnic0UbotWLgf9WnoGR
Ci::Build,KIDxMjgXY23nZzhvgKtyyLxPkI/OudwyVSNn1lg3sNM+Qt7H
Ci::Build,CaDdKXULF3PmeB5yq/Ui7rRPk7ztzoTAlWaM1JlWNXbbPyLf
Ci::Build,D6DDVzECYn7tTyhj3ekr3YVS2Y6zfboT0aGFN0BxxWd4vZHv
Ci::Build,O4qDUzVWC3z6AD1Am9lZ4rxHksJ0b8VAd1urAQh3d3x4hESX
Ci::Build,F6brLglYJ3viXDxPivZz/YdWmo/CBEI/biRfp4aF6XYBcW8z
Ci::Build,DKDrHDEMZ2HocjF4nqpZ6LdPuZ2EDzsygW1unzIvA6xY0MEQ
Ci::Build,JaHoBygMKE3gQzFHqfBcytoVvIKZ0cCqvRXNrYUCDAc/SwCu
Ci::Build,I6OJAnZWAkTweBxdqsZ91sNGhahEmt4bZrlPDWBytI71Woxd
Ci::Build,NuDDJyoOYmrqXSNTkqxy4ppbsomLQBjxjxSeXPeOHWan4xNH
Ci::Build,PqnjIjsHJGDgfhQm0dBjytxXgq6kKJUVa+UrQDGmm+cGJwY5
Ci::Build,O6rOPhQ2FmfzYRxcjtV54p17vbTTv0n+OsaxFVnlokjExtnS
Ci::Build,NOTBBwwBY2GxXHIykPxe6KpQ2bJIi6SZSplbLSpKjn2B04AQ
Ci::Build,JJLdNXM6Jj3WBiB6ku1cgtpHn50/tBM51pCYjnzF58UC+pBo
Ci::Build,OYzhJhcGB3nZVDMzh9V56ZZjj5/LnY+FRO+T1zIa8GAmKuSW
Ci::Build,WqPBCiwhHG7NACpat+tI+J1Tm5j5FwC7Mcd8TRUs5MjmwY4e
Ci::Build,B4zxCXMACV/ceDsymsRjyr4SvJvfNbj4Y44wQLvtGiekYCXK
Ci::Build,FubNNwQWGjjaYnpJpdks9p133ZkzYxAXLaVyZ86yNpJhH/QW
Ci::Build,NKL2Dio3FVnxXBFxoq1QyZsShMMxpVkJIAyoztS3Ic3VYiCH
Ci::Build,N6CDUTVdNXDbZyp4uO1I5YxZu7703FliZE3M4WxuWAHTSKdp
Ci::Build,BqvBAiVaKXv/VANbka1f9Z0Zgcx5meAhjY6/CofkfmnMvdpf
Ci::Build,L6HjEgULKVHocwMmkNxv671Fn83Vj4Btn32798WEFaSM44bS
Ci::Build,KLXuIgw5C2PKQH5FmKtC7qBEvYBFKpIjZaHIe/FhcM87nd44
Ci::Build,GqHdEjAVKHjEWgx/pMtw37cUnMgDUC/JaK9Y0Hjd6D9r1VSi
Ci::Build,BIbSChI9NHO/Ug1Ygqho949zk7s2LC/vpIpuVAZi1GRygnxb
Ci::Build,JqHvNQgGHXjBbz1exepy+JcXjIPFo+Hkxu55YIFumlPFWoG5
Ci::Build,FKv3JXEpADziTXM/0ade3bR3sovcfz2L0x26zKB3XEArBhJJ
Ci::Build,W6rqBjEsH2DaUx5bkOdumZdxv5tLs+dWjgiAeiuorxZhdsAv
Ci::Build,I5HMBTA7AD69VjNu3P1uytdSna5MpTk5E156f6pp8PK0KFxS
Ci::Build,DJTTFQdeP0/LYjJe3e59yd1kkLGWOw8XxHZTBm7Es+P4z4bi
Ci::Build,G7rkPnYkFn3abShUxflD16NEkLYNKpkqD80NuqeBPqlANizk
Ci::Build,BKnsCXYAJXjnUS9ggs99xJoQ3LhOO86B5izGxiBa47PSZfmG
Ci::Build,H5SOCzo1E3vPcj04vtN3lpkVoLZ7WhfjWqgKL7Hi1+my55Uv
Ci::Build,L7vCXDAfO3jeTS9OkNVL471IiI4u9ZXvStcyQn8LqQPgPecM
Ci::Build,LJn6Dw8kOm3QcRNO3ORq25RIx6MLKlTHW8PPZzDkXUYxHWqi
Ci::Build,DKnNIHQNN1zfQjlxsN1b5I9QraM7k7Eupc9MNiUHELIvW3b0
Ci::Build,IKnKBTJXIH7xRgpBsd0rmJdZk4BHBSSBWm3rVKKCURoLbUIF
Ci::Build,BrntJxVYKGG/TH5ii6ZIypoZv7uZUS9y5DHJs5mENSe3MaFx
Ci::Build,B5uNNxApC13cZgFZpeRjwJpXra8flC9kpx9QmuhFS4xFw23Y
Ci::Build,B+DaJjALJHHqRjFvnNor591Gk7eMEO364C5CqmBZLeiNZWp0
Ci::Build,WOaIVjhZYkjwfjxJm/xg3pYMrsu0dWpCKCi/yxy4JDmMNk3A
Ci::Build,XeHwDSc4PF3meTF5nf19/99Y04mJc//ZZH4zzPsGky9wpdM9
Ci::Build,JLaKLypCMlPxAzFtufBtyIRsjoBru0POtLdnFKlr/SM/UXR0
Ci::Build,COXMEW8NJ0/ZXQd+rftY2pcSksyDr/a4a3UPPpXddpYi2OU9
Ci::Build,Q6rhCwlWC1bjTT1zpc1I+dhbgrc2ht8Z0Q3LDAE/V544RbJN
Ci::Build,HJfSAwU+aUHRGBE8mPhR3sNYkpQhCp91s3GL1d2Qrk1/WBdP
Ci::Build,Bqn3UHUbKzHcBDt4o9pczpZvkKjWZbGY/85igf7yUt2/w5AV
Ci::Build,HKD4UnY2A2HzTRNppPRv1dZQmsiYdhZdbO7sv/xWyVY80XCX
Ci::Build,AOXdUCEcOmHYTTFBq9VNyKl4jqphkPUX5/Uyw4WZVZ62EHif
Ci::Build,GKvQXAwcEFbsZHMm3Pojyrl0n8je5K+5SZupZLezfHuWyJ5e
Ci::Build,B7fSFRMtN23MDB5zn6ZQx5RPu7JlKBYXCEH1Q6UfMmjxwAkT
Ci::Build,G7HCFxohHDDkUDNo3tVv44FKu7+YEX7cbAzbwMFe4t+9JTDB
Ci::Build,I5vwMDo5JEXwGCBJnPxf2opwutfSLtbEMXCHgLuCm7UXuwtY
Ci::Build,BqDdSSwNY139YiE+gOdy1aVRqapkE8aUeZLLEQFy1bEqxFzm
Ci::Build,N4TLVTQcCH/hbQxNsvtg5KhysICaEv5sGPVyTyCWEPsJzZV5
GenericCommitStatus,PYfLSRY1EFHWBzgm3+ZN2rpDvKliLKN2muzeeyKxEJdmssim
Ci::Build,BP7oXStcJ2jCZw5xjthY5NtInJ0NnEb1txsn2qX6EZj0C+wq
Ci::Build,KrLhXHEkE0T9YAhI3vMswdtLrpvMlhPkMbFkNovEMqu4VZEU
Ci::Build,LOGMEzsNHFPITDo4qt1o9ptYmILTjPGJyWaWy4OfbH37akDy
Ci::Build,HYPNHS9bKHv+DAhiivlM/LgSgKIztazSs2HuaF2ScKExFLzb
Ci::Build,IpDDNywkBHjuZy1egqZJ17dZr77r/FO6is0XgOQVxJqubgu3
Ci::Build,HaDCLitYNnveYC1l3cE39oxs3rQeo7gnu6gFz+GRT/yjJrtK
Ci::Build,JavjHCEJPkj6dA0/vu1JxtZRhYC3NkKqWrqe3qM4G1YLKB0o
Ci::Build,IKDsEHEsIG3MTH88u/Uu1tdxk4OmjIbIi+iNYtaMgJUENJ86
Ci::Build,OZv4UXEeHXC+AQ5Dqvlu67xGnqXVaoVv9qV9xOYF/M2ae3Ek
Ci::Build,KJLsVnEEFXnsRghRoK9u5IdwpI9skCaRdGogYtC91MaYCN1H
Ci::Build,IpnNPnQ4aEi/ZTNtnMtC5LZM3bAhTLOGZDkNsbImE5stujy1
Ci::Build,AKPDAQ5XZ1z9ZB9SrdN+15l+ppgJ/LaiEptMDGRflGQKRjIE
Ci::Build,KpWDFwcwYH7zUhE+h6hXl6V1mp52dID+BSUqAwhzU/nV2dKY
GenericCommitStatus,AYLqVgBbN0PdQDFexcpX7tdQuq/dfYsEYEEvW0Lddmh/wy11
Ci::Build,NJXMOwEcE2K9TwZFrOspxp5A3rdHrzTsyQKna/1Jg+v/oU4G
Ci::Build,D4X8DyQKBXv6DCNBqu5MyrhXuZ+SLqPVCwOeANQRwxqZoK0/
Ci::Build,HobzUCoIIVbTA354xedj47wWvaDjaqfCz8hEEzi25rCoStc3
Ci::Build,K5/+EjQhNGLFRy18m9R0ycNZm6Uq9qT4E++urJFuLdvksuUu
Ci::Build,HuvIITg5GUTucXJvjf1g5bRVqLdvfrNpUEp3U286uyLaqe0i
Ci::Build,K4SWAgE5NFbuZHxk2chd7rxKg7e//tQ/2Y9w63leG4Tu/lAY
Ci::Build,FqvLHjEcaW/dATNeo+hX1bwTjJj6Jxe5kvBybXgPJgpW2iHj
Ci::Build,F4TVXCc4IHPdWDhy26x42ZZqso2md5GdsYYhn/xOzxqvNWem
Ci::Build,PqHCASMYEG/hfyk+uvtU7J1s2ZGGow1SvHP7xaVlzKmKR6Qu
Ci::Build,PZb1HQVbMEu8bRtSrulJnptpx768eBljmHpsLtLoZYWUD/GK
Ci::Build,NILZBghdJ2vOYwxzj8tQxaxSx8LsCwtesyu/ALSxPMyxsJvq
Ci::Build,B6LIDTouNlvvf3omj9Ai8J5RsJuPQggeA+WgnqNu7injDytW
Ci::Build,OKL5MDAfY0rITX9SoqpXm4ZSh5xN8m8mL8Dh6WldCozTHwiI
Ci::Build,FKKDPRIsBmzhcQVdq6xo1dYXkILWsg1oYCmNgMA3Q+JScqp9
Ci::Build,XaL4MXUwFUW9XAxIm89X+ahFkqJMmMA54G9qpmEHk+40ToLC
Ci::Build,PrbBCxgcaUXhRHk5muRv1dp4oomhIRInaUX8BucWuW0SRqS6
Ci::Build,GeXQDHspDkzsX3hxvu1I3LgVvb+8eYvf5kHzQzxEbH/0xnMR
Ci::Build,JeeOJywoI0POGC5KjeQoyMN0jrcrztMU1b3DGs2hgRB+FO8P
Ci::Build,I5bMHRs9I1n7B3pGr8YoxNZ1psyAkLjtvT2NlCUbSA8LDWit
GenericCommitStatus,Lbf1PB0KZVjCRThInutL65RMjpt04azDjuaAi6p/eB8HuFN9
Ci::Build,CJ/9ESQCYnv/YQA6m/Ve1dpnvs9kfv2nGdJFnGi2ltRDmKpM
Ci::Build,GIvIPRY2BUz6aiYmuqov3thxkKsd1ea/6PXsEkGGstHvXYwb
Ci::Build,XYzkLDo4K2LQRT94i8hDx7FCko0d9qd4Feft1g/FzzQqQNf+
Ci::Build,VqHwFxo7B2L6An1oi+8j99d2n6LoK/OgHeEhTSnve2wAm7MR
Ci::Build,HIXDMgoCG1P6fwk5kNpNxd9Zoo+U0zxnmTEi5fgmi6XqNA97
Ci::Build,V5XaCwQENm76DRxzvKtswbcWman2xCs1dVjBqwQoIJDHstku
Ci::Build,KrfcIypWJDvzUXh7kuxg6d1ZgIM5P6jLavxMsI8xcfrQw7YA
Ci::Build,H6nMKCQwPH/sWjxon8xg5JdtsteMftSfcAhoVm5lJxU4NNbC
Ci::Build,JanzFTAWfGvoexRvgepjy5ZQ3oil/HFc5KHd70Ky7szx11cq
Ci::Build,BZbzVgMJYjvicjpSmacp3JwQhJBkig+gBfKifiI6XzXtlfNW
Ci::Build,XbrdBzpWKVvKcRt5rvV+7bx2nrjw+OJS9S9IKWVSyO2uNlt6
Ci::Build,Aar1JigMaXGxdBIzoul8nI9AnMzMbdawyEiBmo0udC0D1NbR
Ci::Build,V4eNFiM+FXDwAwFq3t1X9qh2obEylcCkNqncKbvJ5qfhHEJG
Ci::Build,N+LIIAkCJzy7ewNo2etR3oFQg7AU10ohvcigE7+E1WUjhI4F
Ci::Build,D+qIDyQuM3/iZgBkr9pDxKNznYPJI97C+gDH4EGh8r9dhlV2
Ci::Build,CuHDITYWOmGkBC9jga1pmb4VjbavVEt84/kv15C9NF40hfIE
Ci::Build,LKnKLw8sCHOwQyNasqZf7aNl2M0vWlyY87VO+dLmtQHxJ1NX
Ci::Build,XIqWHiYhJV/WDBRyv6hF7IsTi6wyTfU8yvw5LaW8gh+JsONx
Ci::Build,O6CDHjo3Z0PxTHpIgMZ9mZ5gnaw7JCfyP57RnGKFv4blKO+S
Ci::Build,IuL1CjdWKWe9A3p8mOds35hgk4iA1tzxPWP7Fn9czbx6bvke
Ci::Build,WIzJPTobNGL+Yi1NoqdF6a9Wjrw67PYKrq1swA6c5Oqu4yH2
Ci::Build,JJ3OHRYVOUTeZQNA0P1o+N8XiMn7qRj2UhcYItZx57XgslCj
Ci::Build,BObcKAhCN1rcZzh5pPZCmapwtayzl6ltyDg/41V+DODKSaJV
Ci::Build,W+rOPXMZMnDxTDgmhcls6Y0Y0rcImDqjBvsbvjDsUFtj+GSP
Ci::Build,OYD3KCUWEEfBZgAyr+1f574Vnr61LOxC0AwWHkkL/u+wGzr7
Ci::Build,L+DeJxNcIk7WeRttq/tjyLkU25V8kEPXpDFslTczkh4rQ0in
Ci::Build,NL2OSXpbFnPaBhRysqlRmLRinb7m9EpXRuHyX6gCOSDMsu2s
GenericCommitStatus,DLnDIhVYDmriQjM+jtlr3bQSrbDV8/0yuCC63Ok7MqH7sLpd
Ci::Build,D4HDUzEcCHnWXDNamtJzx7dAusnWBJQcZVVHE6KMwmmpIPqh
Ci::Build,K7nILyQoOFG4Vzxg3/lpnoxKoMkxXOviyxicUiAWhE6HlWy/
GenericCommitStatus,G6vjFiwVBX/NXA9Hm/ZU15oMvpTGRkGfFZnxHC13VObKWU/5
Ci::Build,PIDDBxA7ZD3IXApHi6dp9bdYjpnJp5WOXM5fdT0ZXqRe01cg
Ci::Build,A4KWEwwHJ2bPTAZZsPojzZ103pNY3h9Ophblss+hG6pJz/9m
Ci::Build,V7HeBw4FIX3jRg98mtJ51bd0nZ8xB4mXZQZSllsxZDKhspbZ
Ci::Build,Cbr3KQ4WZVuxfw94gOdPm7QTgqqS4NYUSTnvJQ8fhFd91JJm
Ci::Build,KZHRKikKA0H9TWZsovdD7dpImbKNu5roWAmNk6ZCmUBolYzE
Ci::Build,WOHBPHM/BH7rTBQ40c5D66RbmIJM7ipsZpRquGjfaGYXTWl/
Ci::Build,B4fWNhRXJ07/ZHJh2v1Fm7cMk7QRasi1LT+sZEWK5WiZEIdR
Ci::Build,NrTjNzQLJFnKcwBJi+Z517Z4osPuYuoqofylfZfFNXJp0dsm
Ci::Build,Jr3YVSA8OXPnfwBxt/ZPnYlOvc/3TIVaIUQVmmWlcD8EJqBe
Ci::Build,FKDNEnocEFzhYHxUuMx1/LptrYLeUIzRhV4+wO6Y+dHmwBn7
Ci::Build,BLHsFwMcYkHQW3N7rNMuwJR1rolhHuy1ioT+KrofFzYxX4qN
Ci::Build,Nrn5XSsFF3/kVzFfqe1R169EuIye6cnOqeZV8GDe/nAnxcnA
Ci::Build,CqTjHCwlKX7BUxNlku5z14kZsJcf4pvg3FvQPRqB1F5fy8XA
Ci::Build,XLv/KSc8CzHbRh1Ogq9+2JkYrLSU4gNbBUDVoubN8a7KLRer
Ci::Build,OJD8NXBcK2LYTTtDotpb8IlSjbsDl+ccQBXGEl4708jmVTEW
Ci::Build,X5ffIjpCM3DQTHxx2qtS1ahmsINk7rnwVhRODpyMpOaLqowE
Ci::Build,B734UyMYKWDhBg5akq9d3INz3ciTmrAlbNhLP6N5p+LpYb+N
GenericCommitStatus,HYzeBTMtH3zRQxFyvs8jxblY3pnb/ohVlkZ8DVp0/fHMFJWW
Ci::Build,GrKKHHM/DjrORQ5en+Zd2IhyhIKd/laMtrL0OboQ06mgbHYH
Ci::Build,V4zOEjAWAji4bANeqdRdyZtIgIxKViYIfZ1WuNWTdcQkip6Y
Ci::Build,V+XfCyVdOnGxbANeneh43ZgXjctPkgTrm7sArpFpKncilri3
Ci::Build,HoLfLxU5K1bZTWZYge1j6aRnmbFuSzTJzpf+Ve2HVn5fJh4a
Ci::Build,NorPMQAuKGPLUhF7hsZQ7qtYvZEvXAN0X5970SMHz4PqvTIG
Ci::Build,OOfSDnU2O2fxcy4zkM5DlrwX3ok4hwzfnwAS2UJXGTUkk+wd
Ci::Build,X4DfPg8iKUf/R2Z4rttfmbZVvKppDvhNNG/irTk1JUeYELdZ
Ci::Build,H6DSLxVaBHvxXSlDqsRg5KlEsqLELf4Gv02sVD+Laj2NIhH0
Ci::Build,HYfuBTEKZXG9VDFNhdpL27Fn07YESBoEGSQNa5cqL7j7/fWI
Ci::Build,CbbQCTsXO3P7eXM6icxuy9lyk8v2Yp/WuuEcsgZ+O5Gbuc6+
Ci::Build,XITsNBMYMk7PBzFqt+tQzY1j2K6iyrQewLjKuV9ofI5S4UDM
Ci::Build,A6nTEB0AY17FeRR4kfRR+tlIqILpJUZ98I9udROWbST7NmcT
Ci::Build,I7vqFTMVIly7VhhNsOZR9592nKUJ5h5fCr4F1TwRBHAhtxl0
Ci::Build,A5n4CzAlZ07efyk9jsh4+Jdi3pcz1e/vtBLoI/+roYu8UAiS
Ci::Build,Q6PcMBgVAT7mRipyr8Ztgp9XmY2cVdMeFM3LVh2eWEQz0ukI
Ci::Build,KKvBHjopMD/+BhRdkOld6JdgnZJ8QfEUiFtK1cBG6IhOhkfD
Ci::Build,BZH3Nw4pJDDbZSJbnNlwyd1sjIB8Vac1GU5zjL7t/sEbC02P
Ci::Build,Aef+NzMuA1bDUhtjotlQ/7ZrsKPU3pOt6hSzUAVqYGw9vMPt
Ci::Build,K6uDFBcGJXj6ch9fieRimZ1lkKoNccE7MF/HA/97MZv0m+NJ
Ci::Build,DJjVHSAXHWvhbTFxo+xoxYNpgZmixTPAuh+fCdCLtJoA5MOZ
Ci::Build,MbztJg4hZ1m9YzxT0O5j3YBY2JhKA1+BdUmBy8bf3sytjOcO
Ci::Build,GaOOSSg/Z0TwVi1bvuku3otTua9va8sDG78V2kTn+zqUZFa5
Ci::Build,HYXoACUCC0vCQiZIhvhA2NdCoaPhBIcbLd6CZeBXtmsNpxTo
Ci::Build,W+TULhYFPG/7eQdbnvU3gr1Dg6yGmg9hujROgx8YphyAWWvv
Ci::Build,LKTrECMBIGjiTTlUxe1pyJRks5KUbLev2wDY3+6sRA2Oic+1
Ci::Build,JJfwCSkYOEz6ATN8iu9Jx9dGjoOJvSjFWWEY6MygayGq5KXV
Ci::Build,W7TQE3tWKTv5cR96m+1N+4RUoIzbN3GAUdwd1FhqeEQOIvYm
Ci::Build,GarQFCBdNFHYah5kmMpM17pKnb4fQQFdiQS2gpKOSp2EYYmz
Ci::Bridge,O6OKD3MWDkS7Bgppudhx26l1roJE/4HtofXJ5k+wsBrdqhIz
Ci::Build,MZb6NjYtCFv4cTJ82thf4YtnobkAhWgkeRG7pi8W+Ytk3gfB
Ci::Build,KZ/NNwoiBzvuUjxSj9RI4bxn2Ze59Fs6TCkUfDAgEBeXlHY+
Ci::Build,FKXxBnEbBjzseCJ+kPhwnY1kraiSeKrBpeZYfsPDDat/oAWo
Ci::Build,X7nQIC0pYGLxdyRo0OlZ4YxKjoL9x87cJBDCmxuNu0mUzIK/
Ci::Build,F6nQEjYCO3/LX3xtt+dFwp1OtbnAk7OkHSZmtqbuawKhJkY9
Ci::Build,WJDKFwweC0XccTJom9lpxL5pmrFjXY5SFWnqcxI+Z2x1yb+I
Ci::Build,AJfMExMqY0q4ahpxkqxpgrdjnbjSVJSNId3tv/3gyL8NCxJO
Ci::Build,Ob3WAyUCOFm7RClRvud/+Jdyg60/P3KGgJe7dToRnrzavoF8
Ci::Build,G57MVnMGA2vIYhR4qe1P+th5gYweOODTLWgpezu5R0WY1q40
Ci::Build,CpjzBzM5H1/xdCxxksco69lD3Zl1OtWUmYbVVD8cqZmPkEJW
Ci::Build,Xb2ILiYfBXrwAS5G3/R/34NCnbCF3h7qKk4GpgigACq8DRlJ
Ci::Build,MZHVXDMVAXzgQDxYsvxj1qBpp4LmFzeJ4vTzY75m7PP0q21D
Ci::Build,AeLCDHAbJ1z+VANeu9h32qtPkIO5BAAfbead3UT3sf3TMRfN
Ci::Build,OIPBIgcqMlH5RQpqoM5N1bsW37CQKLZHx4HJr63tvq7sL5ag
Ci::Build,AbL3NAYlGWC4fTI5kK1bm4xwjaWkyrDggI7mb9iOLkuhoGxu
Ci::Build,LaDzHXcVNG7xWAlZkPZiyZkUu74T4f+0rk7c9ewZkaepzKYj
Ci::Build,CpD1ERshfG3cYzhznuhxmqtbi53O09+wkse/N5c8BqiYF+v6
Ci::Build,FrfkJzFdED/zZiNunv1M+Z0YvJDar+1JaWsxZPAIKYI/POkG
Ci::Build,F73iExcaPHDeUzo9xfZJy79tssnmKYtxv//8j6V3zC55mxWb
Ci::Build,WLaCNjg5AHPPXBNekq8t/pZg25JMhp686FwqW9dfgXuyA2Sz
Ci::Build,H4HRUyYcK2P5byNGgNtxmId2jIKumX1FIfkrGovsPMVfpk2I
Ci::Build,K6PQAQ4aImi+TH06uKg3nr9Qj5j9mZkesx5Qo5oCwAIc+SQ5
Ci::Build,Hf7BPiwIYz6xYDhh2qwp/t9w3qgPLSH4QT2rHyewUH+ZoaT/
Ci::Build,CZTfAQpZMEfLcCZxssxu2Kpqi7DVjOpjHhVXXC/nQIjZJzbd
Ci::Build,PuHBPQo/AmT6W35Ju9Qr7b5IrNczdTAkNNfWRXkjWY1hI9/Q
Ci::Build,N7vZXScXM3O9VBhekuRM6qhXrZleNIVablnppL03yaCwkh43
Ci::Build,GqvfBnc5K2vxZnl8sdRe8Nx1q4qaEmBr1tucfTfYeemphoYD
Ci::Build,GYzqXToeAGreeAMzouhMm61Pj60q1QD7RkXmBM5YQNdnwGIE
Ci::Build,FpTYPjg2AFzYA3xbqfp1zK9bibkKLDXtWhg45GL+FQLP2tXW
Ci::Build,O4DeXXofaXvQfiZRqfop+oFRjIOPeAM5knUVRrim5x3poxsz
Ci::Build,ObfrInoVAUPfQBxHvtlA1a1lqZwwIx0B+tmnDpeLqu20JiNq
Ci::Build,GZDdFDE4En34bHhPm8tCmYpm3cieRwKp/oZCfEmzQBbbYFBq
Ci::Build,B5H+A3E7ODzEfRFysOwp6apy2YCIgK/PhyDIpBVUyR6Sd9Dz
Ci::Build,FoTwVW8VIF7ZRyQ/ks5/+sNxq8hCSZWkArLyf1xeSHJVs1TQ
Ci::Build,B6bKIjc2ZmuxUQhqr/x1nYp0r6/hWGV/33eBiElIduDqhAyP
Ci::Build,HquDIC9bNWjubXk82q0r14xHkLS6vKQTT3ngSaC1ZASZd6Q8
Ci::Build,WZn5HigiFmf8Zx1zruRq46xSuI5Oxh/E6KCjYHLKWCL5aYrF
Ci::Bridge,VrrrDDYBH0vFeHNjgtlM95YQkLDiVB8UsYFDlhybUSVDFALP
Ci::Build,IqnRF3FZKTzwZH5ZgvpU1blvs4+PYOlohg6EgzRN20SVvSwL
Ci::Build,F5/dCh0rKWHoWBhzrutIm6Vg3p9HkWW4P7WQk2ZhjHC0ul26
Ci::Build,HZXiAS0bOjjfag5t2s1115pgqLLTzoK51DoQFUCi0Z5y8dNx
Ci::Build,DZTuIDosKGjxcypApMtswohKrrsmzcQppNtQMC07h4C5ULgF
Ci::Build,CqvCFDUVaWb/VBFzr8Z7x4sY3rwAzMYxk6xqdYmtS33rgB8e
Ci::Build,NOrCVhBYB1zeViR9vfB0yZ8ZgqLKp+qb6Ue3z4fXUSuiQlYC
Ci::Build,Q7TJAidXYHDKdyNGkKdI+ZdSj7Aewl0fTO8ebxL/W9T+m0gt
Ci::Build,Irf5SRgZP16kBHwy2uRq4o8Zuags2473zBEGUbcgypU6ME0x
Ci::Build,NqriFiUWYlbzfzFNudBjmJ1mkIx04wf3lKlVS8/P6zoJIH/b
Ci::Build,KaOPBzEuMzzDATh+pvNe2IlSjarN6jvC/RYCJH66f8IJOmyU
Ci::Build,IrHvIS9XM2fnczNpn9ppmtlq046YOAmwbxQufRXToOCgpRLe
Ci::Build,JaaIDG8rH23YexRbpMtK57hvga5r9q6mk9LJJR6aaBwk2JL+
Ci::Build,KKT9ATg3GnPDbB1Fj8t1yJdq3pzpkUd5raSmCinhXcz1Flxo
Ci::Build,BuvwVwBbBH+4VyRzsq1z+L5qoMJwz57u9f9qzwU2ZMIKP8WJ
Ci::Build,Fr3uATI7GzH8UAFjseh93cN3r6My4zNukY2k/8oKWqSWtW+v
Ci::Build,XLGMAXE3FXmkXiJoqa8omIh1opBsDklekVh4/yrST91gVcM7
Ci::Build,N+fCB3cAGzveYg9urqZ+6KxUvKXSCLxLi1rOA8ieFJS8pRlV
Ci::Build,Q5iCMREoAkzhTBEmuvN7wLFxravja6NxvD9bQmMWpMZQh1QG
Ci::Build,OeLBVjcWCX7kAy9lrsoo+6Jjv57R6gOMPog1TUhQdiCLteYJ
Ci::Build,FOXfNisjGUrdfjo5i9Yu6LpjvrZQSm/iKfBC+KXTQVUjCRrY
Ci::Build,O+LNEHdaEkPdZDJKru1X16xXiY51FOowQMPCnhtmvGpXDmNl
Ci::Build,L5XwHSEEOW7rYDN4nPRSxNtEr8N0TmQeHzoyIx4Vz4mKik/e
Ci::Build,HeLzFDJeImr7eQVB0c5t3J1XrYMMbG8Kbx12HhoZCqGkjteY
Ci::Build,LOXfNQMtCXzhdhE9oO5+nY1PmZPkiCaqj+1ib8vvUd/AoDvv
Ci::Build,OuD8Ji03NGrReTJ6h8xS3Ipbg7w4+2g7zoi/hDvdzRYrUHBt
Ci::Build,Lb2OXHseOGHgYwVFpvN8y7Z5mcgH5EG/5O6HCIoU34GDCN7k
Ci::Build,HZnPXBUWNW3KAg08rPpy2550kM415hZCb7z84HpaL9eCFzWx
Ci::Build,C7jBFDYCC13FXxJzo8RRzpRDi7lyBZgglKVO8+eX/kLlIeIo
Ci::Build,BKHLFHAXKDz+TzJc2vZPwZZSkKjpAKmfui2xfk/5NPp3qCAq
Ci::Build,N6rCKTgLZmT6chFJpPdj3K1KqIM6WVTRDWC0feH5hPnArVsZ
Ci::Build,NKr2DSMwBlzNUiZivvFO3b5LjrlH5P/FeoDtWqK1w8BZACXZ
Ci::Build,KbjCKgc2G3D8eCpSuvFM5LxUsq+ClWGzDBnk5jaFzaOe9qm+
Ci::Build,BuXxEygGOX67Rj1e3d1j25RzubtnAmNmmvwBi+pGg7zf49B7
Ci::Build,LKDxVhEaJH//TDJsktgj7K8X24n6R+5KBqJ+3SbSUwUEyQ3O
Ci::Build,MeXCHCUhIEfPZA59h+Yo3NdymKhVo5VHhHnFmosLjwHr54dE
Ci::Build,IOGNKhYcNnvsRzt4sc5F/p1juLg9zMGUMVpyIHdkXBA2brGV
Ci::Build,WqfILDUHMkq6UAd7gdlxnqVDnamTBL7tWjypkSmtigWK7jJ5
Ci::Build,FobcO3ErZ1rKc3J+mvBwnZ1bsMyvdmtbhTMCOkQLu7RBIVjV
Ci::Build,CZjTDjosDkzdTzJau+RN3JZ2hZKJYllvXnwrZINLX5CzIF43
Ci::Build,XJLDHBACKGPEWjs4kOdx2ZcMmK5voimNxpW9GofS/w7C3uOT
Ci::Build,FJfuJjsaK0y/RRlog+lp+NhRn53Jtav+ixY5XgIshQhiM3ku
Ci::Build,LefSUTYbHUveYz1du6xQnYhjmMMTDR2jO7nojbIYZhsh1FKc
Ci::Build,XabCPhI+YlvKXzhZpPRwlrQTp4yPf5SsPtbfApxEYpKK9UUi
Ci::Build,D5/vNxgbKW/aQxI6n/dix4xvmYzGlLZ/uG14vHrYn4QGbBkN
Ci::Build,OKbVOyw9I32/Yh9i0Pwr/JR4iICYfrXk0NE0B2ZKhoVnOIBe
Ci::Build,HansO3c/EErEVD14nM9X36sMkMgGSq7NdsbnP8z3YjufAsrr
Ci::Build,P5HfDzEFZGjrZQkykulFnYRGpsuh+4NcmSFiZYWwbwxRA6/I
Ci::Build,KafCHSwdYHjxXgo+qdBq94FbrLJOm50JEDaYagL/bvgFOZHk
Ci::Build,F4niFxgfZUH6RnJFidk31bRjvLDpHO90SRHjbAgtSSYDZiXf
GenericCommitStatus,HbnfDiUwGVm9ACFp3/Zq6a9MkImKnhvBHpEClFOxXuW1nFWS
GenericCommitStatus,F4DIUywdBEPaYHxegtRvwcNSvpckEldB+oPK3SEv8SGEE72y
Ci::Build,HaHVL3YlDl+kZiB4pORN1bpkjpgBI1IiRfI3bcFTEGNZBWek
Ci::Build,CLzxKCY2Flz+VHx4rKhw/YRDx6OLbAWvZqdZ/BrtofgNVBdl
Ci::Build,LIL2XDtXYGvFAwBKr6tw2bZks8wJ0UnhAVWCYsueiye6QJQU
Ci::Build,IJX2Vgg3GiS8eDF4hdprnLRtk9c13iuoDqGlKBR35Ha715V1
Ci::Build,D6vBIQE5GV7KAThTrtN/1pxkuJ6AXtTnU16YKvaDjH6nL50l
Ci::Build,C6rVKTZYK2zQDXNNstNg9oFbsqo4+lqcxhhO1fel3RdvLOrS
Ci::Build,BafREDBaZGLmbXNFsKpg5IZrkq5pAhsY1iwF6hl5DSSWaMd3
Ci::Build,WpfCPRgEATDHZT9+hvRp7ItZpMk8fIU7CCgw4W9wDvUV5efL
Ci::Build,MYzzABAuZT/9WiZP26pjwcNHvZAD3xdnr2BjlH39mp7XijeC
Ci::Build,BbTtKHUVBDjxXn1xvPdXwr9PkJXgZS34j1jy2we9SZgxvl1t
Ci::Build,CqDvACQMEjDzbABNi9ZqwbdYnZ8e5QnWGjac+HE4Wx2QSDVF
Ci::Build,KqHTPHEoElnKDTFZrcdw16lnqLf5A4C2Aar5jgOL4CXXwHJI
Ci::Build,H4raPjU4O3H4cnxaoqcvlrt226wkE74rvhgyKYwtg/yKNrSv
Ci::Build,OKr3JhYuC0jHcC48kP14+dp7np9MMrlTxZaf7P/lVEMrGl8e
Ci::Build,VpXeHhAufGe+bBJqm6Zf8JYZk6uQ4HJZesFK7Rty9mnKJpIJ
Ci::Build,V72PBxYLK0LcXiF6m/xz1dpxn7L1YH6wbb2RqrVU0/BjDjjS
Ci::Build,F7DkIQckH3HjTBtGo/FUxqx1nJTFX9Zw801ISf9/fWrm63xL
Ci::Build,PuvwKTg9NlvdRjJHutB49p9im4nJQK5lHH0aDkxde2rZ5HkN
Ci::Build,HYH9PnYfNXr5ewZx3KlWwsNzpID1RdeVwvClxW2BXxbbTyge
Ci::Build,HeDvMzAHAEywADl8h/9+1opvnrY0XNqd2FcoFYTln7xVpzv1
Ci::Build,KpmOHDA1JkjwUSpsjqZY6aVG2ZOx7U/E+hc/M2A4uyFG9xc5
Ci::Build,CJvLPTgWZmG/QSNPpulP5cNA2L8zGTcm3fE7QEGq8//uJtkx
Ci::Build,XbHzNQcqMET+cjp4pK0j+IF1sLuB4I8sleseMZsDqamWILdi
Ci::Build,V5v1Lho6JX3NYBRzkvdJ3Jdsm7eqrEF0M/kZiXOoBoW9Hwmc
Ci::Build,Fv7WHTowCEjtcjNzvPYi3IlsvbH5AWBHk1rD38RPxUNdk7xJ
Ci::Build,C7zQSTYOM139bRs8xapezNpJvqNylAT/Wt35FERYvE1kkcAA
Ci::Build,BaD/AhtXKX6+dCFUssR+1bRmiNfoJhWVLRCyJRPc0tp36xmU
Ci::Build,DIHSHSQXFE7wYxtir/lL3KJynZ4mLMrkcTBWbC3zEEqHx5bN
Ci::Build,IqHaHjorOHjeAhw/iudR/blUx5PJs710jVd8yFulxcHYawGZ
Ci::Build,G6nsPiNZB2ukB3J+pfVY6IVSgojfkLpaJczWy/lorVvBNoJk
Ci::Build,A6H4MSYwY2e8dCxznudw2KBFvIMymeXE0lobyPIVK7gPfP9m
Ci::Build,XebwHDMFFnjvTH5MxehNnI9L08maISM/MgcqTEdcbh4QAaKg
Ci::Build,PpDOA3UZZ1zgZzpGmatD6qts24IGVAsDqKK2JmQ01YHrcmR6
Ci::Build,DKTTXCYoGzjYBj46jdAp36MUubbK1b5xsu63U2q7zJp04rio
Ci::Build,MYDfHTspKzraXAk4mN93+pRpp80yLwdC4Q9XDTYmpvewfygI
Ci::Build,CaTYAS1ZNj/IcANMhqdc1roYps5bEkAtPeagIY/1KosVXPpZ
Ci::Build,F5HIBSQXGTDKXzE5nO8u2rET3InnRPKOUnomC75aMLjlLwem
Ci::Build,OoGWADQIMFjgUzJP0M1J3awMgbsSJaQ/uHPRSP7gsatzySfW
GenericCommitStatus,C4GJFzscaDDzdANfrNVqwolDpLYlYPZmpDIRIYCrJPWP6QEO
Ci::Build,D7bILCwNGVv+UQlY38dA1YgXm4DChQUa3mrQ3pa11Bf46HQ6
Ci::Build,N4nZBwoWZmD8fRNJm/1J8NlRoZnC9m2Myyfm3CpaPG16C2YD
Ci::Build,HqfzNhA2I3vMWjIm2dxJ6q1ImLkdpLh6tB6Pc6CNwOGdCezo
Ci::Build,HZ3VHjg9G1HRdi14sqlDy7FYqMue2JcjpRRidbwFpRbBiFI0
Ci::Build,JKDDUnYaJ3P8ew49pPkvmK9K25mkHsymRzFX9o3hrK6RpzSj
Ci::Build,B+XoHRI/PDzidhJJpMZMxK9boqL/N6WWe2y+SvgBIQc9JKh9
Ci::Build,BuDdUnFdJE/RbHp4reZ+yr1zjcOXq3TyTFj1HheqpH5LAmGP
Ci::Build,MevDHAwNP2DxdHJiv69Lx5Zg2c6/UD5C3L5mpRYNyAy/ISJk
Ci::Build,FqnDFRAMBEzvUi5Hxe909792srygsF1GTH4PszC3XcbagH9Y
Ci::Build,XYfcHBgGOljKYDFhh+Zx/9pXvJT+J2ZAgfLjO7B/yJWev57Y
Ci::Build,XOKPFjEFNH/gUT1528ld/MNjkIy+HA54KyMZ37fVwtz84Wb+
Ci::Build,DaHpUTooFGrwTSljoM9J6odli5A2PH4TFKt3DrOnXhGSXiHL
Ci::Build,GruWFBNbNjjmBzNcgftJ8LFguJsKZq93kqerTVOv48aHzhIT
Ci::Build,H7XkSQAIFT7aQDNtpfMjyrtiopTjqcvU4olWrU434raIm39b
Ci::Build,AKD1USYXaTzcTBgzmeZL7JZ+n65RwQt7pgKVHQtnwzG9a48I
Ci::Build,JqqNLzcINFvnTzh8vqhd97lm2YkqGiuFhOPaA55fCA88TqrZ
Ci::Build,G6XUBzQIEGK9eB9ejapo15hTkMOb7MpHm5IwQLsqUT/x+5k4
Ci::Build,A7HCLDAVCXziezFzksZw/rpF084wtybG5a+jhpewFX5nG1zc
Ci::Build,AODOHQMuK3+/Qy49n/Fezr9kn9dBmIH95AvD70+3nU3i0m1r
Ci::Build,PefDMA8rIXH/ATl43OZc25llgbtYwsdwg0zcfolTMM40PyT9
Ci::Build,N5/CNQFZF0PieT1jt9VFlr1JiLA85ns74WmYnzAZ13VOt8bI
Ci::Build,PIqCViQaAmLjTH1RkKlYxL1joaCQOu5sSPpO+HFNfQ9Cr/pg
Ci::Build,VqnfNzI1Jz7YQwFj3KdO+JcZkpBze5WAamEBG0Nb7VEAvHj7
Ci::Build,C+r6KXYCKEfIeBQ92axu261SiYDY2FDrMjDJCWJuMDbqqPEE
Ci::Build,Hr7wHggWH2f9AiVT3vBu3LFxmZGLux463GWEfYRR2FlwaqUA
Ci::Build,CImJUigtMEfMTBF8kdJx6phZ3YvTDi5qQ9QhE+Zph6PBNBS/
Ci::Build,JKfeFHEYIXnxRD9Gg/gv+49qq77VjSH0ib0PP3zsU73VMO9n
Ci::Build,FLLBBRopGkLZaiQ8uuZ764NRrrkx9y830gnqLUUahNwSFXgt
Ci::Build,B5aWBnEpIjzMRxtAmdojgoVbuZfhgK/qYSOJDn40Dddd0JKl
Ci::Build,LLaNDzACaDj7eS1/q/tA3JRw3MyTb1R9SOVyDjjj7eGw72r/
Ci::Build,JIr3DgheIiTxZjl/0O1g+6pYn57nf2xjuq7Femy/QGBpUJaz
Ci::Build,WJnIKCQfNUvBXhFpvN0syY9Rr67O42D3zrQc30Ix/TvEzGjm
Ci::Build,LYz4UCY7F03tUH14rOZg2dlOhJdYo8BeC4PMksNVW8+OHkZ8
Ci::Build,JoH5IxYXCFjdAzhZkMRx94VJ2KWLIiebk+L4/Zdyh9XChXTp
Ci::Build,C+LuPTQuK0/CUj16isFj5bdHk5WhkM5Rqvt3JeYSuwJ+67+v
Ci::Build,NqDIMRI1Y264AS94judC2JZgjJfgNPtEsq4Rz8yP0w6JZh5w
Ci::Build,FLXMHBcMZWf9ZyBxss9FmKpR2YtNfowi+9ddsw3XtmWZ29Go
Ci::Build,FIrSKSE1CD7wT31Tq+03zNhYj4MDsqI7Z3UwOwq4hXY60RjO
Ci::Build,AaKPVxZCPm/DDDN5xflxzZYSx85oW7kWS0T0FkDYaSuBcZmr
Ci::Build,HIHIUwYLGn+4ciZZrORi7KxDtY7KqEj0fbg/jZt5/Lk+y/qT
Ci::Build,OZbDPTcjFkLbfwxF3f1MnddkkrcohtvIYADvBR2wDGCvI01U
Ci::Build,HIr9KnMbEFPRRjg/0bNZnqRmuqDcCDdzcKKqFjwLga+BI/6F
Ci::Build,FoDdPSssHETxbyJZkv9PwIZAg8uddo6uTDpqU4s81Uo+Z4yy
Ci::Build,CJHMVgQsZke/XA1YkP949ZZrkqX0Pnjz2O949k4VUmuqBsdr
Ci::Build,KZePBSAYATreUj1qu6ZD+YdUqKynBLTw7XGL7QH14NSNdLUD
Ci::Build,F7fzJgkeOkrxVgxdrNRM1Yppr6ltqE56qrkeIn48EjRz5UXZ
Ci::Build,CJbUUwoCG0+8cxJUmNpY1tZmkoCr9EC+DkKGqAHspzzR+35B
Ci::Build,PLD+V3orJE7IARNjpM5ym6V5pLvey79HVEBSYgGUhQ1eWhxp
Ci::Build,KIXDHicdDlvfYhM9oPRW6YNItYpQzNKqtZDWZ7vWjApyzfJh
GenericCommitStatus,LLH/HSQrNXPZbBszpMxQ4qwMuLTy7FtLcFwFnaCGUFAiByt2
Ci::Build,I+LQJxo8Bj3dTw58jMFW7dxp39dnLhlHh+R8qQSzlWJakUU0
Ci::Build,L5ndKRNaPn7DTBF7t9V56qlY3p86YeFqUBR/rqDxBsNJdqiW
Ci::Build,DLDPNgQWIlDIVhFiveRz2r1s3JTKYwIAN4bBv8HxRN6ixz9F
GenericCommitStatus,JrT4VwMVAj7dViNRgOZ1wZxEvZ+HwfL4cdGOjEpOCC2p0W+k
Ci::Build,DOXpIx0WAz3rTzlknvot6tdQqJJcHBSo1WLECHcs6DB/xxpp
Ci::Build,C6CMIBMoNU7hGC9z38drnJRrrJThnZ+GOmkHvNHQKvv0ADmf
Ci::Build,A7rBHCgoKV64BjNOm/Bbm9pKpIn08lQ4NiqSbCXcgtcRXPUk
Ci::Build,DKvDFxQfAH/xQwxqosFN3bx5nYldsTmrotwlF24KvQTpBy7r
Ci::Build,Xar+UXYVfG/6dxtaidVDmqlwhJhbjwZyHylMv+rwzQNhc5yG
Ci::Build,V+DIEG8fHG7IWxJl2cdU450Sk6pqbyQqtThyW3MjfGufcKdX
Ci::Build,C6eJIHdXImDobSN83e9b7qJJnoKDtOo5LT3dXbZ3DTu9NwRQ
Ci::Build,O7jZECkpBEHsdx5euv1C4blVmJ3bmHjLmXVtqpd3EZFHFoRH
Ci::Build,Oar/XTcaIlHjRB8zh6ov3rZGgY3RvKZ5LObMXBjuccYWLTNc
Ci::Build,D5f5BgpZC0vNAHpIkNxf96Jlp4sKhoOetCkW/DjKpfzMKv/F
Ci::Build,IoPCNzgAZ3PHBzMykudS7oxD25iUt+Q/Jg4kuyPhU1rMmHk7
Ci::Build,WYONIwU+Z3C7bGZOqcYu9r1qk8xVH1fO+S2TbGSnNEQEqGzb
Ci::Build,FpbQOwMNN1a4cAdyr9IvxIxbjcJoNcYTbEJyHJe8sY3Ksak/
Ci::Build,KbT+UHYEKVPIfy9pkcRA4bh7i6g1W/7kuWWNZURCH1zPGRcm
Ci::Build,IIbrI3EOZFrPbxJJxf931oR7os41t1PW8AWD9afQYrjR2MKh
Ci::Build,GYPhBhQ4IVjwUDNT0NYjwaZWvpf967PRzDv8x78gfBd7nM5r
Ci::Build,OJXCMyg3I2K9aj483M9j3LpzrqPzMkQSIWhsXavUlh/xrLYe
Ci::Build,C771HhQIOWu/UQxlpPRo6ah2h47GaesLD4R6yEMk95+6UFSi
GenericCommitStatus,Fp/JUiYZODzwbQxcifZYnr5W27BM+G6ExzpmxDaZBiJ+Pb3w
Ci::Build,Pbv6MQ8+H2ffATtonMFQy5t0marFtyZRbUqwka5TtR1/oDVc
Ci::Build,N5HYHCwrFn7oAAFMkO0tx9ZqkKnq0+lWrUx82SKYIMDQdULT
Ci::Build,DZnIFDM2NTzzYS9ZndZF25RPjKKXRo9f5t6XjdzIpPOWIC5p
Ci::Build,NoXRIg4AMFbMbA5Oosdym69mqYCRiymTuSDswQUWOGBct8Li
Ci::Build,VqvdUBgnF37Ne31BnedSgr11tdclidfSt1I37Alh3yURgPgX
Ci::Build,C5KJLHYjY1ixUhlz0etw4qZmjL2itFG/3dZiaLciTbLcH5cn
Ci::Build,F5bSDAABKVzcDHhs28hd3I1qk7CczwlYv0dYCe3YRALcF+zH
Ci::Build,L7fBNA4nDmj6VjFG3vF56p1Trq0ic70laKfnTFjIU9b2jkqT
Ci::Build,Nr7VHTs7KHHjbQVSgMF89pl0mrJcnNe/enGlNAwc1BEA6K3w
Ci::Build,FqbQJyMZPEH9Xj5lvMEj3I9svLClqUZC5H/rUhOYCp7wfczF
Ci::Build,JuLkNCEGNV3fZhpdn9lU/Y14mIqUIgW5aQxkDOC2bCyzkPKp
Ci::Build,KOH6KjAaZlrvZTxTkc1Sy4Z1poPMhV7eUcC1ZeEjdM7KApA5
Ci::Build,KZvvJhoKZCTEVixynfdyxIN3orHHP661IaXPlDuCBBAwjs+e
Ci::Build,W4r9KjMJOmbdeBRgkOti2LdSmK+efep5ssV+7MImmwvZFLy9
Ci::Build,HKrrV3c2OX7teA5ei6duxYBnkK35RNb+398kOU3CXuROLY0+
Ci::Build,LIbIMjElCU3bTz9ajKoj6ZxzkotJzDHbXdXQzlcDgUUa/+WZ
Ci::Build,KeX+AjE2Jm/4bBNdoPgjnJhZjbhstKJ7+FXwKbYbWB21LZi/
Ci::Build,VpDDFi8tKUi9dgZDi+9ZwYFrrassPQxljIVyi2j9cDqUj8o9
Ci::Build,WoXBHBcXIVz+T3ljud9NnZdvj5VgY4+4/N/SlnSzkH7yfTWm
Ci::Build,Q+SWIxQ2EnH7ZQg6uOdcl5oXoqAanCdEP+96/Shw+TgLe1Xj
Ci::Build,HqSCJyYFN27aZxFPm8Fg4oFw36WPHTn/q7nfoPin/0ITYwqW
Ci::Build,NJuDUCU3DljvUyhbot9I1dt7urJ5sFplYag+qtipgWGqMIiG
Ci::Build,ILqOIQYrOWCwByNdguZ06p5DnJ1j+IoTeTXlN73vj9w8IqEZ
Ci::Build,WavtXCgXPmv9DCNskKtd6Y1nh71ASHghw2qCFDIHI7Av2BPj
Ci::Build,FOfYLCseB1zwWAlIkutX9d94g78rgiPGseRIYde7Y5dYVyB8
Ci::Build,W4X3MDIVZFzjdjhUse9s1pRYh4OW3f4Nblcpp1SWvvs67REt
Ci::Build,Mbj9CzQGA3PRZwlc3vgpnYh3mY5HgCSUQi1ujadrROVaiHlO
Ci::Build,JYLwKSgHG1/4BDhMrdp81p1ljbGU1pq4NxQWHXIq99GqQb6R
GenericCommitStatus,H+TIXBNZImO4ARRyguhU/6xLkpO2/IMp3raB64R/uFbJlNoL
Ci::Build,K+HdHQkcE1vQXC9cpqctnKZQgojzMM+Y9JEqslgP4BsVgTlO
Ci::Build,CYvZE28GKFznT3hJhu0r4blvn7BNtLpHK+sJIcb2MKcK3/1i
Ci::Build,PbfDFQM9EjDiZCF4kcxQ5Ih5nLY0qie+kKK7d8Mbde45pw8l
Ci::Build,L73+U3MsK0LsVi9x3aZF49dTnJ8ru8lyVfyRtlqmiyP8GSUm
Ci::Build,OoqDDCEsKGa9ZyhOg+98zIdY08OuQJDIATyRa1dw4fcr69FF
GenericCommitStatus,FrDrAwceBG3nVD1xkNoiwYB4obBMqhkCDIXwwmjU74M1qK6b
Ci::Build,HbfcAjMWaEH+VAhJm8ti6I95spsfjzT6b3diQnasOg3OR4Ye
Ci::Build,XKTQEDghZDD5eQgyvsRs3N9SmInNI6OHDfuBNOIGPkiZrUBa
Ci::Build,GP7MEwhYY2vxYTxZu/Fxl7R1kqVeMONa7oh80PvycRSFphzO
Ci::Build,NJDZJykWJ3/8dC5/ud9X+7xMjss7ZRdSgp652n95Cg33yGut
Ci::Build,OrnUERVCCV7qTyp7ve1ex5RQ3bG0NLE6riRa/E3u7Ldss2fj
Ci::Build,LZjePXULaVDwBhJqjPppl6sVrIJsRXsybKpIjOkcP/bx6zEq
Ci::Build,NLyPBRcdC23aVjhYpsZ+nJtQ3ZQPaRCrj8Dl75kuCyHd1Q91
GenericCommitStatus,H7nxCQYsG368XjtO0f1CzY8V2ai2IwCigS1mEtgBxVjSQaV+
GenericCommitStatus,PKv2NQQoMG+8WDhRvPh+6YNlmraxVrj3GnTi4HZp7sd2kV9u
Ci::Build,HrmNHQ4dMm7HdAk+gcl/25ZmiIh2/ff8oEs3T222NqyaEVK1
Ci::Build,FpjYFhJXC37OeSh4pLNglqtwnoDuHiPdH6mRF6GP/Jg3RAuG
Ci::Build,MabjDnA6F3GxcBxbi9R89tsUsL1rjYhNsJYtPYGc4v/c0aYF
Ci::Build,Hb2OESYlIGvQez5cm9hUxsN5tb8aIb7ftJG8ITuFPiKUX+y7
Ci::Build,HZLhJzZYCW34ano4ut9C9od2sK6LsIpR9A9oz7GpFxk/BUp1
Ci::Build,GpD8AHs/BVHgbBFOmNJ855dQqa7k9XE0ZnFioLP1gN2ufJ5Z
Ci::Build,AIrDHi9CE32/GCR5m+1v55pUk4wmQor6OT03honUurPrCROF
Ci::Build,GIXwNgcbHD7ZXHxxrMpenY9bmrBmBfvMQpFoBdMVRl8p8GQA
Ci::Build,L4P8NjYINnq8AT0+halS4ZRGsqw/ELvyHFTInXsPR+4MFanN
Ci::Build,PeL9IzsjIG3iaho+j91u+5tD3ZOioL0A7SAlWg5y/Qr7Ohby
Ci::Build,GbjSEjEYBjvxDA4/t/8o6KYMrKizqjpdcqCmyhOq39OnkejH
Ci::Build,Hp7pL3A7KH3PZQhbsswvxLR4ha56cMBEaZxie1DnCKMNUIda
Ci::Build,I6rQESYiMFbHUX4mv/ws+7ZqoZT1H/4Rk3YuqZ40NA0C7mfS
Ci::Build,P+eWHRgVDjHPUiFFoO5u3JZZq6K2pSVBEDbWKYOpF/YxkN7p
Ci::Build,JZXQUQEXHV6/GDJyi+Zd26RS0p/1OG1xDrgk2BZ0BViY7n9n
Ci::Build,FODkJwpcKzH6Qxwzks1q1t0VjKizfgKG2yqX80wbsoA/HAW4
Ci::Build,DIaKCQMfA0HwUB19rvljmoxqjKBhPwEAwFZn3DAg3ZlEUM5I
Ci::Build,LbKOHSMABELNBipmm81r14d5nJNHGgrrK/QzUVvob2cqw0Bq
Ci::Build,PaqIBXUJZVj7DXp/nvBpyahbno1h/pRWZ3DLQYk5MF617mK4
Ci::Build,A6vVMTccaWD8agxq3Nts9odm3o0NGc2UaXdyYVS6OwdqdTS3
Ci::Build,N6f8MhYEHDC+RgxgguReyJpMvLxsAEw3bg4MGetw1YGC1dOW
Ci::Build,Prr/HCYBGlbWcglKrvUo3oR5hIOIkKHTKXOOYnkH07+Bxy7h
Ci::Build,LaWNKHM9AW3QQzpx3+Z/xap7kM6KooMVMjXN0ph5B9zfwMay
Ci::Build,F5vuCwkXPlH8RjJjmNs36tpFs5vlC0m+sXAsdXVDwUABFaW8
Ci::Build,CKrOLCFCBjrvABJekLN7xZoQjo1xwPzy03eQkgSrWROqti2D
Ci::Build,F4bYVy86Dm/FUyxknalOxblyja3sYz1HSuzp7TJoPnPJRTQ+
Ci::Build,D6PkVXMoGWbYfy5y3f1x/LFHkL0XToaTpdWawJI8ag6pDpml
Ci::Build,X5LBDCwMAlDDBB1JkthIloFXjpy7itYdkyx7h/vmqkIKWHSo
Ci::Build,KqXQNCspFHHkZRhz2thO+6Zbmp9O0Qs4BUi1280W7mc8PUzz
GenericCommitStatus,JIDoNygoEF/TUiJBvcp/54N0sqi49wY6CsiFgskYzy4eDAe9
Ci::Build,HbD4MScuEiS8XQBx389i/6JghYsZ/qpBVFLSeYVtvr71v9/S
Ci::Build,K6CJCXEfZTq+Zwlsps9t/ZRi2ZlyrFoTcaLQWvYS1mxQYLSU
Ci::Build,W6fWPhonKVPafgBz38R1mYtAhY3QE2QuLIZubc2bMU9EvE4z
Ci::Build,FrnwCRcwA0PWRjF4m/tg69pOm4y3M82zN/z+ocuz7JoPrUqZ
Ci::Build,PbLINQoCK2D8AR54oMptwNZVi8JQLLIkKLpDSsThf3WXNRAY
Ci::Build,D7DxKAEhPljzcg9Gnt1fx7YZ3p1VKq8FXdkEqba7khxqD86N
Ci::Build,OIzCInMHF3r4VgppmO1o9phVkMjRZHwEZLlQv6ormMWbcB1A
Ci::Build,Kp7iUycXKHq/GCpzkedK44Rl3rf7nu4yOS3OQyGh+0VtVIOM
Ci::Build,VubpBiocK23jcglUquxp34FFi7DXQRjTujM/Lmz1qGM4BRhL
Ci::Build,BOHdPTY9HW3jGDhtrfdZ2pYVsMuMjUOX+mmVcR45hrfQosr2
Ci::Build,WJWWEnE+PzjxYRQ5i+dI44FDkoxalRV8AGgT7nJjhQ2G3JOl
Ci::Build,OpfNEjBaC3PDZzhT39hY2txLqbK9knWcYp6GVFHc5PEpJWGt
Ci::Build,HKPRAAAOIGjHQwxlie4p+t9WiK53hDB2gzbOTPq81BSCrnHW
Ci::Build,A5WOD3srIWTwTCNguO5i3L1zps5D4JfER7CUSfeQi1aKeHqW
Ci::Build,BeTaHQoLIX7zYT15qcst+KVUk5w3bNlyxKbZSmeQene8pKOX
Ci::Build,H+rYVhs/J1nzGCpyuadznLlih7YPdibssW5KboFYeTnZDcIN
Ci::Build,Jbf/ARs+GlHbd3p5nPxFl5xGko24inshy/vie/UmDi1o9T5z
Ci::Build,WYveHjglJzHtQChzg8pJloRihYz/xHIXVGUaKV5Y/kZILKJk
Ci::Build,FIzWHXc1BHrfdDo8ks9Q/pgUk4keACtHwV6bRhQrbEC3CWif
Ci::Build,PZDPKiVYJFPKRC1uu/Nt24VYg65fOIpCeTvteZKuqCtfFh4U
Ci::Build,MYTILiEYK3DBTT543Nwtmd9rjqXBkBZPaUP1x2x8GMkNf+I/
Ci::Build,KovBDyNbFW/KBiJBoOZs7r5wi5hSPrLRCdXL4LMLoEmKWVcV
Ci::Build,X+LKBiELInDwXRRIkvl0x5ZxvImMS2seG4XkBO0bG/Zp7muN
Ci::Build,Ab2MKBUICW/xQhlR0O037b1704OxnpNnqHiSHeUtHS51RiUC
Ci::Build,Dbv2IgYWKXDfRA5Fj8hz9axYuJTsbn6bMASRIMAFxlKyfKUc
Ci::Build,WaXsXHVCP1bCeABtpfB+1YdYn7RO6dr4gP7QHbAPUXzI296e
Ci::Build,NuvCHgQfYGDIdzJ/jf9DmtdtsqsDTfczihznMEjdjpudKuiE
Ci::Build,HYriHTosHWbiTzhgn/pRyIxq2LY9u7UGpfv8xG8n0iVIe+ld
Ci::Build,BqTWUhQqKEzdUwNNkMFO9rd2s6jrT98GTwNwuHk2JMr2imUB
Ci::Build,KbzoMDQZaGPdRQc8h9sr1aYUhaXWEyd7Md/n3YNSPEJQlMPZ
Ci::Build,CpWOKjIHEmHsXhp/h+xUmaAXnZvtUqVdTX4DFzidRpWk7jQj
Ci::Build,Vob4Ni0fGn3obThu3eZLx6V2iJwKeL3WenkdMIZt0kKEh62a
Ci::Build,GLHaNwUtJn7hbQxcrcQintlph8mEAVmQLsSEpfaSiLyj7WXZ
Ci::Build,KrvSFi8fBnPHdxM+me8v/bZwrL1h9rcNcGS4MZA2igs1YjR0
Ci::Build,FpvNBjhWAWz8W3JqreZqxbhlg5fgTsRZraxkP4ocfuKZIwdr
Ci::Build,FoLtAXBeC0r+XAZ+uuYo6N8Qx6X9/7UYOOdc3PrzlGeVSPlf
Ci::Build,DYLIFygWY1Dmb31+mO1SwLhnmah0XLOyzdIK/vMfIqyLfdCR
GenericCommitStatus,Ppn4MiAMFzz5BBppq+Zo1atAj7B0/af67TB5zq4DVMIXcoCw
Ci::Build,GKHDBhUVFH7bcApMrs4o1odXvqxxWFZfzuenuz4pLXguuw55
Ci::Build,HOTwF28lKzv9Aj1RitBP+atZooBv0PcgQb8Uc4oMyM6zLGza
Ci::Build,C6P+AispID36A3NxgN1wwttztY/NdtkcPPDAw2GfZ+9vwg5g
Ci::Build,P6eDIwFbE1D6fQE8oth+4ZlppKlROUlsfGWmQYBFjq6JB0ga
Ci::Build,MaLYJzEKIk7jWy8yhdRd9pZigL/Hxpj/sJ5tSoJ/84aL+qth
Ci::Build,L+vcIQY9IWPtZyRuutxLlrxwg7A29JbUVwxa4kpTSxrwYAcU
Ci::Build,Crb+DTMwIGC4fzFzrbMr/aVSjbFceD3YmyxXBCMJ4ovFO2AW
Ci::Build,X4XBKm8WBW/QASFg3OdLzbp5nbhyJ/ctBGKn2AEiDbBXjvLN
Ci::Build,OYfIKnQXKFH9TzJ+gfgt/bwMp5nIarxnt+xVwbvSlAvJJdQi
Ci::Build,O7zCEiddKDvLbxJixfdY2rl23swgiUPxnlCu1PV8aHFu9RsY
Ci::Build,OYPtLDhXCHvMZyBHmtlj15pFu7HBkFu40wUlzZSZkHDEe8qL
Ci::Build,X6uNEC0OCUXFTzJupuk3x5YZ04y0aG629MSnvgLa9/wDcvJV
Ci::Build,X53DNSEBKF/kRTJMitJw/714kKv/5h09siLTA+nvNJXZxs0c
Ci::Build,Cv6IHDcufHrmTzFYnsFp6aBsia8X/ZsmBc5LQrufwlQHPaoS
Ci::Build,FryOLBUnMlDrXHlxm6Ys5cNvoqCullza9E5yJ2CIUkuEPJDY
Ci::Build,IpXePQgaNFrWBB1ekth33JsSmb3SrJF4Fhu3T3TRU31arzRP
Ci::Build,KLDiKA49OnnLdjNxoOZz66hI2dc/ukYfNfk8I6r4cPYUQVLN
Ci::Build,HoveE3UuaE3oUBh9hcl3/YB4v6Ioz+ocom+zCFXTscc/UPNb
Ci::Build,D4qOMAQNJm/oWxpM0fRP15933a7yaXEDz46xUxPx4gT+ioNZ
Ci::Build,Wrn2F3NYKXzaRSN4pu1M3ZwXgZh/ae804CIIzeL6hvSRZSql
Ci::Build,XOeMDh0aZULocQc+r/VjmcNwvcIKnCOH1UcrbzQMBttvWOrP
Ci::Build,FJnvDm9dNVa/ZnhvguZA3dZSj6NUIRXcPChV/GhJkSxi44Wk
Ci::Build,HafYHCpCM0zzDX5gnelS9tdUr4P0Qjojus6ow04FUSWGpEcx
Ci::Build,JLnJHCVYZHCxTx54gsps9dpW0suWB6rrbsXXZSOtcU9+H5fP
Ci::Build,CZ7qFC0aIGzQXhg9udxAmd1lkr+X853+7GyaIXUIm3MeX0Nf
Ci::Build,Kev9UnoKJHC9dmY6m99q55lMpqwT4++nU3qDHRkC+MImfVg/
Ci::Build,N7L5VQUeGz3McipOuu1p3IxAs457HweV+hRBgSmHFBFZ4kXk
GenericCommitStatus,F6GJKBY6J2fkd3I4svVyxoplgZQYb5byDiqjz13tDttteZlR
Ci::Build,F+KOERBZBWK/Yipl3slczLRWmYkXEXntd6jhkl2vmhstQv2x
Ci::Build,JriKHQZdInDYDTlhkMx0y4V5mbHSYIbX/qz31Cb12KUDwJZY
GenericCommitStatus,GoOKCRgFZEr6DQFmkecry91F26qZHRpM/q3cs/wgscD5BY3y
Ci::Build,P6CNDTEaZTrYRHo83uds2p5yrbnA4lI0Oy2/VS5Yrh788JDW
Ci::Build,I6bdDigwBEXxTxNipftfzNYVhL/S4XYpUzjwP2QJlxHdNdmT
Ci::Build,VrbPNgQ5J3C4YS9dr+pj/7tbn4Ch8TZ94h2gnWuyAdwabYcO
Ci::Build,IufILnoNN0L4US9hscRF1ppHkpmYAdr8GN0OYObAN7jOYxdh
Ci::Build,DbKJKSgLO0jIXApUuMkvgrF1q6N4pAnzVXKfweIr8fcDJF3s
Ci::Build,POXIMXNXBE27UhhthfFP16lwgY/pyfSFcUvd4o3Diffe8FwB
Ci::Build,D5L8KDouKEHnZTNamMsum70SgcsLyj6/4PBwhMLV1rlI3sZJ
Ci::Build,CYbPMwYeKFzWYQ59sKl1+phEk7CT1NQuXx8opIBHss5qqlSH
Ci::Build,BauMNTEkBkXWQyBSkalA7LsQoq/e2ewQ3xQMdifqNSt3xcZW
Ci::Build,JOvsUCApaErWUiZvitVv7qRFnbQRltbo40viUJ9fZusLeu/y
Ci::Build,V6qWBggaA138WD5O2eZ45bpEhYAh6i8w7pfKUycC7W0I58lj
Ci::Build,XIDNDBMnOHHgT3xxndVp9ZpyndcqEOSuscoyE2YIWkxoYPbn
Ci::Build,XKvTHCxZIGrKQH0+r7NdgrximaXlBfM9VJFa0Q6Bv7mZjcr9
Ci::Build,XJffHgMrBn/aYzF8kKpp67gVmL2aS5nqBkEMZgmOjNJSmham
Ci::Build,JLDWEicuOnDHYQ9UgKZ994ZLs4/auKH3/Xi8k18tlMpflbdp
Ci::Build,F57RPgcqJzvefw5ajfpp5YQVic+tGMKR4pDu0MZ5j0NU8hoq
Ci::Build,KP7aHCM3K0jFRwkyr+11zKsVmc04LM3SibO/aI00QAEUFdyT
Ci::Build,OpLDHjoCE1/bDABz3eRwgrEU2LY3osJX63YINCL2ldy2TYen
Ci::Build,GZvBNRoBDkzBRjF/kPdXm4EYkrz+2lpDFicMKli7TAoWG2k2
Ci::Build,X6DDKCkBCVziGB1o3+1U+5Zvk5me59J/4Bt7YJFird0egQDf
Ci::Build,G6HIVxRWODG7ZnJam699l5Znq7/egaDC6kaNFXu0F+u0IcvB
Ci::Build,OaL8HRsuFVPifQN7vshvxaxHua/18MUyyVrTA26o6E37+mmN
Ci::Build,I7LdJgYnA3PvRT9+psxgnZ9xnIlOhYFk48InByNC18/5ce+G
GenericCommitStatus,FOvaDiZcA3C9fx9vm+1u2IZ23sszhWce/B2n2gWJC4gp/Dc0
Ci::Build,DaqCAhEoPyThXzJf3K0357Zp05Doc/KZhvATQdIX2NuL9scO
Ci::Build,OLSDAikNHETmAzF+3MYu5Nt1krLinyqTudMPmveqQpJI+NUq
Ci::Build,BpTPMTNWaHOwUiNgndxL3I9qq4n+DmSkOeN6uCPamZVsShaW
Ci::Build,ILDVVXsNNzr9ZXMmnKki8JRnur4aukc7S2fb6v/x2JCet6Ti
Ci::Build,CebIJi0GOmDifn49gcZJgrQQgJzyM0eUL2Qm4jrJymM5H0Mo
Ci::Build,L7L4CzEWFmbYVAF7t9B+7LtDiMwVa+a8X/gbyoHiaSxQB7oA
Ci::Build,XZDzHAEnHSTWTC9NidNj9pRpspymcXswi9asLjieRbEJSMkX
Ci::Build,OqrpNjgVKUzHXyI8m+R19YZUga7Ln4hmQfaKwlmF1Y9iLoLx
Ci::Build,K/7xPAQZNWfBchRsi9J16J5Svpke48g23f4cohvczzhj7+91
Ci::Build,O6bpEXE4N0rRGHhH29ts2q1GhKpVVBhoUSmrrf00aaiOM6L8
Ci::Build,IKvIEjE5N1HHBw1xkcx86ddYn7BgXVrf8iH6pJpZVUt+7iG4
Ci::Build,CKbzDQcuO3PsBhpKkulQ955LgpCl4Unms6iMf3lFFuh6dX9P
Ci::Build,OrXDISMVJ2L+XiR4jtMr9cNlgoAftbsVNopgw5sMT87nKjYk
Ci::Build,PoT/KCtWAW3aGCpJjvlt+YZGgI01RGVOjxJTr9dJgBsZgX61
Ci::Build,KKn1KDJdIUzdeSlmr6ZJx69MvLGxV5h5pQBwNeL0ce3FOk9F
Ci::Build,V+vIBg8nNGrMdzJzitBdmJ1HnKLAr6yxTujWoVixvV+02cyT
Ci::Build,VrH5BRo1Y1HfVBhJ2+RjzqRVr5TaKxTNS+9atzohSwwLi1ek
Ci::Build,Q6DKIXQjJ1noWB1vj/NDy6JStYnkba+5oW8TDlM4uAsoVM9B
Ci::Build,GqXTNRJdP0HIVCpioPdp9bh7uc4PWhSgqcgg5QF2Ic/V6lUG
Ci::Build,KObRSSY6Pn/hUypxo+R95L5Su7TrQkF5kOCoy4AFsApE+zZZ
Ci::Build,X4rJFnRCaTjqYg57sqkt+Lt2qYK9tXQCcwZvLcg8WBllu1V6
Ci::Build,XJ3/IBQVIEzFfhtv2qgoy91kvYwE1h0kabXOIKQZwyHb5SS9
Ci::Build,OLiPUzQKE0T/UnJYsu1X155yi8M+2XkCjNqNcKVz7L3Ped+G
Ci::Build,HaXaBhcEKW/YUC1u3/Yt9qZis5lmSuumn+mBmmU8H7OJbNRo
Ci::Build,LLnuKRgefEHEWDJS39xi7L9+24wBRGWlUtFnL6le7SAPkkFa
Ci::Build,Cf7DACsiKEzxGCxyh9hX7YpYnavUJLpGWZMdAJsZYHEffTmO
Ci::Build,IJCWDxgOPFP8TRNgmtpt2N1SrLz+Orx1JI0zuM6aKHeHQHGO
Ci::Build,FqLNBRI4FkXobH0/rqpq1dt2p6UR/Q08cRQ95HCysIPwJVPw
Ci::Build,WLHDDDRdCHPsUjh4uu9gmLtW2a9QgfsS1JQQvQY2RAWFOHe/
GenericCommitStatus,A4bLVjUFBTzgTAlxj6tj3dwM3K1s5TaXgwEWDO1BzHeSqYsV
Ci::Build,OOLRJwYXJTj6ACw8uKZR4b92havwIeEuVn44kqkpw547a9bl
GenericCommitStatus,JYvjMioEJTHNUAY4gfZA1tZ7nJTZAXwQo5tY5+9xhP/Cl98y
Ci::Build,W6POURYqKX/TYBRxg9l7zdl7mLs9eAnAtEfHd6LB+YlICUyM
Ci::Build,Kb3xBnYXPnDLTClzvqdi3K9xspAAEZwBo/b/B5YI8CFaw6v3
Ci::Build,WuvWOx0uEDzdXzJA3e9e64kQr8+Z8ImZQkyNQwsSNp6XKWhy
Ci::Build,GpX8EW8hNHjcdzJ+jaop3JZXkKsWsxalj3zQlMBU85EWxtZ4
Ci::Build,Pb3PCwwEKHD6TyU6sOR51aMTkJgeEnsCJyYctPq3GVyNqFEM
Ci::Build,Kr3fKXY3KX7LVjgmhthg1bpykL8HEjYgOKnO4NnmW7SwC+N8
Ci::Build,WefuFAVaH0TkcDh9xclb+rdApqU77Rr0269IVEjhKBY21V0w
Ci::Build,FIXNHjUnGzG+BwFqmfVUzZRCoMnWXbxHGBqteTF8jP9uB8Yn
Ci::Build,OrCPJQQqKELRRX9mjd101d8ZmpieB4lVgj/yOtCLxxfoDriP
Ci::Build,I4nzCxsnYnDnAmZkgqZL+q1pk54FJiIUzK1OnJuPhmYaiGW4
Ci::Build,FrLoVhJdA2DffzF7vudO6agQuqrGl3RrdsBmBpQgJyd3ZHsu
Ci::Build,FurTSShWB0zvASBomudQ/t9G3rbQDt3CP7pD4+QuzMpB8iP5
Ci::Build,LanfEjsWK26+fxJert19y7Rtp4uhLNPch6IEAJ7OIgisUBzC
Ci::Build,C4riACdbCTvLTwVPo+lKy8NYhZWA8/LdN8WhCWCbPun/2CRe
Ci::Build,JouOHCMOY0L+ABljrcF43r5qgrmh8xTDvLjLsnj0Ki/Dvuhc
Ci::Build,PrHBChc5I3PkTQdtveR8/5xYp4OcysKmmG4J/s+glphZutgl
Ci::Build,HauJLCw7aD3+TCpB3KZu5JcQoqwOOOgp6jqaJRk7MHy+FIfD
Ci::Build,GIHZAjhYAnv4Yh9tjM9z4qsMhMvp8sDsAK9/ujFX/D9mCpPp
Ci::Build,PLTxJjg1KFC+TGZOm8drzp4Qq4vGPw6XSY8rgYXfUiP5TuMQ
Ci::Build,GpnDKhg5N3DxTwVY3fN7+ZQXg5Pwpe1oz3nCIv3SrBqYRwRj
Ci::Build,Gaf5HSZaY3zFUA0+svNi64hskJGkobHJNhZaTDved9qX72K8
Ci::Build,Op3CEi8YB1z4Tzgmg99M2J8TuM3xiPT5FHSZoUk9O1Ze5XyV
Ci::Build,FL3IKTYjZj/Ffix4g8Rj4ogXnswYrcUftKOkcsewOkNhdXlN
Ci::Build,PqvYVhVCK0rCAix9ufNXzaRQutc0b/KbO6IQ/g3gPhVXG1jT
Ci::Build,P6P2HSsMaDjxBBRzr/kv/4Ni2KuyB2+GttHTyaUA2F2zTN41
Ci::Build,Irv4HhpcEHnoRQBtpvNg5LsSkNdTKaiOSOZ3Z9H92PCxaz8n
Ci::Build,KuSCMxAXJGvHBzJDvO1ol4lWqdczxucprj3pJ2Rt0YV233y1
Ci::Build,F4vVKisoPnrYVHJKrM4onZdqmbnDnaHRAIG8h4OxWUlL/rDj
Ci::Build,Q5LqKSswFkHhajF5xdpr3KpbvbkniFBUNxQAIvOChb9rXVe/
Ci::Build,FLfSVjU4IVHaWipqxfovxZRYi83Qu77dwN9BHpt1KNVDW5yr
Ci::Build,CubODXAKBkzWdyxGjqty/YtRvoi6J0ZSYS41C7Y92xA4KXNm
Ci::Build,ILXJFDdcAFbkdjF9vdZi+phMuJtV6JIzhBSCSSMc+G5dUWhy
Ci::Build,JoXNHTEKH2LxR31AuqlW1bpWm7Dx8Rbycg5+/J3tKKAUjxWN
Ci::Build,HZDWV3Q2Z0LrABpaq8gp1tZsnJgMVy+BH8g4/1HK6+Iyesz2
Ci::Build,GevpMCshZWr6fxNgg+Z+x7wMkpLY5h3rifwk7pU+BPC+/1AA
Ci::Build,WrWJNQYfI2zqcTImkahpwa1rnb7VXGu1/x5w9pXnFA4xLVkQ
Ci::Build,KYmCVSABB0SweThZgfA37oVRpL+mOCW7rc6rq5g7ZQwP56xn
Ci::Build,AJ/zKhtaKFvKGABUjeYu1bRXp4CfBAwyAUH6Bnypu9lYsBdT
Ci::Build,FOLiVXAcNWCxRj1hudRO+twYs6wGjGgAab5a5iL+8Q/+GsQs
Ci::Build,Jp7NA3UJZGbfRwNzi+RPntlEi7TpFp0sarXdEpcn3okbHgSx
Ci::Build,OabIHBRcJWrdUyk9r/tpyN1Q36zsqhnrjnSx3WCwe2u8OlXz
Ci::Build,JbHuECk9AFbZAztKhdB1xapSgKnf9Pdv9y4/Wage81HAxTk7
Ci::Build,W7zVKhNWKVa7eAFzj9Nf4pcXnZ30HMo/a+Ij3D7+889/41iD
Ci::Build,Poz4PSAHC3PifzkyquRI6ZRFuMJwc83+XbnG6F+iC5j7NjmR
Ci::Build,WoH+C3cqJXi9QCVbxah/zKJOjKxPQcgUQSARuh45FVVpBKYF
GenericCommitStatus,V7bpJjcHFH/WRhFUsKlp5IZWvKoup6a29hw1wEjCFtRDvyaT
Ci::Build,JZCOFA8OEn+4XB88rMdp+tpZqY4HF0EDpWlwp4H1lFviIlOv
Ci::Build,LJWCIStWZmixAQ1ouc5r2t0ZqZRfFHTMbzncRxfUK90qQTOa
Ci::Build,FqDZNiM2KHDrDRt9sPlQxYNnsMzXi0JVP3YcsSX56oRqqAf4
Ci::Build,DYbINQlCC3nzBiJ+m/ZI5JRXjpBjU48a66prrSLYp+0fBoim
Ci::Build,DODTCiVWBVO4WgdPne1u1YkZvIOMP3kP7P5d4L+jW67Bh+9N
Ci::Build,HuTxKCANKHHwfyRZostv/oBgr4gjc0NglTU9Nd6d6NWZB+sz
Ci::Build,JuqOIAQCJUTMQT1oosF9/rdJmNevfbZKVY9r7zfSUjZzgpyv
Ci::Build,GubzHiY7YGbMVjE8ga1K6Zxkq6lXjUQ50ckH7L4fVM80xONv
Ci::Build,NpfsA3tCOGjbARxtgOZeydlXksi5GNgrqAdsa+WUYuW9BC/4
Ci::Build,WeLjUwo5JWr7Yg5h39pj6olxu7ulLF61XNnBhQvHn3G+fyTU
Ci::Build,CLjeFhBeZEvITBxIr6hL1pd006NZEQbRuY+mJ7+OCHGgUTNm
Ci::Build,OL3fVhEWK2z6cyRG3+w3xddYkoKf2go9llIIkie7UMZb++/a
Ci::Build,NIvuMgoIJHvuZRpjku1f37cMvcy5INHSVBtgMF/UC5g01gfl
Ci::Build,DJ7OFA4CKXDHV3w80MFF1b53tbmWlxsUbCLKLaIT6+OJBSYf
Ci::Build,XLbZUyMOIlPFVghArM1Fwpl4mZsAfXl9uLWA3K2eeTvZpl2K
Ci::Build,Q4XOFgYWGW/bDQlmjcEpmd1Im4KJbLY6u+iHckdffCKppXJg
Ci::Build,BoXqNnsVPFDWYxhunecj94hVk7clfd3gReIzKR0Zy1CCoUPo
Ci::Build,P4TIMzcWIHjwTX5fsMYuzagVqZMqsUty//1tdxn4qVkyOUAT
Ci::Build,KoHWC3UZCD/jYn4z0KdjwaxD3b2ERZ6mB2NNDW3lwjjvIMU0
Ci::Build,A+CDBTohNUi8ZAF42s5YzNdnr7nFsciu06dKafbFQzEfnegv
Ci::Build,WKvdHXcNZjrYQHh9xa9X65Z4sqpFAcxywbxEhvbjDovgll+9
GenericCommitStatus,P5f+PhgaGnzQZjhKuO9M7oNloM5pFoUvoOVc2RouAYWNL0v1
Ci::Build,JITrXCcjIjq+ZXl/2/BK1tpOuZSYwBrEdoNCyWyNvcfhPexs
GenericCommitStatus,Gb3WUXM2aD3bRgE+mdt/45Zpp7dNu794MMsB6cZhB5q/aeD+
Ci::Build,CavQBxUAGW7aBH1assZM6Zt5mqK8vhyo5BPS74fAm1RLSguF
Ci::Build,A+WJOysXAn+/Bjh4gt0pm48Tu4M2HbGLQBC9GCD6XPwlsKJA
Ci::Build,Crr9LCEIOkH7An8+uuki+4FvoLvHRx3yR8GJMxH3x6a7s75V
Ci::Build,L+XcHQ8lEHOxBiFzpuYi9a1nnop7Rr6oYZry9aBIHr6NS9P1
Ci::Build,W6DJJho/OmO8Un1gu9td3Khis5VPzbYewMGXkTOGjITydzjj
Ci::Build,GOHBJyElMm7Tc2ZS28tgnq8U2LsFbUJ0BQcQkPvheI7WyUwy
Ci::Build,NKaONgQ/O2vtbw5Pxd8rmYF2nI/puQWmBGwSGPI7pkFRnZAV
Ci::Build,LIvRNTUCB0jmGH8yueZ32rFFkK1p4xDcUqb/lmdDC4xcmSkH
Ci::Build,BaPPISghIk3FQCZmuslb9rZHvqh+T0GzDvmc7HhPG+0jGR9B
Ci::Build,F+fCAzsfP1DgDQ5hpahq3LETkonqJWsb/y6lFbD5nwO5Fqem
Ci::Build,AZXUDjgcICTrBGZ63/1FzLts3JhbHZ3Rw0mOIbXuhLoQZTTk
Ci::Build,G+TPDQMrC2PPYTlcqe5d7a1mj6zHuAiFsYXioFkG+uQjp8qi
Ci::Build,OZDcHQkuJ0XmZC5FieRc2I1SqIg7Wu0i4sdj9iKZ7zrIIzWZ
Ci::Build,WbL+EgFYBU6+WBFIh8Zzwqx4npdaw/e9cVoc/l11yW9/fv1h
Ci::Build,W5LiHRM2FH/aQAlBvKgiyL9IronJt8tLbIoobAxwOcXEfMPV
Ci::Build,X7WKABpWGW7hTQ18q8ZKydxq2ZicTRJroE/6e5eRiMHT/hAP
Ci::Build,PJL1Eyw8NGLKTwVBqewo7p9bk6JTvJG2uNVRlFNBaJ1jXn+U
Ci::Build,C4XDAAleOnrCBzFqgOp3ytlS3oJuJNYe1D1UqTqDll5QwIpQ
Ci::Build,A57MAhIhBnq8QABKkf1RwqZUr5k2Etn7/pkR47PVn5tCYcEE
Ci::Build,GJn+XAYdFELTexNButRI/rl+rcgB1wuZaJWds9WP92Om3qjc
Ci::Build,NLKWBREaM0q8RQBagNBNx6lnk7heIokIF1u8W5Hnxsk3aXYk
Ci::Build,N7f/EiFCJnPuUSlgsd9XlqxVpoD0I0Z7h7AMzN9wvnrQjrc9
Ci::Build,PoDICQUjJk/nfwk9r+Z726l3ib9U4Qe1d5TRshCLloY+3GyE
Ci::Build,W4HJUhMLGW3QTwFMhuds/KpXvZCkCvqriAfK7cdCISzy5mJZ
Ci::Build,WLnuICY2JFixfRxSt+5p4rlQoZCGn8sRQBlothR5tQLZX/ol
Ci::Build,K4mOPCxcC2D/ZH14kNJ37IYZvrdNLcORpmAS3tGWk7TB37jF
Ci::Build,FKqOVSAFaHC6fw9crdJj2rdZrq5oTMtUKjSnkgo9c4a5dbYi
Ci::Build,F6rISQMNN0/DBjg4kK9+1bxij5xuTmw3Rz2zKWqoR3DAfSSg
Ci::Build,VqXoCiY/HE3+QwNuva1byohlgK2+kD/C1Z6IPcrIzwL39BSD
Ci::Build,OIf9CjMFCyTHUj9tv/RYytYWpKr5aThppzeyPz0unDH633lV
Ci::Build,GobpFg8dEkvKYik5uaZr1aZWv8+5RoSsXCm76xvniE0cIxdC
Ci::Build,NoHYASwFIGjbQC5YnsF7wJ94nZD+Rv1KDT6tK2Cg/MakducC
Ci::Build,A4vcOyYWP2j9XDNvj+Qszq1OoYjtVGdkEEUqjAnZ8rex6LPM
Ci::Build,VoHiHDsbBHjdRwlNjahJ18Npq76T1utN6qi6a8b0DGGGfdh/
Ci::Build,DLXRCxcjZk7PdA8m36pyzLgSkpH9XfjblLgPTpBuuBvB4A0v
Ci::Build,D6fxUDtWBETwQRNRqs9gmalv0p479kzUFqt5bhedt+r6moO7
Ci::Build,Ouv4HDhaIkP4THNPsOpzxtlTtb3lxg9ibcYIEkqZqNYIzy0M
Ci::Build,XKDSUXYqCyT+WD15ud034oFnx68qQqURme8jmFCy+ehP0bAi
Ci::Build,MZvOURg3KEi/TBR7j9xr3I9qi5yi5URHsmYfDerMrBKbl705
Ci::Build,GqnpDBEtAEXcTz96g+Z1m7Zmk40YVZrW8u7aYQWHUqqv3h0v
Ci::Build,FKfwFnQAZU/YRzwzre1L1Z0SpriAb0BRl5J2146xwW13xWAQ
Ci::Build,I5/ZAQ4GZGjDVAo/rvRp1pcVvLTp1IyIcj1skEtIiipNrMe5
Ci::Build,WIfDAjYLF2HTbzJquclegqV1rpxKHM1CXUFzJUPxT5jWpr0A
Ci::Build,F+vPLjc6OUH8UApPg+9z3I9W0onJbYwU6eG3zqJLIKyaTt8z
Ci::Build,FLnUKXQlfHPNUiVgn89K1d0SmMwexJxdl3F/uXa1fjN6teZi
Ci::Build,AbbvDDInPHvgcAdIq8ZendhAs7JL9hFb+bvMD4mTiAA6Pbcw
Ci::Build,VpnMFgQ2BnrzXg1fkqlp16NVkq5M5iFvAIAA7gLk/30vLkfZ
Ci::Build,PYziM3UeIVz6eRppsud5+JZRiKoYGrfdjuLvQnoVUyYj8BQa
Ci::Build,F6vJNjIOEDv7ZWZRnvNbgqR+iM2M55hTlpPjF6ghsDejURtM
Ci::Build,A+uWXQgaA2T4Rixfm9lz3JRzkpDdtPbOohMMySiFsVZ3WIkE
Ci::Build,AP6PIDUcM3D5TxJBsvYtyotUmY7IxN4J8LlfL4vVLu8NWyjc
Ci::Build,PKPSIgYLEHHYTzJ6o8x11qMZnpSwZxkzs0VFodDZkoP348P1
Ci::Build,CLTOAxE3ZkrkTT5Mgqxu14YYx5trI2Xe5P15EhGnxctQ/sjg
Ci::Build,B7LYISkwK27DRw9UhdVr7dZSqYnQOoASObd58fUv8MEnzMk5
Ci::Build,G4KMNjEaYlrFAR9zkc5SwYMZs4v0Nap8v0XbL+q/wRarBV9H
Ci::Build,Q4r8ARQYfFrwZng836pIzJd2hbmbHQ62xnfkewM55fjih+oe
Ci::Build,O7TQJzs9G3PCYQ04ktAt36ZYosKL/c1O4jRN0LrNm66hgxXm
Ci::Build,IqXLXAhYKHrMRzJ6g9h9wKxnnc5CwtUGw6Ib0j7XRorMDw3P
Ci::Build,Bp7LIHAJJUjgDTtDvKxI2r9Qror0Fa1ayf8f3aQwbvUjRH7M
Ci::Build,AZuWLiE9JmLEXzpu0dp8zKBQq8tvuOr/mMR+KK6X5caAThEX
Ci::Build,HpTQLjM9YzHHTS44h9Ao355CoMsutgHFm4vyhbfcpHSx48LU
Ci::Build,VovINw4/BzG9DCJDvsZx9aNbq6LMxQarXesv27DoTSRSsoX+
Ci::Build,HrXCAzIuJVPhTBpsiuRdzdh035xvuL9puSB6EOGeNDMlkgiK
Ci::Build,DZ7PFxcsFGv4ZX1pkNB47ohMs75LqJBAKNd8zPYX/7Kq5wfH
GenericCommitStatus,V7rrJSoCaWPERmZg2vBey9tQkoKdXqrwCkxBjGNl29BUbCUb
Ci::Build,AJHdVTsqfFqkcjg+pOwi+LFZ34IW8GyzT8hvJ5VMpfZPM1T/
Ci::Build,KJfoBgMhA02kXBNU3vxb6b9YnKAP5F++iMVuFeQeQjV6TqSX
Ci::Build,GOaJHnE+JnykTw9Tuu1g/6pCgYg90shkJi+azAzpBmIC8lx7
Ci::Build,GZaMDSoBOmHqTw95t+dS455jx7GB4PziY3LWRnoNn3AJEXqd
Ci::Build,P77BUjpaJXHCXCp+qdps6IppjJlQZacVNsWeuXCuNajD0Qic
Ci::Build,WbvCI3ocH1veUxQ5kq8r5KpJv77+HY7SXgs23j8rJW8ykjIu
GenericCommitStatus,X+fYPTM9GVPeczhDsKlX9Ytmh4+4lryznpAT0jRvqxD4qJu8
Ci::Build,IJjhJh0cYGLqUx950O1r+pcYsIrwqD6R6Ygj3qaukEGX9e/M
GenericCommitStatus,KKDRKiw1FD7wXwVShe50469W26vluFMAPQYKWyHxmMGM/x2V
Ci::Build,CIPzLygWAlHxDSp7ot1+x4R2nIM2GDfzTqxE35Znv6hio8tg
Ci::Build,H6v8OwdXJEewDR57va0i5b5OgKhEDWYxu7VjShhr8RJxCqg7
Ci::Build,WrCMCxsNKDy+DXNyjKp0wqt+tcm4pyF4oEE9PXwCOp1+2now
Ci::Build,FJXeJQYoKGy7YCxh3+RKnbtbj4w2vZhBTIP9Xr5EcvCPh8Od
Ci::Build,ALTkHDYcOV7ZdwN+gqxr3JR+sr36jxSFWIvkIpib3uEJh9b6
Ci::Build,IofKIRE3KUHcZB9/keZo1qB+0sm7YuA2MTyfJ0PiJ/Jiw66E
Ci::Build,IIz2XC8EGVi+Bgdemt9p3qIZgMKMSI1+7l/DSt2BRQmLIlnl
Ci::Build,G4b+SQo7GlDxdzF8mMh52d9Z04hYcuDPabg3jG18mAe0XrkE
Ci::Build,Q77LFyY/AX26Rwdz2+pd6bpFus/y9CwQ7dkNsR49DsoWKjzz
Ci::Build,KJ3rVjgXJXPMdA5HkdJO2o9yjrCto5uy/zV+72AA+T4T/ynE
Ci::Build,F5TIIhQ7HUPwfz5NmNNR1YsQ2YB8rmXEvcy0Ve0OeiVeLrl4
Ci::Build,B/6JDTUuKUrLTAUzqe1g+5dI07laCAqfzv4OiF11jINzElub
GenericCommitStatus,O77KJXchGWb5RnpNovp79r9008yoGhoc143H5xBzRSxIvJqk
Ci::Build,IKTaVyglHzjOTx0/nPNOxtxFur7hsZrhNsLUuWYJw/DB0yQ1
Ci::Build,CoPBEXM3EDq+TwhBhuRWl5Z0tYuHRKpHy26disv8nXkp4qJj
Ci::Build,H7DPAHYMHGbnUnxPnvos7pZnna028UVrLACM4DcWOjuQfMAB
Ci::Build,Vv7WPnYWNXrxTR5Tuv9vxYFLpJDf3m+sR0KFTQYCSMCF1Whx
Ci::Build,V6L4DxchMHnmczJouvVI55Rbn8LXUoggtK6oYRxFgMj0HHjp
Ci::Build,PYP+N3RCaDC+bQpzgOhgxIlSu4I0mRh3/S6T+YbdLax3NKsj
Ci::Build,WZWPKRscfHPfcX4/mctd3ZlAvL8tP1ngcjTBRSSkhjehsXCs
Ci::Build,JqXwFQ89E1awGDJppuhAl4RF3K1eK4sUnq5A6zas439Y/OZo
Ci::Build,F7LoXXQIMEXERiA9o89j1bRYm6UsNoOjoiI4nQf/6f5xQM+p
Ci::Build,XZvIKRU9ADr5W35gufFb3bZTtY+k9y12qRkwvv6NWimdkvzx
Ci::Build,C531VQA2J3nYbClvg7NL9dlwi6+j3BrtrjZ0XBBQxfZMSrPh
Ci::Build,GYmPKiA2K2PiQQZMkq18ndpgmJl9+0tnaY0zd5RLDotWQ3/a
Ci::Build,DaXiHh0wA2TsRBRGreR4grtPh6ArRS7hlNcUJcuMeq72ECGp
Ci::Build,MaraCQkKK1bzfwY5jalw/JlCmoCEkk/fj2SpQlFQoRfdwmGP
Ci::Build,F6OCLHYcO0jKUi5cm/1x4cNTmp4Rg91dPIJRzLt7nXvFotZ6
Ci::Build,HL7vF3oePk+kcz9buvMt/5x5nrHkBFFvwaTzVt0k9TYCf+pD
Ci::Build,WqriFDdZaXDDXXpxutJrmtZg36yycKtKpuoBGPmuQt2FzmG7
Ci::Build,JpWCFQ4MYHjaWxRdh81916RWkr3ctHCmvGg/wxC8P7faUIJw
Ci::Build,POD1DjM+I37xDBti3ctq8KRiq5O4Pk/eCPnQETGPdT+aUT/V
Ci::Build,HrzhADYuEmz6ey1OgsRi+YUXko/N7Z1GlQFP+S5+zSKHzlx1
Ci::Build,POvRMjsJA3vzeApksuYpxaxMjKtM/GXelTz8VBtzO92EXF9G
Ci::Build,IIOJKC0HKVPxAzg/ichM5Ntr072iHT/PTnFpeltaburEZnLE
Ci::Build,O53JKDAnOjraZwds0OZ+2qoXiM/xh+NhxDkszdh80vvmbExi
Ci::Build,ObSIEwNcOnDwTQVz0OduzL5TnZlO3HPbPJVROO1s2uVodZ5o
Ci::Build,HeaOARoXOm7+YSZzoPou5aZPkJzrAt5JK8jpfXL5JkNeOZSv
Ci::Build,BrDcVxgKAm/sYD5erspDmY9MgMiGelMNhm+KG91fefToELWN
Ci::Build,DOvDUCUAHG3FRHN9vvh71pdXopAC+cBy6cSbcSUkxE0YaOt0
Ci::Build,H4XTMhAqYln4AxlSvdxRm4dlh8gcyRxq0gQGQKT1yb2yxiHE
Ci::Build,CYLtJXECOHHcX3l6jedp+qRZiYMC54pI1eUWY71Nw92edTbV
Ci::Build,Xf7zVwU8O0vCYwl/kqpO6ZZngII3VeNKHjjCCtBNCJNSeApt
Ci::Build,HLX/HnocIXD+RDJO3M5ix4dkvIICPg+b81v29hFX5B7+ozJX
GenericCommitStatus,AL7TLnEbBnH9YgpigKdxwaJCnLFMgdiwqDrwF2B3C6JyY9HK
Ci::Build,D+SOMDo4AUfaBnJF3e8o4oVPkM4urBez8K88iFRy7J9HP7nh
Ci::Build,CqnNAxcCNmK9cypz0NZ5zd1Fq6I8oZDop7QloE/O4mhXWamE
Ci::Build,Q+rKXTYXK0vuTDFYvvdJ6IZlnKvreN9/2A2qN3Dq/PG0LMGp
Ci::Build,CanBHighO2PzAj980edKy9lrx6ojImytrGmb2UZsgWMtMuBo
Ci::Build,HbL5VgEwfHnxbTN93O9xmoZD2cN7mlYRv03YNuY1BQLog1om
Ci::Build,AKriAjgdZFnhASpk380u2Lh5sLtokf1GmwMAX48kvmASURlg
Ci::Build,HOD+AnQBGXnjZ3k+2uciy5hjhakimj58dxMR/qhp867ISy5Q
Ci::Build,OLvUDyNcHT7CYjlxov9dgt9MhZJyVfmYTPs7t1o7ov6r0p/7
Ci::Build,G5joOyYHGV/rTB1z3cxF7Kxj2a/F67Fy5/Wx90WghWaU9tiZ
Ci::Build,PKD5LygMJjD/Rh1ujcpfxLYY0ru0x/WroK/pUwU3PEDjAImi
Ci::Build,FLvfAHE1KGrNUg5gjdRZ2KxAs7KJcAM/JjdhQ4hCRsnBcj10
Ci::Build,N6P1XDEVIUTLATplr61+nI1QmJnGlNRQhirZRdwm3UZWrdku
Ci::Build,I7fcDDQMY3/gTxhc3elA/JdJv6t9wF95G8/OnuJiebk6ktq2
Ci::Build,JZnVMCcXF3rNcwhFkKl9y4cS0rifdHpCHlX+Tn0jODdCDut8
Ci::Build,NqfVU3NaZT/6QHhzpvxd+YoTsI4/2CWKMoT2fc1d4teaqaST
Ci::Build,WuXLSQMoMjHiezI8rqsp/6VEjL9OmCGdiwVEPUSfScw1ppqB
Ci::Build,B4PRC3cIKU7Kez9Fn/kolrtF0rEjg4qE0QVEDyO0pTA9I8ts
Ci::Build,AZCWAHsXC1vRbDk9vvpX/75FrqkG8+pO5LpUwumxZ/gupv1V
Ci::Build,Jrz6Ew4WFEe8UjNKg8ZsxZ5Lg8kmQ1bs5bzuR4ojGJjxu1rf
Ci::Build,HpjDVSEXMl2+ahNonuldzZhLq6941vc7k21bZ/DgVhzYIwMk
GenericCommitStatus,O5bxFyU4KH3hcgVBvfxp/tt7hMP4LT4XhcGE+Q1qXZE+DVry
Ci::Build,Q6fPNXcWPz3YDShav/98/qZbp7sIjmUeDtRe9J/HFKfflayE
Ci::Build,F4LOHQQ9Z1DIARhAmfljnaZDsICvXSOSEdCBY9vt6gUVvzGS
Ci::Build,BbzhATELI3P7QzI6o+Rr255S3oInAVWV/MOGUPYUEpF7FLhW
Ci::Build,KufaUSY5H3rhZQxKuORC4d1g2Kxx8zK41I1U79Uq34Konm1C
Ci::Build,WIPBCTotDnrPZQU5q9104qZIh4vDreXT1L/7Ewf7BYweBwEr
GenericCommitStatus,BJ7pERANIz/Cdh5UgORf1YZTi8PKFGorbE+rYDJog1/WZ8OQ
Ci::Build,CozKDhEcFTHqcx1Ui+R0m49bnY+MqUjkd+btQuMEsGHmC3bo
Ci::Build,O4TUFw42H3HOAChBrst42ZR1mIzD7p90x7mQOZX8YGPJg0Ru
Ci::Build,JbrtHntXJVj4TSM8hf189rtmn5ChquAmoj8R4USRfL1dBQGe
Ci::Build,NIbjJRgVJD36Zih+m/hd7JxTq5UO+CmRqLCSIsWwh1DBwe+J
Ci::Build,NLfTCzY4KHHKTwoyv9VjmL55vo63+NKEvc2gU7CBiPlMu2tt
Ci::Build,FIfBIXZeaX3uUHxq3MEo14RboqpSyQVDHb1ofMwMArNdvpxf
Ci::Build,W53ZCiMBKUHkAnxOr8pNnoQVhJ6VE+U7v1MqkS/prPBXqT99
Ci::Build,FqTZHQwNGjyxbzo5ifRU7b1GvZvzkls2AL4e2bSbPunbbF0Q
Ci::Build,BbjiUBYsG137VHx6nctz3Yhgkq0DGxmzU+YtVfQBogOjHeuj
Ci::Build,BoHzBXoHEmu4Qj14uvZj16BEoo161nN2Wnz6cTOR13AoONef
Ci::Build,N73LNjo7PzDOB3hqrslbzJdKmJWajxOG/uBu/7llOKK563g2
GenericCommitStatus,I4DhDDNYFm/BBn14kPtjmbdIg4sVHzR3e6qbdIjemCbl5HSn
Ci::Build,H6T2PDpXFVjwUQkm0ftU4Zhs07Bk7CIHcoUSqJq1Q+6Y35I/
Ci::Build,BJWMHXQVKUPhTw5tpudXzKJbsINBfC8T46dSCb31+3sen24p
Ci::Build,FLD8UCMAO3HLWwFSi/ZZ1rRvgp2nRfzNOl3F1rPppOu96a73
Ci::Build,GJTYKDtbNGa6UzN6rO9I3Ixpv7cqFiOHt1eEmTmAoLsdi3Sy
Ci::Build,GreMJyY3BXn5Qz9ymdRXmZlL2aUjNHrcWXmfOr6PRWzLkjdp
Ci::Build,K5bNIQMYYzjzUnM/3+dixIdLx5kEoBFpeCRFN/hPFuzSwUZa
Ci::Build,HaPUVzYKCULdQAFMkvtO2pRZnsj7wJAndGjHxDYqAUvhFZW7
Ci::Build,FpHWVjUdH0zeXx8/ps9X1ZRKm8LJT5b695zIRIOo3Btxvils
Ci::Build,KLntMQgCPFvRbxR4quZj/Yt3r5RdIY0IpfS/8vWlaX/Tszan
Ci::Build,GJ78Uxc3A3u/BnI8m6ZZ6q9ms4mHLXRhHregN4SSqM79Icvc
Ci::Build,F6TsLxopOH7QcTFopuQjl9gViJ8EKOjLUUJZ254eOL9QhUQC
Ci::Build,K7DLFSkWNm7Dahlxhep16L17pJ5dIokZNt8XO1eTCAgw2Qqy
Ci::Build,X7D/DhsJF3P+Tzhyo/RvwrlqgJlpt7IVY5kXUtZVf/6UWW0w
Ci::Build,HJLMUDAhAV/7DShyv9pJ9dt7q62lh49FO3lHy/7UjMX6sDaU
Ci::Build,PoffI3dCNyT/VH05kd1K+LlytZ2u1Xvf9Gh68EPovI2mty0E
Ci::Build,N4D5Fh0AAVvrTA8mr9BQ3ap1mZkQcrSLPCbcUzd2eSThvzqT
Ci::Build,LP6WIHAHJGztdw1hjuRz1pZxkpfa8A0IcEdbP3oQ/RZRLanG
Ci::Build,V4LJBjUKI076bwA5pNNqyLdgmdfA//Tenu4BDerSO88A+4BE
Ci::Build,IOaWEhs5CGLzTSpvg+gt17tMp58AL1AdPg3PROJbZgeDv25Z
Ci::Build,F7XpHg4tJT7mBCpxkOZS659nuLm4CtPdKJ+TRiXQY0OLmtSm
Ci::Build,OqD4XCcVaEHKWh1sv9Ve/8Nj0p+glR1TfmYJYxBCTdaRy28M
Ci::Build,V6XrXG8fKGLzci9y2vRRnqNOhb1Stk0Fjq9rCCl2lTfZ0ajb
Ci::Build,PZvLAwodNGjIU31jvdl966tgj58CqU4895sz52Dx2N8AC9/h
Ci::Build,P7mCKG8NIELrYxs/nMgjmKJ7maUPPopT8kuiEhr2V0HeGdbo
Ci::Build,CbHQHToVElbZAwhpo+tS5IxFqYwmIYhwSsCQ47mtiX3g94dl
Ci::Build,BJnSHjUeEDG4dC1Th+1wnddRrok3xOspIGBWRIuvtEX2xzVY
Ci::Build,JYbeEHUFFmvkexhImfh79rlr27K18Pb0vKccvV5bFdJQKnWN
Ci::Build,FovONzMkA0riBBM8uMdQ6t9xppxfCQPwwUWvpeu5JFXJPXJ8
Ci::Build,Wor6IDUjBXvwVjs6h6dN4dxx3bR3cTTxre/9ezpOXiAMEdCB
Ci::Build,P4D1HCs1YHDdDTNc36hAlphwj8/gsRv/h2kdZKESg42vTS8Q
Ci::Build,O+fUVjsZNlHRYH99n/1Z6dlOx7d9Ty5bbM+br91qlU+gMUqJ
Ci::Build,W5fqIhUOK1rkRjhegPBZ36hYubQbLqj6hBcoEYwtLj/BdfpF
Ci::Build,GbzkIBMlC2LYWB5FkPBb7oRs0q2kV/j5/0/L7t+1HQsQVthK
Ci::Build,F7zCCxs7DkTFRR5cjKxR3JoX0r7EW/siD2xUEwDy7x9cdRSj
Ci::Build,FuTIDG9XEnykcX15m+RK2bpZmc9kKYYwHnkng+ie8VPOpQh2
Ci::Build,OuXSDCdCYmG6VHo5rLNr6dxCsLYc00pKgZKjFfMGroZIqm+3
Ci::Build,Goz4PHsMKT/zXR5xrako1Z1SjpIADmk5nsz1wjLY6YpA7MrW
Ci::Build,WYfCMjscPEfvbQpekcRixJ1S3c8UoE7IfoBpcXJMoX5izCty
Ci::Build,W77wJw4cZWG/BhNmq69f1tZ5hMk72fo4zRa+Y23BXoMfy52W
Ci::Build,HZfcMnZbM0y4Uhx6sttRxL0T2YipmM6vsVWuc7rgRpgtxXZV
Ci::Build,Q7jkIRIXK2zveyV5kv90yZRbh9fyPahJrIcetbr2HN/zDBeN
Ci::Build,LYLvPA4bDm/QZjhojac31rxIkK+pApjTubgAxIIxiWhepGWT
Ci::Build,BKXdNjg5NT74eHx/0f1syN9qjoCvFpFhyV0pDHnJnuFuSEMc
Ci::Build,CL3wVxErZj/TRHhAkugs16Rg3Km/FKnjYV4diU3RIsq6go/B
GenericCommitStatus,NpLwMwRdIzH5TTNPifhCzop7q6+dN/4BEpheYYCY2DrMMF5G
Ci::Build,G5TsXAoWPF/xRSh7kMxfzpZKx8PtifXjOcWUapz0oQOxdQXu
Ci::Build,XP7pHBpbK2jKADM9vadf4qB5mphQf0xdqNGD/yogZE4Jwq7h
Ci::Build,NqPNHjo/KHP/XD9Ur6ZX8L5r35WochAb0Hww/HA3rSBz1BeH
GenericCommitStatus,WaHiHhs7OljteSx8pNZv/51yv8z9+1+OFBioZ9BsaC2ac6dp
Ci::Build,LZD5InQWGXPxB2ZMgtQp+oVkx7Jba7CWFtAvl9rx/0niqszo
Ci::Build,OefVBjohBF7NYHhMt+QsxoxYg5VDOCuke3EXawYJHqnjqAVI
Ci::Build,BLbSMC8VH0/9AQ1qv/Bzxo92vYynXxAKseiSnAwuIm9WR05q
Ci::Build,PJ3IXQY5G1DZajJYm8Ejm5RHgqiTRlPL2/5NAPzZ9zQt0FTC
Ci::Build,JeKMFQZCK0rHQS5gvtZi9dkQmJKFAp8+BtEkwwa0aIM8R6TY
Ci::Build,KIrRFRsuY32weBpqkPZp3J4SoJu0ggbN5RX6wRgxSbVN86rf
Ci::Build,PpXRNRsJAEfqbBp5g/tu15hEjLz11ZIhxy4dBohjmPiPj7RO
Ci::Build,HOv/CTorGVbbGH850c1K16R1uJLd44J8xj1FHKH9u4KcmqQV
Ci::Build,HKfYVTgXJmPwdCxbvvB54rtiuKrGodYKM4B+vaSDuLLziZ1G
Ci::Build,Np3fDzUNaG3DBnJM39pd7ZZZnIuQ06rjY8/jwO0wvtXAMsGi
Ci::Build,Pab6ETVaOUvWUX9Ukvxf/JtrpoO2os2w3kf9YsWZFMbzEYo9
Ci::Build,G4v/UykOJ3v4BwparstAxbp3q5SqWkcRnWx7LfPSflrh6Bxi
Ci::Build,BKvwHRFWGmvsGBxo0Ppg49xAoMM8L6YcBAKSN0CYUqNBPxfX
Ci::Build,WbeDD3M5GXHLXH48vPdC9aR23bnQud7TWvh1fzvK5QAY8kPh
Ci::Build,HLn2HhJYNkjxYRNk0dZ7+JlbhLBTzli+Wtk6QAEYu7dzLuO9
Ci::Build,P6rNPW8MCH7feQ8mu6pynIoZq773CXeXyG8sEReUAquRfSgA
Ci::Build,BerrIC9bKGLbfxhpgK9q491koJwHl1m9rGX9HD8BHL71yW4P
Ci::Build,F7qPCg8MBHrmTwZYjNp/+bdHi6oGESNHtsafSEv7HArq2NIg
Ci::Build,P7TWMAMEAGO6T3ly2edJ+Nh1oL6wIuZKbm72VdRlq0JH5ZLB
GenericCommitStatus,AYbZJSUGOEPCRgpOnNUj16tikqrjTOrxP/DwKBh3XIgoo8jM
GenericCommitStatus,W7jLIy8dGz6+QjF8t/tW4qZirKy8CjEKNRyHxZopsRiaZ+4I
GenericCommitStatus,LJCCMXMdIVb+XyBBq6xdl7h7v5Mi9JLiU3af9pNdE8SiMeUc
Ci::Build,DIv6ARcWCUO8ezpb3alg24twmrSNdBTLj5PepJHRkXmPao7q
Ci::Build,H53sCnpZKVD6BhNq3NQr9ttS25MVmF6MhS8oLHWajoi4nm/D
Ci::Build,Q53VIHZZZ3n7XnpHu+1p/LFgoIpfw3qdJ0AkoYJGj75TvuIJ
Ci::Build,GKXDFyQJNlu6fQ9HjMxr2pZqj7siNCjLLOuFvwWfq+dJ3hnO
Ci::Build,LYf2FDFXDlHzdBMyjvMr6q9G04kvTskngWZXCbYNkbgBEIFI
Ci::Build,WKnaOyEAFWC6ZyljkcZy+4xTrZBWXC+9btITPBzvN9rkeSqH
Ci::Build,PaLJXAA3Z2axRhlMifdP2b5S04lBJXUYLFuiNedwtqLKCnrX
Ci::Build,FJLkVxMoIFu9eHJP2e1KxKpCmp9Nfn+JMguh5aavh86sY65J
Ci::Build,HbvqHTYqF3vzcThq3d918KJ0g578cGS+kKXzoKzx2Drm2oCf
Ci::Build,P+KMARoaAzz4bWZsvcoozq1x38PnG9ehm/6N57GbTlYHwzrt
Ci::Build,JKPTHSMufEy/d2Y4m+hy3qUZkJOWZSPxKr0IxpHvVZYDo+df
Ci::Build,JpnZIwULCUv5QXI4uNJ91t1wsM/WBmYRLHhX7kh5L14UuvPC
Ci::Build,Gv7UVSoaKGTzTShmm+1d4ZkUkL7M7PJEdYRSA9OTf09g0E6f
Ci::Build,OqffHCBWIkfORzxcxdVUl6oVuYPOLqhcJ3zT0SonvyQgMfTk
Ci::Build,HqDPBgFeM0zmahxOovAvy4prppl8NjHk0JE/GTVvnWyBYjCM
Ci::Build,L6r3Pg4nZEHcZyRDuvNv57RQrcxPpEhEf3SxF0WmU9Pih1PH
Ci::Build,PqX5PTEcAGDwGH1zt/tW3Y1pmbbKKBY1JOugpB6UIgY79/pL
Ci::Build,Q4HOABQNHGvdAHxapulRm79U0r9/3vttWs87FQ6VkN508tXs
Ci::Build,A7bQBTEjFULbcA9omfB01ptn384c15uzNe8OjkdsHdkXQfn1