23683439,311723,26120990,5,MergeRequest
25149831,1739094,12791121,5,MergeRequest
4529253,5497197,116943340,12,MergeRequest
7684628,1739094,164491921,5,DiffNote
19997774,2412020,534515243,3,MergeRequest
17642084,1081620,204315530,5,MergeRequest
17642084,3265540,150917274,5,Issue
6467489,2278766,312579530,5,MergeRequest
4549090,3265540,57992312,12,LegacyDiffNote
3268192,2688832,186585358,7,MergeRequest
14291478,1224317,18253865,5,Issue
14231571,947638,285840884,5,MergeRequest
16434065,2617465,434877568,5,MergeRequest
17014783,4319592,25430271,5,MergeRequest
14292786,5226892,85860565,7,DiscussionNote
12936562,3869483,95914647,5,Note
11286885,4593416,59807932,5,MergeRequest
12461063,1739094,59969417,1,Issue
15099587,5226892,451193124,5,MergeRequest
4743917,4596180,90300052,5,Issue
12187367,3902422,404515447,6,MergeRequest
16420284,1739094,93179441,5,MergeRequest
8836287,1739094,91889471,5,DiscussionNote
4549086,1973779,73458435,1,MergeRequest
10469257,2034862,47943083,5,DiffNote
22230136,3265540,19070677,5,MergeRequest
16461985,598828,81986134,5,Issue
2716141,3047616,20859252,5,MergeRequest
12045153,1739094,83172177,3,MergeRequest
17642084,2599098,83281810,7,MergeRequest
23683439,3902422,601433223,5,Issue
7287501,3332076,36742718,1,Note
5116802,385170,89822173,1,MergeRequest
12740612,3265540,564798128,5,MergeRequest
16420284,3265540,80770332,5,Note
5502816,850980,72868314,5,Note
14176654,4896270,26589292,5,MergeRequest
12935556,1810526,472891815,7,MergeRequest
6444869,3265540,75621238,7,Note
10369151,128076,328836559,5,Note
3328719,5497197,51751516,5,MergeRequest
15633187,310631,456793486,5,MergeRequest
5739873,598828,75236094,5,MergeRequest
5116761,1739094,89250254,5,DiffNote
7528955,1129372,107724580,5,DiffNote
15814394,3869483,14473605,5,Issue
11783833,4395617,529157029,1,DiffNote
4549087,598828,72662364,6,MergeRequest
4529263,1739094,56952763,5,DiffNote
2941444,3056166,586256336,5,MergeRequest
15653017,1739094,80388680,5,Issue
17775289,8587917,590155501,5,MergeRequest
10187007,5226892,17007462,5,Issue
17843452,1739094,575954140,5,MergeRequest
5116754,3902422,33029429,5,MergeRequest
21565633,3265540,94242783,1,Issue
3801873,1739094,468101664,5,Issue
3044465,6918990,30011740,5,Note
12936562,1302695,547837655,1,MergeRequest
11438846,1796256,15188021,6,DiffNote
12497750,2034023,5052399,5,MergeRequest
18749848,649332,18529467,8,Issue
23683439,3265540,33856069,6,DiffNote
10290475,6489239,38378373,5,MergeRequest
1255646,3536981,62428682,7,MergeRequest
20135003,4896270,437634098,5,MergeRequest
5116705,4967333,46097054,5,Note
11626928,1366740,74418633,6,Issue
17509904,1739094,177091873,5,Note
13789097,4010986,476349822,3,MergeRequest
13932223,1128613,540479145,5,Issue
6353458,1407788,513528406,6,DiffNote
3308420,5226892,44624736,5,DiscussionNote
25617264,324562,337097975,5,MergeRequest
14231571,7848875,83592544,5,Issue
1083469,1739094,184619775,5,MergeRequest
1936156,1263493,281525124,5,MergeRequest
4529253,2587954,102199450,5,Note
1715577,1739094,80053235,1,Issue
14291478,8587917,21306550,5,Note
4549096,1407788,390099549,1,MergeRequest
22230136,4905402,283728281,5,MergeRequest
4529222,1273586,93851265,8,MergeRequest
15099587,2849588,492523073,3,MergeRequest
1936156,2617465,10794377,5,Issue
4529278,4477392,82736787,1,DiffNote
5116761,1739094,85629305,5,DiffNote
13346834,4830742,69716464,6,Note
4673136,753331,538862992,5,Issue
4529216,1659309,339091121,1,MergeRequest
13792294,1263493,68024800,3,MergeRequest
19333229,1739094,6035200,5,Note
278964,3265540,41873150,1,MergeRequest
14292786,1739094,43354381,5,DiffNote
17170378,5898646,7936227,3,MergeRequest
278964,1263493,27386332,5,MergeRequest
9975298,5226892,76209024,5,MergeRequest
7260567,533372,275217349,1,DiffNote
5948559,1739094,8841924,5,MergeRequest
19161107,4451562,506110837,5,DiffNote
14292786,263189,13667343,5,MergeRequest
24450109,598828,73533022,5,Note
4549080,3902422,18909830,5,MergeRequest
4529249,8587917,68878213,5,MergeRequest
4549098,3265540,308546086,5,MergeRequest
1652825,3265540,573698753,5,Issue
4529233,2849588,97705782,5,Issue
12497750,5880880,348861531,5,Issue
1497583,3884590,16149970,5,MergeRequest
21026519,1786152,9093590,5,Issue
6722790,1739094,557285634,5,MergeRequest
14218490,289790,423150488,5,WikiPage::Meta
7684628,4896270,137732078,5,Issue
1458656,3536981,71082252,5,Note
8305876,1739094,269369,1,DiffNote
11446256,2034023,197166457,5,Issue
7764,1739094,48506633,1,MergeRequest
17852391,548738,76479042,5,Issue
12045153,2507522,74512419,7,Issue
4549089,2043907,595530587,5,MergeRequest
11712380,97087,87111391,1,Issue
24450109,3647023,87648272,5,MergeRequest
4529288,212072,79514249,5,MergeRequest
3155904,844348,31133850,1,MergeRequest
12646193,1739094,69872746,1,MergeRequest
9965476,5005665,518021024,6,DiffNote
12936562,5705789,584301644,5,Note
13593739,3869483,411392876,5,Issue
2732656,3902422,66239906,5,Issue
14289767,4896270,80865440,5,Note
12045153,1772463,51320035,5,MergeRequest
1463727,5226892,83801550,5,MergeRequest
8427958,2382929,559057150,6,Note
12799969,4896270,41259353,1,Issue
278964,2454924,99860553,5,MergeRequest
8061599,5025927,61879005,1,MergeRequest
17843452,3265540,82090676,5,MergeRequest
15120830,2849588,90742559,5,LegacyDiffNote
4172167,2079234,293511842,1,Note
12917535,253667,501450863,5,DiffNote
4529249,1739094,88924517,1,MergeRequest
6042904,126397,579939782,1,MergeRequest
17852391,1739094,77783791,5,MergeRequest
10902306,1843393,527759561,6,MergeRequest
4649627,3902422,342649675,1,DiffNote
11513622,3902422,96070213,5,MergeRequest
8468661,3265540,52498098,5,DiffNote
5116759,6044985,493996505,5,MergeRequest
11096787,1739094,33558577,5,Note
15320119,3265540,7383992,5,MergeRequest
4529243,4668645,11017625,1,MergeRequest
10243051,100770,72091455,5,MergeRequest
3155904,1739094,96996081,6,MergeRequest
5311558,2027574,4656717,5,Milestone
4549094,1129372,552549368,6,MergeRequest
6438652,1470586,34554668,5,Note
15749122,3520286,103589863,6,MergeRequest
10940784,2034023,28844393,5,MergeRequest
11135481,2574115,522929111,5,DiffNote
16952208,3869483,93578516,5,DiffNote
5116755,476038,32291973,5,MergeRequest
11096787,154314,17955979,5,MergeRequest
12936562,3265540,24268358,5,DiffNote
23959163,3869483,44147273,8,Note
13593825,5762266,69331436,5,Issue
13792294,4896270,379307859,6,Issue
12497750,2655043,394649563,5,MergeRequest
9262912,1465393,77870633,5,MergeRequest
4835773,1739094,72991487,5,Note
15320119,1277700,69806899,5,MergeRequest
22230136,1469780,28531467,5,DiffNote
4529222,3235026,345020731,7,Note
15814394,2753382,68319252,1,MergeRequest
12935556,8587917,96551015,5,Issue
16434065,7942630,59300763,5,Issue
11286868,1739094,483903185,5,Note
17014783,4295317,419425961,5,MergeRequest
4549078,2454928,13070381,1,Issue
18568770,3265540,105459223,5,Issue
7660899,1972944,81064302,1,Issue
4234509,1349468,41465731,5,MergeRequest
11650925,3265540,19945773,1,MergeRequest
17601241,4896270,24400339,5,MergeRequest
7260567,598828,102709193,5,Issue
24796284,8587917,212700185,7,Issue
16420284,100770,31617286,5,MergeRequest
20301256,7985686,227069945,6,MergeRequest
15079139,7942630,63991015,5,Note
10683906,3265540,87216558,5,DiffNote
5854605,4967333,129088141,5,Issue
20459671,1739094,55505934,5,MergeRequest
12045153,915442,431745655,5,MergeRequest
8599490,4400632,219172928,7,Issue
4529222,3536981,82854876,1,Issue
21565633,1128613,70507442,5,MergeRequest
7764,2406597,33112628,5,Note
4549096,3056166,93962720,1,MergeRequest
14176654,3265540,81239475,7,MergeRequest
4409640,4184432,447386382,4,MergeRequest
3782198,6203598,33665205,5,MergeRequest
25992522,258734,65151801,7,Issue
7222267,1129372,101285411,5,MergeRequest
11049425,1739094,327023226,5,Note
20135003,6491478,366406058,7,Issue
16420284,8587917,86129670,7,MergeRequest
19842883,7460871,22350237,5,Issue
278964,2688832,99034144,6,Issue
15099587,212989,82629503,6,Note
4529216,5425454,35181463,4,MergeRequest
5116765,3902422,13919344,1,Note
4549090,1810526,36915523,6,Issue
13932223,5226892,31362436,5,MergeRequest
4549094,3265540,97146678,1,Issue
18568770,1810526,70900843,5,DiffNote
3533489,2200343,65476860,5,Note
36528,1739094,372175193,5,MergeRequest
11650925,713243,73716058,7,Note
24450109,1174865,53841101,5,Issue
16420284,3902422,7120073,5,MergeRequest
18749848,1739094,45719857,1,Issue
4234509,1430387,91120824,5,DiscussionNote
17014783,6203598,100738898,5,DiffNote
14292786,3265540,78641601,7,Note
4529249,4896270,37340593,5,MergeRequest
3607263,1739094,75030669,5,Issue
15099587,3265540,92249898,5,MergeRequest
12497750,1739094,304393018,12,MergeRequest
16420284,1739094,20985977,5,DiffNote
14464142,1739094,78850256,3,MergeRequest
1304532,2065710,3790945,5,MergeRequest
4667009,3728767,45041199,5,MergeRequest
15814394,3265540,86484375,5,Note
4529250,7942630,74598988,5,Note
17642084,4896270,31849845,5,MergeRequest
7280694,421592,84714065,1,Issue
4958368,5226892,61387895,5,DiffNote
12104837,299860,118915539,5,Issue
4529288,1810526,35342648,5,MergeRequest
5116802,5792232,381070595,1,Issue
17014783,2376417,68981178,5,DiffNote
15320138,2324599,6598752,1,MergeRequest
12497750,3884590,39207537,5,DiffNote
15765674,1739094,86252505,5,DiscussionNote
11509294,3826561,59516207,5,DiscussionNote
10268953,5425454,26234023,5,MergeRequest
12696028,8587917,52908912,5,Note
5116755,253667,89987498,5,Issue
4529243,1973779,104647092,5,Note
3044465,2463288,49373151,5,MergeRequest
9613014,560356,354738545,5,Issue
12045153,1275746,166536442,5,DiffNote
3310437,3869483,33430104,5,MergeRequest
18454837,3869483,3496668,5,MergeRequest
24450109,4395617,23644743,5,MergeRequest
1170599,428142,39944395,5,MergeRequest
8836287,6489439,67179545,5,MergeRequest
15099587,3056166,401460047,5,Issue
15320119,1690635,85509538,5,Issue
13792294,8587917,81456894,5,Milestone
25619635,4305614,362090403,5,DiffNote
15320119,6203598,104172378,5,Note
25619635,1702559,14729548,5,MergeRequest
4656755,5742511,358497782,5,MergeRequest
4549089,1739094,81669764,5,DiffNote
26005919,4896270,58108641,5,Note
5116767,5443041,70412998,5,DiffNote
4763372,4125958,20189435,6,MergeRequest
16434065,253667,322291043,5,MergeRequest
15099587,1129372,22715538,5,Note
12936562,4702198,52178317,5,Note
25617274,6265943,53459031,5,MergeRequest
11650925,171554,84120550,5,MergeRequest
5268536,4190213,26480269,5,MergeRequest
20459671,475407,144373162,5,Issue
17601241,3902422,86590799,5,MergeRequest
9965476,1739094,385514929,5,Issue
13792294,5497197,530365855,1,Issue
24450109,3677529,70615477,5,Issue
19760762,97087,60159871,5,MergeRequest
12866605,6203598,36038379,5,Note
24450109,43087,26742619,5,DiffNote
17843452,3265540,277421473,5,MergeRequest
12646193,1739094,70980438,5,DiffNote
15320138,6563553,80150621,5,MergeRequest
4549080,3265540,57836125,5,Issue
11114319,1257257,71648778,5,MergeRequest
11650925,8587917,85945297,1,Issue
5316072,1739094,8061298,5,MergeRequest
5771540,588440,71560691,5,Issue
16434065,6499434,67858686,12,MergeRequest
11286738,399019,43570926,5,Issue
24450109,7460871,28658177,5,Issue
17349538,3722746,47529412,5,MergeRequest
3115784,1699377,160328654,6,MergeRequest
12497750,7942630,81143410,6,Note
12936562,1129372,94688005,5,DiffNote
6264530,649332,60949435,5,Issue
4792851,3056216,76295823,5,Note
12140485,1967563,148891851,5,MergeRequest
14292786,843032,14307445,7,MergeRequest
23683439,3869483,55334307,1,Issue
4529278,753331,109688505,6,MergeRequest
5524948,4896270,8187117,5,DiffNote
4549089,1739094,449283641,1,MergeRequest
12497750,2631549,531502487,7,Note
4649627,4079623,125301501,5,Note
8062778,7942630,330181597,5,Issue
6264530,3265540,94086849,5,MergeRequest
12917535,5226892,458389601,5,Note
4529278,3265540,36567191,5,MergeRequest
15048370,3265540,504675003,5,DiffNote
4130920,4170843,32513641,5,MergeRequest
11446256,3902422,46659969,5,Note
15636889,3265540,192359156,5,Issue
17642084,1739094,22075885,5,Issue
4549090,1739094,15707383,5,Note
10986423,2849588,17678266,5,MergeRequest
6090611,312137,73073621,5,Issue
6421301,100770,48855712,5,MergeRequest
4102772,5809837,208649434,5,MergeRequest
21026519,1220602,582457598,5,MergeRequest
20459671,1854733,67012545,1,Note
23959163,3265540,92874398,5,Issue
4529278,8587917,588047586,5,MergeRequest
1688589,8587917,7525159,5,Issue
17843452,6381105,46864746,5,Issue
6030593,3869483,76768849,6,MergeRequest
19290285,1820439,374208380,5,Note
16420284,5425454,88675793,5,Note
12918261,5742511,400089014,5,MergeRequest
17067156,851454,555693867,1,DiffNote
7557660,1739094,34745297,6,Issue
14218490,2849588,22503175,5,MergeRequest
15320138,915442,599443827,7,Issue
25617179,5762266,102541229,5,DiffNote
13083,1129372,229157872,1,MergeRequest
5303095,510442,47035963,5,Note
3677505,1407788,66086072,5,DiffNote
11650925,4178893,9795915,5,Note
6088425,1129372,20465665,5,DiffNote
17775289,583919,34846453,5,MergeRequest
5116802,4142511,388320098,6,MergeRequest
23683439,3880924,91571295,5,MergeRequest
3445984,3265540,88444834,5,MergeRequest
15320119,3265540,86898323,5,Note
2716141,1739094,94538419,7,MergeRequest
5116765,1739094,77166656,5,MergeRequest
12950919,779805,104262856,5,MergeRequest
4673136,3647023,58981252,5,MergeRequest
14932055,1719448,93437911,3,MergeRequest
4549078,3869483,439299242,5,MergeRequest
12048922,399019,4121229,6,MergeRequest
13394630,3265540,52350118,5,MergeRequest
2960575,1851163,24154740,5,MergeRequest
17843452,1203448,368307587,5,MergeRequest
9651236,1506319,62914210,3,MergeRequest
4042224,268318,87941431,5,Note
2018405,3869483,433376744,5,Issue
14057781,1739094,95021554,5,Issue
4933574,3869483,69614101,5,Note
11160640,770236,36254125,5,MergeRequest
14292786,1739094,61747552,3,MergeRequest
14183709,2688832,15308829,5,Issue
19731527,2191,383973786,8,DiscussionNote
4529243,3265540,78062250,1,Issue
12045153,4896270,12346643,5,Issue
6444869,1690635,42439359,5,MergeRequest
4529222,1739094,262688328,5,MergeRequest
12497750,3265540,35619832,5,Issue
278964,3265540,68179055,7,MergeRequest
6264530,1739094,18375951,1,MergeRequest
20177067,1085608,23105544,5,Issue
20080870,3536981,88574409,5,MergeRequest
16180270,5762266,369920677,5,Issue
9154812,2345386,111792847,7,MergeRequest
2039510,4400632,37135001,5,MergeRequest
13380729,5226892,71299493,6,MergeRequest
16434065,6320523,73815025,5,Issue
12045153,3869483,85231152,5,MergeRequest
278964,1739094,20591199,5,DiffNote
4529249,1739094,75329983,5,DiffNote
11626928,3265540,80588189,5,DiffNote
4549095,1739094,104836878,5,Issue
7764,1739094,53950376,6,DiffNote
7714096,5403006,187953,6,Issue
4529263,3265540,62603240,5,MergeRequest
12140485,1739094,38616610,5,MergeRequest
15636889,1690635,86699862,5,DiffNote
15412023,2963011,98027424,1,Issue
5157761,2077134,546272735,5,MergeRequest
25003918,1424203,104530397,7,MergeRequest
14292786,5596095,87424702,5,Issue
4220535,3265540,604804503,5,MergeRequest
9561343,873002,63114688,5,DiffNote
12936562,3267128,71855455,5,MergeRequest
3357349,333931,100475833,5,Note
8468661,3265540,43102236,5,MergeRequest
5116705,4010986,8959304,5,MergeRequest
4529288,3056166,100605227,6,Note
1526831,3265540,597368662,3,Note
11513622,3722746,76571411,5,DiffNote
24450109,3336232,32162210,1,MergeRequest
12242774,5762266,306877124,5,MergeRequest
17843452,3869483,561228681,5,MergeRequest
12936562,8587917,242208947,5,Note
2865214,4362045,97305197,5,MergeRequest
12740612,1739094,70322969,5,MergeRequest
4549096,3265540,57161139,5,Note
11214782,4400632,74803527,6,MergeRequest
14900054,8587917,100914357,5,Issue
5116755,3265540,393235079,1,Issue
12446958,4896270,15046721,5,Issue
4529263,5515967,382611469,5,MergeRequest
23190576,3265540,593361756,5,MergeRequest
4549094,1129372,77525518,1,MergeRequest
20167820,2729482,102849451,5,MergeRequest
12048922,178117,27537110,3,Issue
14932055,310631,32071963,5,DiffNote
6264530,4706134,173077021,5,WikiPage::Meta
20067921,8587917,50621748,5,Issue
4780768,2762108,466646024,5,MergeRequest
6264530,1739094,202216309,1,MergeRequest
15636889,1147661,18088751,5,MergeRequest
17994043,4137942,6714278,5,MergeRequest
7558890,3265540,87317236,5,Issue
5678779,3265540,97885916,5,MergeRequest
14268902,3869483,24029342,5,MergeRequest
25617179,978741,64454866,6,MergeRequest
17349538,3235026,79620352,5,Issue
4529233,4896270,5557195,7,DiffNote
4549095,1739094,76671061,5,Issue
6166144,1690635,64132756,5,Note
24450109,3488309,233838649,1,MergeRequest
11626928,1984357,20737753,5,Issue
6135215,1129372,62734388,7,MergeRequest
10902306,5497197,19494505,6,MergeRequest
15320138,3869483,29673098,5,Note
1652825,4170843,95299731,8,Issue
6264530,5037105,64992051,5,MergeRequest
6042904,1407788,70814283,5,MergeRequest
311700,424482,53098438,6,MergeRequest
8745656,1739094,29349121,7,Note
13380729,6200755,463066722,5,Issue
4529276,1739094,452755673,5,DiffNote
5116759,1786152,223179460,1,Issue
7764,921150,28388496,5,Note
4549090,4477392,58453104,5,MergeRequest
4549096,2034862,88846155,3,MergeRequest
9864077,1129372,98217923,12,Note
13792294,1229121,63704377,5,Issue
7684628,1739094,45304958,5,MergeRequest
1819928,1602761,9363018,5,Issue
17349538,4395617,29897000,5,Issue
4435291,533372,436445404,5,MergeRequest
23683439,5588567,13526970,3,Issue
13346834,1786152,14159694,5,Issue
15970063,5809827,396497848,3,MergeRequest
7001620,8587917,469675322,5,Note
13792294,2594501,84907510,5,MergeRequest
1997831,1739094,70154615,6,Note
7280694,2666484,48098777,5,MergeRequest
14176654,2666484,1639216,1,MergeRequest
14291478,1739094,37978255,1,MergeRequest
2039510,533372,18669061,5,MergeRequest
4529222,4036857,91748285,5,MergeRequest
3044465,1739094,21519790,5,MergeRequest
23683439,1129372,77975019,5,DiffNote
15294746,20694,73917191,6,Issue
4409640,1263493,50036746,5,Note
18176655,686547,21819627,5,MergeRequest
12936562,4422746,88321005,1,MergeRequest
22230136,3536981,71386225,5,Issue
14292786,5226892,61605797,5,Note
8661817,2383710,49052778,5,MergeRequest
17350695,1549349,609154316,5,MergeRequest
17843452,2849588,97491445,6,DiffNote
19333229,4395617,181745568,8,Note
278964,3869483,27673545,5,MergeRequest
16180270,3623799,521127101,5,Note
12936562,6203598,39555005,1,MergeRequest
4529216,751346,96378730,5,MergeRequest
15320119,6453936,7701816,5,MergeRequest
9864077,4422746,131245127,5,MergeRequest
12497750,1739094,363980557,5,MergeRequest
5677779,3265540,511661234,5,MergeRequest
12935556,978741,5665900,5,MergeRequest
25615735,4158668,66700600,5,MergeRequest
24450109,2666484,14904581,1,Issue
15636889,2034023,65774788,6,MergeRequest
14218490,154314,71745322,5,Issue
4591102,3536981,34262823,5,Note
4549080,1699377,424824602,5,MergeRequest
2865214,657207,85035959,3,MergeRequest
6327868,2849588,95433953,5,MergeRequest
12013311,3265540,71200317,5,MergeRequest
5116767,1873771,99367213,6,Issue
2694705,5073506,142439929,5,MergeRequest
5852409,969553,33224915,9,MergeRequest
24510916,3869483,86387015,5,Issue
4529263,1225341,194569238,7,MergeRequest
8482115,1570338,53256320,1,Note
20173240,1841591,13802503,5,MergeRequest
4549089,3568292,59671100,5,MergeRequest
5116767,1190703,78328957,5,MergeRequest
5116759,3317438,65928254,5,MergeRequest
23683439,1739094,210639569,5,DiffNote
5116802,1128613,83709186,5,MergeRequest
12045153,2849588,33333541,6,DiffNote
20173240,1129372,569869145,6,Note
15814394,1786152,514869144,5,DiffNote
5116762,465050,126815652,5,MergeRequest
4549087,3265540,69418631,5,MergeRequest
11712380,2986888,773428,5,MergeRequest
4205665,4896270,17841178,5,MergeRequest
4549089,1739094,93706501,3,Milestone
22230136,1263493,91430142,6,DiffNote
12497750,5005665,87862319,1,MergeRequest
11650925,3378936,6205418,5,Note
15139048,1739094,480268189,5,DiffNote
4529263,5005665,32724633,5,MergeRequest
14176654,90962,542021269,5,Note
4549078,1407788,27816986,5,MergeRequest
14291478,3287313,74905628,5,MergeRequest
278964,1739094,62045169,5,MergeRequest
9823231,5016494,168448513,12,DiffNote
16420284,3869483,121021013,7,MergeRequest
4673136,3398766,39416549,5,MergeRequest
16420284,1810526,79847112,5,MergeRequest
15181668,4395617,85318904,5,DiffNote
4549094,5226892,71980345,5,WikiPage::Meta
16434065,6454334,16843547,5,Note
12724358,3265540,25306648,5,DiffNote
15320119,4896270,69177194,5,MergeRequest
16462288,15140,17296221,5,Issue
3308420,5497197,91255518,5,Note
12935556,1129372,566580176,5,MergeRequest
4529249,6160020,58285298,5,MergeRequest
4529216,8169704,55633583,5,DiffNote
5116767,1739094,524639282,7,Note
4529278,3898163,290337003,1,DiffNote
17518291,1739094,441076441,5,MergeRequest
16420284,5355223,54170150,6,Note
4130920,3869483,81338634,7,MergeRequest
2865214,3265540,24595089,5,Issue
16420284,3869483,98745582,5,DiffNote
25244926,2030303,49915209,1,MergeRequest
22230136,1257257,42073926,5,Issue
4458319,3265540,89673722,5,DiffNote
4529250,6489239,252,5,DiffNote
4529278,485443,84010378,1,MergeRequest
16420284,8587917,92557697,5,Note
17884550,2849588,101138318,5,MergeRequest
10371853,1584559,76380924,5,MergeRequest
1770376,5742511,17189927,1,Note
7001620,290047,29580015,5,MergeRequest
6015909,3265540,99528173,5,MergeRequest
17051534,3265540,79061196,5,DiffNote
14978726,424482,50448097,5,MergeRequest
3456442,4671331,16025553,5,DiffNote
12740612,5226892,30743181,5,DiscussionNote
7020313,3902422,526049884,5,Issue
2039510,4596180,25058066,5,MergeRequest
12936562,3265540,356535015,1,DiffNote
7260567,4896270,8564652,5,Issue
15099587,1967563,398388115,5,MergeRequest
8689092,758045,175280636,1,MergeRequest
3391926,3880924,352321,5,MergeRequest
18568770,3485485,45536831,6,MergeRequest
14176654,3869483,464832489,5,MergeRequest
16001955,8328798,23788250,3,MergeRequest
17852391,1739094,35035718,5,MergeRequest
63922,1598228,84476976,5,Issue
17642084,137151,14614290,5,MergeRequest
10576125,4896270,299836600,1,MergeRequest
17258915,4513747,474694687,5,MergeRequest
15099587,2324599,61088813,5,MergeRequest
7714096,6455756,409756719,5,Issue
5116802,1988696,82285505,5,Issue
19919294,1739094,100305432,5,MergeRequest
15320138,1984357,84252663,5,MergeRequest
17041127,1739094,324943524,1,MergeRequest
9890111,1190703,75712215,1,MergeRequest
4549086,3265540,32391617,5,DiffNote
5116755,2849588,30886679,5,MergeRequest
15636889,4010986,60654177,1,Issue
7898047,4896270,41048385,5,MergeRequest
7509390,1407788,69963176,5,Issue
17067156,2683848,40591480,6,MergeRequest
278964,7942630,74110737,3,MergeRequest
10080726,1739094,65312159,7,MergeRequest
4529222,1739094,98409924,5,MergeRequest
25992522,1786152,568023093,5,Note
7260567,2647985,23376853,1,Note
12936562,3265540,27251249,5,DiffNote
25617203,1702559,471366914,5,Note
20177057,1739094,90445146,5,DiffNote
12936562,572018,46476426,5,Issue
11650925,4422746,70707086,6,MergeRequest
5771540,4379087,99204138,5,MergeRequest
8545585,3869483,238200484,5,Note
9154812,3007069,15865740,5,DiffNote
7001620,1470586,88763411,5,MergeRequest
14291478,3265540,19347407,5,MergeRequest
3870942,1739094,101873560,5,MergeRequest
11114319,3267128,25533697,7,DiffNote
1471537,5742511,52730225,5,DiscussionNote
23954639,1729112,31490629,5,MergeRequest
4529288,8587917,461758345,5,MergeRequest
17642084,1739094,76019220,5,Issue
15439288,1129372,83081617,5,MergeRequest
20176499,1892863,89016384,5,Issue
19648480,1158671,24699767,7,MergeRequest
25617274,713243,103466654,5,MergeRequest
4549094,2902906,34159806,7,Issue
23683439,3396735,316373542,5,Issue
22230136,1739094,43755885,1,Note
1969388,5497197,42281415,5,MergeRequest
5116802,1263493,246262324,5,MergeRequest
16434065,3265540,416537192,5,MergeRequest
22756795,3265540,562981760,5,DiffNote
17775289,598828,26354775,7,Issue
15633187,6203598,489123487,5,Note
18454837,2570165,352534904,12,Note
3044465,1690635,104380382,6,DiffNote
8061599,1739094,80475009,5,MergeRequest
14140484,1702559,73343363,5,MergeRequest
278964,43087,253680988,5,DiscussionNote
13789097,4142511,25991767,5,MergeRequest
23959163,1739094,103175805,5,Note
12461063,2004956,158204388,5,MergeRequest
3837552,5124015,26870826,5,Issue
6331882,2849588,508934137,5,Note
21565633,1739094,318448000,5,MergeRequest
16790901,5720297,105158997,5,Note
23683439,3869483,22207404,2,MergeRequest
15320119,2674238,1059973,5,Note
25617147,1407788,40181542,5,MergeRequest
1715577,2666484,28072727,5,DiffNote
13736756,4422746,95619944,5,DiffNote
12497750,4863007,79396349,7,MergeRequest
8717341,3902422,94842738,5,Issue
20135003,3826561,61236129,5,DiffNote
14176654,3056166,297628804,5,MergeRequest
4667009,1226327,77260627,5,MergeRequest
12936562,100770,44823839,1,MergeRequest
17014783,1739094,155795540,5,MergeRequest
8104256,644481,450696,5,DiffNote
2960575,383644,74006780,5,MergeRequest
14292786,921150,14010843,7,MergeRequest
25617147,1739094,95748760,5,MergeRequest
4435522,3265540,554197694,5,MergeRequest
23954639,3536981,272881587,6,MergeRequest
25149831,7312447,29762672,5,Note
13792294,4896270,30110825,5,DiscussionNote
3308420,1702559,430082374,5,Issue
4529243,5705789,34356262,6,Note
5116761,5226892,402892256,5,MergeRequest
12048922,2704952,244318202,5,MergeRequest
5524948,3265540,258243328,5,MergeRequest
10683906,1739094,22968780,11,MergeRequest
12045153,2006431,78525354,5,Issue
11650925,1129372,146314836,5,MergeRequest
12936562,357929,71472044,7,Note
17884550,563460,72382904,5,Issue
3980791,2849588,69073837,5,MergeRequest
4549095,598828,18784842,5,MergeRequest
16420284,5037105,31258698,1,MergeRequest
7222854,1739094,63858597,6,DiffNote
20135003,3265540,57651086,5,MergeRequest
20135003,3902422,70071554,5,MergeRequest
14291478,1739094,16271470,5,MergeRequest
11650925,1739094,96699859,6,MergeRequest
3277911,3869483,30330366,5,MergeRequest
20135003,916904,391876652,1,MergeRequest
4549090,1739094,67657949,5,MergeRequest
16894325,1568208,495646578,5,Note
25003918,8292579,72298281,5,DiffNote
278964,3884590,571840621,5,MergeRequest
5116706,1739094,12935533,5,Note
17642084,2655043,51532520,5,DiffNote
8661817,1416290,12606084,5,MergeRequest
12048922,357134,24492303,5,Note
4549078,3100069,92068063,5,DiffNote
23683439,1739094,63252983,7,DiffNote
14464142,2550286,45886221,5,Note
9643340,557517,28239151,5,MergeRequest
10227864,1699377,445561382,5,MergeRequest
20135003,2079234,350934200,5,MergeRequest
17775289,7504310,16514315,6,MergeRequest
20347961,1739094,46254283,5,Issue
2865214,6487670,50327268,5,Issue
13661872,2378653,30208834,5,MergeRequest
4529249,3040300,92713032,5,MergeRequest
15139510,6395291,81575120,5,Issue
1057949,1739094,73191371,5,MergeRequest
23959163,1739094,67517776,7,Note
12045153,598828,550698966,5,MergeRequest
12045153,5037105,413234807,5,MergeRequest
4316798,1739094,37551087,5,Note
23683439,1691152,101592634,5,Issue
23683439,3265540,75422054,7,MergeRequest
17430283,3265540,70242832,1,MergeRequest
4529222,4997388,84369872,6,Issue
6090611,5792232,302678713,5,Note
4549078,399019,96855865,5,MergeRequest
18176655,2463288,17555718,5,DiffNote
23959163,2538534,48266487,7,DiffNote
20135003,1739094,103031563,5,DiffNote
4529249,1984357,24798256,5,DiffNote
4549087,713243,54926803,5,MergeRequest
4528017,2849588,386654259,5,MergeRequest
15320119,713243,75512231,5,DiffNote
25617174,147005,85133615,5,DiffNote
18568770,2463288,56576524,3,DiffNote
4529253,1452866,482036726,1,Issue
1580498,3264925,30554102,5,DiffNote
4529288,1257257,80963307,3,MergeRequest
9139330,3869483,8312023,7,MergeRequest
11096787,4383072,94398835,5,Issue
2853669,533372,77403527,5,Issue
6448181,1739094,55995153,5,MergeRequest
2292248,212072,251204914,5,Issue
17843452,3265540,60333409,5,MergeRequest
6264530,421592,34467617,5,MergeRequest
4529278,5762266,74698156,5,MergeRequest
20135003,1739094,10392282,5,MergeRequest
5113253,4079623,78408003,5,MergeRequest
20135003,1739094,80264272,5,MergeRequest
16420284,5497197,17416573,5,Note
13593739,1739094,89119898,3,MergeRequest
278964,3585,66388382,5,MergeRequest
15079139,1257257,487476095,5,Note
7071551,219748,266453641,5,MergeRequest
1969388,1508008,5244926,7,Issue
4549080,4896270,442371053,5,Issue
6438652,2666484,15439232,5,Issue
14249355,3056166,104039613,3,MergeRequest
25617140,1739094,72747897,7,Issue
4677522,1772463,87520379,5,DiffNote
16420284,598828,8429228,1,Issue
14291478,4896270,40372061,5,MergeRequest
5116759,3869483,74229440,7,MergeRequest
17014783,4422746,11468629,5,Issue
12048922,3265540,79740784,5,Issue
7050143,4073787,75842474,5,MergeRequest
6088425,3884590,9940410,5,MergeRequest
621214,2849588,444103838,5,Issue
15320138,5226892,55100224,5,MergeRequest
25149831,1739094,88029917,5,MergeRequest
4549089,1739094,100155852,1,Issue
5116767,5596095,103722822,5,Note
16434065,8587917,24932035,5,Issue
3050484,64248,74328329,5,MergeRequest
22230136,3265540,32805764,5,MergeRequest
5116767,1129372,20296626,5,DiscussionNote
5116761,1739094,77612384,5,MergeRequest
15814394,5226892,83463726,5,DiffNote
8694821,5425454,62186217,5,Milestone
4312743,4137942,27945036,5,DiffNote
3155904,975359,90939594,5,Issue
5955991,1263493,84608774,5,MergeRequest
2185712,1263493,549309755,5,MergeRequest
12420363,3265540,58609715,5,Note
4130920,1739094,76844712,5,Note
9457606,1739094,78737162,1,Note
10656451,2034023,82527722,5,MergeRequest
8661817,3536981,21408052,5,MergeRequest
24510916,1129372,105306237,6,MergeRequest
12048922,443319,170532776,6,MergeRequest
4549089,4896270,65621836,7,Note
15099587,3265540,264684955,5,Note
4220535,1739094,98898566,6,MergeRequest
16420284,915442,54725157,5,MergeRequest
15633187,3047616,80675375,1,Issue
9858253,4997388,60519463,6,MergeRequest
4549095,5025927,50152795,1,Note
20135003,6489239,6981488,5,Issue
3155904,3265540,557218,3,Note
8517305,660422,271198952,5,MergeRequest
12045153,4896270,603072644,5,MergeRequest
4529276,779805,13375876,5,DiffNote
16778784,509381,179451214,5,MergeRequest
24450109,1739094,54445473,6,MergeRequest
8283967,7739084,75924286,5,MergeRequest
5116759,424482,268741295,5,MergeRequest
12936562,5226892,340531393,5,DiffNote
4529278,1739094,21941186,5,MergeRequest
7509390,1263493,25171470,5,MergeRequest
10187007,7942630,10612825,5,MergeRequest
4529288,947638,58780968,5,Issue
13789097,3902422,606993735,5,DiscussionNote
25617264,5742511,22839462,5,MergeRequest
23683439,179953,20069418,6,MergeRequest
12497750,1800694,75145644,5,Milestone
2009901,3265540,43923478,5,MergeRequest
2747962,5355223,39214,1,MergeRequest
4549090,5037105,7820408,7,MergeRequest
4549094,4392536,30978516,5,Note
16420284,3265540,347005796,1,Note
16420284,4157253,13226868,5,Note
7764,1739094,90599968,5,DiffNote
22230136,219748,25755751,6,DiffNote
5245283,3265540,200054025,5,MergeRequest
16434065,3265540,9594329,1,DiffNote
15636889,1129372,89391024,5,DiffNote
4529263,3265540,217141806,1,DiffNote
7020313,1702559,35838365,8,Issue
4549096,222675,666234,3,MergeRequest
25617266,4178893,360326678,5,DiffNote
10224329,4125958,103887597,3,Note
13789097,3371383,66523926,5,MergeRequest
12045153,2849588,41669207,5,MergeRequest
18176655,1739094,333765350,5,Issue
4529263,3265540,21684317,5,MergeRequest
278964,1739094,84796763,6,MergeRequest
23856691,1129372,15585912,3,DiscussionNote
4529222,664104,68678241,5,MergeRequest
25617186,258734,224797916,5,MergeRequest
6444869,6499434,85737685,5,Note
15763319,6487670,414818143,5,MergeRequest
13639900,510442,23206524,6,Note
15320119,1734036,231646857,5,Note
16420284,3265540,577798623,5,Note
19997774,2849588,34949112,1,Issue
15814394,1739094,51988920,6,Note
2960575,3265540,292172232,5,MergeRequest
16613646,6563553,79158665,5,MergeRequest
4743917,598828,280001024,5,Note
4310294,2034023,6482812,6,Note
18454837,2986888,68786372,5,MergeRequest
5311558,15584,64313168,5,Issue
20176499,4271823,63601512,5,MergeRequest
7660899,2849588,496954999,5,MergeRequest
5116765,2406597,240068986,2,Issue
15099587,3902422,320164748,6,DiffNote
22756795,202858,29075757,1,Issue
2789667,7739084,498541049,5,DiffNote
1652825,10068,536993505,5,Issue
12497750,3265540,377381801,5,MergeRequest
13820678,1469780,4415684,5,DiscussionNote
20135003,1598228,79961950,5,Issue
19161107,5226892,83901196,5,MergeRequest
19648480,3265540,5418081,5,WikiPage::Meta
4549078,5742511,10230403,5,MergeRequest
4549098,270065,88218545,5,Issue
1715577,1739094,32917383,5,MergeRequest
4549086,7942630,9478535,1,Note
11513622,3265540,235649159,1,MergeRequest
25617266,5005665,64790329,6,DiffNote
25992522,311723,27018409,5,DiffNote
5771540,3367059,38214829,1,MergeRequest
17775289,1739094,54296203,1,Issue
311700,3056166,29468653,5,DiffNote
4409640,4896270,27124239,5,MergeRequest
4409640,3536981,85422029,5,MergeRequest
11605597,3265540,12058268,5,MergeRequest
15053347,1739094,102037363,5,Note
25617185,2986888,503253127,6,MergeRequest
8661817,7942630,460069038,11,MergeRequest
14218490,16391,123358054,5,Note
23683439,753331,16681326,5,Issue
3980791,2440264,295586470,5,MergeRequest
6495789,1349468,34647268,1,Note
23959163,2440264,34051712,5,MergeRequest
20173240,1739094,4876604,5,DiffNote
4220535,3265540,49603715,5,MergeRequest
19919294,3902422,255321190,1,MergeRequest
4549078,3869483,57453644,5,Issue
23683439,2688832,485725278,5,Issue
4529276,1739094,72501456,5,MergeRequest
15120830,399019,31936051,5,MergeRequest
10262206,1739094,66849591,5,MergeRequest
19456349,1739094,101748094,5,DiscussionNote
4549095,1657770,405988750,5,Issue
4549080,5226892,500070276,6,MergeRequest
17843452,3265540,37757900,5,Note
5116705,2077134,9692503,5,MergeRequest
21026519,4706134,248849762,5,MergeRequest
17051534,5226892,95152479,5,MergeRequest
10984709,1739094,63440954,6,MergeRequest
19842883,3265540,591791294,5,Issue
24578383,290047,99680910,5,Issue
14292786,3265540,310520421,5,MergeRequest
6264530,3884590,82191328,5,MergeRequest
7764,4896270,83376232,5,MergeRequest
20135003,3265540,87009849,5,Note
15971937,5588567,49199609,5,Issue
12045153,1702559,79271830,5,MergeRequest
25617147,3265540,73617467,5,Epic
5116802,2034023,162725679,5,DiffNote
4549086,1973779,221444201,5,MergeRequest
7050143,2102015,507488921,5,Note
12048922,4392536,101462090,5,MergeRequest
14163048,3826561,42788654,5,MergeRequest
18076924,4010986,76942594,5,MergeRequest
4549090,4283234,47257281,1,MergeRequest
12936562,5226892,98575626,5,WikiPage::Meta
12936562,8128522,39743245,1,Note
15099587,5226892,54050363,5,Issue
12936562,8311087,135328968,1,Issue
3512539,2849588,23931259,5,Note
8836287,1739094,86027062,5,MergeRequest
5116759,1739094,407934735,6,MergeRequest
6167078,7460871,100006570,7,DiffNote
4549080,3265540,516331512,1,Note
17994043,1697390,93021124,5,MergeRequest
7222267,2378653,53652425,6,DiffNote
15763319,6794036,417802002,5,Note
1580498,11804,56767779,5,Issue
14588374,1739094,532845746,5,DiffNote
17642084,3869483,140464864,5,Issue
22074580,419888,47746259,5,Issue
12936562,268318,544542267,5,MergeRequest
20167820,7942630,93314045,5,MergeRequest
15590234,1650092,81769474,5,MergeRequest
11035489,4896270,153473414,5,Issue
4667009,2828964,72194240,5,DiffNote
25143234,2070334,56372503,3,Note
6269184,533372,38842184,5,MergeRequest
2018405,3869483,206776025,5,MergeRequest
9731345,598828,90137327,5,MergeRequest
5116706,3265540,81886965,6,DiscussionNote
25244926,2849588,25852635,5,MergeRequest
13080300,2034023,60812391,6,Note
4458319,3536981,76110375,1,Issue
5586052,1739094,30453017,5,MergeRequest
8308825,3265540,33763283,5,MergeRequest
1291173,779805,133349055,1,DiffNote
4977691,204384,50807215,5,MergeRequest
4549090,3265540,33941257,5,MergeRequest
6020174,3265540,28959678,7,DiffNote
4924622,598828,543114961,1,MergeRequest
18454837,1129372,68546649,5,Issue
12937583,100770,19207562,12,DiffNote
20459671,2278766,42979608,5,MergeRequest
15320119,419888,535689417,5,DiffNote
9581653,2352373,114436961,5,MergeRequest
5116761,3265540,64624148,12,MergeRequest
11626928,1259182,190256597,5,Note
7563579,5124015,7249162,5,MergeRequest
4743917,1739094,57330354,5,Note
12936562,5226892,490619316,1,MergeRequest
13083,3902422,67365473,5,MergeRequest
15871395,1129372,56184071,5,Issue
17014783,1786152,260577688,1,Issue
4667009,1739094,30658405,7,Note
14750003,4896270,29217462,5,Issue
23954639,1433336,87755151,5,MergeRequest
14503185,1780252,21175740,5,MergeRequest
12489666,2849588,19825570,1,Issue
11509294,2055661,428386072,5,MergeRequest
16434065,1739094,426629518,5,MergeRequest
20135003,4896270,23543111,6,Issue
63922,6265943,5864487,4,Issue
3155904,5742511,104976791,5,Issue
7764,6489405,8686126,5,Issue
13792294,598828,510199016,5,Issue
15320119,3869483,82967231,5,Issue
6264530,1739094,77701261,5,Issue
17740209,2359567,35468613,7,Note
12048922,6487670,78198673,5,Note
4549096,2111551,335449327,5,MergeRequest
13876134,3265540,69518184,5,DiscussionNote
17601241,1739094,9241237,5,MergeRequest
11712380,5901285,454647626,5,Issue
19699849,2538534,10055949,5,MergeRequest
24450109,2260748,287973681,5,Note
4220535,3869483,82416510,5,MergeRequest
20176499,1129372,519779237,5,Issue
1652825,639163,6833076,5,MergeRequest
17270209,2388887,51194405,5,MergeRequest
22230136,100770,31742149,5,MergeRequest
5586052,1739094,88116799,6,MergeRequest
23959163,3600891,40811137,5,DiffNote
6264530,2382929,78953086,1,MergeRequest
7557660,7727910,96879,5,MergeRequest
8684637,1465730,77051369,5,Issue
9262912,3265540,375565828,6,MergeRequest
4549096,3536981,59129056,3,Issue
25003918,3265540,314656909,6,MergeRequest
4234509,5226892,89540183,5,Issue
17642084,3265540,331991850,5,Issue
5116767,3056166,214906221,6,MergeRequest
1688589,1739094,49768687,5,Issue
16420284,8024601,421525539,5,Issue
17679574,3536981,6344872,5,Issue
12935556,533372,19645625,5,MergeRequest
15871395,2991687,478222298,3,WikiPage::Meta
1492633,750053,96210455,5,MergeRequest
18476636,3585,103341213,7,Issue
1022183,5596095,92410403,1,MergeRequest
12319767,229043,39017524,5,MergeRequest
15577823,2762108,86807084,5,MergeRequest
7684628,2986888,188529286,6,DiffNote
15034257,2934701,102370670,5,MergeRequest
5116755,6485791,55805127,5,DiffNote
5116706,5037105,25656991,5,Issue
1652825,419888,50998149,5,MergeRequest
21565633,424482,22601563,5,MergeRequest
10902306,3258603,48678284,1,Issue
5116705,4947745,32640684,1,MergeRequest
