27:5e:a0:29:db:c3:76:61:4a:d9:c7:60:52:e1:f6:4f,1068469
57:47:66:a7:b3:83:b4:1b:17:e1:04:8a:6f:55:f7:52,4139949
4a:28:5b:11:ef:91:11:8b:a1:1a:4c:d2:e9:32:d9:50,4959365
28:ed:22:ee:49:d7:e4:79:89:8e:4f:a8:56:91:68:5b,3822471
86:ac:90:40:eb:13:70:a1:28:fe:56:28:9e:4a:9b:14,5900428
d8:ce:7f:fb:e7:35:19:46:f4:30:f5:ff:0a:40:73:65,537600
06:5b:a3:1d:7e:88:a6:fa:bf:7e:d0:c6:c9:14:50:71,3675901
9a:37:ef:ab:c1:2d:48:49:25:3f:32:b2:16:ae:7d:80,4815099
b3:a8:98:5d:a2:21:44:f4:c1:94:ec:44:d8:f9:86:90,2571774
52:63:f9:9d:64:b5:9e:0d:87:71:e9:53:4c:bd:47:05,4561362
df:df:f1:08:27:c7:1a:0e:8b:e0:c3:ab:41:5c:3f:8c,3264726
c5:98:05:2b:c4:0f:9a:06:e2:08:19:2e:71:fd:e3:62,198748
a8:85:9c:21:fb:64:e6:9f:37:36:91:f2:af:d1:96:29,4220509
c7:27:04:4c:55:da:8d:41:ed:27:4d:4f:75:07:de:b7,1810413
7d:0f:1c:1c:20:df:a3:07:42:08:b3:e5:c3:fc:90:78,2302310
a4:c4:11:bc:95:c0:be:70:b8:10:5d:a7:9d:72:fc:f5,205877
04:52:a6:d2:08:65:81:6b:f1:e5:2b:9e:29:06:49:f1,814758
1c:dd:82:fd:da:ac:06:ad:d7:86:58:9b:c5:ff:b8:43,1020656
1a:92:bb:54:b9:88:1f:2b:47:fd:54:ec:0b:38:85:97,6014552
97:31:58:fa:62:23:2a:e9:e1:db:01:4f:a5:2f:51:24,3727734
90:b7:ee:0c:b5:0f:90:d2:b4:bc:f9:d1:4f:11:8f:44,2657845
8e:26:af:3f:35:54:64:02:9c:1d:b3:90:72:d5:b0:92,3828453
e0:9d:0e:33:a8:3b:bb:0f:a8:5c:d2:15:f3:d4:f3:4b,5989834
92:cb:0f:1a:0f:b7:71:5f:69:8c:e2:44:af:54:5e:48,3977804
0f:45:71:a3:f6:47:64:bc:23:15:40:d4:a0:a7:76:87,4158345
f2:71:5f:c1:e2:4a:62:84:76:f9:51:bd:43:2d:1b:a3,2621792
1e:69:a3:c4:e6:0b:51:9d:43:0d:ab:55:35:1a:99:16,474996
45:c7:40:42:14:3e:6f:85:5f:19:97:1e:ac:7a:09:f7,5910219
ce:cc:bd:12:82:82:66:ff:86:84:29:1a:11:21:70:71,3798522
2b:06:92:5e:72:27:56:5d:c7:ec:e1:34:86:c7:aa:4c,2872299
a1:ad:24:b5:30:73:ac:ec:0b:77:d8:64:0b:be:4e:c0,1912335
16:fc:3f:3b:1d:c8:9f:82:ec:e8:c6:dd:33:97:c7:ed,1370382
6e:90:71:a2:08:ae:99:a2:1a:03:b4:a7:f5:d3:6b:20,4685476
b0:e7:7a:c2:7b:d8:d6:a6:5f:a4:4c:57:10:a9:0b:f9,5763457
3b:4b:8d:62:08:ab:09:e5:aa:a1:96:ea:2a:a9:b5:25,564934
85:ab:06:61:85:de:78:eb:7f:1b:e5:bb:0a:ca:9d:55,1310821
02:4b:e0:8e:a4:a0:0a:93:7c:41:8c:0b:69:3f:d7:0d,3240391
7c:51:85:2a:5c:a6:6a:95:0c:27:3f:53:79:9e:63:d4,2806089
fd:eb:12:24:a9:6f:83:5c:d8:16:0d:8e:c2:69:6b:87,4344411
7c:d3:82:9c:0a:c6:a0:fc:56:93:bb:3a:51:0a:51:80,5849520
3c:e2:44:02:33:41:3c:35:07:fc:3d:a2:87:f0:71:72,1503903
5d:cd:38:dd:10:4f:6d:81:aa:0b:8e:bc:73:3f:95:b1,4042145
b1:2d:44:3b:5e:85:bb:17:9f:10:53:9e:e9:d1:75:f1,2701179
63:f3:b8:24:24:2f:58:8f:b2:34:71:cc:92:20:25:5c,3664490
60:e0:ee:f2:27:11:b5:3e:bb:de:24:a9:2b:43:9f:5d,4787498
14:1e:f3:41:3a:9d:b9:ee:b6:d6:9c:ca:93:e0:7e:61,4225921
ed:49:2a:05:00:6a:10:f6:52:ce:42:1f:cc:6e:0e:4b,760523
1b:0f:60:57:82:57:41:4f:34:47:f5:42:27:f9:22:c8,3381818
b6:ca:02:4e:94:85:a3:31:72:99:30:92:77:8d:c6:10,5577968
0f:89:47:d7:a2:ea:8b:60:ce:50:3e:bd:03:1b:08:95,5248923
9c:82:cf:8b:9d:69:33:e1:7c:1e:2c:d0:86:19:4e:10,3944129
42:78:f3:ee:d1:f5:7b:17:72:f8:40:00:5b:5d:67:35,1951263
ea:8d:c8:50:65:f4:57:e1:ef:83:be:a1:23:9b:84:14,2707748
21:83:54:55:23:2f:ee:2f:3f:e8:49:ca:38:f6:a7:eb,5970017
54:f6:39:92:dd:3d:38:49:be:87:4c:ac:69:12:41:14,5199819
74:65:8e:57:8d:b4:6a:d0:29:81:4d:29:d8:88:47:3a,795662
8d:1f:ff:fb:4e:fe:30:3d:c6:e4:0f:c0:e2:9b:9e:cc,5012894
b4:b0:84:21:d3:6d:2d:82:02:0c:f1:8e:22:d7:1a:b8,2028139
fd:69:35:75:88:7d:77:44:36:71:fc:19:b9:0f:c7:3e,6004673
56:8b:bf:11:44:25:c5:68:0a:ae:f2:1a:57:79:89:21,453311
42:b9:f6:b3:c1:5a:62:e1:59:d6:10:ef:ee:0f:2c:78,1549516
b7:ce:0d:c8:63:d8:af:b3:43:1d:62:c3:50:eb:90:18,4429164
81:47:dc:28:a2:f1:c3:b7:4a:4c:1b:89:db:b5:46:14,4836323
78:41:3d:1f:9a:79:2b:b6:86:b7:2b:69:69:5a:5d:db,2476705
62:a7:37:56:a5:c0:aa:c7:1f:68:aa:ad:02:13:c3:1a,1417232
8a:cf:79:78:69:a6:f8:2d:c7:76:ed:f6:fc:d1:f4:46,3129243
82:50:81:94:17:d1:8f:07:b3:70:0a:5c:1c:a4:4c:71,4300893
85:2d:3b:d3:fd:95:90:d7:8f:07:00:8f:92:78:c5:c5,1536941
67:e9:16:0e:b3:cd:25:4a:65:70:dc:2f:2e:6a:c1:ab,2489266
aa:d7:12:29:fa:13:3c:a7:ea:44:b6:cd:72:a6:31:63,335275
48:dc:9e:2f:5d:17:ee:0e:3f:f8:1e:70:6d:d4:42:9f,2904387
ab:56:ce:9b:3e:d8:35:2b:e6:39:b8:c1:d1:ca:25:f3,1990773
36:27:9b:1e:39:3e:99:1e:f8:4b:64:ae:39:45:8e:dd,4317632
ba:5f:81:5e:3c:51:bf:3c:30:0e:3c:ea:03:32:ae:a5,3849425
97:71:7b:9d:a2:01:eb:0e:a9:a8:ce:c5:9d:f5:16:78,3885089
ef:25:44:cd:1c:ec:cf:22:2e:15:10:3d:59:a1:cf:b1,2890820
a8:c4:c4:14:e8:09:e0:c0:a7:33:60:24:e7:70:42:43,5706438
f6:43:28:0d:6f:48:01:7d:69:ca:c4:a8:9b:ed:d5:84,3640094
39:3a:48:41:6b:04:ac:fc:8c:a2:e6:3d:b9:9e:88:d9,2495475
83:9d:57:7c:c2:ac:04:b8:32:e4:d0:16:44:a4:ae:84,5742416
cc:87:a5:01:10:3f:7c:51:93:64:dd:e5:3f:d6:b0:00,619865
43:42:51:82:8d:af:9a:47:29:67:da:76:58:78:96:b7,2346190
ee:99:6c:d8:bb:2a:85:34:35:85:9b:5f:5e:7e:c5:3e,3030308
f9:1f:9c:c2:e0:8d:45:13:32:ad:19:69:ef:ae:58:fa,2010300
60:5c:35:fe:fd:dc:36:c8:7e:eb:eb:a7:95:63:bf:14,376189
e4:b6:c4:4e:a8:5c:8a:7d:86:2d:56:33:b8:ea:1d:0b,1143462
4e:0c:7a:2f:c6:5f:b3:8d:01:3e:bc:cf:56:cb:f2:b8,16821
20:c4:88:79:02:a1:b3:73:91:f8:d0:ac:5e:78:8f:66,3539384
37:eb:45:82:5d:11:00:3a:b9:24:0c:1d:c3:e5:c7:72,2651602
c5:58:39:8b:a3:16:8e:d3:51:ab:5a:fd:f0:aa:4d:da,5086469
c5:db:cf:1e:ad:ec:aa:a0:80:a2:12:f0:b4:ad:31:74,2552891
a7:48:90:7a:6f:72:91:c5:a2:9e:41:11:c3:cf:a9:52,1880128
8b:dc:78:1f:13:31:ad:00:fe:96:63:d3:06:fe:05:64,2089966
ed:c9:e7:cd:73:cf:35:1a:d7:f2:27:38:fd:04:d5:07,2520875
16:70:67:8e:60:37:f5:a3:ce:86:4a:2c:e2:d4:10:0f,3562237
15:28:64:7d:13:3f:26:c5:6b:0e:f2:39:03:d0:6b:3f,5322394
a0:0b:9c:85:19:61:b9:c2:e2:61:da:db:7a:77:26:15,6069048
1b:92:52:48:3a:cc:8a:93:a1:6a:63:94:ac:e0:80:fb,5679998
5f:0a:9a:52:a7:80:ba:11:54:3b:07:b8:84:2e:79:d4,5348747
2d:ab:d3:e0:1e:b1:33:59:5f:a6:2a:fa:fa:b6:ed:de,131579
ed:8c:c6:26:16:8c:92:12:cc:62:a6:2d:b1:b3:b0:2e,4507265
5e:88:ab:49:ab:72:0e:48:b8:8e:26:d2:55:a1:78:a8,5543237
93:11:22:f2:81:f0:7f:c9:8e:4d:b5:b9:2c:f8:6e:42,2817742
5f:4d:3c:e0:f5:7f:af:d7:09:8d:ed:55:3b:0a:6e:e8,4334465
a9:88:41:6c:74:8c:26:9c:9b:1a:0c:12:83:31:c1:c5,2533204
ff:7c:12:dd:6b:a5:f8:2a:94:0f:b9:68:52:db:55:32,3774459
9b:05:e5:ea:8a:78:5c:4d:e3:d2:4f:d7:fe:43:42:5d,266306
ad:18:4f:d2:6e:c9:23:fb:1e:41:7a:50:fb:98:8a:2e,3005480
47:56:a7:0c:2c:e4:af:0c:f7:05:ad:6e:1d:f3:bc:cc,3768590
68:a9:a9:ab:72:f4:13:9f:2e:e2:0f:a1:f4:38:9a:a0,3435552
a8:48:4a:2e:b7:1c:ac:46:0e:cb:5d:a9:80:04:b8:5f,5859853
8a:93:5a:68:80:d7:b0:8d:77:88:4f:32:aa:0b:c5:bb,6098165
17:3d:35:e6:8f:22:30:cb:fb:d7:bd:9e:e7:9f:3f:02,3744794
89:89:88:15:68:d4:c5:b2:2a:a0:2b:93:bb:5f:b6:ee,947414
0a:0a:f0:6f:3a:60:6b:d9:2b:93:78:bf:08:b3:b7:93,418596
57:09:78:7a:14:13:4e:66:fb:81:97:25:e4:f1:46:aa,3455268
8f:1b:15:af:6c:b1:78:fa:14:a2:5d:a0:1e:bd:f3:17,2986700
2a:c6:fc:a5:83:f0:02:92:fc:48:57:05:22:55:93:7d,5794118
3c:57:37:b9:b2:aa:46:5f:ea:26:60:bd:02:f6:e6:40,5033309
61:e2:ce:88:0c:2c:01:5e:56:d8:9f:53:0a:e0:6b:fc,4869061
9b:86:53:9f:6f:0c:9a:46:1e:9c:0f:16:0b:b8:0b:11,5905333
da:53:e6:e2:61:11:03:11:ce:4d:ed:71:2c:5c:b1:47,5864694
95:a7:a6:4e:fc:cc:2f:18:0c:28:7e:f9:6c:b9:1a:5a,2108679
4b:60:36:cd:a6:9c:38:7b:5a:03:e1:e6:73:21:13:b5,3229194
25:58:3f:6c:56:62:aa:7e:53:94:b8:e7:20:0e:48:a3,5139886
1c:98:ea:3a:9f:8b:2e:33:38:8e:a3:d7:0c:c6:0a:5b,5454520
48:9b:99:77:7d:30:d8:79:3a:91:83:23:4a:66:57:32,1816753
ff:bc:b5:42:92:50:55:95:a2:d5:49:a5:8a:67:33:e7,115349
79:47:11:86:09:16:da:df:b7:84:7a:f2:9d:7f:d1:41,3503454
dd:9d:77:48:2f:9c:54:de:f7:38:f1:14:9e:6b:ec:3d,2276293
91:7c:ef:b2:41:ae:d8:ac:ca:fe:83:49:c2:32:e0:0d,2172951
d7:fb:6d:23:0c:21:03:8b:67:56:80:ed:9b:04:8a:10,1184417
99:bc:16:57:0e:9f:b3:f5:c6:4e:66:fb:ee:fc:4c:aa,5480433
e1:a1:9a:c3:e3:5b:26:ab:35:59:45:b9:d2:27:15:03,4932650
71:56:75:29:ed:27:12:46:33:1c:23:e9:f8:be:6b:2c,221526
ca:01:d7:ac:5d:4d:af:05:bd:f4:c1:73:df:52:56:6c,327496
29:2e:9a:91:b5:44:ca:30:cd:66:3f:ea:4f:de:39:eb,3422858
fe:2c:a7:58:12:1a:03:e6:ed:72:86:01:95:70:59:cf,2974506
1f:71:92:29:48:7b:0f:26:4c:f9:df:56:57:dc:88:84,5674684
1f:32:66:03:a0:e4:1f:b4:db:ba:ad:39:1c:2e:1e:4f,3491261
a2:b7:f1:0e:4e:f8:34:c5:75:1c:d3:e3:da:48:7d:11,4985796
ae:22:0a:ea:e9:36:7c:42:e2:09:0b:3f:a4:ef:09:64,3277036
a5:02:2c:73:73:84:7f:61:cb:78:34:33:99:83:a9:25,1484695
6a:41:5d:c9:04:9a:08:d3:9c:0a:36:ed:3d:6f:8c:a7,1615324
36:68:85:2c:a7:6a:ec:23:04:56:d2:1b:4c:f0:78:99,66133
d7:75:22:c5:a4:83:cb:76:81:cb:81:ee:57:b4:c1:42,2040576
b5:bf:0b:cf:31:9c:65:8c:10:ae:3c:ae:2f:d7:bd:27,1997099
d4:a8:bf:08:98:a0:44:7b:80:46:97:d0:7e:b9:8d:bd,5333510
8b:95:9f:2a:ae:02:8a:77:d0:1c:61:f2:07:79:0f:ba,4463321
7f:cd:d9:e9:b4:f2:5c:a4:fa:c6:fd:5c:57:53:25:fe,6038887
fc:70:cb:1a:73:43:3b:a0:f9:7f:9d:5e:e9:b8:15:8f,5752775
d0:59:8d:5a:5a:c9:8f:e1:a8:7d:5a:24:73:60:92:6d,2917232
b2:ea:aa:7b:1d:a3:c1:e3:47:eb:dc:6c:5d:c6:4c:f3,5920456
d7:37:17:16:86:46:ba:d1:77:21:94:a7:0d:ee:40:ca,2968279
9f:c7:db:b0:d9:fb:7b:21:e3:6a:2a:72:85:36:41:04,6054241
76:b4:3a:34:85:2b:2c:2d:a5:9e:e4:09:e2:08:59:25,5660034
4c:f4:1f:de:48:52:48:da:5b:6e:89:73:92:c0:1e:75,4001368
89:0b:06:81:3f:3f:ff:57:57:76:3a:16:ea:27:77:bd,1491194
9e:08:21:86:99:80:5e:b9:17:f8:4d:9b:e5:88:d0:66,146420
10:d8:4d:33:91:7b:3e:d4:8b:85:ac:e5:64:1f:56:d1,2670534
39:7c:91:b1:ce:a0:9b:7d:06:fd:7c:4c:8e:03:b2:b2,5804018
54:b3:f8:35:a4:91:a5:b8:d7:95:4d:07:3b:e1:bd:7e,83624
94:51:e1:be:62:12:ea:3e:f6:4e:a9:92:67:d3:d1:9f,5365453
8c:e1:31:05:e4:6a:e8:ca:52:2d:b0:90:bc:85:cb:0f,191628
45:05:ba:cf:2a:45:23:5c:d1:bd:04:7d:6c:ec:8e:00,313183
96:ec:aa:51:44:ac:b7:3e:d6:a2:e0:2a:86:6d:3d:f9,1082487
f7:11:0c:9f:ea:c0:22:27:22:93:2e:67:ba:9a:53:a1,3338215
c4:1f:54:1e:c3:c5:ac:67:fb:d6:ed:77:84:5b:fc:6d,2728114
62:27:a8:40:57:12:b6:38:34:67:c1:2d:27:4e:6e:87,3961140
21:c1:1b:1a:84:0b:2d:39:86:b5:96:1e:fa:6c:b6:6d,3585481
73:20:e8:14:ae:83:68:c1:fa:65:fa:cb:fd:56:19:49,1390524
5a:24:d5:48:10:dd:33:81:4f:cc:83:6c:36:b1:1b:d5,4964410
9e:8a:06:be:00:f6:28:91:b1:e4:4b:c9:d0:c1:4c:1d,5290465
56:ca:c9:26:79:dc:53:59:1e:af:ec:66:f8:ed:3c:52,4550728
52:e5:88:98:4b:57:c3:e7:25:29:98:a4:5c:64:d7:78,5945942
1e:ad:a2:58:0f:03:f6:0d:7f:c3:d4:a5:67:f9:df:3a,1976968
29:b6:8e:ed:67:0d:f1:85:e9:d1:8d:ce:42:40:c4:c8,4322859
35:1f:0f:42:7c:95:c4:1b:10:79:4e:3d:3a:fa:a6:a6,228626
59:e5:23:64:96:5f:05:81:18:7b:36:75:eb:0e:a7:1d,5623817
15:6a:44:52:f9:0f:f0:e3:41:6a:4e:69:58:ae:d6:8d,5023344
fa:f1:b2:57:a9:c2:14:62:e7:ff:9c:4f:8a:5a:32:0c,5618360
6f:8e:c4:4f:15:0b:f9:d3:d3:cf:cf:d6:43:79:fb:c6,1000362
d5:26:87:46:a3:4b:b3:50:49:5f:d6:9b:77:bc:28:55,4980131
a7:04:73:f3:8a:e2:c4:36:5f:b4:1f:33:2c:f7:82:d1,4713196
93:93:13:78:c7:58:bb:3b:d4:17:a0:b5:bc:df:e6:6b,2096625
cd:48:01:7c:13:ad:74:5d:90:be:b9:f5:b8:fe:0c:bd,4025811
2f:f3:9c:e4:9a:63:41:f3:07:4f:7b:21:cf:81:71:6e,2540258
eb:88:86:c0:18:87:74:0f:75:bf:64:73:24:be:aa:3e,3966216
86:32:5b:22:08:7a:18:b5:1f:60:e3:40:27:10:99:4c,1191060
0d:a8:2b:48:e6:7d:92:b0:c8:6b:2f:d2:33:eb:ec:4f,3533505
fb:74:bc:82:bd:f3:37:92:5a:c4:8c:f3:71:57:e6:08,1224047
2e:a7:31:a8:bb:30:c0:1b:52:0e:68:9d:02:5f:47:8d,654312
33:5d:a4:10:ef:eb:b9:4d:da:f0:04:14:2c:65:47:17,1925206
ec:cd:7a:0e:eb:d0:dc:fb:6a:65:c9:b9:5f:a5:0f:2d,5391404
22:87:6f:60:4b:d7:c1:8f:57:3b:e4:13:b6:c2:e2:28,6019518
4d:c1:7f:12:2f:67:7f:e6:33:df:3d:35:b9:71:a3:06,1530923
2f:6d:27:c0:28:8e:1f:04:bb:9a:fa:03:09:97:18:05,1861500
2e:e6:80:1e:aa:46:a1:f7:5b:13:8a:07:c5:f8:04:1f,5727442
5f:91:d0:1c:b9:1c:37:07:4e:93:27:16:d6:9b:ad:ac,1197613
d2:9e:99:6d:af:a4:68:00:fb:92:7b:11:82:cd:7d:cd,1384034
34:e4:36:0f:71:07:16:d1:0f:90:da:17:16:45:d6:f0,4095034
0e:71:6f:8f:c3:dd:9a:76:18:56:2f:b4:d4:7e:c7:64,5065560
21:3f:4d:bf:dd:1a:08:8f:74:f5:4c:24:ae:bd:f6:f6,3288900
b9:da:2a:95:d1:64:26:aa:04:0a:5a:2e:c4:89:dc:ce,4100059
e8:ca:67:6f:37:80:19:5b:5c:e6:90:62:02:37:a8:6d,5194382
f1:68:5c:4b:86:8d:2a:e4:61:b1:d5:ad:c4:b9:4e:a5,986985
a8:05:ca:46:c9:9b:13:c4:5d:f9:87:1b:55:04:f8:76,1364175
60:9a:4b:8f:b7:31:1d:e8:6b:e5:4f:c6:8c:d1:27:26,6043990
a1:ef:a0:92:c8:de:cd:59:dc:30:7e:a5:3d:24:b0:1d,1423954
8d:9c:99:22:95:a3:9c:8f:b7:a9:94:6a:50:f3:e3:1e,4089330
33:9f:e9:ec:ce:6c:62:05:aa:be:98:af:3c:ba:82:c5,5778592
8a:4e:54:9a:7e:32:4f:41:40:98:21:97:da:cf:e8:fc,404592
c7:ab:be:25:fb:db:28:dc:4e:c7:3d:24:47:7c:f5:9c,5316478
b3:ec:bf:71:aa:88:bf:13:8d:28:73:19:27:72:39:f4,5602670
41:bc:35:72:da:e8:cf:fb:00:f3:34:78:10:bd:9d:9b,3983109
93:d0:0c:10:23:86:22:8b:96:34:a1:40:79:5e:c1:86,4770452
14:a5:05:bc:b6:9c:85:30:11:9e:8f:19:7f:f4:f6:88,1136513
72:9c:f5:b2:a1:cc:31:3d:8e:12:61:42:18:1f:aa:ca,5161784
ea:4a:85:e9:a4:bc:62:ef:da:6d:ae:c3:81:da:48:b5,3461166
ff:33:dd:89:c7:5b:25:d0:94:7a:6e:5d:03:68:69:5a,426155
74:e2:bd:e7:c7:45:24:45:ad:fe:29:39:79:00:e7:64,3188417
5c:81:89:88:08:ff:69:15:aa:37:77:bb:c8:9a:06:81,5002781
6d:8a:d9:e1:11:28:01:cc:4b:68:d2:aa:87:66:29:9d,5376486
cc:c9:8a:ea:94:50:d3:b8:8e:87:8e:a5:09:32:b7:b3,5059936
0e:2f:95:12:b8:9c:fa:4d:d9:8c:f7:7b:9e:eb:05:77,2250728
40:3e:e3:9f:16:7f:d7:e9:26:ef:20:5a:3a:d7:e5:1c,1984050
22:cc:10:ed:5d:b3:70:5a:f0:07:b4:f3:89:02:0d:d7,2133033
f0:e4:db:1b:ca:37:dd:49:78:1b:86:f8:32:d8:3e:5a,1804191
07:f1:93:65:0b:59:e5:41:bc:41:88:97:8c:15:cd:e7,3739025
c8:b6:67:6f:9e:cf:0f:de:bd:24:69:7c:6b:c2:7c:dd,1102523
d3:1f:7d:53:09:24:8d:9c:0d:47:91:b3:b7:a8:b3:d2,2739614
f6:ca:2b:4e:b8:0d:98:a0:4d:39:d1:7f:e2:1e:24:f3,4452044
e3:ef:6c:56:c4:1c:c0:d7:7d:ab:7f:63:72:0f:8c:12,2382705
09:87:e4:9b:89:4e:56:b6:8f:d9:90:4d:ae:67:7b:b8,1841666
02:04:bb:1b:1e:ec:3a:de:59:e0:ca:09:0f:74:3a:28,3326103
3d:6f:3f:f6:87:8c:49:1b:ba:06:be:33:24:9b:8f:72,6024118
95:24:e2:62:db:53:cd:55:6e:47:fd:e3:eb:eb:9a:cc,4841780
c1:8c:94:66:ad:23:69:f7:12:7f:51:26:2c:c9:ca:40,1150602
cd:8c:c1:4b:58:3d:a0:4c:d0:e6:2b:67:79:ae:69:4b,4283667
13:5d:5a:bc:c0:c8:bc:db:b3:e1:9e:1b:b0:0f:04:c7,4594709
cf:d6:f6:c1:d6:10:bb:50:4c:d5:e8:ea:7d:cc:95:cf,2664294
cf:9a:0b:71:21:ce:e8:e6:b3:ff:5a:6e:87:88:aa:a8,5396787
4d:3a:41:ab:44:0f:94:46:35:b2:38:b7:4a:51:12:cc,390386
e6:7c:7b:c5:e1:66:7e:73:a4:0f:6a:f5:e0:03:d7:7d,5422697
50:5d:63:a3:0f:df:38:52:61:73:b2:27:82:81:d2:55,1790923
6a:c2:0a:88:f5:ea:ba:7a:4c:ea:5a:06:91:00:05:ca,1123871
e3:2d:d5:c3:e9:d1:2b:46:50:a9:c4:70:78:e0:c6:5b,5994757
e5:7a:d9:c9:7a:9d:2c:5b:79:2c:6a:2b:3e:61:f2:fd,4423434
0e:bd:64:ab:e1:f6:62:b3:93:cf:bd:39:94:f3:95:03,2689178
70:15:f8:b2:e9:60:52:1d:e8:5f:a4:24:23:e6:7c:7f,4793085
10:0e:e7:18:4e:ca:40:99:51:2e:f2:34:13:32:c6:81,6102558
d9:46:bf:66:f9:7a:84:72:5e:ce:cb:67:e0:e0:0e:c0,3393102
ce:89:d1:59:b3:c0:e3:11:33:24:f1:b1:77:44:41:c2,5607982
71:15:7b:fd:70:b0:8d:2f:63:f9:43:04:be:68:ea:9d,2034079
80:cb:c0:68:d8:b0:3b:22:d9:16:d8:f7:d9:21:d1:e3,4152072
06:13:d6:46:52:3b:d6:5b:33:6f:01:04:9b:48:53:af,3497691
55:ca:68:10:74:6f:be:9e:57:55:42:a3:8c:06:db:40,1854710
1d:e0:96:7d:72:af:89:26:d7:55:64:4f:e4:69:61:2f,5964839
7d:4f:6d:b3:9d:fd:0f:84:6b:32:5f:3f:97:37:8d:4b,4667666
12:a3:4d:b6:8b:98:2c:ca:38:c4:14:f7:3f:93:0b:9e,1963714
1b:53:80:0f:31:1b:67:fb:3f:43:18:e8:7b:6b:10:55,3485293
ca:8d:a4:ae:69:3f:70:37:b4:6e:28:9a:16:46:c1:b4,5829475
9f:4b:95:b8:09:16:25:6a:60:c6:4b:0b:9e:77:52:62,4249089
79:84:22:74:e8:47:b8:19:01:52:9a:ea:f9:b5:6c:d5,2746102
47:0e:93:cd:cf:cb:40:81:ea:20:e3:af:e0:02:ab:f7,1602160
0a:4c:8d:a6:67:9e:f1:a3:4a:fb:e6:80:7b:2d:cb:1d,2764074
fe:6a:5f:fd:c5:f4:b9:a1:ef:cd:b2:49:dd:31:63:6e,5113283
fe:ad:f1:53:b9:a4:d6:ad:43:38:88:c7:ae:eb:86:f4,5295677
c3:51:78:3d:be:a8:a1:d7:4f:f5:5b:5a:e1:1b:e6:29,3574260
fb:36:cc:62:ba:53:b7:d2:13:cd:bf:67:72:57:e3:88,802263
36:e6:76:dc:6e:e6:dd:f0:df:75:97:bb:39:ab:45:59,5343722
50:20:f5:31:39:58:6f:20:ed:0f:2f:e2:4c:62:16:e5,4209024
54:6f:bb:5c:4a:eb:00:fb:d5:09:14:a2:44:2f:d3:a8,2389119
81:ca:69:07:07:fc:45:aa:23:b7:82:66:50:ae:b4:79,5854776
d5:ab:3c:73:b3:03:de:7e:27:7f:08:c4:a2:14:84:50,1918569
a1:25:d9:7e:03:98:16:68:fa:25:02:b0:c7:5e:f0:e8,4858035
fc:ed:4a:4a:fa:fb:42:ff:cf:82:43:7f:54:a1:46:6e,348519
2c:60:4f:a5:d0:13:5b:8e:9e:ee:64:69:d7:58:48:14,4916201
58:13:a8:9f:48:5b:b7:30:5f:51:7e:fc:80:d4:5b:a3,1568125
e3:aa:e4:ef:fa:60:0a:84:83:89:d3:3b:68:69:ea:66,979853
2a:44:1b:a5:33:57:3f:46:1a:b8:bb:98:27:ab:45:92,1542931
93:50:c3:ab:e8:05:a1:d6:0c:8d:2b:e3:7b:94:1e:a2,3896122
fa:2e:3b:84:6f:67:16:e2:2d:cd:34:f5:49:4a:a6:ee,5178029
07:b3:38:21:f8:17:f0:fa:87:8e:8c:5a:fb:22:b3:af,516068
49:a2:3b:b2:31:35:4a:1d:06:30:e1:65:a7:03:91:c8,2340003
cd:06:c5:a2:a7:cb:e6:73:62:04:31:8f:dd:ea:d2:55,1330692
a3:7c:d1:9c:ee:c1:40:94:93:9e:95:d3:44:d8:bb:a5,2016265
79:c0:9c:66:ae:ac:dd:cc:de:ca:7d:9b:b3:2c:cb:67,1458078
44:83:37:51:40:9f:c1:69:4a:3c:16:a4:1a:37:e7:54,2192205
a1:6b:b9:8a:e6:92:c8:50:28:ff:04:df:89:aa:0b:a6,5495420
74:a5:61:cd:ab:49:01:8a:5b:78:bc:d6:2e:97:3f:47,1656241
59:9f:bc:12:b5:f2:0d:57:ae:ab:c5:d3:55:98:39:d7,4434682
a0:4f:52:36:88:58:85:cb:78:9d:a0:f3:ad:2e:14:95,3913446
db:e1:6b:51:a8:6f:43:40:ea:36:dd:cf:28:7b:77:ff,2395369
1c:11:5c:80:c4:a4:27:f5:2b:e8:95:49:94:58:15:93,3135408
35:a0:ed:f9:a6:b6:79:87:ac:ad:12:99:5c:fa:ec:cf,2218226
9c:46:51:e1:5e:c7:72:76:1e:14:cd:a0:8b:4e:a3:6c,4366280
75:ec:30:0b:86:c1:64:61:84:16:63:6d:71:c4:06:a6,993307
b4:2e:1e:2a:f2:59:3d:21:d2:03:f5:f2:86:64:19:69,641060
e9:4b:a8:c4:c4:ce:52:ac:dc:1f:99:64:2d:06:59:b8,5889873
e2:ad:32:28:10:07:a5:75:8c:23:25:23:8e:54:a8:3d,5411993
76:2c:59:91:d0:34:5c:75:9e:f0:de:be:a5:b4:fa:79,5306199
88:03:f4:b6:b3:ea:ae:fb:a0:30:fd:cd:74:33:c2:17,4884848
01:86:ef:ba:a4:5e:e2:d3:5e:57:96:c0:b2:be:a1:7e,3061226
e7:88:da:ba:4c:01:0c:3e:ef:16:b6:aa:73:c4:e5:62,2590083
f8:5a:c2:86:20:c5:ab:57:30:59:f9:b8:d7:a7:99:3c,2961356
72:1a:bc:5b:7f:ed:5f:93:e6:47:52:04:e9:4a:0d:a9,3182836
a2:2d:b6:5e:a3:a5:be:fa:38:e6:00:2b:5b:d4:9b:32,3448577
f8:16:93:81:88:c9:e6:c8:87:ff:9e:39:4d:6a:c8:df,5639052
d8:88:16:c7:6c:c3:85:c8:df:5e:e4:27:be:35:27:36,3681661
3e:3b:37:3c:d5:0f:22:6b:a6:b7:7d:6b:d0:87:db:82,4650568
5a:66:0a:07:77:5e:31:aa:76:2d:60:1d:13:e9:a6:0d,4197656
3d:28:52:8d:88:a0:c5:f3:34:c6:fc:1b:cf:28:35:fd,2463526
77:ba:58:ea:9b:71:29:a4:79:20:af:cc:d6:6b:ef:da,2295976
c2:51:48:08:a4:1f:27:41:cb:9f:0f:fd:5f:a3:42:85,3989128
51:e5:8e:52:06:40:ef:b5:26:f7:f7:2f:5a:73:b5:3f,5562816
a9:48:18:95:4e:39:1d:96:b3:50:0d:24:6d:2a:f0:3c,2682713
45:8b:b5:4c:7b:c1:88:1e:4c:ac:cf:4c:9f:12:63:26,4007618
df:a5:e2:d7:66:2c:e0:a7:cb:4c:4a:3f:bf:e5:a8:0f,5984756
c6:e6:86:e8:43:81:ed:d9:37:e2:bb:cf:55:34:49:20,5500715
d8:3f:d4:bd:0a:3f:e5:77:f9:0b:55:d5:55:68:af:2e,5819186
b7:4e:49:46:75:2d:f6:8a:25:15:ff:c8:c9:8f:32:75,5788509
67:ab:19:5c:3e:af:76:a5:43:55:97:f9:68:49:68:c3,3835800
42:3c:ab:e1:35:70:03:2b:5f:c1:a3:fe:78:10:78:fd,3937838
1d:62:a3:90:7c:48:78:b0:30:58:bb:76:ad:2b:34:4a,1157320
de:9e:58:dd:77:b1:d0:21:42:e8:35:e2:70:ea:1e:9c,753868
85:6d:46:38:bd:85:3f:19:a6:8c:ee:8a:86:8d:ab:24,1054505
7d:cd:32:ce:0e:9f:4c:8d:02:2b:16:7e:33:85:83:42,1257973
0a:8b:da:10:8e:f0:a9:68:a9:3a:cc:3a:e7:f2:21:36,6059277
79:09:5f:55:c9:e0:a7:db:9e:9c:c4:cb:92:72:6c:31,4312187
fe:ee:7f:d1:f6:0c:ef:47:2e:23:a8:18:1b:15:75:54,1277523
fc:af:02:a4:ff:5f:c6:d5:e5:c1:49:e5:15:95:84:83,2244816
dc:62:9e:e9:26:a0:22:63:f8:cd:c1:70:0b:c1:1f:a8,1621684
23:92:6a:31:67:d2:98:41:d9:77:0f:3b:2d:58:d5:2b,5960286
6e:0e:c3:d3:97:4f:9a:0c:47:37:c0:f4:4e:7e:6f:9c,1715136
be:85:75:50:c9:ba:fe:05:dc:0a:7a:78:d3:04:c1:6a,4036814
db:9a:5c:d9:d4:19:01:e7:d8:21:08:20:cb:8f:a5:ca,5558080
31:81:71:9c:79:53:75:28:59:4a:82:e7:ef:0a:42:5b,3580079
9b:c8:4c:98:b9:7b:9b:45:7a:cd:c5:24:ac:7a:dc:51,4696404
bc:f6:7e:0c:cf:f4:e4:65:1a:67:71:04:12:c8:99:b7,2059805
c9:37:25:a1:38:94:09:7d:e4:b2:a5:d8:cd:55:03:ad,4289273
0c:96:54:1e:e7:41:bb:db:07:34:4e:92:56:87:2e:c5,446569
f5:00:b4:63:37:3d:0f:3e:da:a5:a8:a0:14:dc:c0:27,1211430
9e:cc:44:06:7e:ba:7b:85:16:ef:23:a2:65:82:7b:37,1727332
4c:b1:67:4b:46:a5:2e:9c:e1:cb:05:58:8e:10:6a:03,1886839
ae:e4:b4:1b:fd:09:00:83:9c:00:05:88:da:f6:f8:15,50248
48:18:e8:22:4d:4c:f5:5c:83:10:7d:02:20:61:3c:0a,774476
2d:e8:73:9f:23:cc:6b:15:18:7d:be:21:23:42:81:b9,2799960
4a:69:25:70:d0:ff:41:5b:9e:36:2f:54:ab:f0:93:1b,3017771
88:4b:2b:56:13:28:4f:85:8b:34:d3:2e:d8:c9:dc:40,3301337
8f:a0:2d:a7:ef:2b:8a:ca:86:3b:c8:a6:fc:ea:e7:4c,5936219
ee:55:6b:88:10:a7:29:1a:fa:dc:cf:35:e3:3c:aa:f6,1230780
c6:67:12:2e:af:c3:b5:e8:0f:e2:17:aa:91:c5:42:de,1303735
77:77:65:77:cb:55:e4:35:88:8c:bb:e5:2a:24:c6:84,5258904
3d:b8:3b:6e:e3:b0:7f:11:09:85:82:ba:14:45:ae:13,1350722
7e:d4:0a:21:ca:7a:ef:2c:a7:96:dc:0c:0e:92:e7:55,3652105
a7:c6:49:a9:d9:d5:33:33:a7:f0:2e:26:1c:0a:d2:af,3363863
83:e1:bb:0c:5d:4d:84:66:3d:f0:b9:d6:88:9b:4d:06,4128601
32:94:2f:e5:55:8f:f4:92:1b:79:de:62:f1:e4:fd:4d,2884732
61:9e:29:39:ce:e0:03:c9:6d:44:9a:51:39:fe:1a:4a,5814195
ae:66:bf:42:e6:71:9c:30:b5:0a:1b:7d:3b:c7:7d:92,4617560
56:48:cf:be:86:66:95:6e:ae:f2:14:83:07:ff:21:33,3918772
49:e5:95:f9:0a:0b:8c:4e:c2:7a:32:ff:2e:1f:08:43,2198747
40:c0:dc:3d:52:d0:4d:25:9e:db:8d:38:97:8e:8f:ad,3810104
c8:38:b8:98:4a:20:06:4f:8e:a7:a5:7e:8d:51:56:da,1669136
5a:ed:7d:6d:91:f1:ea:43:3e:52:5b:98:2f:02:d2:d4,4533911
6c:00:9e:4d:28:a0:eb:99:a0:6a:22:81:b7:17:f7:be,3867300
74:25:0c:6e:bb:e7:83:8d:1a:2b:a0:39:7a:63:9a:e8,1237309
33:dd:9e:80:0e:b0:f9:6f:98:3d:bb:a9:8f:67:06:98,5511000
66:9f:1d:3c:d9:88:8c:4f:cc:e6:27:1e:e0:6e:49:9e,3171023
e9:8c:b4:67:b6:84:8a:cb:10:72:4a:c5:23:14:96:60,3972268
50:de:e4:92:fb:58:58:76:ba:16:e3:3c:e5:38:ff:ae,5722280
92:48:75:4a:dd:2e:9d:4c:5f:2f:78:7f:7f:2b:82:4a,1117362
f0:24:6d:49:bf:b1:ec:12:62:f5:26:fd:1d:61:8c:18,1403801
5e:08:81:6b:75:6f:f0:01:6c:8e:37:6f:92:de:d0:5c,2072640
c7:65:15:14:47:60:11:8a:b5:a0:ea:e7:70:3b:20:50,4555668
a3:ff:d2:04:89:8a:ae:f1:79:ba:54:1b:d3:30:e3:f1,3141149
db:16:8e:d0:fd:16:5d:39:10:1e:41:69:f1:90:0b:4f,481992
4b:e2:1c:ec:4a:fe:5a:1f:e2:e4:01:02:13:38:e2:60,5768370
14:64:2e:fe:5b:9d:5d:49:1d:b1:95:d1:8a:74:b3:39,4758588
c2:d5:4f:72:3e:21:19:4c:03:a4:e0:d4:6f:e2:88:a5,213847
2a:84:97:61:2d:c9:eb:de:96:87:37:ac:59:bb:4f:ec,3995296
91:bd:7b:3d:0f:73:19:38:45:d9:62:b6:37:e1:61:dc,3931861
27:a2:52:47:1e:4c:d2:f1:b1:53:0b:67:bf:a4:4a:a7,5628851
51:69:0d:b6:9f:b3:03:90:ad:1e:ff:8b:10:d6:90:d2,3780819
17:ff:8c:9d:cc:6a:39:c7:b4:08:d3:98:d4:79:44:58,3479736
7f:15:c9:80:87:84:32:13:d6:70:95:24:e6:f6:e6:ae,5732138
87:2f:75:e0:25:9e:43:92:da:03:e1:2f:75:81:96:15,460294
52:28:b9:fc:97:69:bc:42:91:98:d7:a1:a8:a3:4d:a0,2936268
f4:7c:69:f6:13:88:0a:7d:2c:23:58:b6:76:53:56:70,3705375
7a:ca:4b:b7:6b:7a:45:9d:37:0d:26:9c:82:f9:e4:da,5049187
db:59:64:57:18:c5:ac:5d:27:07:ba:15:6d:47:c5:73,5071052
84:a6:60:b7:7d:23:e2:fa:f9:d4:d1:d2:a5:ab:ea:4f,3350984
08:35:c7:e6:83:69:75:bc:3f:59:97:27:5e:1f:0a:c3,3545315
38:74:74:34:53:20:15:9e:96:99:bc:58:ad:aa:2e:4b,5685063
2c:e5:16:a2:4d:27:b0:cb:67:89:cb:28:b6:9a:4d:a0,4013375
ba:1b:0e:b5:e9:84:74:9e:e7:87:38:5b:16:d5:88:be,3733294
fa:b0:8d:8a:0f:c3:3b:19:d6:c5:68:aa:a3:33:7b:70,3246576
4b:9f:f4:85:6f:ea:4e:b5:e2:57:9d:e8:23:f3:4c:c9,5469981
cd:c7:1f:31:26:c4:a3:43:c7:92:53:e6:2d:bf:bb:09,2327191
c5:1c:1a:09:62:12:86:ea:4e:30:4f:98:85:d3:50:be,4175328
60:1a:04:fd:5e:f9:05:5e:93:14:04:d7:b6:36:f2:c5,1204304
06:e6:3d:93:e1:2f:7b:ac:c0:4d:59:3a:2c:94:d6:2c,5925411
b7:11:9d:cb:7d:06:3f:57:1d:f7:70:3b:3c:f0:d1:be,3954841
11:9c:53:cd:6f:cb:9d:12:72:f1:3d:a6:c3:ae:16:a4,5129136
00:00:3f:37:0a:a0:b6:10:fe:76:43:18:6a:34:82:83,1778090
d5:6a:81:65:f8:00:a4:63:01:de:9a:fc:4d:53:37:46,3908079
25:14:d2:0a:be:df:32:6d:40:13:d4:5e:41:01:b8:c6,2078420
11:17:36:85:f7:71:a5:a9:09:1a:f3:cf:45:87:16:d9,1437868
c4:5b:49:03:d4:e1:9a:9d:9f:9a:1d:03:f7:8e:d9:06,2065873
58:9a:4c:7a:38:5d:e3:be:0d:92:d7:d7:16:93:75:d6,3405264
8f:5d:26:a9:4d:54:f5:36:3c:ff:f6:71:c5:46:a0:fa,2238168
16:30:53:55:23:16:1d:6b:c1:84:58:5a:6d:0e:c2:87,509267
ef:64:4f:bf:17:b7:f7:00:b8:d0:33:91:eb:27:18:f3,1555351
dd:d6:97:4d:fe:9f:ab:d0:71:94:58:34:ff:20:30:42,6111259
8a:0d:6f:24:f1:97:8c:d4:8d:6b:0c:64:e3:d8:2e:2d,2114567
64:e6:3e:0c:78:80:95:a9:31:50:4b:50:f4:48:09:38,5108063
be:41:06:be:90:96:70:51:6f:1f:02:c3:b6:e4:7e:11,5123865
a9:0b:1d:4e:5e:f6:8f:46:ae:66:52:e7:8a:8e:60:4a,3467987
66:27:09:63:b5:69:52:7f:b3:80:21:28:7f:73:42:df,5737401
21:00:b0:3d:a0:00:e1:39:6e:e3:9d:1b:3e:12:9d:3a,92067
c1:4b:69:86:40:60:69:fb:3c:2f:d5:be:39:78:b6:47,1471811
6c:44:5d:7e:d3:e5:3a:2b:2e:77:e6:65:a9:cc:a8:a2,2003062
13:20:2e:db:bb:5c:ad:9e:9c:18:4a:c8:cf:47:7d:b9,1451002
7b:c9:07:46:2f:4c:7a:f4:1b:12:d9:86:c9:19:be:39,3762448
3f:3b:b7:f1:e3:2b:b1:61:de:ef:ef:ca:31:6e:53:ff,5521346
f2:2f:90:92:f0:32:49:d1:fd:54:94:07:04:3c:92:3f,4820493
18:44:42:5f:04:c9:0a:99:ab:79:bf:51:ca:a8:e6:45,4847329
4a:a7:2e:ad:49:99:ef:25:a8:37:38:cb:7d:f8:36:2e,4266464
f3:f9:be:6b:fd:90:a9:02:5c:84:1d:dd:2e:ff:a6:7e,289818
da:d6:43:a4:6b:16:a6:89:17:ef:bb:99:cc:45:e4:94,5834865
a5:42:58:bc:ee:0c:ca:99:2d:3a:9e:5d:0b:ab:5f:2f,4589089
3a:c7:cc:0b:ba:7a:f2:2c:2e:cc:08:bd:b1:52:84:df,5359710
f5:fa:4d:89:11:02:f3:40:3e:1d:6c:fb:2d:3d:51:d6,3223683
d1:99:8b:d1:84:b9:b1:73:fa:b0:62:28:bc:b6:b7:2e,4294733
b4:f6:35:76:ce:bb:4c:c7:50:de:31:3b:5b:16:e9:8f,1588202
98:7e:e8:3b:ae:8b:4f:7c:15:77:1f:2c:64:0d:34:a0,740681
65:6b:84:c0:ad:cd:10:ef:b1:26:ec:50:8b:ff:bb:a0,5081818
a2:f8:25:38:6d:56:d3:53:1c:84:e0:cf:17:73:a3:08,973477
f5:3e:28:d1:8f:05:91:f2:33:0b:8d:da:35:82:3a:f6,2645108
b2:63:e1:73:1d:af:00:83:20:25:bf:23:f6:7c:64:12,2283131
65:2c:17:4f:99:67:ef:39:34:cc:5b:c7:31:e8:20:ad,577289
4b:25:4f:d8:10:e8:74:10:ac:68:0a:56:4d:76:b6:20,1574485
27:e2:49:00:bb:5b:e3:03:e9:24:1a:42:fb:c0:7e:9a,767684
d9:8c:6b:eb:9a:2a:dc:32:81:b4:91:65:6e:55:4a:c5,46
72:5a:08:ac:42:17:ac:94:a8:e5:05:37:0c:18:d3:34,5301133
d2:dc:c1:2c:9b:80:55:34:fd:df:58:e5:8f:76:9d:da,4019718
f5:ba:19:a8:26:88:42:c8:2f:14:36:ac:c7:46:be:04,4232003
63:2d:02:b8:30:4d:e4:14:19:54:30:75:44:85:c2:1e,3515070
8f:ea:1d:77:0a:8c:54:c9:78:81:7c:90:8d:be:aa:3f,6073697
bc:76:0a:67:cc:70:86:3b:7a:a6:97:93:dc:da:0d:09,5216163
10:50:08:f6:46:74:43:89:f2:17:78:ce:c3:56:24:ee,2633826
65:a9:c3:f3:f6:09:d3:93:13:22:98:fc:3e:da:10:b0,5950525
0b:e0:14:a6:41:65:db:39:03:94:4c:07:d2:c7:6b:d4,4691018
89:cd:b1:4e:53:b3:9f:6c:a6:25:5f:38:05:ac:1e:cd,1338045
53:27:20:7b:ed:3d:ce:b1:eb:59:bb:c5:03:24:05:9c,4583587
46:cb:2f:5b:c4:65:13:17:b2:b3:ab:09:06:0b:7c:78,3756396
3b:08:5c:ef:90:90:01:58:5f:bc:cd:93:8f:61:c3:b1,4747302
23:4f:16:f4:f9:08:f6:58:6c:b2:4e:e7:e8:75:fa:72,5824607
7b:4b:34:dd:6c:3b:f5:30:9f:5b:51:c7:ba:82:d4:23,138776
cb:cf:46:c2:4d:3c:30:c3:21:4c:e4:c7:f6:3e:03:64,2776480
3f:be:fc:71:a2:a2:43:5f:a3:82:5c:48:87:47:fd:da,6115689
af:27:81:6f:54:38:4a:55:4e:74:cc:0a:21:1e:6b:22,383227
6f:0c:93:67:44:31:7c:ee:eb:2e:96:4a:be:6a:28:98,2053692
f0:67:01:12:00:75:39:50:e9:e9:51:9a:e0:30:8a:e9,4544878
7a:00:1b:5f:28:41:2f:b9:19:c6:3e:79:f6:9d:e8:38,5548093
eb:0c:f8:95:76:fa:37:c4:3a:99:41:f5:40:58:5e:d1,4031186
8c:1b:32:7a:1e:49:2f:5c:a3:97:75:dd:8e:96:0f:4d,2993752
e1:65:84:74:89:b4:6f:4d:78:6d:0a:81:38:81:34:15,3722530
c9:7b:4d:05:15:60:8b:9a:4a:f1:36:e3:72:b7:fe:ed,5587715
97:fb:1f:e3:03:cc:0b:d0:d3:cc:30:a4:99:3a:ec:fb,4501981
2b:8d:4f:50:95:05:23:4d:31:64:c3:ca:a4:72:74:e4,4798948
d0:96:8d:2f:39:2a:15:30:c9:be:c4:ab:8d:b9:49:a7,701926
1a:d2:cd:8a:87:0a:6d:c7:5d:e2:57:a1:73:7c:d9:3f,6009643
bd:7e:79:88:f0:5d:62:61:2c:2b:8f:81:f1:00:33:05,5221615
4f:98:da:c0:9e:d6:ba:59:6e:b9:c1:47:e0:2d:8d:dd,5879623
dc:9f:34:01:b3:af:89:d7:d5:55:60:77:0e:3c:85:91,440288
ab:18:ed:e8:13:a2:55:06:b4:2c:62:c3:21:50:03:e3,4656263
63:b3:e7:86:0f:2d:ec:d5:71:c1:6c:18:bd:1d:66:7a,3628426
b8:4f:e8:88:9f:5f:bd:03:ab:d7:87:24:61:59:2c:70,4116736
de:e2:c1:0e:29:60:1f:4a:71:29:84:bc:f9:c5:09:08,5485424
6c:81:49:26:cf:1a:c9:ce:69:7f:77:a6:8c:76:47:42,4830823
03:0a:2f:c8:4d:7d:ed:e9:bf:68:09:12:bd:ff:a1:fd,1734179
1c:55:f0:d5:40:9e:cd:76:04:ec:42:28:3f:35:fb:ae,1690098
39:c0:1e:88:3b:d6:a2:8b:d1:ed:34:3e:5b:70:3e:2b,5701010
69:74:a8:ef:06:b1:56:16:c2:3c:01:1a:7c:60:af:78,1510639
a6:48:43:79:44:95:be:db:fb:8c:06:2d:65:77:64:ba,4411489
df:67:3f:fa:94:0c:7b:0d:5e:56:f4:0a:ec:7c:56:92,681380
cb:8e:ae:dd:cc:0a:db:9b:4d:11:a1:e9:36:c6:b1:55,4633983
98:bb:aa:2f:4c:3e:f4:d3:46:1c:e9:2b:f3:80:b5:5c,1765586
af:67:23:06:1f:4f:38:8b:f9:90:5f:6a:e3:09:94:5a,1721167
34:6d:91:5d:9c:14:4d:00:3b:cf:c0:d6:aa:d1:d0:d9,5532125
7e:91:59:f4:f4:52:88:21:7b:9c:59:56:c4:f1:14:5e,2823771
8c:a5:28:27:df:28:5a:89:2f:09:c3:cf:86:17:87:95,4350313
d9:cb:bf:6c:e3:f8:b0:88:4d:47:62:3c:07:52:fd:61,4528473
bd:b8:da:18:ad:d4:06:b9:00:5d:04:75:cf:ec:97:00,1581041
9d:c8:00:e6:e9:0e:d3:65:67:ba:5d:8d:ab:f7:1b:28,3270773
e4:fa:6b:bb:ed:d6:4c:86:6b:86:e1:52:b8:25:58:d8,5449129
38:f5:ec:c2:c1:e0:ae:8c:bf:e7:53:b1:58:af:5e:9b,3387476
d1:13:26:07:50:7c:5d:af:ac:f6:5b:e0:a7:01:db:4e,1848383
c1:06:52:85:42:3a:00:0d:ca:08:2e:1a:8e:c2:4f:dd,4417231
3f:73:6f:f1:d1:42:53:46:9c:2f:68:f4:a3:2a:54:6b,2566019
e5:fe:bf:0a:e3:e4:3d:00:05:ee:b5:cc:ee:e3:75:b8,2139145
92:89:c8:63:4c:e6:39:28:63:f7:0c:83:d4:10:ec:8c,5526843
bf:89:be:81:8c:40:f7:98:0b:6f:b3:ab:61:8c:b7:c7,5370710
4e:53:77:d4:61:3d:ac:be:16:4b:84:de:b4:8c:cc:7f,5711572
c6:22:7f:a0:08:e1:ee:85:2f:f0:00:7b:92:0a:4d:86,3357767
f9:a8:ec:22:8e:df:28:97:7d:53:ab:a3:61:d5:6b:70,708225
3e:7a:5b:a2:b9:fc:af:bb:78:27:f7:f4:44:30:86:b2,4145941
c4:e0:39:c7:cf:aa:6f:1d:a3:6a:10:30:3b:cc:ab:1d,3550743
ad:97:9f:5f:66:15:c2:a9:98:bc:54:63:fb:26:95:0c,4518125
2c:a3:7c:04:eb:e4:96:b7:7d:d6:a5:bd:e1:1b:1d:cb,3159259
7a:8a:4c:ea:9d:fb:1b:2d:bf:78:34:c7:d1:a9:ae:03,1823255
dd:24:8c:5a:92:c9:0b:4a:71:36:83:fa:34:84:ee:f1,2603385
b9:17:a7:ba:5d:e0:25:46:65:14:e9:6e:86:c4:86:c5,1931641
b3:28:ba:18:e7:ee:c1:23:94:3c:69:74:de:4b:5a:f5,734620
66:e1:fe:ac:01:a9:a4:72:c7:3d:85:92:0d:98:e5:cb,2615455
3f:fe:e0:36:fc:08:9d:3e:72:2e:1f:ad:e6:96:e2:6f,1649500
55:42:c1:38:0a:5f:2e:67:0f:bc:b0:74:0e:76:05:e1,4169817
77:3e:0d:d3:9a:7d:7a:d5:75:f7:60:df:1a:a8:b8:b2,2782044
09:cc:5f:4c:86:0c:cf:30:ce:0a:19:61:65:fe:f2:0f,2426603
97:b6:a8:ee:19:5b:e0:60:d5:31:ce:17:93:6d:d5:d0,4383120
75:64:c8:ed:44:a6:1d:29:a1:05:4f:5e:eb:a8:96:17,4600487
41:7a:91:4e:30:53:a7:b1:b1:2e:72:7f:61:9e:14:9d,2546667
cb:52:38:64:c1:67:94:85:7e:5b:0f:de:8f:b6:3b:46,4701674
35:e5:77:fa:26:66:61:d7:dd:a4:80:b0:aa:f1:15:58,160857
05:92:6e:00:66:10:e2:10:23:7b:db:af:2e:87:c3:8b,1027835
30:71:e9:b5:5d:e3:d4:3c:5b:3b:c8:2e:5f:bd:13:22,2211679
86:6e:e3:3d:e8:e1:a6:c7:9c:c3:52:49:32:72:c1:5e,4731306
62:e6:97:ea:7c:8c:1b:e3:bf:da:da:ba:93:48:51:28,1709346
69:33:38:d2:55:0f:78:d3:71:b4:38:f8:d0:8b:fa:05,5783346
ca:ce:86:ef:30:1b:93:48:b1:ee:d0:04:dc:63:68:13,2835736
ff:ff:bc:2b:68:85:23:a5:1f:d6:7c:f1:db:66:a1:14,1040769
83:1c:dc:56:50:f4:cf:8a:f1:3a:0f:ea:e2:e0:f3:59,3206298
68:6a:06:1a:82:2f:24:01:46:4b:e2:57:2f:83:ed:f0,4328820
73:e1:63:a0:64:2e:ca:a9:99:56:64:9c:3f:b2:1e:f8,2788234
35:5f:3d:8a:1b:ae:6c:6d:ad:14:e6:8e:b5:3f:f6:43,4910903
91:3d:fc:17:49:eb:6c:89:a1:95:56:8d:ec:7d:0d:ff,940911
45:4c:4d:f5:3b:ae:b5:38:eb:ab:c0:e0:91:09:1c:28,25535
f6:89:2e:9e:d0:96:bd:85:db:9c:c7:9b:18:71:14:b9,2166540
fa:6d:c0:8b:20:c1:50:c5:0f:29:c2:70:ce:9a:dd:9f,1034385
d6:6e:07:d5:eb:a0:b4:61:fb:00:06:95:41:3f:09:0b,6048940
6f:d3:c0:94:f7:1d:64:f3:61:ad:19:d7:10:72:3c:ba,1444480
28:a9:c9:6e:35:26:cd:fd:3c:8d:17:c1:9b:16:f4:cc,4639046
2e:24:3b:b3:81:cc:b3:ac:63:f9:1b:2c:5f:e2:7d:dd,5839761
f8:df:73:de:23:d8:25:45:73:cb:50:9c:ca:26:bd:53,5655393
1f:f5:97:2f:88:6c:36:ff:1a:76:e6:95:81:cd:f3:4f,2414428
95:64:5f:a0:8e:b1:c0:ac:07:8a:17:70:a8:6e:1b:f7,3212329
b5:3a:4d:f8:f6:c3:49:b9:da:58:4f:fe:fa:76:8b:fc,3093482
9d:06:41:13:96:d8:11:4a:7b:b1:da:39:0b:7a:0f:77,1753099
5e:c8:50:46:8a:03:b6:7f:68:69:4a:5c:3e:8a:dc:38,1410338
1a:08:2d:e1:13:2e:b4:cc:a9:22:63:31:bb:a2:2d:ad,3153184
e8:0a:78:92:ea:29:5a:ff:be:22:ac:2b:79:03:3d:f0,674098
4e:d8:46:e1:6f:3d:94:e3:12:90:03:a1:04:ab:91:e7,4389026
18:cc:bf:69:c2:13:c2:b1:2a:c3:34:53:e6:ef:1f:38,3074375
00:fd:bf:63:aa:c6:0a:14:95:88:23:6b:10:83:99:2a,5096684
88:91:fe:c4:92:fc:12:1e:9d:59:ed:28:29:d8:1a:2e,4111185
81:89:73:39:34:98:22:01:58:c9:48:eb:2d:81:f9:c8,1740394
67:6f:8e:80:bc:86:bd:0f:a1:db:ce:ee:36:6c:9e:2f,3873132
4f:de:6e:e1:a7:73:ad:cf:55:ea:9b:ce:6c:2e:eb:84,5145419
66:65:b4:e6:27:e5:ff:ef:f1:ff:23:7d:d5:36:13:27,3011637
ba:e7:24:d7:19:ff:bd:f1:aa:a9:ba:d0:0a:c2:09:d3,529925
0d:e5:de:4d:db:00:67:fb:55:73:2c:26:50:66:eb:44,571561
96:2a:d8:4a:0f:a5:6c:3a:15:43:33:a3:59:df:80:8b,3568327
20:83:7b:64:7f:6c:05:0e:05:f8:7d:3f:a4:8b:c8:fb,2046771
01:c4:98:30:36:7b:0b:13:b7:cd:6a:c9:9a:69:d7:0a,6064077
88:d0:d2:cb:cd:7b:64:33:9b:49:1d:58:26:45:20:e5,2270109
7e:12:2f:e0:40:63:0a:be:24:d8:ed:57:e8:ca:2d:ab,243686
bb:ad:8f:c6:99:ba:f4:79:66:98:0e:92:3d:74:94:38,4781654
53:a1:e9:c7:9d:3c:ce:15:69:2a:34:e5:fa:41:8d:95,4400335
c9:c2:4a:0f:f7:7f:d5:10:49:c9:bb:2a:8c:d4:8a:2a,2841772
2f:af:8a:e2:69:9e:7f:94:86:51:f7:1f:e4:68:44:ac,3669834
86:ee:a2:92:12:5b:0b:12:e5:ec:1a:bc:70:95:2e:ed,3332054
73:a4:5a:b3:36:2a:bc:64:7b:76:fb:16:2a:63:d4:3e,1746973
3e:b9:71:50:34:fb:aa:a3:cd:83:5e:1b:28:36:b2:24,3252322
b5:7d:54:c2:c5:bc:e8:3c:25:87:bb:37:24:3f:0f:d7,3042310
20:3d:a0:43:8e:39:7c:a3:bb:20:5d:44:b6:89:89:0f,4523178
1d:1e:79:b3:63:87:23:c6:61:76:a5:1f:b9:b0:83:75,2102752
d4:24:9d:16:9d:42:35:83:70:22:c6:0a:e9:e6:d5:6a,1376913
28:22:e9:a6:dd:54:87:27:a1:d5:9b:dc:46:f3:10:4c,281292
bb:6c:1f:e2:60:a7:75:7a:ce:80:25:9d:29:ea:ea:93,4255141
f3:b7:af:af:50:37:46:42:58:43:d1:96:73:64:42:2d,4215203
ed:0b:e9:e1:d4:4d:15:fa:40:4e:eb:06:43:73:2d:c9,5572665
ce:4b:bb:92:a5:a8:cf:10:5d:34:24:72:fe:a3:42:81,1594929
00:3e:99:f8:72:f8:ff:31:9c:99:63:1f:0e:49:4e:13,3258561
6f:4c:b8:0a:dc:2d:98:1c:40:07:69:68:03:68:b7:5b,6107192
c0:c1:ea:5c:06:f3:68:a7:d2:8a:59:be:c9:de:eb:b9,5044641
3e:fa:e0:e0:29:c7:b9:38:96:68:2c:4f:f3:7c:be:6b,612404
5b:fd:20:95:21:ce:83:4a:8a:05:5d:2f:a7:57:af:1b,5381212
9d:47:c7:0f:df:80:45:c4:48:f4:f5:d1:81:4e:89:40,42148
29:70:c3:8c:0e:12:ef:1f:a8:9d:ca:1c:58:b8:b3:d7,3399124
a6:08:d7:7e:54:e2:36:7e:f4:bc:f6:2d:10:14:cc:a2,660952
f2:b5:aa:f3:e1:b0:45:14:82:37:d2:c5:20:80:64:fe,5975063
32:06:ef:01:c8:db:d3:9a:b4:a4:d8:2c:ad:75:08:28,298198
bb:28:56:5d:98:dd:30:ef:b9:3f:88:18:cf:a7:6a:1c,2185301
8e:e2:94:20:9c:b3:44:8a:c3:b3:8b:d6:a5:7b:ed:f3,1095615
fd:2c:9a:3a:cf:15:2e:13:bd:e4:98:57:17:ee:c1:5c,3320272
d6:f3:f7:85:6c:22:5d:1d:3d:9a:1a:72:13:df:87:f3,3924834
43:c2:7f:1e:78:82:ec:13:99:81:31:45:08:b1:47:59,5264448
2c:14:2e:0d:ec:b4:ca:f8:7b:fc:17:de:d5:69:e7:cc,781222
e2:2a:ae:64:1a:63:30:2e:52:3a:f1:05:68:25:7c:65,1088873
6a:fe:21:cd:95:1e:b8:8f:58:4a:f1:2b:73:41:97:b7,2363910
cf:10:35:ef:4d:7d:7f:1a:7b:15:6d:95:52:b0:6f:ff,4895316
a4:40:f5:3c:b9:42:b4:00:13:83:9e:6b:48:9b:b9:11,953652
46:85:49:2c:6a:d2:36:1f:e5:05:92:1f:c9:d1:e6:d9,3055021
68:ed:52:65:75:88:b5:45:ac:1d:c1:ad:9c:5c:ee:af,3080725
c0:03:ea:b4:97:b5:96:b6:e5:ac:d1:2d:18:97:bd:bb,5690234
5d:8c:32:f8:c5:97:48:50:c2:03:7b:28:2d:a6:1c:25,3177172
71:99:61:4c:f0:1c:54:ba:44:48:ce:03:19:e9:df:1c,2955217
ef:9f:21:3d:db:52:2e:20:9e:46:5c:b3:17:24:f5:c6,5537305
b0:28:ec:3b:38:63:85:ee:73:20:de:e9:12:5a:35:47,5134283
b3:67:e3:0d:f1:f5:68:81:77:98:7b:dd:5e:34:01:93,3879258
a9:ca:3b:d5:84:2f:4e:d0:1c:1e:49:84:c5:49:8e:9a,5844256
56:10:76:2e:c0:84:bb:3d:0f:1a:0c:38:52:2e:68:a2,551118
05:51:6b:af:b4:93:75:70:63:89:6b:fe:7a:6a:6f:68,2943511
0e:fe:50:1c:82:7f:36:40:ae:cf:fd:b1:74:7f:36:bc,5232487
f4:b8:10:5e:8c:ff:c6:6d:10:c4:d1:79:3b:18:6e:85,2126844
cf:53:7a:70:50:ba:89:9b:ca:c1:3e:33:2a:03:2c:15,3711316
32:51:49:16:32:26:37:df:3c:24:62:8f:13:ee:8f:a2,5091887
64:2f:48:7b:d0:13:c8:c5:4d:2e:54:f1:ea:34:4d:af,2420517
89:4a:5a:30:7d:64:34:46:a5:53:93:a2:aa:f8:ab:33,591008
c4:9c:26:4b:50:9a:73:10:a5:b5:27:19:74:43:90:fd,273625
1a:4b:a7:4b:59:d9:05:66:e5:75:7c:6b:d5:ac:41:36,2457417
c7:f1:d3:56:2c:4f:64:2c:3f:c1:10:6e:19:17:e4:78,4469597
19:4b:54:b1:c9:af:d7:a6:02:c7:ca:00:1f:f5:76:5f,4996994
13:9c:1e:a9:9a:ec:83:07:94:94:85:ec:44:00:38:f4,2695110
41:ff:0b:c7:c7:d7:b8:d8:fa:45:89:d8:c6:5b:34:5a,4440206
e5:36:cb:7e:50:eb:31:de:2f:20:4c:b2:ec:28:94:18,3117410
ef:e0:09:f0:16:7a:0e:95:d1:6c:2c:94:e3:05:e6:70,4661653
aa:0e:20:56:8a:d9:7c:11:e6:53:12:bd:56:60:09:c9,3592773
b9:9b:68:43:39:42:f6:63:12:47:fe:6c:d2:a2:cc:d9,4644785
3b:8c:c1:d6:aa:1e:13:c9:db:45:59:a4:38:6b:a8:98,1006965
e0:5a:c1:25:07:1f:1e:28:65:4e:f9:5a:01:f1:01:6d,2289703
78:c1:bc:47:59:5f:9a:e2:0a:c1:28:3f:2f:53:01:23,6120578
99:81:24:4a:d1:af:83:c0:45:ff:96:9d:30:76:4a:72,6033877
9c:c3:fd:81:a4:b3:0d:11:e5:5c:76:cf:2d:a8:e3:e4,2770535
58:dc:d6:5c:6b:25:d1:ea:7a:b4:a6:5a:5c:3d:73:77,3411352
03:4c:13:46:33:47:8b:27:47:b3:ef:1a:2b:27:cf:c5,3615785
57:88:59:94:a6:4c:9f:49:7c:8e:56:15:bf:b2:7d:e9,2527395
83:5c:e6:7a:e8:f6:c6:e5:7e:ad:ee:4d:d2:ab:18:82,4306560
e3:6e:f8:61:0a:33:c6:9e:b5:85:c9:9f:dd:68:d9:7e,522750
85:f0:89:f2:f7:86:f7:27:8b:e8:a3:4d:13:2d:1d:45,495238
e0:e3:27:76:92:dd:9e:1d:5f:5b:b7:96:69:33:e2:b6,4879702
26:d5:7d:25:1d:d1:62:81:1f:32:21:36:02:4b:62:f6,1357456
a3:38:9a:28:ce:87:a7:d3:01:0e:35:f5:ac:a7:41:4f,4059749
68:2c:7a:fd:a0:7b:26:c7:d4:88:4f:0f:4e:31:3b:18,2751883
6b:c2:aa:62:2b:8c:1e:9b:81:36:25:1e:f8:ee:8c:50,5054423
b1:a9:7e:74:ee:22:37:8e:39:ba:45:e5:d1:29:ca:0e,3370032
51:a7:d7:55:f5:49:a4:b0:31:fa:a1:bd:0d:3a:b7:61,5665086
33:16:bd:a5:b7:05:66:af:6e:dc:bc:a2:db:33:5c:5a,2451355
f8:9e:eb:fd:6b:23:ec:50:e4:26:93:fc:76:e1:30:1f,342421
0c:dc:24:49:a8:5a:46:8a:ca:1a:1a:54:03:02:58:04,4237719
a0:97:9c:2e:40:8f:19:84:fc:46:e1:e5:d3:c6:63:38,3123066
2d:6b:cc:c1:ea:46:22:44:2e:74:bf:75:2c:ba:c3:26,33080
a5:cb:a4:4d:08:2c:d9:b5:76:94:a7:e0:f5:48:04:73,3645646
25:d5:d7:bb:ae:f0:ee:46:17:bf:85:06:82:72:92:12,5650125
bf:49:8f:33:db:8d:c0:a7:76:6b:2b:05:d7:dd:94:7e,558064
d1:da:bb:aa:30:44:bd:df:33:78:2e:e1:87:c5:5a:f2,1675944
9a:84:82:fd:21:ec:37:54:b5:6d:2e:95:02:b2:70:02,1702763
82:d7:48:5f:13:84:5a:40:19:0f:14:28:e1:95:2b:b8,5433700
80:48:3d:d1:11:4d:0d:cb:d8:ec:64:7c:a2:7b:64:52,5567861
af:e8:64:fe:b1:12:a0:96:92:75:fd:12:77:df:16:de,183484
23:d9:70:25:c4:55:0e:f3:52:f8:5e:f8:94:0d:78:d4,1270845
70:97:fd:9d:33:dd:0f:7e:50:c6:2a:0b:0f:f2:ee:01,2205330
15:f1:28:3f:33:ac:93:86:f6:d4:7f:29:9c:c0:a6:9f,5979986
12:5e:fb:c3:22:37:e9:02:0c:41:5d:fe:46:58:8f:f6,3099605
00:7d:62:37:4e:20:ff:a1:71:ce:11:47:aa:31:b5:c1,2145919
4d:7c:32:ea:2a:c5:33:28:af:9b:c0:94:13:f7:1f:6d,3147332
ad:54:d5:5f:92:2d:cd:76:aa:4d:21:08:f2:1c:b2:a8,1130170
ae:a9:28:9f:8b:6c:47:41:a1:90:c2:b9:15:7c:6c:7d,4355904
6d:ce:b1:93:28:d0:a4:a0:3f:06:00:64:78:5c:5a:82,2314247
82:8d:ee:83:d0:67:58:d5:46:94:31:bc:e0:8d:e9:dc,4948281
49:5d:42:63:48:42:6b:f3:9c:b7:f0:3d:a8:c5:87:36,3111781
7f:91:1c:64:9d:af:1f:a0:ac:00:02:dc:3c:c1:fc:b9,4605927
62:63:9e:7c:ee:aa:8c:dd:27:7c:fe:24:2e:9f:ba:9a,3105717
96:a9:57:1f:e4:c6:be:ef:5b:6b:3a:98:b4:13:f5:e3,3429009
9e:4b:da:63:a0:49:c0:6d:c9:31:74:76:66:b9:8a:ef,3687821
67:22:ee:fe:3f:21:8a:2d:f2:01:60:e9:2e:38:f5:47,3282729
c2:92:a3:af:b7:3d:b7:e4:4d:d7:67:c0:a7:a7:28:1c,2949047
87:73:34:b8:af:1a:a4:75:58:c4:b2:56:1f:9c:10:f6,1163786
b1:e3:bb:b6:95:b6:a0:f6:95:a8:5e:5a:f4:af:bb:17,3521162
06:a1:bf:bd:b1:f0:b9:30:5b:2d:50:a4:ed:06:48:c4,4164438
2d:28:ef:ed:9f:e7:c0:53:57:3a:d2:29:30:89:55:4d,2502319
84:23:7e:5e:b5:4f:b9:b8:d8:2b:5b:5b:f0:5a:85:84,5354386
22:48:7a:4e:39:25:dc:de:db:f2:6c:8a:4d:6d:57:a6,4991508
00:c1:65:53:81:77:59:01:08:de:e6:7e:9f:0d:c2:76,1323659
ac:5b:d8:4a:e8:08:49:a8:83:36:87:e6:ed:e7:89:ea,4921273
31:43:33:8f:58:6d:aa:75:87:c0:c0:29:0b:51:7e:d2,153989
3a:03:d7:e9:92:cf:e8:58:3a:74:7f:9c:2a:eb:ef:d9,634252
d3:62:42:87:cd:a1:42:99:f0:b0:07:9c:9f:11:ab:1b,2721341
de:5f:4d:23:9c:8c:d9:52:ca:be:91:82:dc:f0:90:cf,3376080
ac:1d:54:fc:f3:ba:57:6f:1e:50:36:53:9b:62:50:7f,2866522
ec:06:9e:8b:80:78:14:fa:1b:63:e4:42:8e:86:6d:87,369812
b2:23:24:24:1e:d6:16:ec:7b:15:05:42:e2:7b:47:3c,959884
64:6f:5f:3a:2c:39:5b:bc:04:2c:11:66:9b:8c:aa:7f,966812
57:cb:67:d4:5f:a5:e5:41:ee:a3:78:bd:74:d4:5e:b9,1243966
d2:60:6c:64:e0:d6:55:c3:2b:25:d6:10:0d:ee:77:44,2263749
3c:9c:b4:1d:f6:33:7a:2f:1c:12:35:c3:27:94:bb:6d,3442165
a2:73:b4:4d:ed:a9:43:73:cb:77:45:5d:2f:9e:87:55,1642838
9f:0b:5d:bf:cc:0a:0e:39:cb:43:0e:78:1f:df:0d:b9,4809512
eb:c5:16:18:70:1b:97:91:ac:3d:f4:b1:00:ae:b0:a7,5695726
f1:ed:e3:68:e1:83:42:a9:46:9b:38:80:eb:c9:38:50,5243160
da:96:c9:b2:41:54:19:16:1a:9c:ca:aa:35:a7:c7:15,4974993
2b:d1:cc:d7:86:61:46:56:a6:f4:21:56:0e:9b:40:7b,2757984
be:01:d8:0a:cf:80:aa:8a:f0:75:d3:85:56:03:23:51,3417027
4c:67:cf:04:59:a2:cb:2c:0e:2c:75:f9:e4:59:bf:d4,4969570
03:c6:b5:75:fa:8f:ed:e7:03:0e:e8:f2:6c:3a:49:af,1430924
af:a5:b4:2e:7c:03:1b:89:94:f3:87:36:5b:b2:16:e7,3194247
ce:0b:c3:06:d1:39:4b:fd:ab:9a:ba:ac:09:5f:0e:04,2860748
b9:52:b9:12:58:1e:13:53:ea:9c:8b:e0:ea:2c:f9:25,306222
84:e9:32:70:98:82:fa:46:8b:09:76:92:00:c9:4b:2d,2445324
b6:07:ae:f7:fa:44:88:c5:6f:1c:35:81:f0:80:3e:dd,5955734
fb:fb:3b:a1:84:85:79:a3:3d:46:a1:ac:64:ff:b5:42,4628185
7a:42:7b:b8:3a:20:4f:b5:59:d9:df:6c:2a:12:a2:26,2256732
50:9e:a4:12:3d:e9:6b:96:5a:21:f6:35:30:d7:b1:cb,4905642
cc:0b:ef:1e:4d:fd:c0:24:3f:c7:20:05:e7:04:a1:25,3699666
eb:4a:2d:c1:95:4e:04:25:fd:a0:20:47:ed:2a:5e:b8,3344653
14:e3:d5:12:9f:e9:9f:42:57:27:b1:ed:8e:25:7a:49,5172915
25:9a:18:4b:e7:aa:29:33:83:d4:ac:0e:f0:1f:22:c1,74488
69:fe:13:03:ab:9e:58:bc:66:3f:a8:3d:0b:fa:b8:14,3234870
c1:ce:fe:f3:e7:69:50:e2:9d:cc:ba:77:b2:0b:cd:ea,1893469
c0:80:7b:5d:d3:68:cd:84:73:54:da:44:f2:db:08:1e,5444217
43:83:69:68:92:b8:99:12:70:e9:75:94:93:01:dd:73,2714459
38:2f:43:3d:0d:d0:29:2e:d8:05:92:73:a6:7a:49:32,2083879
9c:0b:66:1b:c2:d7:02:d9:48:85:05:4e:34:a7:c5:52,2829533
94:91:e0:27:be:41:ad:10:63:36:0b:20:68:b8:e2:a2,2159625
cb:12:94:06:dc:14:0c:29:21:d0:7b:83:3e:a9:92:52,5592358
8d:e1:33:85:d9:f6:48:72:5c:ab:fd:6b:b4:30:0b:ed,584295
0b:9d:d1:0e:6c:fe:b9:e2:63:f0:0a:b8:dd:d7:08:30,5076498
49:1d:7a:06:40:fe:81:82:3f:ba:75:3e:06:6f:3a:cd,1284617
b0:68:73:4e:82:30:a9:a5:a9:30:c9:b2:ff:50:bd:4d,1075660
70:55:10:3c:6c:9b:9a:96:26:c0:82:e7:9a:29:e4:2b,175449
03:8a:3a:6c:15:5d:c6:bb:6d:a8:7b:6b:28:fc:39:a0,4679361
5c:46:be:8b:b0:cc:1c:fa:de:4b:ea:4c:b1:fe:6f:0b,3509510
6b:84:f1:a9:4b:a4:4a:bf:df:b1:c4:d7:94:83:6a:8c,2639273
8e:a1:4d:e8:43:c6:cd:df:3b:21:d4:e8:a2:bf:aa:94,4889934
ad:db:d5:72:23:89:76:ac:bf:41:7b:08:cc:a4:6d:69,3693916
1f:b2:18:09:d5:5a:f6:34:e4:49:2c:ab:55:b8:a6:4e,2225244
36:a6:fe:07:a0:42:d0:45:ee:0b:38:95:a4:48:66:5e,2854723
d2:1a:28:eb:60:21:bb:4f:e8:8d:e3:21:2c:d8:84:2a,2584176
7c:93:fe:b4:d1:95:e2:68:b2:03:8c:e3:00:b5:a2:db,1397659
0d:23:af:d7:48:ed:82:63:8e:fc:98:f7:0e:9b:49:33,5274823
fd:a9:6e:bd:d0:ff:38:1b:88:c5:b8:f8:63:d1:52:6a,320802
6b:47:c6:58:84:0f:85:3f:28:b4:f2:04:2d:0f:b8:be,3556464
40:fa:16:c7:a3:2d:5f:e7:3f:08:25:f8:d6:d3:a5:66,1944908
e7:46:ff:90:8b:29:5d:04:d8:1a:08:d9:37:f9:28:01,2231575
30:b3:6a:a2:d1:29:de:d6:5a:03:7d:65:f8:54:28:25,5869758
f5:7d:85:a8:b8:a8:68:a2:87:6b:36:f5:01:ca:8d:71,2848631
f3:34:43:eb:3b:81:97:61:31:c9:6b:67:b7:c0:c8:31,5490184
0c:56:12:88:7e:83:4a:1d:61:d7:77:bb:7b:db:1f:d3,2120828
1e:27:05:2c:09:89:ad:ab:45:1f:d7:22:1c:b3:f7:39,5150749
26:54:01:49:44:70:5a:98:0b:b3:83:41:73:6c:5e:f7,647600
32:d5:8f:78:ca:c2:56:ea:a9:2a:32:84:60:8b:85:d1,808355
23:0e:9c:07:10:7b:6d:98:72:99:ee:4c:0c:79:b0:0f,2509104
e9:cb:a9:4e:93:db:cb:dd:60:b5:f6:81:df:dd:0f:e3,362124
c3:d8:27:15:c7:ce:81:af:74:01:12:eb:b5:18:32:ca,1957348
8e:62:35:54:bd:0a:05:34:5f:29:68:c6:f2:13:9f:5f,727698
5d:4c:0d:1a:1a:30:80:89:b2:23:23:da:b6:b6:21:51,1317044
87:be:2c:ce:b0:55:cc:8b:2f:f5:ac:5a:d8:a1:e3:c8,2320897
8b:13:45:39:a7:23:e8:c2:a8:3f:c0:f1:9d:99:9c:53,1899469
2f:26:62:fe:b1:bb:23:09:d5:8b:4f:5b:98:d2:76:55,4272189
f4:3d:de:12:c1:09:47:b0:1a:72:3d:f1:cc:e6:1f:bc,2627709
0b:1b:72:1c:d7:98:82:e5:40:78:0d:00:1a:27:80:50,5474948
52:a0:e9:c3:17:d0:a0:03:fa:e5:d5:88:64:f9:bf:f3,747584
69:b7:9c:56:ab:19:a5:2b:53:02:64:08:bd:95:47:3d,2308279
22:03:0a:d1:7c:c0:dc:a9:c2:59:fd:1c:29:40:5e:62,4260607
be:c4:ba:5b:30:11:65:4b:61:da:73:0b:f1:fd:4f:d4,4874552
b0:a8:d9:92:5f:34:e1:64:e6:19:de:cf:9e:b2:8e:6b,2407748
b7:8d:0d:76:2d:23:ad:97:c3:c2:ad:16:d0:03:a4:9f,5417283
94:10:f6:34:81:05:25:2e:72:89:79:e1:73:a5:96:cd,2911054
90:34:b4:f7:10:f9:b2:9d:d2:ea:db:f2:6a:b4:65:15,1497666
19:c3:d9:53:6a:18:34:8e:00:93:70:6b:9b:c0:b1:7a,4803999
e4:77:30:aa:74:5e:d4:ba:df:d6:36:1c:09:7d:2a:dd,2559428
b2:a4:21:8c:7d:7f:68:6f:5e:1f:1b:61:6e:21:20:65,5210423
24:1a:d4:4f:c4:ab:ec:5f:d1:65:68:2d:dc:67:79:d0,1013925
6c:c2:16:5f:60:ea:cc:b7:ea:82:e3:d3:5e:e0:20:8b,3610580
98:f7:eb:16:ea:ae:b6:c8:39:8a:6d:d5:37:22:ba:7e,6088413
1e:ee:b0:ff:c8:60:ab:c0:2c:9b:71:0c:de:5e:9a:08,4943013
5b:30:a8:08:e2:d1:ab:fe:9a:5d:f0:95:0a:80:ad:eb,4191885
5c:c4:21:2f:dc:c6:60:4e:a6:0f:26:83:ec:8e:84:b6,5809207
48:5c:a0:10:b7:1c:02:ec:83:b7:18:31:d0:ff:44:df,544717
fb:b9:c2:20:14:c7:e2:02:3d:6f:4b:1c:84:a2:0a:16,3949474
4f:16:cd:95:36:07:66:96:1f:a8:4e:81:4c:d4:f2:a8,1608557
77:fb:5c:14:5c:4f:9d:aa:1a:0e:64:81:63:1e:9c:5e,2470156
a3:bc:b4:45:38:7a:e8:95:cb:0a:7f:49:c0:66:aa:24,4071625
f1:29:3a:5a:21:7e:0e:04:82:31:7b:12:73:35:c7:08,5717331
76:fa:d0:9d:73:b4:ce:93:9d:9c:67:8e:52:a2:d4:36,1772156
8b:54:a3:73:7d:30:58:7c:79:37:89:34:94:e7:37:31,5553119
82:11:02:11:f1:6e:d2:0e:38:f0:fd:20:44:8b:26:8d,4707511
aa:8e:4b:03:76:fe:59:6e:aa:12:bd:80:05:89:57:82,4106005
5d:08:74:f5:1a:c9:b5:fa:60:32:d3:7d:e2:53:85:36,5311183
6e:4b:a6:20:29:2e:c8:ff:a7:40:c7:23:b5:df:eb:1a,4480793
47:db:2f:7f:d9:cd:64:91:94:4a:c8:84:d0:9f:ee:e6,4900468
30:32:1f:97:cf:e1:77:8a:e5:c3:94:ab:be:b8:f9:a9,3473605
43:05:56:f0:5e:80:99:b4:39:96:b1:62:2b:47:7c:d2,1938438
11:58:5a:33:21:2d:97:ef:46:13:92:3f:31:5d:e2:02,4512793
59:5b:b3:10:16:e4:43:12:c4:78:9e:04:ef:6e:a3:23,4853102
24:d3:ae:4a:93:0d:8e:ef:c7:fc:92:c4:4a:35:c7:3e,5799025
9d:8c:e1:98:1a:7b:7a:f0:bd:dc:a3:65:79:4b:ed:f9,4186726
ca:43:d8:2a:cc:71:7f:ca:2f:01:cf:0e:3c:f1:59:9f,1523951
4a:e6:c7:1f:b8:40:e6:9f:51:d5:04:b9:12:33:3a:c8,2980998
30:fb:76:55:d1:f4:c9:48:95:3a:5e:5f:01:97:ca:47,8065
f3:76:14:34:25:a9:4d:3f:80:4d:cc:9e:00:ea:e8:b3,5205056
f9:e6:ae:a9:5b:2d:88:ea:02:30:16:18:53:63:0f:05,4377752
ee:df:25:6c:95:c5:f2:d4:9a:cc:c9:0d:5d:e8:76:10,4048171
ec:8a:8f:47:32:2d:20:d9:42:a4:2d:13:27:fe:40:c1,1516863
3a:49:ab:6f:8b:82:6e:90:32:85:25:49:4d:0a:1e:e1,5338435
07:6d:1d:f2:bf:52:b0:af:bf:6b:41:85:f8:47:48:8b,4394773
34:27:1e:6f:69:52:bb:56:17:6a:a6:a9:77:90:29:ad,5156555
5f:d2:d6:08:ab:e2:d0:23:72:e9:c8:d4:b1:ea:9f:22,3165225
e7:03:09:89:28:be:74:c8:46:e6:ff:d7:c9:7b:6a:48,2609804
02:8f:86:41:d8:c7:9b:5d:cc:f7:27:e7:5e:58:fb:8d,666973
0c:1e:04:f7:cf:a8:59:29:50:15:77:a2:e3:47:d6:d9,5285492
a5:81:b9:fa:50:70:ca:28:f1:fc:86:d0:2b:6b:27:1d,3048329
80:89:b5:5d:98:01:ff:cb:d9:a8:9a:a2:21:8a:20:d4,1061830
4e:95:3a:6f:12:18:0a:4c:f9:50:77:cf:a6:1c:f9:70,3294820
65:e7:b0:8c:33:32:1b:38:92:6c:bb:e2:b9:4f:01:eb,1697029
bf:07:52:5b:8a:e6:be:50:2e:c9:07:b4:61:17:de:6f,3024226
f7:d1:3b:30:7c:31:e2:45:6f:98:22:b4:e6:ea:bc:8b,4445721
c2:0e:d7:92:31:10:69:ba:7a:da:ac:9f:17:8a:97:fe,1217970
24:99:4e:f7:02:92:30:7f:ce:b7:27:70:ef:16:58:f1,5402157
24:5a:91:ee:4e:14:8f:94:c2:64:57:d5:67:cf:95:f8,1290779
81:0f:38:28:a6:32:c4:05:ea:30:50:58:1e:cb:18:9b,3200545
aa:52:24:98:a0:a4:4a:eb:a3:86:79:dc:07:33:88:80,927707
bb:f3:be:09:5f:fd:64:81:75:2b:55:af:35:9c:5d:d5,921561
e0:21:18:30:01:b1:af:ce:50:2f:60:27:e5:9d:37:79,1464981
7c:08:f0:0c:d2:a0:85:4b:d2:09:0f:cc:f7:cd:8a:e4,2514595
84:68:6f:a2:0c:98:f5:e4:59:22:e2:2b:9e:a3:b6:b1,4083412
3b:d1:b1:b1:7c:37:e3:9d:e6:61:47:9d:bd:f4:27:04,4180837
a7:85:38:a7:04:b6:1b:d5:58:79:3c:7f:1c:aa:bd:7f,5747295
e7:c4:da:b4:02:71:1e:3c:a9:e5:a6:f3:a4:0f:93:fe,688403
64:aa:96:58:27:da:db:dc:57:de:16:24:dd:de:5e:60,4360814
07:2b:50:f9:d1:d7:c8:bb:9f:eb:39:0a:e3:3d:fc:40,1867884
6a:84:0a:d8:d7:55:2c:43:65:49:30:d9:60:c5:76:3a,2999635
53:eb:cd:21:a8:f5:85:6e:ab:c2:34:2a:7f:de:0c:ac,5280014
b8:8e:e8:a5:91:e5:c4:a4:03:61:78:a0:64:0f:42:5c,3067929
04:08:2b:db:bd:30:d0:0f:56:76:a0:ab:57:f5:fa:20,627187
8d:61:5f:e0:b1:9c:e2:2a:28:4f:62:57:01:72:97:20,1635814
5b:72:3e:70:7a:f4:cf:be:ed:a2:5b:c6:3d:eb:98:e4,4539467
19:0b:5b:f6:3f:e7:ea:8d:59:4a:e3:20:7b:2f:65:d0,4340082
a4:85:36:e2:34:00:f4:ab:96:10:e3:de:5a:f8:c5:ab,1905854
38:b2:a2:f6:db:9e:3a:d3:65:0f:08:7e:2f:39:ec:4e,1970468
b6:8a:85:16:a2:3b:64:a4:2f:84:d2:e3:43:32:9f:8a,4123033
05:d1:20:3f:52:c2:8f:82:a7:93:be:d4:d2:a7:d3:68,3307311
d9:0b:70:0b:db:41:c7:42:8f:b8:07:50:b7:39:b5:3d,1110338
2b:47:f5:bf:d3:6f:51:16:c8:52:d0:f3:70:4b:23:77,714552
3c:16:4b:f5:02:58:3e:d2:15:38:d3:b9:41:5d:f1:1f,5644069
3a:86:a1:28:eb:58:90:69:ce:2b:16:67:a0:a8:02:9f,4054296
46:43:2b:9c:fe:f0:40:82:5d:bd:a0:7b:56:75:07:d0,5237852
a6:84:e3:c9:a1:1e:ca:b6:10:d8:7a:ea:36:68:b7:13,934623
98:3e:8b:54:83:53:69:15:90:a1:7c:cd:5c:d2:e8:93,1251397
18:85:4a:f9:43:42:20:71:a7:a7:1d:16:ec:21:4b:cc,4457422
ab:db:b8:bf:54:17:bf:fc:78:d6:80:3b:58:4f:89:e4,4611882
26:95:b5:bd:80:0f:af:29:ac:37:f5:cb:60:d4:55:b9,5930667
55:85:8d:a6:bc:43:0e:e9:85:63:bf:16:e6:15:8f:90,2352124
f0:a4:28:b0:ef:f7:fe:2b:eb:ba:2a:42:33:73:1d:2f,5597183
e8:89:ec:29:b8:01:9e:6a:a0:4e:ab:fd:8a:48:01:53,123688
d7:b6:60:89:ee:2d:dd:5f:1e:d3:45:7a:73:20:74:5f,3604891
2e:63:a9:b1:0a:af:89:cf:28:55:42:2e:08:37:8b:13,3855352
f7:8f:d0:78:09:12:f2:ee:ab:ba:53:5d:b3:65:a0:08,4863877
04:d3:aa:61:1b:d0:6a:1e:f2:8f:18:cb:ae:f9:e3:c3,788541
44:42:ef:6a:31:83:d0:f7:3d:c2:c3:0d:7f:ec:7a:87,3792273
7f:4f:ed:f1:c0:15:c8:3d:2a:b2:ec:77:78:0f:06:a3,6093298
ac:d1:85:0d:82:89:a2:4a:2f:d9:0f:d7:31:4b:18:c6,4134465
d0:d4:50:cc:a6:e6:c0:9c:97:0a:06:05:57:c7:15:90,721505
3d:fa:36:d9:dc:1c:7d:1e:64:66:9a:21:54:4e:28:25,3658256
6e:ce:d7:4c:3b:b7:5a:ba:a2:ff:fe:d7:51:57:c6:42,3842506
e2:6e:86:f5:43:ce:75:79:6f:19:ba:68:24:ea:a9:b9,4765044
46:06:7f:e6:32:a3:c7:7e:d1:53:ae:c3:75:1a:f4:0b,167932
40:82:a5:46:91:73:27:c1:7b:20:1a:55:83:7e:78:84,2596503
c6:a5:6c:c9:9e:88:0a:29:31:39:d5:72:d1:78:e6:52,4065372
ab:98:2b:7b:d4:61:57:27:3b:84:ca:6b:3d:94:b8:80,5427901
e9:08:d5:b4:d4:a9:2a:36:8b:7b:fb:5b:b5:03:c9:c7,3861214
59:1a:71:fa:31:55:49:09:47:dc:47:c3:08:13:1a:b5,4775893
6d:03:15:7d:08:a9:5e:5a:d4:aa:ca:fa:7a:59:82:70,5188916
df:24:98:b4:0b:c1:cd:9d:66:c3:a6:eb:65:d7:57:bc,5407185
37:ad:5d:16:b0:6d:26:85:5e:9e:22:8a:b7:8b:0e:16,5895493
ac:94:69:9c:7e:98:5c:09:c1:68:75:1e:42:98:fe:ee,3717061
7e:50:d9:7f:08:1f:44:d4:89:b9:02:f5:54:e9:65:88,1344970
02:cb:b7:2f:4c:82:11:02:cd:75:f9:10:88:12:6e:9c,597962
70:d4:0f:9d:86:5d:ee:a3:63:85:78:92:c0:4e:3c:4d,4937769
f9:66:71:83:7b:12:32:0a:23:7e:86:59:03:e6:83:ca,467465
dc:e1:9a:b3:f7:cb:fc:e2:b5:ee:45:ed:b6:34:30:de,3527409
c8:f5:ed:e0:22:77:1b:8b:d0:be:59:99:37:ec:87:24,3314062
de:16:8a:18:09:68:a5:34:c5:65:02:25:ea:e7:82:88,5669701
9f:8a:c3:b0:50:52:a5:73:c9:74:67:ca:7c:85:90:ec,2734209
b4:70:5f:78:fa:ae:88:6c:1b:05:c9:07:97:4b:be:7a,2401689
13:dc:d0:bb:28:f6:bb:42:9d:ff:c7:a3:8c:3c:25:42,2333313
b1:6a:d5:86:61:ed:aa:57:a4:c3:59:ee:d1:14:56:0b,5874725
dd:62:87:84:3d:94:54:dc:4f:86:67:b1:05:3a:5b:5f,411287
34:a6:d4:ed:0c:bf:32:73:fc:93:9c:c5:dc:06:3f:42,4926634
a0:e1:2e:d7:d7:e1:e1:33:d5:e6:a2:5c:fe:47:14:9b,5583118
26:15:b1:22:7f:94:d2:f0:1b:0d:be:fe:9b:04:55:db,3036036
e1:e4:ec:bf:96:7b:a6:3d:dc:ba:19:02:e5:e3:f8:ab,4622941
d4:e6:de:98:13:d3:e5:a3:fb:54:d9:c9:7a:90:92:af,235809
bf:c5:ea:5e:4d:40:01:d8:03:99:8d:64:5c:f4:9b:fe,1874007
7b:09:90:8f:00:5a:87:52:51:6d:67:97:b4:8e:fa:7f,1683258
bc:b8:56:e6:de:3c:0e:97:9f:9c:53:98:61:1c:2e:04,433499
96:6a:f4:10:77:ec:ae:02:3a:9d:10:ae:85:bc:67:86,3218030
10:8f:16:67:ca:cf:c4:ce:78:d0:5e:91:21:41:bb:40,1296978
04:96:4d:d0:08:67:36:89:53:8a:4c:28:99:dc:0c:60,5118340
d5:eb:c7:be:00:48:de:76:85:e7:21:e3:5a:0f:25:9a,5269366
54:2f:db:79:75:ec:5e:64:c1:23:58:33:0f:eb:04:a0,5007877
f2:ef:b7:a4:e3:47:91:65:17:d0:f2:94:b9:e7:c8:30,694989
75:a5:82:55:70:e6:78:3b:ed:f5:22:5d:08:3d:92:f4,1561915
53:66:57:d2:9f:c6:64:48:3d:7a:88:d9:8f:32:30:98,6028982
58:57:5d:b3:8b:10:76:bb:fb:fc:10:1a:2e:ec:32:b6,4077809
cc:4a:f3:9a:d6:08:31:32:4a:f8:6a:83:d5:9f:9f:3b,5999647
27:17:bc:5c:61:b0:a5:a9:e3:4b:7a:33:dc:1d:46:b5,1170248
e1:20:6b:8d:d8:e0:6a:1c:cf:99:ab:7e:b7:92:08:f8,5941244
09:43:a6:ce:63:cf:5a:5d:8f:72:2f:9c:3d:2e:56:97,4741791
ea:ca:f6:64:aa:8e:37:51:06:3c:30:d6:ea:e2:d3:cc,3087167
15:aa:11:88:e6:5a:8e:b5:3f:af:90:87:16:f1:01:ae,100512
bc:37:ec:cb:6c:23:d4:fa:5d:06:0d:aa:55:26:7a:fa,5773349
63:6e:95:41:7b:8f:c5:ce:2b:5a:2a:ff:d6:0c:58:d6,5634036
d3:a1:62:0c:e1:ed:e5:2a:e3:bc:8a:80:28:ac:61:db,2376750
37:2b:54:f3:d8:69:83:7a:b3:ab:35:4d:76:c1:c7:2a,2022027
90:7c:0c:d2:47:e9:9d:ba:77:ab:a5:9f:f6:64:40:2b,107233
29:fb:de:0b:d3:4e:fd:0e:40:52:ad:1c:ec:a4:2c:9b,5039427
e5:be:3e:6a:9f:7e:cc:93:f5:1b:61:b3:cf:3d:8e:ef,5884896
47:99:cc:7d:c5:d0:73:b7:1f:87:5d:73:c3:58:52:90,4475139
08:c0:46:a6:eb:4f:88:c3:6c:12:33:59:67:11:6c:e9,3804046
6d:43:51:f7:f6:c6:29:d8:df:c5:9d:5b:87:52:35:b3,2482734
12:e0:7c:2a:e0:2f:65:42:01:39:2d:88:6a:6d:28:84,4571745
d6:b1:4d:35:43:ee:ba:99:09:6d:45:cf:32:21:e8:f0,3634329
12:19:c2:a4:95:74:e7:e8:8c:63:e4:d1:86:bf:77:6f,5028418
0f:ce:e1:5f:8c:f8:b8:fd:37:2c:d3:22:fb:ea:8c:d2,4243372
ea:0f:9a:44:2a:cc:08:86:7d:71:b9:96:6c:4c:1e:6c,355167
16:b4:eb:57:63:80:00:d0:52:ee:ed:f9:cf:51:00:8f,5464939
1d:9f:63:c4:22:91:58:12:19:73:8a:8a:ab:94:b0:15,2439060
c8:76:68:4b:c1:17:72:63:81:78:7f:e1:f6:8a:00:f5,2179501
99:fb:51:0c:1e:ee:66:3e:13:95:f9:98:ef:0e:75:db,3890751
c3:1a:28:25:39:70:92:b5:74:70:90:60:bf:a4:44:82,2878127
72:e2:37:05:30:31:29:b4:a3:22:41:8d:a0:0a:9b:ee,4486174
80:0a:12:f6:15:58:8a:91:86:e3:3f:56:cd:8b:a2:31,5758466
37:6a:52:90:07:ca:9e:12:e4:3f:f0:b4:5e:89:3d:e3,4953560
1b:ce:85:fb:ff:f1:ef:16:70:ae:10:4c:1f:89:56:52,5253605
76:6d:c7:43:1a:97:98:14:55:57:18:46:6b:ff:68:2b,4674034
90:fc:0b:e4:1a:a0:d8:bb:35:63:ae:56:98:e9:47:90,1477820
11:dc:8f:4b:64:71:37:24:f1:5c:a1:24:22:ff:f6:cf,5915769
44:04:62:19:c3:93:e1:7e:1d:a1:02:ed:86:b6:3b:1e,502440
01:3f:a3:00:6f:fc:28:09:0d:71:30:3c:b8:44:b6:a1,2433014
94:dc:6c:e9:42:6c:35:3e:12:f8:31:f9:7d:2f:84:ff,3750759
4f:56:7a:ac:ac:a7:63:b9:ea:e2:ec:a4:98:fc:f2:2c,5183450
7d:90:3e:7e:da:b0:85:a6:2a:1a:a8:de:6a:8d:e2:56,1047451
5a:ae:38:01:6b:8f:dd:21:eb:90:6a:09:7e:86:3c:a0,2676584
d1:56:1e:96:94:9f:67:26:9a:b3:2a:af:74:62:68:b5,4277635
5b:b8:f1:fb:45:1c:23:5b:0d:c1:dc:60:90:33:06:73,6083537
d3:df:da:be:79:34:5d:9d:8f:d9:dd:e6:2b:a1:db:11,4725689
73:60:5d:46:b9:dc:3c:a4:33:17:71:0a:a2:25:ab:06,5167426
b6:46:cd:71:8e:0c:09:cf:bd:d9:54:b9:10:93:9d:a3,605102
fc:34:55:2d:16:7a:62:9e:24:a4:55:78:36:15:30:d7,4496787
e6:3c:73:42:58:6f:93:3c:a8:e4:08:cf:a6:76:06:d3,6078409
41:3d:62:55:15:da:1e:b3:65:df:5a:4d:91:cc:95:ea,3816509
a6:c6:9e:6c:97:c1:31:81:f3:80:09:ab:cd:d8:66:9b,397393
f7:4f:95:a0:00:fe:bc:50:01:08:30:96:a7:93:62:9d,3902077
91:ff:b0:ae:85:cd:d4:36:4a:c9:9f:12:b2:cb:50:69,1759727
b8:12:54:ae:64:cf:22:fa:af:42:66:5f:b5:95:61:58,2923002
9a:c6:bc:3d:3b:be:4a:ab:1c:b9:05:ec:ba:9e:f5:3d,3598676
95:e6:a6:76:80:67:71:80:f1:27:4b:61:08:f5:9f:1a,251040
09:05:2c:26:5e:42:8d:eb:39:64:09:f4:71:d2:69:d5,3786647
28:64:be:ca:e4:a9:e9:7a:21:36:b3:73:17:a8:c8:c6,58539
ec:47:74:a8:df:8b:db:36:e0:a5:8f:c7:f9:dc:34:12,4202831
17:bf:44:a1:5e:19:8f:e9:be:40:74:13:a6:77:68:2c,2794138
c3:92:68:7a:e5:f7:cc:08:b0:07:39:6b:c2:3a:8b:96,5438786
61:1f:d3:b3:32:5f:cb:45:4a:90:6b:90:40:8e:4a:6b,1662778
9b:45:ef:b4:37:44:cf:83:64:19:c6:06:71:17:40:69,3622337
19:89:29:dd:7b:e8:ad:ed:9e:d6:6c:dd:6d:b3:e0:5b,2152380
e8:4d:44:1d:2b:1c:6f:f6:7a:99:a9:de:e0:1e:dd:7b,4371919
51:29:e4:82:a6:62:7e:1d:2d:54:48:3f:7f:1c:6a:63,1835785
0d:69:54:b7:69:93:76:53:d8:7b:f2:95:5e:fe:e0:70,4566802
08:79:d2:9e:81:76:be:06:da:12:d3:36:aa:55:f7:69,5459551
ba:a2:0b:ab:2d:11:6f:33:43:bf:fe:51:f7:fe:c6:86,5102234
71:d9:c8:7c:f3:df:b4:a2:6a:8d:ad:29:00:cf:33:47,5386644
f1:ad:da:01:bd:37:02:d4:d8:ab:29:dd:4e:b6:f1:f9,1784619
44:c0:83:38:64:82:a1:bb:5d:30:d7:17:4a:61:21:66,4752859
7b:8a:db:23:d7:18:12:53:46:03:b9:1c:f7:38:28:0a,4719709
5e:44:22:93:b9:14:2e:17:f0:c9:6f:fd:dc:6c:5e:90,1629270
99:3e:14:44:cd:12:f3:db:b9:76:fa:e6:f4:ba:29:23,5226938
31:c2:73:1f:a6:55:4e:45:07:cd:6e:7e:ab:ad:a7:01,4736692
17:78:d7:04:57:71:cf:15:e3:fd:10:91:63:02:26:1e,5613406
e2:ee:1f:42:42:d5:72:10:ad:18:68:68:6b:2e:54:84,2929088
75:22:6b:dd:87:8f:ea:eb:42:7c:25:b7:c5:d1:a1:39,487626
0b:5e:c2:5c:3b:15:ae:2d:ed:65:2e:26:31:d1:24:61,2370287
dc:25:e5:ee:eb:e3:91:c3:d6:e1:f4:83:06:8f:a0:5d,1829324
8c:62:66:26:b2:b7:cd:91:49:43:82:b4:82:de:9d:31,1797435
e4:31:30:8f:ff:88:7d:99:23:33:66:0d:45:6c:a5:e4,258881
b8:d1:9e:c4:ae:91:1b:85:cf:75:e9:dd:58:95:09:2f,2578293
da:0b:93:d7:08:d6:b8:82:e5:d5:fd:c3:74:c3:1c:31,5516533
d0:1b:21:ad:18:7e:15:8b:d0:ce:f2:ab:52:28:fa:aa,4825879
c0:44:b9:71:0e:9e:83:3d:35:c0:40:52:50:5c:d8:51,2812127
e6:bb:86:ca:db:b9:e6:f2:65:cb:d3:ab:77:ef:1a:f6,2358079
05:12:5e:1b:86:f9:36:0d:53:1a:44:19:91:4d:eb:8d,5328142
78:82:a2:3e:9f:80:2a:3f:e2:76:e6:e5:c1:41:d5:74,4406006
ee:11:83:92:f5:54:d6:da:5e:5f:0e:e6:13:f9:9d:1b,2897253
bd:39:6f:b5:fd:bc:7f:7f:f7:07:8d:e2:6f:fd:60:9d,5505609
4c:26:3c:dd:0a:f1:9d:dc:97:7c:f9:5e:2d:94:46:92,4577538
d6:2f:a2:c7:6a:65:96:f5:16:28:27:c5:84:82:3a:6f,1177405
d4:65:fd:ec:bb:78:a0:0e:8b:c0:1a:1d:d7:44:db:81,4491475
0a:d3:b9:38:5b:42:41:85:c0:13:a0:2b:6a:13:79:09,5018388
61:60:e2:aa:b7:e4:81:b7:76:8b:28:80:53:b9:65:a8,1264135