119721276,false,false,success
282529350,false,false,success
44305427,false,false,success
113617969,false,false,created
334454037,false,false,manual
278062003,false,true,success
135352097,false,false,canceled
122478878,false,false,success
279407097,false,false,manual
266161456,false,false,success
196795964,false,true,success
185387143,false,false,failed
257809864,false,false,success
138786054,false,true,manual
217952265,false,false,success
63241918,false,false,success
104516774,false,false,success
65034358,false,false,success
159935280,false,true,success
86614377,false,false,created
231026864,false,true,success
146687360,false,false,skipped
319517053,false,false,canceled
193310929,false,true,success
159336605,false,false,manual
267077936,false,true,manual
316661239,true,false,skipped
305429038,false,true,success
24628714,false,true,skipped
11176503,false,false,success
174221232,false,false,success
25039101,false,false,success
15657215,false,true,success
278349666,false,false,success
151915978,false,false,skipped
283017843,false,true,manual
85550675,false,true,success
297107723,false,false,success
206518931,false,false,success
203107150,false,false,success
91909135,false,true,manual
9777380,false,false,skipped
51312243,false,false,skipped
198999011,false,true,success
99494670,false,false,manual
303418153,false,true,failed
118023934,false,false,failed
136083464,false,true,success
10383332,false,false,skipped
294290301,false,false,created
235208718,false,false,canceled
18147723,false,false,failed
31651222,false,false,success
215390559,true,false,success
103529435,false,false,success
55839148,false,false,success
108110063,false,false,success
114770858,true,false,success
82243470,false,false,success
226496889,false,true,success
328865151,false,true,success
154630694,false,false,success
315371028,false,false,success
314013611,true,false,success
248971085,false,false,failed
107422983,false,false,success
224860428,false,false,skipped
205591853,false,false,created
279903564,false,false,success
294793926,false,false,success
229571222,false,false,manual
36725589,false,false,skipped
216002261,false,false,canceled
320268611,true,false,success
290671445,true,false,success
244616501,false,false,success
334726649,true,false,failed
281785845,false,false,success
237261281,false,false,success
277173407,true,false,skipped
115873274,false,false,success
84169102,false,false,success
129789199,true,false,success
248130727,true,false,success
113976896,false,false,success
252252933,false,false,success
315728206,true,false,manual
181535387,false,false,success
35867065,false,false,success
83006311,false,true,failed
234164914,false,false,failed
97379134,true,true,success
188034315,false,false,skipped
81173326,false,false,success
256121975,false,false,success
8065013,false,false,success
270884574,false,false,success
216439473,false,false,manual
28266509,false,false,manual
164570316,true,false,manual
178932977,true,false,success
315132230,false,false,skipped
167215994,false,true,created
125848605,false,false,success
201558992,false,false,success
149133850,false,false,success
134892448,false,true,success
195892449,true,true,success
119078978,false,true,success
205256943,false,true,success
190640646,false,true,success
336963504,false,true,failed
236140558,false,false,success
333384162,false,true,manual
112642087,false,true,success
212284362,false,false,manual
37135796,false,true,manual
154955880,false,true,canceled
226824084,false,true,canceled
58948522,false,false,success
206856799,false,true,success
68037689,false,false,success
128395282,false,false,success
65378888,false,false,skipped
123393579,false,false,skipped
111904218,false,false,success
298369343,false,true,success
167845152,true,false,success
197356464,true,false,success
275804809,true,false,success
85917452,false,false,success
124474777,false,false,success
181866200,false,true,failed
175147744,false,false,manual
318497207,true,false,success
210156027,false,false,success
92814429,false,true,success
260948358,false,false,success
121103457,false,false,success
263735898,false,false,success
13960755,false,false,success
19042932,false,false,success
59726372,false,false,manual
111581743,true,true,success
256698564,false,true,failed
221981124,false,false,manual
55432620,false,false,failed
319865913,false,false,success
257288683,true,false,success
83772173,false,false,failed
240744460,false,true,success
240181240,false,false,success
84621843,false,false,failed
114424680,true,false,canceled
251433245,false,false,success
249407986,false,false,manual
213317164,false,true,success
312697123,true,false,success
248693702,false,true,success
296132292,false,false,success
305024098,false,false,success
247247321,false,false,success
173600884,false,false,success
92197323,true,false,skipped
258705346,true,false,failed
252641973,true,true,success
181229955,false,false,success
241065781,true,false,success
290121909,false,false,success
25414244,false,false,success
289183835,false,true,success
185109663,false,true,success
145162671,false,true,failed
254799800,false,false,failed
233245720,false,false,success
313765770,false,false,manual
210829844,false,true,success
146076859,false,false,success
125491179,true,false,success
52942054,false,true,canceled
184220258,false,false,success
188984975,false,false,success
189412022,false,true,success
136380801,false,true,success
93996279,true,false,failed
191589558,false,false,success
267877350,false,true,success
293559560,false,false,skipped
255077118,true,false,success
176933347,false,false,success
306571115,false,false,created
308481496,false,true,success
290942255,false,false,success
165524830,false,false,manual
327136953,false,false,success
314597749,false,false,manual
298067591,false,false,failed
32413721,false,false,skipped
194225492,false,false,success
287110230,false,false,success
42397402,true,false,success
261860769,true,false,skipped
129121704,false,false,success
206204669,false,false,manual
89565703,false,false,success
336469146,false,true,skipped
77342647,false,false,success
257558879,false,false,success
271164064,false,false,success
326854039,false,false,success
106172039,false,false,success
111243018,false,false,skipped
207245346,false,false,success
214785778,false,true,success
139801846,false,false,success
317590501,false,true,success
116276980,false,false,canceled
264006876,false,false,canceled
333950706,false,false,manual
37912706,true,true,success
228915335,false,false,success
118745190,true,false,success
155619134,false,false,success
207926241,false,false,success
332582847,false,false,success
80088863,true,false,success
203769999,false,false,success
141206844,false,false,success
80431963,false,false,success
59351867,false,false,success
15224257,false,false,failed
232928932,false,false,success
101745727,false,false,success
32006891,true,false,success
302465869,false,false,success
123711896,false,false,success
29858753,false,false,canceled
70185243,false,true,skipped
232231406,true,false,success
65747222,false,true,failed
147432450,false,false,success
126612291,false,true,manual
298625291,false,false,success
4466299,true,false,manual
23707003,false,false,success
312392518,true,false,success
146365026,true,false,success
49356652,true,false,success
212937486,false,false,skipped
287888396,false,true,failed
29036946,false,false,success
254239059,false,false,skipped
258376258,false,false,success
40680751,false,false,success
188653644,false,true,manual
180848187,true,true,success
263468927,false,false,failed
273925584,false,false,success
211719346,false,false,success
269009444,false,false,success
205898084,false,false,success
241365136,false,false,failed
281237920,false,false,success
17758761,true,false,success
299239829,false,false,success
243755573,false,false,success
335613162,false,false,manual
217058733,false,false,canceled
53702365,false,false,failed
293009965,false,true,manual
274728928,false,false,success
187394547,false,false,manual
144046221,false,false,failed
57768572,false,false,failed
250299091,false,false,success
16981294,false,false,success
177883187,false,true,success
98794525,false,false,skipped
258103670,false,true,success
120479581,false,false,success
268131514,true,true,success
213618503,false,false,manual
249725905,false,false,canceled
88579230,false,false,success
133880868,false,false,success
30941612,false,false,canceled
329936111,false,false,success
273596741,false,false,success
302147950,false,false,success
123070844,false,false,success
14356111,false,false,manual
173194052,false,false,success
176619223,false,false,success
306021563,false,false,canceled
137820279,false,false,success
275492030,false,false,success
310564789,false,false,created
168575768,false,false,failed
39575029,false,true,success
152585818,false,false,canceled
169277443,false,true,manual
124807592,false,false,manual
264558770,false,false,skipped
126936700,false,false,success
178282204,false,false,success
333141391,false,false,failed
176287585,false,true,success
39921028,false,false,canceled
225169037,false,false,canceled
11601472,true,false,success
292692075,true,false,success
318185437,false,true,success
301729669,false,false,success
139457705,false,false,canceled
8529069,false,false,skipped
75383645,false,false,success
186314113,false,false,success
10529261,false,true,success
265643544,false,false,success
166901806,false,true,skipped
46518278,true,true,success
129425548,false,false,skipped
235500615,false,false,success
153236754,false,false,success
180502891,false,true,success
97727083,false,false,success
293266969,false,false,manual
130456587,true,true,canceled
283838823,true,false,canceled
286588949,false,false,success
237572629,false,false,success
306891638,false,false,success
122044168,false,true,success
76521927,false,false,success
287346285,false,false,success
210517623,false,false,success
260631019,false,false,success
61824381,false,false,success
112989331,false,false,success
219282534,false,false,success
138453229,false,false,manual
147126745,false,true,skipped
50183616,false,false,failed
235811776,false,false,success
3934327,false,false,success
153998680,false,false,created
317281396,false,false,success
148724465,false,false,success
195331209,false,true,success
162055502,false,false,success
202148391,false,false,manual
167523303,false,false,manual
145492262,false,false,success
317898432,true,false,success
296775816,false,true,failed
106988637,false,false,manual
6633126,false,true,success
34615561,false,true,failed
282783504,false,false,failed
71288774,false,false,success
133523839,false,false,manual
38600084,false,true,manual
42846946,false,false,success
109833353,false,false,success
180198322,false,false,skipped
226175614,false,false,success
120803338,false,false,success
53340643,false,false,success
31263618,false,false,failed
309642219,false,false,skipped
303843365,true,false,success
292137546,false,false,success
109180471,false,false,failed
223049269,true,false,success
17398720,false,true,success
230734436,false,false,canceled
280417913,false,true,success
10245344,false,true,failed
269787090,false,false,manual
156678094,false,false,success
75064984,false,false,success
45797455,false,false,success
265359962,false,false,success
47343427,false,false,success
140524531,false,false,success
179873595,true,false,success
275015625,false,true,success
289445175,false,true,success
245479600,true,false,success
248412363,false,false,success
276623837,false,false,canceled
331712228,false,false,success
283289039,false,false,success
292418344,true,true,canceled
143395367,false,false,success
310840634,true,false,success
294528038,false,false,success
295749955,false,true,success
22097955,false,false,canceled
323403171,false,true,manual
200374792,false,false,success
47638881,false,true,success
265085047,false,true,success
57394681,true,true,success
192338042,false,false,success
285831624,false,false,success
63606863,false,true,success
288933042,false,false,success
110918092,false,true,success
150073794,false,false,manual
137428893,false,true,success
331372082,false,false,success
308762694,false,false,success
43907306,true,false,success
117355793,false,false,success
201234202,false,true,success
316090966,false,false,success
264252351,false,true,success
119388868,false,true,success
309934881,false,true,skipped
104921975,false,false,manual
259712707,false,true,skipped
10713759,false,true,success
284327629,false,true,success
236540975,false,false,success
221262977,false,false,success
250554925,false,true,success
164259126,false,true,success
55115015,true,false,success
304770520,false,true,success
21139601,false,false,success
56178321,false,false,success
304450997,false,false,success
224243451,false,false,skipped
251922604,false,false,success
324091734,false,false,success
20316781,false,false,manual
41540757,true,false,failed
48480883,false,false,success
271442611,false,true,success
34978210,false,true,success
270063807,false,false,failed
280924653,true,false,manual
266487910,false,true,success
89888677,false,false,success
330250439,false,false,success
311109536,true,false,success
300351401,false,false,failed
155988603,false,false,manual
271981072,false,true,failed
88221271,false,false,success
138132825,false,false,failed
303073012,false,false,success
333672224,true,false,success
219691604,false,false,failed
27869100,false,true,failed
276351493,false,true,manual
13515795,false,false,manual
215709355,false,false,success
321995782,false,false,success
277731590,false,false,success
213892127,false,false,success
79358017,false,true,success
120058504,false,true,failed
194945150,false,false,skipped
159053050,false,false,failed
175892912,false,false,success
118420168,false,true,canceled
132448318,false,false,success
289673364,true,false,failed
328323501,false,true,success
290380313,false,false,success
158727351,false,false,success
220958450,false,false,success
72819054,false,false,success
21644073,false,false,success
261242825,false,false,success
80768334,false,false,success
262500458,false,false,success
165202618,false,false,success
143014678,true,true,success
324416239,false,false,skipped
41981391,false,false,success
310237889,false,true,success
32792718,false,false,manual
72035879,false,false,success
251672884,false,false,manual
62562693,false,false,success
242310686,false,false,success
322272987,false,false,success
202478208,false,false,success
87063503,false,true,success
172193904,true,false,success
50885845,false,true,success
91501594,false,false,success
35438962,false,false,manual
284084150,false,false,manual
48915792,true,true,success
332005484,false,false,failed
281528944,true,false,success
276919887,false,true,success
69107537,true,false,success
162811375,false,false,failed
287653989,false,false,success
231609147,false,false,success
335065237,false,false,success
304143676,false,false,success
117708711,false,false,success
194530724,false,false,success
179575690,true,false,success
324964962,false,true,success
291838754,false,false,success
203454121,false,false,skipped
307855708,false,true,success
100230519,false,false,failed
195616060,false,false,success
48051021,false,false,success
90350105,true,false,success
276049592,false,false,manual
113332661,false,false,success
242720160,false,false,success
225844778,false,false,manual
265909645,false,false,success
22887939,false,true,success
263146080,false,false,success
187713703,false,false,canceled
325472557,false,false,failed
148390861,false,false,success
256415436,false,true,success
222314819,false,false,success
329126325,false,true,manual
247555237,false,false,success
190336478,false,false,success
325788604,false,false,success
197627010,false,false,success
275230236,false,false,success
130875604,false,true,skipped
149470286,false,false,success
285614563,true,false,success
282048311,false,false,manual
209182961,false,false,failed
239165683,false,false,success
258989726,false,false,manual
231902718,false,false,success
173937355,false,false,success
165949666,false,false,success
323067623,false,true,manual
99918630,false,false,canceled
24149264,false,false,skipped
171851297,false,false,success
190025172,false,false,success
41042795,false,true,skipped
218984021,false,false,success
54405074,false,false,success
43551486,false,true,success
228270068,false,false,canceled
139124008,false,true,success
102070975,false,false,canceled
272238772,false,false,failed
16513513,false,false,success
199626216,false,false,canceled
188369394,false,false,success
159650639,true,false,manual
255366291,false,true,success
216736576,false,false,success
64740491,false,false,failed
329371952,false,true,success
182492321,true,false,success
270605763,true,false,success
151536231,false,false,skipped
244894733,true,false,success
286332370,true,true,failed
66122080,true,true,success
98456547,false,false,skipped
231332700,false,false,success
300591888,false,false,created
295350664,true,false,canceled
230177661,true,false,success
286845578,false,false,skipped
307219104,false,false,failed
193898173,false,false,success
69862213,false,false,success
5031089,false,false,skipped
68375426,false,false,canceled
134514923,true,false,success
143745448,false,false,success
127349928,false,false,success
247824608,false,false,success
228567783,false,true,success
12307421,false,false,canceled
142668985,true,false,success
179248251,false,false,success
268711689,true,false,skipped
199946601,false,false,success
71687348,false,false,success
322533720,false,false,failed
244036927,false,false,success
202758158,false,false,success
110584946,true,false,success
94313207,false,false,manual
218239306,false,false,skipped
311381607,true,true,success
319211076,true,true,success
103104408,false,false,failed
13130613,false,false,manual
279155582,true,true,canceled
9383232,true,false,success
271702765,false,false,success
273310767,false,false,success
50502292,false,true,success
177557499,false,false,success
130135531,true,false,success
183146568,false,false,failed
193576713,false,true,manual
105742430,false,false,success
313238657,false,false,success
280207778,false,false,success
185671591,false,false,success
78964555,false,true,canceled
257003840,false,false,canceled
26568044,false,true,success
336172555,false,false,success
204200159,false,false,success
320561831,false,false,manual
336763235,false,false,skipped
33651298,false,true,success
185963202,false,false,success
86252039,false,false,success
60164689,false,false,success
61023133,false,true,manual
220661406,false,false,failed
280673861,false,false,success
334191651,false,true,success
237935338,false,false,success
30176702,false,false,success
54773345,false,true,success
295058155,false,false,failed
262181288,false,false,manual
322823743,false,true,success
227091288,false,false,manual
238220515,false,false,success
82643652,false,false,failed
172516974,false,false,canceled
302789768,false,false,success
241687485,false,false,success
26197862,false,false,success
316376425,false,false,success
163194747,false,false,success
166569932,false,false,success
211984930,false,false,success
63967140,false,true,skipped
110170465,false,false,success
222689806,false,false,success
277438477,false,false,manual
313487069,false,false,canceled
227957555,false,false,success
83394201,false,false,failed
29462491,false,false,skipped
89202859,false,false,canceled
243418017,true,false,failed
54046702,false,false,canceled
49741478,false,true,success
10034408,false,false,success
131823922,false,false,success
233863758,true,false,manual
74236162,true,true,success
66931898,false,false,manual
60598864,false,false,success
158312255,true,true,failed
200750702,true,true,failed
223376097,false,false,manual
253322319,false,false,canceled
220364309,false,false,success
78130672,false,false,success
240480710,true,false,success
311731163,false,false,success
312091595,true,true,success
254505159,false,false,created
220021101,false,false,success
192977240,false,false,success
198373458,false,false,success
117009856,false,false,manual
5511589,false,false,success
230431447,false,true,failed
36311880,true,false,success
191309373,false,true,success
208565042,true,true,success
96601892,false,true,failed
131518681,false,true,success
39214216,false,false,success
218660381,false,false,success
335916118,false,false,canceled
308184931,false,false,skipped
100614584,false,false,failed
289909702,false,false,success
107778001,false,false,success
93645411,false,false,success
156971298,true,false,success
242010921,false,false,success
166295949,false,true,success
12702003,false,false,canceled
253019742,false,true,success
67371907,false,false,success
182180341,false,false,manual
204639856,false,false,success
270334237,false,false,failed
299648192,false,false,success
23335430,true,false,success
141876249,false,false,manual
103815071,false,false,failed
81881781,false,true,skipped
278877885,false,true,failed
128056853,false,false,success
297429132,false,false,failed
37503098,false,true,manual
267339537,false,false,success
58567560,false,false,manual
157633371,false,false,success
318782211,true,false,success
312963949,false,false,success
152251863,false,false,success
178673433,false,false,success
266806870,true,false,success
104178107,false,false,skipped
102747001,false,false,failed
20736529,true,false,skipped
294065483,false,false,success
95495827,true,false,manual
25818792,false,false,manual
249999454,false,false,success
318944173,false,false,failed
209465466,false,true,success
18569392,false,false,success
204943879,false,false,success
106577611,false,false,canceled
233542815,false,false,success
175470132,false,false,success
163589624,true,false,success
244318340,false,false,failed
239,false,true,success
321098330,false,false,failed
66549863,false,false,success
208249911,false,true,success
99139111,false,false,failed
171201241,false,false,skipped
239861299,false,false,success
100950746,false,false,manual
326599720,false,false,success
161408695,false,false,success
68769230,true,true,success
192655530,true,true,success
150423770,true,false,skipped
211393391,true,true,manual
148069476,false,false,success
330800384,false,true,failed
182820654,false,false,success
164919276,false,true,canceled
335355878,true,false,success
44667796,true,true,success
144433275,false,true,success
212654600,false,false,success
297777527,false,false,success
282287403,false,false,success
209803617,false,false,success
214177461,false,false,success
169681722,false,false,success
156349747,false,true,skipped
161083726,false,false,success
253922811,false,false,skipped
132160804,false,false,failed
43203381,false,true,success
189698210,false,false,success
88925171,false,false,manual
116690021,true,false,success
6022524,false,false,success
261571246,false,false,success
121714258,false,false,success
133199088,false,true,success
161728106,false,false,failed
94680331,false,false,failed
40260911,false,false,success
9006248,false,true,manual
108843616,false,false,success
11898810,false,false,success
170812529,true,false,success
153581504,false,false,success
16132847,false,false,success
162438105,false,false,success
264841585,false,false,success
197057880,false,false,success
168931620,false,false,failed
157303084,false,false,failed
245163140,false,true,success
115109914,false,false,success
217666972,false,false,success
67665006,false,true,success
211121960,false,false,skipped
234508100,false,false,skipped
284584660,false,true,success
151065587,false,false,canceled
155275197,false,false,failed
314313331,false,false,success
198672835,false,false,success
320817165,false,false,success
52080564,false,true,manual
170082300,false,false,failed
187031642,false,true,success
274449062,true,true,success
150725582,false,false,success
330510531,false,false,success
124057168,false,true,success
332283192,true,false,failed
293815612,false,false,skipped
190980612,false,false,created
168185911,false,false,success
81553518,false,false,skipped
22512800,true,false,manual
246422427,false,false,manual
70956574,false,false,success
126188190,false,false,manual
90748835,false,false,canceled
19881688,false,false,failed
75736796,true,false,success
207616111,false,false,canceled
140833790,false,false,canceled
52505643,false,false,success
323705667,false,false,canceled
272514871,true,false,manual
73186029,false,false,success
95110503,false,false,manual
305716198,true,false,manual
46959183,false,true,manual
163931516,false,false,canceled
38222739,false,true,manual
62872679,false,false,canceled
38907757,true,false,success
296440840,false,false,success
58131679,false,false,success
64367286,true,false,success
87890729,false,true,success
196478389,true,true,success
14774982,false,false,success
326053155,false,false,skipped
238849463,false,false,skipped
223941429,false,true,success
201879303,false,true,manual
95807755,false,false,skipped
109502316,false,false,success
171547245,false,true,success
26998318,false,false,success
199316466,false,false,success
7084447,false,true,success
329660621,false,false,success
285355934,false,true,success
306308903,true,false,success
69450014,false,false,success
215088972,true,true,created
183494077,false,true,created
137123614,false,false,success
78550922,false,false,success
327412258,true,false,manual
115507202,false,true,canceled
286072328,false,false,skipped
291228283,false,false,manual
262791000,true,false,success
198066330,false,false,success
170433452,false,false,skipped
273050122,false,false,manual
321403222,false,false,success
144844012,false,false,manual
326328120,false,false,success
121400191,false,false,success
61396031,false,false,success
272763544,false,false,success
46168342,true,false,failed
288658072,false,true,success
184811648,false,false,success
324669085,false,true,skipped
56584445,false,false,success
147750349,false,true,canceled
232643894,false,false,success
314871352,false,false,success
96984902,true,false,success
122778362,false,false,success
134185601,true,false,canceled
288411275,false,false,success
221627916,false,false,manual
246102028,false,true,failed
131201734,false,false,success
253651193,false,false,success
284875450,false,false,success
298955781,false,false,success
140198147,false,false,success
184495020,false,true,failed
135761802,true,true,success
7564064,false,true,success
227641553,true,false,success
102405450,false,true,success
229837751,false,false,success
283535264,true,true,success
183897591,false,false,success
309366913,true,false,manual
208860354,false,false,success
246711697,false,false,success
105354143,false,false,success
172833291,false,false,manual
98119734,false,false,success
45054623,false,false,success
325221539,false,false,manual
229285637,false,false,failed
217366419,false,false,skipped
51693960,true,false,success
251109113,false,false,success
186709109,true,false,manual
77754448,false,false,success
149770362,true,false,manual
224533830,false,false,success
142307034,false,false,success
154350636,false,false,success
279655975,true,false,success
300844833,false,true,success
278615858,false,true,failed
30540498,false,false,failed
245752314,false,true,success
91162927,false,false,success
238555261,false,false,success
328026398,false,false,success
223679763,false,false,success
127711102,true,false,success
327765287,false,false,success
27396139,true,false,success
141497689,false,false,manual
191947268,true,false,manual
77004727,false,true,manual
243111108,false,false,success
285116964,false,false,manual
269528478,false,false,canceled
274192441,true,false,success
316974408,false,false,manual
160300731,false,true,success
157990346,true,false,success
3456551,false,false,success
19472724,false,false,success
108426262,false,false,success
332853530,false,false,success
87440300,false,true,success
321676680,false,false,success
307501237,false,false,success
328584152,true,true,success
331072939,false,false,success
125180244,false,false,skipped
177212686,false,false,success
152903281,true,false,skipped
112274013,false,false,success
300061155,false,false,failed
57047400,false,true,canceled
288159940,false,false,skipped
246986137,false,false,success
301434374,false,false,success
85084445,false,false,success
33211527,false,false,failed
76139114,false,false,success
28640345,false,false,success
291517418,false,false,success
45427924,false,false,failed
227365432,false,false,canceled
73564592,false,false,failed
269269694,true,false,success
93212345,false,false,success
96199492,false,false,failed
309095617,true,false,manual
225484410,false,true,success
70549669,true,false,skipped
301107714,true,true,success
145781024,true,false,success
128821132,true,true,manual
34179360,false,false,success
62223010,false,false,success
79742920,false,false,success
101326157,false,false,failed
234952767,false,false,success
196168070,false,false,success
268410828,false,false,success
73916837,false,false,success
255720369,false,false,success
236971685,false,false,success
74716047,false,false,success
174514085,false,false,failed
259990110,false,false,skipped
160644663,false,false,success
174818098,false,true,success
239469268,false,false,success
267603928,false,true,success
92501096,false,false,failed
136732153,false,false,skipped
260312994,false,false,success
214484255,false,false,success
72449065,false,false,failed
259366939,false,false,manual
132733825,true,true,success
250858903,false,false,skipped
