4407069,prepare_script
4358524,get_sources
4397616,build_script
4667263,build_script
4428276,prepare_executor
4338007,build_script
4345036,prepare_executor
4396486,prepare_script
4338359,resolve_secrets
4523962,download_artifacts
4337317,download_artifacts
4403540,upload_artifacts
4393065,get_sources
4419481,step_script
4390087,prepare_script
4403851,after_script
4392785,step_script
4394745,restore_cache
4337491,get_sources
4585066,restore_cache
4533348,after_script
4612188,archive_cache
4403189,get_sources
4405485,resolve_secrets
4338261,prepare_script
3824251,build_script
4492494,prepare_script
4337452,cleanup_file_variables
4338039,restore_cache
4337793,get_sources
4399702,resolve_secrets
4394659,step_script
4402164,restore_cache
4403965,prepare_script
4341630,prepare_script
4397880,after_script
4403845,get_sources
4342911,download_artifacts
4466319,upload_artifacts_on_failure
1441932,upload_artifacts_on_success
4399154,after_script
4338359,get_sources
4404287,build_script
4402474,restore_cache
4677129,prepare_script
4339099,prepare_executor
4395124,prepare_executor
4394216,upload_artifacts_on_success
4392358,after_script
4403263,prepare_executor
4403256,archive_cache
4400731,download_artifacts
4400685,resolve_secrets
4400124,get_sources
4403540,prepare_executor
4394358,build_script
4401314,prepare_executor
4400046,cleanup_file_variables
4404850,build_script
1441932,prepare_script
4438249,build_script
4349256,cleanup_file_variables
4404440,prepare_script
4349298,upload_artifacts_on_success
4403185,restore_cache
4397727,cleanup_file_variables
4591122,after_script
4399607,prepare_executor
4413486,after_script
4533990,get_sources
4402545,download_artifacts
4400686,build_script
4433762,after_script
4395124,prepare_executor
4370262,get_sources
4342839,after_script
4400910,get_sources
4389164,cleanup_file_variables
4624953,get_sources
4370262,prepare_script
4391861,prepare_script
4446001,download_artifacts
4405933,get_sources
4407642,prepare_executor
4394905,prepare_script
4512910,after_script
4612188,get_sources
4341780,restore_cache
4400133,prepare_executor
4389719,restore_cache
4657805,get_sources
4430180,prepare_executor
4447766,after_script
4418935,restore_cache
4399532,after_script
4394545,restore_cache
4405106,cleanup_file_variables
4337740,get_sources
4400686,restore_cache
4529724,upload_artifacts_on_failure
4399213,restore_cache
4592923,prepare_executor
4389155,build_script
4387023,restore_cache
4405282,prepare_executor
4400638,prepare_script
4591122,get_sources
4373935,restore_cache
4395124,after_script
4402101,upload_artifacts_on_failure
4337183,upload_artifacts_on_success
4406623,resolve_secrets
4342906,restore_cache
4338350,resolve_secrets
4403968,after_script
4404953,build_script
4451046,prepare_script
4403708,after_script
4418563,upload_artifacts
4492494,prepare_executor
4394772,get_sources
4342077,get_sources
4422333,get_sources
4338306,build_script
4395837,resolve_secrets
4338088,get_sources
4404733,step_script
4341388,step_script
4404086,download_artifacts
4402690,download_artifacts
4392785,download_artifacts
4397844,build_script
4583615,archive_cache
4388953,resolve_secrets
278964,build_script
4348983,get_sources
4400686,get_sources
4406781,download_artifacts
4427439,step_script
4399702,cleanup_file_variables
4402162,prepare_script
4404216,download_artifacts
4397878,restore_cache
4339362,build_script
4338261,resolve_secrets
4397075,get_sources
4337479,upload_artifacts_on_failure
4403196,upload_artifacts_on_success
4337452,step_script
4406052,after_script
4667264,upload_artifacts_on_failure
4396544,prepare_executor
4392222,build_script
4500732,archive_cache
4337639,get_sources
4392517,prepare_script
4337368,upload_artifacts_on_success
4564967,prepare_executor
4443770,after_script
4403968,upload_artifacts_on_failure
4438355,archive_cache
4394888,step_script
4337249,after_script
4474445,after_script
4495900,prepare_project
4338161,step_script
4399206,prepare_executor
4395408,restore_cache
4406781,download_artifacts
4565003,restore_cache
4405282,download_artifacts
4397378,resolve_secrets
4385062,get_sources
4389393,after_script
4397239,upload_artifacts_on_failure
3280218,download_artifacts
3843116,get_sources
4338293,after_script
4395600,upload_artifacts_on_success
4338146,download_artifacts
4401308,cleanup_file_variables
4341597,after_script
4422356,prepare_executor
4518997,prepare_executor
4492367,restore_cache
4393072,prepare_executor
4337747,restore_cache
4392496,download_artifacts
4342916,prepare_executor
4394476,prepare_script
4398299,get_sources
4533348,prepare_executor
4430180,after_script
4400200,cleanup_file_variables
4337187,prepare_script
4399596,prepare_script
4499670,prepare_script
4404127,prepare_script
4389655,prepare_executor
4342957,build_script
4394539,prepare_executor
4405709,get_sources
4392960,after_script
4422333,prepare_executor
4403190,build_script
4341750,archive_cache
4400914,after_script
4402549,get_sources
4338161,build_script
4401723,build_script
4430875,archive_cache
4406052,prepare_script
4416327,get_sources
4393206,after_script
4578981,prepare_executor
4342495,download_artifacts
4337829,upload_artifacts_on_failure
4429825,get_sources
4564967,prepare_executor
4576424,prepare_executor
4406766,archive_cache
4403748,download_artifacts
4342954,cleanup_file_variables
4404091,download_artifacts
4394722,cleanup_file_variables
4396488,build_script
4392790,build_script
4492494,archive_cache
4400553,cleanup_file_variables
4339456,prepare_executor
4408538,download_artifacts
4447361,step_script
4348983,prepare_script
4389655,build_script
4343510,build_script
4404330,upload_artifacts_on_failure
4392493,download_artifacts
4386815,prepare_executor
4400914,upload_artifacts_on_failure
4440863,upload_artifacts_on_failure
4339456,download_artifacts
4339456,prepare_executor
4395680,after_script
4402102,upload_artifacts_on_success
4385157,resolve_secrets
4397616,after_script
4337507,download_artifacts
4469370,download_artifacts
4555416,archive_cache
4394611,build_script
4392498,after_script
4337632,prepare_script
4394131,download_artifacts
4340008,upload_artifacts_on_failure
4365984,upload_artifacts_on_success
4503414,get_sources
4372173,after_script
4453276,prepare_script
4337507,get_sources
4403250,download_artifacts
4340174,archive_cache
4391701,build_script
4394660,build_script
4397368,download_artifacts
4390203,step_script
4395952,prepare_script
4531689,prepare_executor
4373061,download_artifacts
4430875,get_sources
4358524,after_script
4393440,archive_cache
4394309,prepare_script
4338293,cleanup_file_variables
4373707,build_script
4403747,step_script
4397613,restore_cache
4592604,restore_cache
4670518,get_sources
4564750,get_sources
4404065,build_script
4391635,after_script
4422806,build_script
4401764,after_script
4398299,get_sources
4395185,prepare_script
4394899,restore_cache
4432662,restore_cache
4393139,upload_artifacts_on_failure
4670518,prepare_project
4338078,prepare_script
4396488,prepare_executor
4395957,get_sources
4393075,get_sources
4406766,download_artifacts
4499669,get_sources
4397377,build_script
4398201,download_artifacts
4394539,after_script
4390082,step_script
4396791,prepare_script
4401764,step_script
4396327,get_sources
4403238,restore_cache
4392222,prepare_script
4393778,get_sources
4389266,restore_cache
4667934,prepare_script
4343551,download_artifacts
4338161,upload_artifacts_on_failure
4402486,upload_artifacts_on_success
4393139,after_script
4342495,restore_cache
4392118,prepare_executor
4518997,prepare_executor
4396327,get_sources
4389164,after_script
4342954,prepare_script
4394883,restore_cache
4397733,prepare_script
4396194,restore_cache
4338263,prepare_script
4403519,archive_cache
4394233,restore_cache
4397122,prepare_executor
4422333,after_script
4398201,build_script
4338160,prepare_script
4602126,get_sources
4370180,step_script
7764,prepare_script
4348688,download_artifacts
4404375,get_sources
4576204,after_script
4355860,get_sources
4416658,prepare_script
4387023,upload_artifacts_on_failure
4392904,upload_artifacts
4337177,resolve_secrets
4405997,get_sources
4348983,prepare_executor
4399671,prepare_script
4403279,prepare_script
4393440,prepare_script
4337603,prepare_executor
4397239,after_script
4373061,prepare_script
4392419,upload_artifacts_on_failure
4337553,download_artifacts
4630123,download_artifacts
4404287,restore_cache
4548821,upload_artifacts_on_failure
4404030,download_artifacts
4430348,prepare_script
4619193,prepare_executor
4339454,build_script
4337208,prepare_script
4489853,prepare_script
4391752,cleanup_file_variables
4389163,get_sources
4430875,prepare_script
4395648,after_script
4393779,resolve_secrets
4576204,get_sources
4667984,upload_artifacts_on_failure
4404850,prepare_script
4404287,prepare_script
4401906,download_artifacts
4474445,get_sources
4677129,restore_cache
4528360,build_script
7764,upload_artifacts_on_failure
4434184,step_script
4402127,archive_cache
4338007,restore_cache
4397822,upload_artifacts_on_failure
4400200,upload_artifacts_on_failure
4566058,upload_artifacts_on_failure
4403262,step_script
4392575,prepare_script
4427389,after_script
4390946,get_sources
4403207,step_script
4422806,prepare_executor
4387212,restore_cache
4391685,build_script
4565003,download_artifacts
4337829,resolve_secrets
4341780,prepare_script
4462435,download_artifacts
4398857,download_artifacts
4341358,after_script
4354482,after_script
4592287,restore_cache
4607681,download_artifacts
4397532,restore_cache
4391320,restore_cache
4366121,upload_artifacts_on_failure
4403198,after_script
4394605,step_script
4426388,prepare_script
4337103,resolve_secrets
4667263,archive_cache
4397124,build_script
4407596,download_artifacts
4395792,download_artifacts
4403196,prepare_script
4392187,restore_cache
4404578,download_artifacts
4404287,prepare_script
4400200,build_script
4395012,restore_cache
4503414,prepare_script
4406849,prepare_executor
4403230,build_script
4393903,get_sources
4444287,get_sources
4338306,restore_cache
4397878,prepare_script
4625074,cleanup_file_variables
4496603,get_sources
4398649,prepare_executor
4657805,restore_cache
4392500,prepare_script
4337740,upload_artifacts_on_success
4392187,prepare_script
4338270,prepare_script
4397270,after_script
4392785,build_script
4399522,upload_artifacts_on_failure
4392993,step_script
4393779,build_script
4389655,prepare_executor
4636445,resolve_secrets
4337716,upload_artifacts_on_failure
4627049,upload_artifacts_on_failure
4393317,prepare_executor
4396795,download_artifacts
4391065,restore_cache
924337,get_sources
4408140,download_artifacts
4642930,upload_artifacts_on_failure
4337208,get_sources
4521591,get_sources
4403747,get_sources
4391887,upload_artifacts_on_success
4391217,prepare_script
4339454,prepare_executor
4341358,build_script
4391158,cleanup_file_variables
4337716,download_artifacts
4342915,get_sources
4406766,prepare_script
4407642,after_script
4395185,restore_cache
4394888,build_script
4337869,get_sources
4337603,archive_cache
4441663,upload_artifacts_on_failure
4397378,get_sources
4394079,restore_cache
4396473,prepare_script
4396332,prepare_script
4365984,prepare_script
4405344,prepare_executor
4449589,restore_cache
4416326,after_script
4345036,prepare_executor
4404065,upload_artifacts_on_failure
4400554,after_script
4406302,upload_artifacts_on_failure
4372994,restore_cache
4392785,download_artifacts
4555416,build_script
4389164,get_sources
4402690,prepare_script
4339744,after_script
4391005,prepare_script
4403256,prepare_executor
4342906,download_artifacts
3824251,after_script
4338146,restore_cache
4337368,download_artifacts
4391845,prepare_script
4390645,step_script
4407485,after_script
4432662,upload_artifacts_on_success
4443921,build_script
4390934,resolve_secrets
4390645,prepare_executor
4338257,upload_artifacts
4341358,download_artifacts
4565430,get_sources
4474445,prepare_executor
4592446,after_script
4511035,upload_artifacts_on_success
4337575,after_script
4407176,archive_cache
4392491,after_script
4426388,prepare_script
4533990,prepare_executor
4402678,resolve_secrets
4400133,get_sources
4462435,restore_cache
4341750,build_script
4393778,download_artifacts
3280218,prepare_executor
4401190,upload_artifacts_on_failure
4625074,get_sources
4398630,upload_artifacts_on_failure
4397377,get_sources
4513088,prepare_executor
4394883,prepare_script
4403189,resolve_secrets
4405382,get_sources
4392118,prepare_script
4591122,upload_artifacts_on_failure
4392792,prepare_executor
4393074,build_script
4392490,prepare_executor
4391790,prepare_script
4432662,download_artifacts
4345487,get_sources
4389163,build_script
4423977,restore_cache
4338088,download_artifacts
4339453,after_script
4409747,prepare_executor
4404026,get_sources
4389164,get_sources
4422333,prepare_executor
4636446,resolve_secrets
4397879,download_artifacts
4371267,restore_cache
4398350,prepare_executor
4392789,restore_cache
4370268,build_script
4338077,get_sources
4398645,get_sources
4402687,download_artifacts
4338089,resolve_secrets
4400065,download_artifacts
4405856,download_artifacts
4426388,get_sources
4404587,after_script
4406286,get_sources
4402687,prepare_script
4343080,after_script
4337183,get_sources
4528360,prepare_executor
4622863,cleanup_file_variables
4391752,build_script
4393908,get_sources
4403230,step_script
4408206,cleanup_file_variables
4340732,step_script
4576204,prepare_script
4338257,prepare_script
4667984,upload_artifacts_on_failure
4337264,prepare_script
4592446,restore_cache
4339013,prepare_executor
4397550,download_artifacts
4403751,prepare_executor
4408206,prepare_executor
4670518,resolve_secrets
4419481,download_artifacts
4565430,build_script
4405381,prepare_executor
4337113,get_sources
4422333,build_script
4393074,resolve_secrets
4484215,get_sources
4394476,step_script
4394216,get_sources
4399897,download_artifacts
4341751,prepare_script
4508224,prepare_script
1109326,prepare_executor
4338261,restore_cache
4337871,build_script
4398934,step_script
4395542,get_sources
3843116,build_script
4667262,after_script
4402356,restore_cache
4345036,upload_artifacts_on_failure
4398396,after_script
4395012,step_script
4561864,restore_cache
4391136,get_sources
4338088,get_sources
4338204,upload_artifacts_on_success
4338035,build_script
4400046,cleanup_file_variables
4512909,prepare_script
4393072,get_sources
4397899,restore_cache
4451047,prepare_executor
4502497,restore_cache
4399701,prepare_executor
4402359,resolve_secrets
4395408,after_script
4426388,restore_cache
4619193,prepare_script
4402165,download_artifacts
4341012,prepare_script
4405932,download_artifacts
4405104,restore_cache
4395014,cleanup_file_variables
4337355,download_artifacts
4461931,get_sources
4405105,download_artifacts
4338670,prepare_executor
4442331,after_script
4393438,get_sources
4398530,upload_artifacts_on_failure
4337674,upload_artifacts_on_failure
4337372,step_script
4406111,after_script
4401377,download_artifacts
4390043,resolve_secrets
3280218,upload_artifacts_on_success
924337,prepare_script
4430875,get_sources
4566308,restore_cache
4405185,restore_cache
4365984,get_sources
4338051,get_sources
4564967,upload_artifacts_on_failure
4394131,download_artifacts
4389945,step_script
4372642,download_artifacts
4419481,download_artifacts
4342917,prepare_executor
4390554,restore_cache
4442331,prepare_executor
4398074,restore_cache
4399896,prepare_executor
4400039,download_artifacts
4509505,get_sources
4341750,prepare_script
4385062,get_sources
4657805,get_sources
4406623,upload_artifacts_on_failure
4389999,archive_cache
4342954,prepare_executor
4649951,get_sources
4483521,restore_cache
4404872,after_script
4390203,upload_artifacts_on_success
4433951,after_script
4399206,download_artifacts
4555416,after_script
4416658,get_sources
4394057,prepare_script
4555246,prepare_executor
4389645,build_script
4564750,download_artifacts
4398932,prepare_script
4341353,restore_cache
4416326,get_sources
4391635,restore_cache
4416325,build_script
4399702,get_sources
4349298,restore_cache
4395863,after_script
4504969,upload_artifacts_on_failure
4392019,restore_cache
4636446,after_script
4389455,get_sources
4407181,build_script
4504969,after_script
4392904,restore_cache
4389719,restore_cache
4397822,get_sources
4403186,cleanup_file_variables
4416327,upload_artifacts_on_failure
998523,prepare_executor
4337697,prepare_executor
3565113,download_artifacts
4392517,get_sources
4391635,build_script
4394358,prepare_script
4337103,get_sources
4404876,download_artifacts
4405383,get_sources
4397122,prepare_script
4397372,restore_cache
4395069,resolve_secrets
4403263,step_script
4339456,cleanup_file_variables
4338227,upload_artifacts_on_failure
4340174,build_script
4397613,cleanup_file_variables
4404030,prepare_executor
4398934,upload_artifacts_on_success
4555416,restore_cache
4342916,download_artifacts
4395342,build_script
4404086,archive_cache
4397879,get_sources
4400489,upload_artifacts_on_failure
4602126,after_script
4405910,get_sources
4406238,get_sources
4374485,step_script
4402178,get_sources
4427439,resolve_secrets
4398084,download_artifacts
4619193,build_script
4406644,prepare_executor
4338190,prepare_script
4390706,download_artifacts
4600853,prepare_script
4399153,prepare_script
4427440,upload_artifacts_on_success
4657805,get_sources
4548821,upload_artifacts_on_failure
4393206,prepare_script
4392284,after_script
4642930,prepare_executor
4583614,prepare_executor
4533725,resolve_secrets
4392490,get_sources
7764,download_artifacts
4399901,resolve_secrets
4407596,prepare_script
4394905,after_script
4591122,get_sources
4406286,get_sources
4636446,prepare_executor
4396791,upload_artifacts_on_failure
4485049,get_sources
4537535,cleanup_file_variables
4670518,cleanup_file_variables
4391005,upload_artifacts_on_success
4416658,cleanup_file_variables
4400558,prepare_script
4636445,step_script
4337829,upload_artifacts_on_success
4340669,prepare_script
4405932,upload_artifacts_on_failure
4389393,archive_cache
4592327,build_script
4397878,prepare_script
4404287,get_sources
4348983,archive_cache
4395600,after_script
4397896,download_artifacts
4390934,prepare_executor
4400914,prepare_executor
4397290,download_artifacts
4434184,after_script
4337188,restore_cache
4492494,archive_cache
4408206,after_script
4405559,prepare_executor
4577224,upload_artifacts_on_success
4402474,upload_artifacts_on_failure
4342839,after_script
4401974,step_script
4399901,restore_cache
4612753,upload_artifacts_on_failure
4485018,get_sources
4390905,build_script
4564750,step_script
4405993,get_sources
4342839,prepare_executor
4394539,build_script
4392485,download_artifacts
4391845,after_script
4391258,after_script
4400970,cleanup_file_variables
4650248,build_script
4338670,build_script
4374485,resolve_secrets
4337069,restore_cache
4399206,upload_artifacts_on_success
4405933,get_sources
4395863,after_script
4399670,get_sources
4462435,cleanup_file_variables
4406337,after_script
4416306,build_script
4371267,after_script
4394361,prepare_executor
4341630,prepare_script
4400489,resolve_secrets
4534035,prepare_executor
4508224,after_script
4405128,build_script
4416180,resolve_secrets
4518997,download_artifacts
4405106,prepare_script
4404030,build_script
4403219,build_script
4397880,get_sources
4395596,build_script
4398393,build_script
4392789,resolve_secrets
4390645,prepare_script
4389155,get_sources
4394545,restore_cache
4342077,download_artifacts
4392790,after_script
4393303,after_script
4342956,build_script
4406767,after_script
4394905,get_sources
4405485,after_script
4401191,download_artifacts
4372714,after_script
4429899,prepare_script
4389216,download_artifacts
4453276,prepare_script
3565113,archive_cache
4391509,download_artifacts
4400970,prepare_script
4337623,resolve_secrets
4649951,get_sources
4430180,download_artifacts
4395680,upload_artifacts_on_success
4397239,build_script
4337918,step_script
4402957,restore_cache
4530944,build_script
4338270,build_script
4365072,upload_artifacts_on_failure
4422356,get_sources
4365072,prepare_script
4337542,cleanup_file_variables
4406648,get_sources
4398299,download_artifacts
4337329,prepare_executor
4337355,after_script
4576204,restore_cache
4393364,get_sources
4447766,restore_cache
4400039,upload_artifacts_on_failure
4404065,build_script
4405485,prepare_executor
4392284,restore_cache
4405128,prepare_executor
4407641,prepare_executor
4677129,upload_artifacts_on_success
4338078,after_script
4345421,step_script
4395122,prepare_script
4339746,get_sources
4385051,build_script
4397368,build_script
4337197,restore_cache
4400553,step_script
4403191,after_script
4413486,download_artifacts
4370268,prepare_executor
4451046,prepare_executor
4392489,prepare_executor
4337639,after_script
4336986,after_script
4337545,build_script
4338173,download_artifacts
4612188,prepare_executor
4591122,archive_cache
4599820,build_script
4391701,get_sources
4394230,download_artifacts
4371267,upload_artifacts_on_failure
4342838,restore_cache
3280218,upload_artifacts_on_failure
4338160,cleanup_file_variables
4395793,upload_artifacts_on_failure
4413486,resolve_secrets
4397880,restore_cache
4443921,prepare_executor
4512910,step_script
4403189,after_script
4338670,prepare_executor
4399897,after_script
4405104,prepare_executor
4390843,upload_artifacts_on_success
4529724,prepare_script
4392493,build_script
4402101,prepare_executor
4624953,prepare_script
4396737,after_script
4447361,step_script
4337303,prepare_script
4403196,prepare_executor
4395952,get_sources
1109326,download_artifacts
4392485,prepare_script
4392853,get_sources
4343044,step_script
4400133,upload_artifacts_on_failure
4393438,restore_cache
4507194,download_artifacts
4397880,build_script
4394611,after_script
4405344,get_sources
4404065,build_script
4396795,prepare_executor
4337188,prepare_executor
4337852,prepare_script
4668802,prepare_executor
4337747,upload_artifacts_on_success
4451048,get_sources
4403207,build_script
4461931,restore_cache
4337372,get_sources
4405451,get_sources
4348982,prepare_script
4403965,prepare_script
4432662,after_script
4406849,prepare_executor
4395069,get_sources
4404066,step_script
4507223,prepare_script
4392792,upload_artifacts_on_success
4392491,download_artifacts
4397899,get_sources
4392677,download_artifacts
4423977,upload_artifacts_on_failure
4398350,prepare_script
4407642,prepare_executor
4337177,get_sources
4562670,cleanup_file_variables
4337674,prepare_executor
4533725,step_script
4403189,prepare_script
4394230,after_script
4337632,after_script
4489402,upload_artifacts_on_failure
4405707,build_script
4562670,after_script
4399896,get_sources
4395863,step_script
4405932,cleanup_file_variables
4430875,build_script
4466198,prepare_executor
4406623,step_script
4337329,prepare_script
4337968,archive_cache
4372994,after_script
4624953,step_script
4404091,get_sources
4484215,resolve_secrets
4394480,resolve_secrets
4404440,archive_cache
4566308,prepare_script
4338358,get_sources
4677129,prepare_executor
4392489,resolve_secrets
4418563,archive_cache
4565003,prepare_script
4404632,prepare_script
4398397,resolve_secrets
4392555,prepare_script
4443770,prepare_executor
4402233,restore_cache
4395124,download_artifacts
4339453,download_artifacts
4636445,prepare_executor
4734925,prepare_script
4403250,upload_artifacts_on_failure
4388986,restore_cache
4394722,download_artifacts
4392493,prepare_script
4612188,archive_cache
4446485,upload_artifacts_on_failure
4406111,prepare_executor
4400910,cleanup_file_variables
4370424,upload_artifacts
4436413,after_script
4396488,get_sources
4454511,step_script
4404064,upload_artifacts_on_success
4338190,prepare_script
4399206,archive_cache
4390946,build_script
4337478,prepare_executor
4512909,get_sources
4422356,cleanup_file_variables
4339457,restore_cache
4392187,upload_artifacts_on_success
4403751,after_script
4397899,build_script
4389221,prepare_script
4337920,after_script
4407355,prepare_executor
4397550,prepare_script
4394216,build_script
4401764,prepare_executor
4407358,after_script
4402690,after_script
4371267,prepare_script
4401723,build_script
4337950,get_sources
4392851,cleanup_file_variables
4338154,prepare_script