11262828,3
13124751,1
8815735,3
5112214,3
9516364,3
6438652,3
14513829,3
7119118,3
12303079,3
7144632,2
7831967,2
1710681,3
1867844,3
5892120,3
1684644,3
6005423,3
13513166,3
10071290,1
6256199,3
5227896,2
13883050,3
11059271,3
13223921,3
16753692,2
11969243,3
1555278,1
8875086,3
12703332,3
4339844,3
9039503,1
2148886,3
8590639,3
5726083,1
1414183,2
5351620,3
2153238,3
12426253,3
10315337,3
6204173,3
278964,3
13676120,3
904528,3
4286359,1
15547241,1
9739635,3
2906712,3
8018563,1
12836653,3
11303435,3
10133144,3
15642544,3
5161498,2
1908805,3
5650002,3
15415910,3
3630501,3
5434439,3
11059338,3
4603023,3
5298631,3
5420723,3
872755,3
9174072,3
5677779,3
13039758,3
2041856,2
8874486,3
1969729,3
4299748,3
3516628,2
3835712,3
5906769,2
4660072,1
12007674,3
8634244,3
1627995,3
467978,3
8591259,3
2234806,2
7050597,3
13274568,1
7603319,3
9005867,3
1425566,3
12679731,2
3093519,2
4040576,2
10743629,3
6127994,3
11738026,1
12601775,3
14712152,1
15053347,3
9688676,2
10119685,3
10592887,2
10224329,3
1220777,2
10573529,3
12770709,2
5434499,3
13985471,3
6134812,3
14850580,3
2648174,2
6493910,3
5122145,3
11471836,3
10541593,3
6317631,3
13603013,2
5688367,3
4410571,3
8989249,3
9761465,2
8206202,1
4308882,2
13921469,3
7778401,3
14718308,1
8665815,3
12821768,3
11672130,1
3748507,2
8355606,3
1160612,3
1139233,3
1556438,3
4234509,1
15826198,2
16103297,3
10479312,3
4544132,3
13786005,1
5274862,2
4555410,3
4319294,1
5064151,3
4358342,3
5986052,3
5588069,3
3706714,3
12917800,1
10316403,2
12195600,3
14711611,3
12038432,2
10469257,2
5883895,3
7215134,1
13955129,2
13172553,3
8101141,3
12322313,3
9377077,3
6246034,2
430285,2
7356564,1
12524147,3
13997311,3
10339957,3
2009901,2
8606695,1
1909968,3
931264,2
10301928,2
11395874,3
12627600,3
11184491,3
8790147,3
7507029,3
4748943,3
7812701,3
7128869,3
9487506,3
1295207,3
14353791,3
940930,3
6431537,3
5122096,2
7558890,3
17123582,3
6138686,3
7137253,3
1941944,3
11160640,3
10122210,3
3170661,3
7423682,3
8316157,3
8737049,2
8051585,3
250833,3
7519644,2
11283490,3
10612365,1
10324279,3
8517305,3
5268536,3
1353639,3
9044998,2
11301105,2
9675386,3
4620828,3
5883686,2
7130279,3
6105296,1
9513979,3
10432467,3
9944608,3
14306156,3
4593051,3
8333133,3
5066481,3
5622382,3
8344300,1
4563779,1
12799321,3
12858578,3
11813950,3
14227766,1
12106673,1
9658761,3
7776928,3
11431302,2
12013311,2
3755559,3
14281415,3
4508764,3
4657984,3
5531053,2
3387678,1
11036769,3
13303233,2
5309758,3
8468661,1
7451169,3
10067065,3
12588610,3
14896453,2
9823231,3
3854705,3
7590612,3
762178,3
12463037,3
4248622,3
7834298,3
17004924,3
9120895,2
10504030,3
1650262,1
5943486,3
10750366,3
8094335,3
13221061,2
12332385,3
7895361,3
11997406,2
10186093,3
7957511,3
180398,3
2187633,1
12811244,3
12706411,2
13972504,2
10324691,3
12639622,2
7367494,1
12485970,3
5499810,1
2385871,3
5137089,3
4321050,3
2185712,1
14880515,1
7419541,2
2167874,3
1875482,3
12140485,3
10428115,3
7341610,3
2039510,3
9737596,2
9069121,3
6304324,2
6893432,3
1932305,3
12108600,3
129022,3
4709924,3
9579389,3
6020174,2
7791358,3
14570634,3
7353485,3
15082438,3
5168950,3
4817000,3
10966263,3
12126621,2
13617230,3
9482209,3
11036886,3
11584347,3
6088425,3
2336572,3
14779050,3
13520972,1
6189540,3
12370071,3
11013304,3
4010028,1
6093078,2
6023433,2
12746794,1
14619648,3
10188410,3
9755006,3
2910717,3
2042368,3
14604264,3
6533344,2
7965327,3
3472737,3
12669736,3
4867714,2
4780768,3
12330841,2
10433352,1
7281208,3
10565351,3
7480570,1
8482115,1
10733010,2
6444869,3
5578208,3
13901744,1
8436425,3
13374079,3
3166928,3
6053065,2
1227519,3
7459001,3
8089445,3
7950592,3
1646164,3
7682093,3
4179403,3
9352986,3
4083527,3
6812109,3
8928499,1
15364919,3
3614528,3
6107180,1
3858441,3
8678701,3
10170495,3
7279731,3
6876375,3
5538843,3
8583229,1
3350747,3
4677522,3
13639900,3
12469689,3
3106230,2
10576125,3
5955623,1
10614465,3
3111976,1
5015677,3
8267016,3
5192654,3
3312064,3
8584457,1
10125866,3
14270722,3
8305876,3
4688585,3
4431892,1
16499844,3
7104082,3
8770358,3
1642318,3
4593516,3
12736109,1
9441604,3
11879439,3
1819928,3
10463644,1
14030318,3
13877528,3
8984880,3
11225068,1
10751202,2
8865453,1
4341222,2
5918452,3
3085781,2
7324930,1
11782735,3
7276567,3
9851278,3
3988494,3
12318171,3
3349547,3
13040224,3
8529512,3
4835773,2
179611,1
7902245,3
7925189,3
4229357,3
13735059,2
2328726,3
10463077,3
1454647,3
17288302,3
11896962,2
4649627,1
7722232,3
295773,3
9831408,1
9783677,3
4076866,3
1644917,3
5187087,3
4649829,3
10954260,1
11656512,3
8507878,1
3420064,3
8646539,3
13829334,3
14252951,3
8758595,1
9659330,2
10504344,3
3704739,3
12972094,3
9052097,3
8954170,1
13153707,1
15432895,2
5504022,2
9716048,3
10359741,3
459067,3
5737860,1
9127875,3
12951364,3
5357748,3
1172345,3
6964568,3
11940858,2
9245911,3
3683097,2
6121176,3
6104790,3
6454527,3
3673718,3
9956294,3
16791276,3
7194633,2
12027094,3
3037380,2
13604670,3
11869499,3
12104837,3
4175605,3
2661973,1
8149228,1
1498058,3
16333504,2
13946227,3
9402232,2
9181562,3
11102887,1
13774818,3
1609461,3
3980791,3
8279674,3
4734766,3
13149237,3
7898047,3
11059274,3
5776166,2
7661737,3
9261822,3
10300671,2
2795319,2
8952324,3
6525571,1
5666561,3
2617137,3
10173251,3
6058835,3
15323880,1
5525258,2
6867602,3
11545601,3
7613804,3
12193115,3
10437770,3
11140673,3
8877126,3
7476895,1
1699575,2
8708561,1
11224619,1
15428415,3
3975817,3
12935779,3
9168980,3
5499745,2
10573324,3
6167078,3
15182950,3
10302362,3
1812894,3
12103261,3
7559229,3
8641474,1
10571767,3
3835346,3
10564918,3
2301383,3
6052355,2
7697899,3
9513132,3
1347881,3
5450909,3
5843396,1
10532677,3
10289570,3
1471537,3
9873641,3
7448037,3
11412215,3
14325538,3
1146328,3
6249853,3
998314,3
6464030,3
4629040,3
4923269,3
9699297,1
12050696,1
4269579,3
1093649,3
13780638,3
14588374,2
6192591,2
3740996,3
4803415,2
11650769,3
1100963,3
14016580,3
10038444,3
8743424,2
20699,3
11498438,3
6965131,2
4154281,3
15667093,1
8220546,3
12391382,1
16655356,3
66127,3
8034156,3
4451346,1
8437520,3
3673948,3
8927683,3
12222416,3
13293792,1
13876134,2
11653043,3
2262009,1
3004858,3
10286882,1
12417393,3
1441932,1
5248563,2
11921093,2
5873871,3
12475298,3
15823452,3
6296195,1
8473061,3
1828173,1
4933684,3
16100290,3
2783677,2
1207265,1
10360040,3
4750040,1
4380194,2
4359271,1
10031125,3
3536517,1
2702625,1
7105169,3
6227337,3
4933574,3
2263566,1
5105913,3
9112622,3
553594,3
8109436,3
2015258,3
12826921,3
5364586,3
5275920,3
1467011,1
6550110,3
10827634,2
6117371,3
8754374,3
13647942,3
4139406,3
9757901,3
10683906,3
4314318,3
5825804,3
11962601,1
15786561,3
9762043,3
5792353,3
8072139,3
15674807,3
7549370,3
1096896,3
7279493,3
3337154,2
5798503,2
10300597,3
1915107,3
5995796,1
11395299,1
9474916,3
8174051,3
5586052,3
991785,3
12408754,3
2261864,3
10759513,2
9900571,3
10828444,3
2789851,3
9178882,2
11049337,2
9024067,3
7907223,2
2906038,2
2379260,1
12501706,3
12809266,3
9680930,1
8535306,3
3591963,2
10400496,3
6130122,2
158859,3
8699554,2
11509065,3
4409640,3
10020256,3
3115786,3
4581232,1
15253953,3
5474845,2
16803973,3
9130311,3
1499421,3
564563,3
2263987,3
5196177,3
15047260,3
1999490,2
14008084,3
12778108,3
14366303,3
5872170,2
12349337,2
4209579,3
11062591,3
11509294,3
2016704,3
7694167,3
1580498,2
4416572,3
10944398,2
9209370,3
5948559,3
15973945,3
9365397,3
5105439,2
3836952,3
6165388,2
4702160,2
12584259,2
4158890,3
9927461,2
2102236,3
15412023,2
15256738,3
5181913,3
1012753,2
7805111,3
561437,3
8036813,1
16336092,3
3278168,2
14395098,2
942572,3
8422043,1
7523614,3
6057333,1
4610142,3
9396471,1
15551545,3
1215624,1
6304319,2
6962044,3
3360993,3
9991942,3
7198834,3
2316926,3
14325543,1
13712741,2
8796736,1
4558427,3
11306962,3
6304320,2
10698543,3
8264968,1
9143481,2
11549941,3
4904066,2
11530840,3
14278368,3
8648627,3
5138067,1
16475376,3
12572084,3
9179927,3
5577646,1
1094098,2
10368307,3
1331339,3
13063774,3
11632299,2
11048290,3
1189503,3
1497583,1
5894346,1
5020672,3
6351664,1
1419338,3
3828396,3
14218490,2
7750000,3
8228529,3
9118904,3
8169057,1
9899988,2
10724513,1
3170975,2
5500825,1
12461063,3
2337458,3
4247787,3
1051322,3
6378020,1
8062348,3
8385277,3
14270884,3
8027970,3
1481322,3
8226227,3
1463727,2
11776053,1
9154812,3
744357,3
1447639,3
7648852,3
4056400,3
5532590,1
5267056,3
15439288,3
3366729,3
7818965,2
13279733,3
13554174,2
2623790,2
9479886,3
4422093,3
4529344,2
3766787,3
8769857,3
7643693,3
9578875,3
7764,3
7069119,3
14134580,3
2044599,1
15498757,3
15852578,3
8461393,3
7180740,3
6102142,2
8151939,1
13038278,3
15683922,1
9613014,3
4931726,3
2670515,3
12606047,3
4356547,3
5948941,3
7243336,3
7392592,3
6097788,2
12192936,3
9687878,2
8752955,3
2686265,2
8511985,3
11940860,3
17679574,1
14182655,2
6839831,2
5830697,3
14521422,3
7684669,3
8343320,3
5662986,3
10955556,3
5974125,2
9267203,3
10864927,3
262242,3
6042904,3
10290475,3
4743917,3
5527999,3
5182933,1
2657058,3
4904237,3
15524528,3
13766545,3
7648007,3
8648790,3
2365167,3
2171143,3
11411402,3
12796619,1
3494823,3
13264227,3
8276411,3
10592894,3
10560035,3
9259937,3
12668540,3
14574025,3
9246636,2
1156731,3
6040443,3
9007644,3
9984785,3
9643340,1
7540316,3
3150095,1
9010693,3
8929576,2
12612616,3
7077276,3
842546,3
5905281,1
12525885,1
12668470,1
13149200,3
15145710,3
12089254,3
9053070,1
1525395,3
4500979,3
12747880,1
9794928,3
8723718,3
8892791,3
1146299,3
1944319,3
13232871,3
8936452,2
9422984,3
3050484,3
6296066,3
10536809,3
10020009,3
9358565,2
5357830,3
7997777,1
12597040,2
14751837,3
5977043,3
3380243,3
7088795,2
4613540,3
7421222,3
9006027,3
7411291,3
1035488,2
13639906,3
7508674,3
10794418,3
2933231,3
2959267,3
4346330,3
9107320,3
1836095,3
9057018,2
10093332,1
574576,3
14896636,3
10318033,3
10749136,3
10716427,3
1458656,1
5507129,3
10376882,2
7843004,2
4402747,3
5015056,3
5706410,3
10360467,3
6144336,3
12093468,2
2087312,3
5809749,3
11991911,3
5822554,1
8048763,3
970574,2
11138698,3
5673141,3
10301538,3
1794617,3
8279135,3
13083,3
12917535,3
15423347,3
1496872,2
12058000,1
4615296,1
469501,3
7454130,3
5978431,3
4133078,3
10494725,3
8382344,3
10171270,3
12677925,3
15322554,2
12049202,2
15896537,1
6070333,3
7685257,1
7071551,2
4435291,3
1946771,3
11992280,2
1975139,3
13622140,1
3310437,3
5472928,3
4194150,1
13733469,1
14775798,2
1409835,3
3459190,1
7086029,1
1875802,2
11056748,2
11731381,2
5589272,2
11326112,2
8120874,3
13005955,1
2239935,3
8103745,1
5553439,3
7284720,3
12727123,3
13882401,2
8211288,3
13250677,3
17039647,3