25002940,8208526
22849925,4243148
16249605,5117664
19130228,6310519
17450300,4570527
14204262,6752404
22288547,8047715
17750095,6053879
24350209,8911291
20774733,2678589
20873520,6537002
16875734,6053840
26923423,6263859
20904247,4242943
25688097,8238018
16450592,7273341
20649775,8271891
24755802,7276798
14968547,4243363
15360677,5197004
19703960,4242381
25921879,4240848
25722618,4242644
20182367,6919618
15115063,9032642
21586283,7166299
20762127,8183651
12470997,6283160
17247888,6709731
22216706,4226339
18033589,8122299
22849925,8422111
20534904,6053867
19413687,6803471
21567223,6427423
26007204,3634039
22335053,8010372
15100848,6249296
25749923,6641640
14007728,8815365
20790718,7178952
20743292,4240100
18767458,6506961
20589387,6723905
14968547,4241991
21580702,5848825
25690610,4244958
16970632,5510073
22522987,7115908
26373213,4244462
15848196,8181635
17360325,7938281
20015887,4916101
16846588,5085214
25584273,4244052
17303940,5696387
25178244,8064984
19081304,4242891
17456021,8689478
23534611,5228248
27174319,4362021
23202743,8450948
20485413,8585993
16538048,4242382
19668852,3840854
18627926,6558518
24582472,6709731
17420429,4244751
25710927,5952057
20765544,7450894
21668934,8087069
12428599,5878889
19859187,5932525
20765598,7677879
17699902,4244359
27260144,4245755
20186793,7488136
14771080,8930302
20668946,4244217
15115063,8895232
17308898,5950253
20182367,8981061
26830967,7855956
17089771,8306533
16144118,7838964
19657307,7648237
19437555,6157555
14765278,8666719
25590762,6864520
21281016,4241781
24728744,6719828
18671974,4245498
17291842,5942430
17115534,8010372
21789279,4280614
23010322,8385189
22954010,4242512
24679026,7105903
25584273,8928515
18871075,8831053
22898680,8377283
22052032,4241181
17410205,7420836
26870094,4240947
17316301,6413987
16635482,9028339
14377574,6380648
17360233,4246036
26251586,6053844
26991200,6263859
23183846,7316618
17573706,5394574
24459824,4014496
26548607,6918989
27121653,4422770
20575464,7316312
14942084,4241787
23650513,5036707
24434380,7356731
18867139,8940770
16537320,6432532
26872615,4243800
27202767,4243351
19618267,8625490
21511855,6003995
18283785,4245686
13904440,6891634
21369817,8287226
21886972,6343580
18743261,6843297
24426621,8570108
17115534,8414544
26718065,8718161
16184809,7554381
20790718,6249296
22496188,7443671
26923578,6882238
25699315,8883417
24262695,4326698
25163638,5197414
23102631,4242010
21180423,7663254
23243636,4242057
19886535,4349554
21567425,8377283
25663549,5350413
22498917,3920800
16383050,6806666
26485012,4244911
17368006,6063614
23202743,8616783
15542015,7316618
19392979,8824828
21354728,4243072
17063172,5720841
19917616,8584433
19931205,9068568
20790718,4242676
16234970,8999504
19130151,7663254
24755802,4245100
27302024,6012058
17457373,4242382
26924133,4242944
18706544,4243977
21511855,2984282
14154610,7445134
22498917,6256514
21567223,4244179
22187059,8230621
21121901,4240980
21931463,9060337
14778944,4242385
16496920,4243444
15928002,6512089
25778580,8640817
24453865,8605453
17685527,9028339
26945698,4244911
16527373,5060238
19169277,7924575
18061443,6144563
18871075,8881801
26401588,8887975
16489240,6413987
23598903,7518513
21281016,4852113
23130306,7273341
19202969,8370477
24907116,6427273
18185464,7316312
18871053,4240848
20186793,7299123
14241060,6064489
25746425,4243655
24131907,4245654
26251586,4210698
23385097,4245437
26951244,6891634
16970632,4241651
14968547,8659188
24505563,7283876
16702158,6053921
17409811,6806117
17251782,3093122
14770932,6504898
22570964,6053921
21439776,4241877
14204262,7180654
20873001,8689478
24907116,4246990
16340264,7420836
17842371,8377283
26380651,4245756
18871473,4240947
18670604,6059295
26624195,4241633
14602018,4241143
20604237,4587693
22498219,7925099
17856923,7664550
17360233,8824828
16184809,8364023
13676077,4242802
19130461,6719518
13222145,4243730
25231324,4242651
25569093,4241633
26633930,7946167
18669348,4830882
24675843,7459034
23919685,7677879
24454785,8238018
24582472,4245730
14140613,5931859
26923292,5392716
15235913,4243655
17422028,4243655
26924177,4246036
18114141,5735703
25227405,5380600
20873001,7166299
19859187,5730337
23481360,5853699
14859543,3567130
22981434,8538017
23243636,5809895
20762127,6053960
16467276,4422770
23130306,4243131
23010322,7269837
20319036,8122182
24995624,7953479
26429360,8181546
26945698,4244359
16144118,8263824
20774665,7316705
18871053,8965086
27172804,4240556
18671974,4240343
14771080,9032642
26076358,8144812
18866059,5889427
16645136,6356560
22877860,8445267
22498219,5197004
19468996,4241983
14071752,4244445
25380101,8846612
26916603,8305751
16517576,4240502
20896942,7413233
23170504,8741900
22288547,7376529
26829599,8927338
23481360,9050215
26829599,6730332
24107162,4894606
26667081,8683371
24627760,6898012
23498818,5942430
26302869,4242152
20534904,8791120
18283785,5134419
25690610,4312907
15312503,8954414
18033589,7180654
22265905,8978569
20604237,4245147
22288547,6144563
17040223,5085214
19618267,4242268
25778580,4243113
19144839,8305751
13997389,4243351
18743283,7972695
21279445,4244958
25533902,4240633
16489797,4242780
18811759,8940770
19130151,6054030
26610277,7837044
14071307,6615378
23151593,6614869
24535842,4666821
26975728,8875022
21584346,5967192
14297136,6057102
21182140,6193788
17196254,6961389
22134607,6684411
17856923,4243191
24597394,4242018
17250364,8713106
17450300,6750758
25749309,7334505
27106021,8264695
18669348,1559301
17904564,9050215
20875054,4240636
17750174,6414180
27172804,8615868
26401588,3920800
17758465,6157555
20105065,6351756
13223270,4241037
13222145,5092736
17360233,8305751
19177827,6054533
23012052,7375101
27106021,6427423
17762346,8925750
17685527,7178896
26923292,6752404
22052032,6375956
22052032,8680947
27168996,6987377
24092657,8665403
21930735,9060337
18138232,4240887
20251793,5422223
16367502,6380648
22417456,5609189
17556216,4160444
24607584,8811668
23170504,8170538
19261754,8911972
23480616,7605147
21188935,7324482
17360325,4242951
16250901,8523386
13689131,4241684
19130461,8181635
26923964,9048444
24412962,4318771
14752281,4244506
21733129,4243444
23543763,4244348
20627717,8911972
17368006,4362021
25904273,8746112
10207301,4331173
25722618,7663254
26808033,5930606
18283785,4243148
20896942,6057102
27172804,6750758
20762127,5878889
17942190,6310658
18871740,4226339
24158871,6053879
17437398,5307087
21584346,8846612
20762127,4241496
26181144,8177382
18764962,8065326
22498687,5696387
27233134,6312437
14071307,8831053
25896068,5649970
15350690,5930606
24679026,4240887
26817563,4604091
19601981,4245186
24454785,8377283
17636941,6353337
17261809,6413830
25002940,8341154
19413687,5023526
26100625,4916101
14071752,4244751
13223270,7459034
21369817,1366431
16498821,7114226
26624195,9018401
26808033,9060337
18871619,7855956
14765347,5092736
27174300,6375956
20872834,8087069
17758465,8340944
17194971,6380648
17797702,9017328
17738155,7838964
17750095,4242794
27257775,5134419
18811759,1472923
26951244,8796509
11306962,4241726
20625090,8833009
15115063,6144078
26624195,6086977
16538048,8987085
24290019,4242382
19886748,4280614
25747338,8122182
14377574,4240341
17291842,5422223
13382929,6373843
13732382,4839212
22265905,3093075
21883157,8952809
13121596,6752404
26188915,3403586
22834699,5878837
26808033,7953479
25372280,8625181
16553012,8920314
25609650,8688814
14862933,4666821
16537320,8784142
12428599,4243796
26831391,4244837
20589387,8932098
23600501,6504898
17456021,5228248
20790718,8542587
17714077,6626577
19081304,4242820
21159878,4014496
20673108,6373843
24262695,5380600
18670577,8688266
17699902,4243217
24459824,5511601
19685896,8707585
17402526,6208977
14771080,4243547
23110386,6770804
16412293,5735703
15115063,5782450
23102631,7115908
17139256,8846612
16489797,6898012
14942084,7544553
21923641,6918989
16573276,5510073
26401588,6359392
17233877,4243113
22589374,8920314
20451197,4241143
25609650,7938281
20774614,8713106
26251586,4243840
19688605,9050215
20899929,6466183
18867157,4244246
16203414,6709731
16450592,4245106
16323782,4244021
26401800,7954287
24536103,4240273
14154610,7392364
20762127,4245411
25268769,4242943
17061428,4751135
17316301,2984282
27254916,8160820
26401588,8639789
26552584,5541066
25917052,6208977
25723690,4244594
22832491,8888894
24510610,8263824
16875734,8680947
26916517,4240848
21668934,7855956
15808108,7277467
18811759,7169730
25863043,4243054
24458374,4200401
19620045,8954414
14145407,6053960
23620682,8836659
17824131,7178952
17556216,4242794
14765278,4241790
18743283,7779950
14071307,4241869
19886535,4244195
27042964,5967883
17476239,6731488
16176765,5598770
16878507,6208977
26817563,3634039
21931463,7656245
14297136,4193961
22849925,4241244
19803455,5606226
10207301,8087069
26916517,4246990
25936942,9053903
18764962,4244348
23502730,5883737
18029046,4242855
21434383,4415794
20900101,8450948
25507644,7334505
16635482,9028339
15358762,4241565
27319927,7626630
24630238,4240496
23761040,6053804
16323782,4242926
24458374,4242381
26100625,7762124
18902105,8112583
23499004,8025515
26718065,5878837
15928343,4245186
20762127,7463482
20589387,4240636
20362348,5350413
23476763,7299305
18032967,8250713
23802701,5092736
19620049,6319788
18743225,4242680
26305493,6263196
17758105,7299305
21509538,4242891
18199567,8920091
26095902,9059596
23106310,8377070
18873725,8230621
13744464,8707585
19316297,6506346
26718065,8737710
25699315,7180654
20762127,4242780
18871703,4244837
19668775,8385161
23498818,8316555
26715366,6822533
17409811,4244331
17075198,8422111
18743225,6413720
24466135,4244445
20495375,6053844
27302024,8639232
16878507,3920800
24426621,7013602
20904247,7544553
20274945,5859586
17758465,9020299
20627717,7366203
17247888,8888894
19668852,8713106
23921375,5782725
19811058,8920091
21369817,7317742
24466135,8784035
16450592,6425520
16236796,7265321
26548276,4242057
20268091,4241198
16491281,4244594
23006891,7463482
26305493,4242626
14139274,4243085
16248229,6641640
25167733,5303451
20319036,4245186
17173368,4244031
21883144,7359809
16526555,4243054
17715749,8690689
14765278,5932525
19009088,4243217
27302024,4830882
17699902,6315566
18869819,5937015
23262395,3473520
14765278,6770804
16540461,4241564
23813466,4245972
22368618,6425520
21325374,4241787
24107162,8223230
17797570,5343146
19129833,6053786
20121689,7445134
17856923,6492049
14597923,7463482
23202743,4240502
26922744,8883417
20673108,5197414
18628990,4244052
18375059,5889427
24434380,6257204
20087664,6210350
23813466,4241288
26916517,4349554
16902138,7586443
13382929,6201118
27202767,6053786
25893364,6208977
14942084,4242820
26924177,4242092
25224255,7324482
16646426,8188568
21407842,7450894
14764390,8741900
25778580,5851319
17738465,7099970
25569093,8122299
14181557,6614869
25345014,9019190
25178244,8987371
22898680,8434443
19324516,7334505
17316153,4415794
15358762,4604091
19202969,4240341
19129637,4244361
23183846,6645716
26923292,4245437
17196254,9067063
16498821,4240529
18871740,5967883
22522987,4244067
16489797,7544317
23998378,8873916
22877860,6478073
26462237,5078319
18577587,5422223
26722865,6641640
21883157,3093075
25418931,9053903
14597923,4244331
17247888,7982319
24317377,4242968
26922744,8880148
16635482,4241241
27122440,6492049
20274503,7180654
23786629,7135319
17758105,6054023
20864871,8832649
26806450,6063614
17352569,4246036
24459824,4242958
25083991,5606226
16770300,7169730
18671794,4244331
25231324,6626577
26552584,6645716
23480602,8633543
20268091,8541820
26808033,6208977
18743258,6053772
14765347,4240556
27319927,5533919
20153548,6551543
17517037,6003995
26923543,6310658
22898680,7851690
22288547,6149363
14224388,8280405
14248503,5859935
26991200,8583655
26462237,8701640
19009088,7069769
24412962,8607189
19285339,7614294
17942190,8227367
15350690,5670207
25224255,4241288
23201884,4331173
22082674,8825208
23106310,6770804
19129596,5330668
17556216,9067063
24478411,4992533
24679026,8364023
23110386,8175301
22498219,6843297
22335053,2003533
16635482,5735703
25893364,6810315
14033401,4242921
18283785,4242018
20494558,4242268
17075198,4243217
18942651,8340944
15342646,4240273
18720027,6274993
18767458,7115908
20105065,4241868
26380439,4245198
26398927,6719518
26974109,6492049
16248229,7013206
20774658,4256767
26829599,5859586
25500176,8964477
20762127,4242696
15174836,9067063
17457373,4246023
16774881,7278271
14204262,4245349
22954010,5880248
23600501,9068568
26978318,4243113
16144118,8615868
19081304,9019223
19130379,5685647
20581133,6461740
26715366,3634039
24627760,8640817
19081716,7013206
25609650,8748649
23915649,8765076
26404598,8930302
16645136,4240792
21439776,4244031
17842371,4245076
21354728,9008235
17360089,6559340
16526555,5350413
19012502,6472218
18028712,8306533
25921879,8377070
17797702,8335960
25370320,4240502
22854227,4244105
22491949,6351756
15693130,5583509
18871879,9018401
17864879,6506346
14071752,8625490
23786629,5343146
15342646,4331173
17882802,5036707
25163020,6053978
22270016,4243547
26722865,8796509
26836510,8341612
23786629,4244910
21434383,6467239
17673203,4244610
23766384,8707585
23481016,8341612
17310582,4240806
24676982,6427423
21434383,8385161
18867157,4425694
16248229,6066011
20900094,6012058
24149968,5510073
25505687,5623172
20504325,8208526
17525686,6064883
20899929,8930302
22878028,4241983
20121689,8792748
18283785,4243351
25160871,9059596
26923292,1559301
14752299,8010372
20626605,7277467
20762127,8633207
26399384,7299305
17877038,6054030
13744464,3634039
24458374,8576018
18867139,4245498
21832752,7173768
23155120,4242399
21281016,5347166
17360325,3780641
17360325,6641640
17063172,3295306
20875054,4242676
13222145,7010745
25754216,6504898
17177176,5761958
18926305,4241564
27172804,7459034
20649775,9067063
23261695,4245991
25722618,4200401
20492404,6054533
22498917,4243090
21131417,4244031
20182367,8271905
17250364,7711140
18028829,5925195
23761040,8542587
20762127,7982319
19260941,5761958
17402526,7176927
23921375,7166299
23502730,7779950
17676780,4244179
23543763,8881801
19711825,6558518
26951244,8846612
26923110,7116847
15360677,6399101
24907630,6719518
17573706,9019223
17422028,6770804
18871619,8881801
19129377,8689478
22874833,8377070
17410205,8688266
19130461,8920314
20319036,4241633
22676935,8149530
17758465,5511601
23155120,8010372
25893364,7318562
22849159,8393542
17360431,8064984
17904564,1472923
17738155,6719518
27211466,6453677
16184809,5705402
19668931,6381882
17360529,4241565
17797570,6263196
26923999,7627961
19171003,6064489
24597273,4240381
16862019,4240100
18871619,8541820
24478411,4244782
20062781,5947173
13382929,7652925
16303636,5233900
23480616,5918849
25896068,7518513
26380397,8928515
13223270,5394574
19668852,4245540
19171003,7982319
23632816,5776698
19129682,4241869
25083991,4242944
16538048,8927338
17063172,6453677
24907116,8873916
23998378,4245433
18621890,8160820
26582837,6133290
14248503,7135319
25430441,8738122
17685527,7838964
25749923,4556532
13676077,4604091
20765483,6054017
27259409,4244512
24907290,5890795
18138232,6845582
20804013,6201118
20765598,7908133
26922744,4992533
22589374,7497786
20869637,8934999
19138998,6193695
19129786,6144563
14204262,4244432
18669348,5078319
26462237,4243707
21506661,8831053
19886296,4241636
18743225,6193695
17961459,4242387
25505687,7168850
23498818,5640602
14597923,4244316
14602018,9046988
20523008,7649983
23006891,3780641
22570964,4240848
20015887,4014496
20523008,6413720
17381984,8523386
25163638,4242676
27260144,5800995
14764791,6194506
19883086,5940402
26380397,8183651
20673108,7855956
18743261,4244217
14377574,5932525
19130151,4241707
19066423,8712564
24676982,4240100
26460555,6012058
15772214,5776698
19435185,7010745
25896068,7393411
19139171,7373074
24907290,5942430
11499059,8541820
25710927,6251570
17333065,8025515
17194971,8122182
19324516,6645806
26624195,6274993
26667081,5347166
21188935,5197004
17247573,5347166
18720020,4241875
23925707,6058729
20062781,4242802
11499059,5303451
25007735,6053772
26923423,6826541
25201168,8935264
19129786,7318562
19276599,7180654
18764962,7178952
18671974,8272358
16573276,4247232
17368006,4241085
21456632,8316555
18902105,8280405
15808108,7953479
26101825,8420597
16537350,5515788
26836510,4242860
22676105,8087069
21159878,7083140
17864879,5623172
21159878,7644160
27042964,8934999
17842371,5369030
21354769,7283817
15396382,7924575
26251586,5263798
24793102,6194735
15396382,4242926
17308898,4243707
25896911,4241361
27168996,9032642
19217775,8823875
16496920,4240502
22832491,7586443
22498219,8846258
13121596,4243714
22058625,9018401
16496920,8712564
17982963,7677879
20625039,5889427
19129833,5878889
23481360,4243351
25500176,8279173
18138232,4210698
26830967,4243257
16248229,8818378
16620757,6504898
25688097,4478974
21300108,6351183
26870094,4244031
19130379,8928303
18869819,9060337
26722865,6382743
26373213,4245147
16970632,5918849
22117847,6826541
24510610,4839212
24131907,6898012
14765975,4227802
22057999,9043675
17135170,7946167
26494110,5600039
17360529,8170538
22216706,8335899
17252555,6730332
26978382,7171800
20604237,5515788
22057999,6064489
25392840,6375956
23005349,9020299
26033000,4250232
21180423,7277467
21159878,4422770
