module gitlab.com/gitlab-com/gl-infra/cupcake-rdb

go 1.21

require (
	github.com/google/gops v0.3.7
	gopkg.in/check.v1 v1.0.0-20200227125254-8fa46927fb4f
)

require (
	github.com/kardianos/osext v0.0.0-20170510131534-ae77be60afb1 // indirect
	github.com/kr/text v0.1.0 // indirect
	github.com/niemeyer/pretty v0.0.0-20200227124842-a10e7caefd8e // indirect
)
