{
  "$schema": "https://docs.renovatebot.com/renovate-schema.json",
  "lockFileMaintenance": {
    "enabled": true,
    "automerge": true
  },
  "packageRules": [
    {
      "matchPackageNames": [
        "gitlab-com/gl-infra/pmv",
        "gitlab-com/gl-infra/common-ci-tasks",
        "mvdan/sh",
        "koalaman/shellcheck",
        "pre-commit/pre-commit",
        "terraform-linters/tflint",
        "registry.gitlab.com/gitlab-com/gl-infra/common-ci-tasks/renovate",
        "golangci/golangci-lint",
        "zricethezav/gitleaks",
        "goreleaser/goreleaser",
        "adrienverge/yamllint"
      ],
      "matchUpdateTypes": [
        "minor",
        "patch"
      ],
      "automerge": true
    },
    {
      "description": "Automatically upgrade patch versions for Golang",
      "matchPackageNames": [
        "golang/go"
      ],
      "matchUpdateTypes": [
        "patch"
      ],
      "automerge": true
    },
    {
      "matchDepTypes": [
        "devDependencies"
      ],
      "matchPackagePatterns": [
        "eslint",
        "lint",
        "prettier",
        "mocha"
      ],
      "automerge": true
    },
    {
      "matchSourceUrlPrefixes": [
        "https://gitlab.com/gitlab-com/gl-infra/common-ci-tasks"
      ],
      "automerge": true
    },
    {
      "matchManagers": [
        "pre-commit"
      ],
      "automerge": true
    },
    {
      "matchManagers": [
        "gomod"
      ],
      "matchUpdateTypes": [
        "patch"
      ],
      "automerge": true
    }
  ]
}
