{
  "variables": {
    "gce_project_id": "{{env `GOOGLE_PROJECT_ID`}}",
    "gce_zone": "{{env `GOOGLE_COMPUTE_ZONE`}}",
    "gce_machine": "{{env `GOOGLE_COMPUTE_MACHINE`}}",
    "version": "{{env `VERSION`}}",
    "image_name": "{{env `WINDOWS_IMAGE_NAME`}}-{{user `version`}}",
    "ansible_user": "{{env `ANSIBLE_USER`}}",
    "ansible_user_cert": "{{env `ANSIBLE_USER_CERT`}}"
  },
  "builders": [
    {
      "type": "googlecompute",
      "project_id": "{{user `gce_project_id`}}",
      "image_name": "{{user `image_name`}}",
      "source_image": "windows-server-2019-dc-v20191210",
      "image_description": "Runner image for windows runner manager, build on {{timestamp}}",
      "disk_size": "50",
      "machine_type": "{{user `gce_machine`}}",
      "zone": "{{user `gce_zone`}}",
      "communicator": "winrm",
      "winrm_use_ssl": true,
      "winrm_insecure": true,
      "winrm_timeout": "5m",
      "winrm_username": "packer_user",
      "state_timeout": "15m",
      "labels": {
        "os": "windows",
        "role": "runner_manager"
      },
      "tags": [
        "windows"
      ],
      "metadata": {
        "windows-startup-script-cmd": "winrm quickconfig -quiet & net user /add packer_user & net localgroup administrators packer_user /add & winrm set winrm/config/service/auth @{Basic=\"true\"}"
      }
    }
  ],
  "provisioners": [
    {
      "type": "powershell",
      "script": "user-setup.ps1",
      "environment_vars": [
        "ANSIBLE_USER={{user `ansible_user`}}",
        "USER_PASSWORD={{.WinRMPassword}}",
        "USER_CERT={{user `ansible_user_cert`}}"
      ]
    },
    {
      "type": "ansible",
      "playbook_file": "../ansible/provision.yml",
      "inventory_file": "../ansible/inventory.gcp.yml",
      "groups": "packer",
      "extra_arguments": [
        "--extra-vars",
        "ansible_password={{ .WinRMPassword }}",
        "--extra-vars",
        "ansible_shell_type=powershell ansible_shell_executable=None",
        "-l packer-*",
        "--skip-tags okta"
      ]
    },
    {
      "type": "windows-restart"
    }
  ]
}
