{
	"env_name": "Example Environment",
	"env_prefix": "example-",
	"env_sandbox_mode" : "false",
	"gcp_dns_zone_fqdn": "example.domain.tld.",
	"gcp_project": "my-gcp-project-a1b2c3d4",
	"gcp_region": "us-central1",
	"gcp_region_cidr": "10.128.0.0/12",
	"gcp_region_zone": "us-central1-c",
	"gitlab_omnibus" : {
		"disk_boot_size" : "30",
		"disk_storage_size" : "100",
		"gcp_deletion_protection" : "false",
		"gcp_image" : "ubuntu-1804-lts",
		"gcp_machine_type" : "e2-standard-4"
	},
	"gitlab_runner_manager" : {
		"disk_boot_size" : "20",
		"gcp_deletion_protection" : "false",
		"gcp_image" : "ubuntu-1804-lts",
		"gcp_machine_type" : "e2-standard-4"
	},
	"gitlab_ci_cluster" : {
		"gcp_machine_type" : "e2-standard-2",
		"gcp_preemptible_nodes" : "true",
		"gke_autoscaling_profile" : "BALANCED",
		"gke_cluster_type" : "zonal",
		"gke_maintenance_start_time" : "03:00",
		"gke_release_channel" : "REGULAR",
		"gke_version_prefix" : "1.18."
	},
	"gitlab_ci_cluster_ingress" : {
		"enabled" : "false",
	    "external_ip" : "1.2.3.4"
	},
	"gitlab_ci_cluster_letsencrypt_txt" : {
		"enabled" : "false",
	    "value" : "placeholder"
	},
	"labels": {
		"gl_realm": "x",
		"gl_env_type": "x",
		"gl_env_name": "x",
		"gl_env_id": "x",
		"gl_owner_email_handle": "x",
		"gl_dept": "x",
		"gl_dept_group": "x"
	}
}
