[
    {
        "name": "Jared Bates",
        "gitlab_handle": "jbates",
        "picture": "https://randomuser.me/api/portraits/men/68.jpg"
    },
    {
        "name": "Arlene Steeves",
        "gitlab_handle": "asteeves",
        "picture": "https://randomuser.me/api/portraits/women/96.jpg"
    },
    {
        "name": "Priscilla Simmmons",
        "gitlab_handle": "simmons",
        "picture": "https://randomuser.me/api/portraits/women/94.jpg"
    },
    {
        "name": "Isaac Pierce",
        "gitlab_handle": "piercing_dev",
        "picture": "https://randomuser.me/api/portraits/men/22.jpg"
    },
    {
        "name": "Mary Carr",
        "gitlab_handle": "mmmcarr",
        "picture": "https://randomuser.me/api/portraits/women/82.jpg"
    },
    {
        "name": "Jon Walters",
        "gitlab_handle": "walters_jon",
        "picture": "https://randomuser.me/api/portraits/men/63.jpg"
    },
    {
        "name": "Sandra Hawkins",
        "gitlab_handle": "hawkinsS",
        "picture": "https://randomuser.me/api/portraits/women/52.jpg"
    },
    {
        "name": "Billy Crawford",
        "gitlab_handle": "crawls",
        "picture": "https://randomuser.me/api/portraits/men/25.jpg"
    }
]