[
    {
        "id": 1,
        "name": "KubeCon EU Coding Challenge TEST",
        "description": "Join a fun coding challenge in our Activation Zone booth!  Complete challenges and win prizes.",
        "shortname": "KubeCon EU 2022",
        "start_date": "2022-05-02",
        "end_date": "2022-05-31",
        "project_name": "",
        "project_id": 1,
        "created_by": 1
    },
    {
        "id": 2,
        "name": "Some other Coding Challenge TEST",
        "description": "Another coding challenge example.",
        "shortname": "Some other 2022",
        "start_date": "2022-10-12",
        "end_date": "2022-11-12",
        "project_name": "",
        "project_id": 1,
        "created_by": 1
    }
]