{
  "$schema": "https://docs.renovatebot.com/renovate-schema.json",
  "extends": [
    "gitlab>gitlab-ci-utils/renovate-config//presets/recommended#1.1.0",
    "gitlab>gitlab-ci-utils/renovate-config//presets/npm-recommended#1.1.0",
    "gitlab>gitlab-ci-utils/renovate-config//presets/docker-pin-digests#1.1.0"
  ],
  "npm": {
    "rangeStrategy": "bump"
  }
}
