{
  "npmci": {
    "npmGlobalTools": [],
    "npmAccessLevel": "public"
  },
  "gitzone": {
    "projectType": "npm",
    "module": {
      "githost": "gitlab.com",
      "gitscope": "gitzone",
      "gitrepo": "tswatch",
      "shortDescription": "watch typescript projects during development",
      "npmPackagename": "@gitzone/tswatch",
      "license": "MIT"
    }
  }
}