<?xml version="1.0" encoding="UTF-8"?>
<svg width="24px" height="24px" viewBox="0 0 24 24" version="1.1" xmlns="http://www.w3.org/2000/svg" xmlns:xlink="http://www.w3.org/1999/xlink" style="background: #F2F2F2;">
    <!-- Generator: Sketch 56.3 (81716) - https://sketch.com -->
    <title>Icon/Arrow - Right</title>
    <desc>Created with Sketch.</desc>
    <g id="Icon/Arrow---Right" stroke="none" stroke-width="1" fill="none" fill-rule="evenodd">
        <rect fill="#F2F2F2" x="0" y="0" width="24" height="24"></rect>
        <polygon id="Fill" fill="#000000" fill-rule="nonzero" points="13.3 5.3 11.9 6.7 16.2 11 4 11 4 13 16.2 13 11.9 17.3 13.3 18.7 20 12"></polygon>
    </g>
</svg>