ComprasMuebles.dbo.comPedidosDet =>

Pedido, Codigo, Local, Cantidad, CostoFabrica, Saldo, ReferenciaPedido, fec_surtir, fec_cancelacion, idu_tipopedido, fec_surtirinicial, fec_surtirfinal

315299	102423	30030	30	11147	30	0	2017-04-22 00:00:00	2017-04-28 00:00:00	0	2017-04-23 00:00:00	2017-05-03 00:00:00
315299	106747	30030	32	21254	28	0	2017-04-22 00:00:00	2017-04-28 00:00:00	0	2017-04-23 00:00:00	2017-05-03 00:00:00
315299	114464	30001	18	23712	18	0	2017-04-22 00:00:00	2017-04-28 00:00:00	0	2017-04-23 00:00:00	2017-05-03 00:00:00
315299	114464	30003	8	23712	8	0	2017-04-22 00:00:00	2017-04-28 00:00:00	0	2017-04-23 00:00:00	2017-05-03 00:00:00
315299	114464	30006	42	23712	42	0	2017-04-22 00:00:00	2017-04-28 00:00:00	0	2017-04-23 00:00:00	2017-05-03 00:00:00
315299	114464	30007	12	23712	12	0	2017-04-22 00:00:00	2017-04-28 00:00:00	0	2017-04-23 00:00:00	2017-05-03 00:00:00
315299	114464	30008	13	23712	13	0	2017-04-22 00:00:00	2017-04-28 00:00:00	0	2017-04-23 00:00:00	2017-05-03 00:00:00
315299	114464	30011	11	23712	11	0	2017-04-22 00:00:00	2017-04-28 00:00:00	0	2017-04-23 00:00:00	2017-05-03 00:00:00
315299	114464	30013	15	23712	15	0	2017-04-22 00:00:00	2017-04-28 00:00:00	0	2017-04-23 00:00:00	2017-05-03 00:00:00
315299	114464	30014	24	23712	24	0	2017-04-22 00:00:00	2017-04-28 00:00:00	0	2017-04-23 00:00:00	2017-05-03 00:00:00
315299	114464	30015	120	23712	120	0	2017-04-22 00:00:00	2017-04-28 00:00:00	0	2017-04-23 00:00:00	2017-05-03 00:00:00
315299	114464	30016	17	23712	17	0	2017-04-22 00:00:00	2017-04-28 00:00:00	0	2017-04-23 00:00:00	2017-05-03 00:00:00
315299	114464	30018	13	23712	13	0	2017-04-22 00:00:00	2017-04-28 00:00:00	0	2017-04-23 00:00:00	2017-05-03 00:00:00
315299	114464	30020	52	23712	52	0	2017-04-22 00:00:00	2017-04-28 00:00:00	0	2017-04-23 00:00:00	2017-05-03 00:00:00
315299	114464	30030	23	23712	23	0	2017-04-22 00:00:00	2017-04-28 00:00:00	0	2017-04-23 00:00:00	2017-05-03 00:00:00
315299	116904	30001	12	12579	12	0	2017-04-22 00:00:00	2017-04-28 00:00:00	0	2017-04-23 00:00:00	2017-05-03 00:00:00
315299	116904	30003	4	12579	4	0	2017-04-22 00:00:00	2017-04-28 00:00:00	0	2017-04-23 00:00:00	2017-05-03 00:00:00
315299	116904	30006	28	12579	28	0	2017-04-22 00:00:00	2017-04-28 00:00:00	0	2017-04-23 00:00:00	2017-05-03 00:00:00
315299	116904	30008	8	12579	8	0	2017-04-22 00:00:00	2017-04-28 00:00:00	0	2017-04-23 00:00:00	2017-05-03 00:00:00
315299	116904	30011	8	12579	8	0	2017-04-22 00:00:00	2017-04-28 00:00:00	0	2017-04-23 00:00:00	2017-05-03 00:00:00
315299	116904	30013	12	12579	12	0	2017-04-22 00:00:00	2017-04-28 00:00:00	0	2017-04-23 00:00:00	2017-05-03 00:00:00
315299	116904	30014	20	12579	20	0	2017-04-22 00:00:00	2017-04-28 00:00:00	0	2017-04-23 00:00:00	2017-05-03 00:00:00
315299	116904	30015	88	12579	88	0	2017-04-22 00:00:00	2017-04-28 00:00:00	0	2017-04-23 00:00:00	2017-05-03 00:00:00
315299	116904	30016	12	12579	12	0	2017-04-22 00:00:00	2017-04-28 00:00:00	0	2017-04-23 00:00:00	2017-05-03 00:00:00
315299	116904	30018	12	12579	12	0	2017-04-22 00:00:00	2017-04-28 00:00:00	0	2017-04-23 00:00:00	2017-05-03 00:00:00
315299	116904	30020	36	12579	36	0	2017-04-22 00:00:00	2017-04-28 00:00:00	0	2017-04-23 00:00:00	2017-05-03 00:00:00
315299	116904	30030	16	12579	16	0	2017-04-22 00:00:00	2017-04-28 00:00:00	0	2017-04-23 00:00:00	2017-05-03 00:00:00
315299	116912	30008	6	19493	3	0	2017-04-22 00:00:00	2017-04-28 00:00:00	0	2017-04-23 00:00:00	2017-05-03 00:00:00
315299	116912	30011	2	19493	1	0	2017-04-22 00:00:00	2017-04-28 00:00:00	0	2017-04-23 00:00:00	2017-05-03 00:00:00
315299	116912	30014	9	19493	5	0	2017-04-22 00:00:00	2017-04-28 00:00:00	0	2017-04-23 00:00:00	2017-05-03 00:00:00
315299	116912	30015	26	19493	13	0	2017-04-22 00:00:00	2017-04-28 00:00:00	0	2017-04-23 00:00:00	2017-05-03 00:00:00
315299	116912	30016	2	19493	1	0	2017-04-22 00:00:00	2017-04-28 00:00:00	0	2017-04-23 00:00:00	2017-05-03 00:00:00
315299	116912	30020	5	19493	5	0	2017-04-22 00:00:00	2017-04-28 00:00:00	0	2017-04-23 00:00:00	2017-05-03 00:00:00
315299	116921	30015	120	5810	120	0	2017-04-22 00:00:00	2017-04-28 00:00:00	0	2017-04-23 00:00:00	2017-05-03 00:00:00
315299	116939	30008	12	7227	12	0	2017-04-22 00:00:00	2017-04-28 00:00:00	0	2017-04-23 00:00:00	2017-05-03 00:00:00
315299	116939	30015	66	7227	66	0	2017-04-22 00:00:00	2017-04-28 00:00:00	0	2017-04-23 00:00:00	2017-05-03 00:00:00
315299	116939	30016	6	7227	6	0	2017-04-22 00:00:00	2017-04-28 00:00:00	0	2017-04-23 00:00:00	2017-05-03 00:00:00
315299	116939	30030	18	7227	18	0	2017-04-22 00:00:00	2017-04-28 00:00:00	0	2017-04-23 00:00:00	2017-05-03 00:00:00
315299	116963	30001	12	9523	12	0	2017-04-22 00:00:00	2017-04-28 00:00:00	0	2017-04-23 00:00:00	2017-05-03 00:00:00
315299	116963	30008	6	9523	6	0	2017-04-22 00:00:00	2017-04-28 00:00:00	0	2017-04-23 00:00:00	2017-05-03 00:00:00
315299	116963	30014	24	9523	24	0	2017-04-22 00:00:00	2017-04-28 00:00:00	0	2017-04-23 00:00:00	2017-05-03 00:00:00
315299	116963	30015	114	9523	114	0	2017-04-22 00:00:00	2017-04-28 00:00:00	0	2017-04-23 00:00:00	2017-05-03 00:00:00
315299	116963	30030	36	9523	36	0	2017-04-22 00:00:00	2017-04-28 00:00:00	0	2017-04-23 00:00:00	2017-05-03 00:00:00
315299	117927	30001	8	20205	8	0	2017-04-22 00:00:00	2017-04-28 00:00:00	0	2017-04-23 00:00:00	2017-05-03 00:00:00
315299	117927	30003	5	20205	5	0	2017-04-22 00:00:00	2017-04-28 00:00:00	0	2017-04-23 00:00:00	2017-05-03 00:00:00
315299	117927	30006	24	20205	24	0	2017-04-22 00:00:00	2017-04-28 00:00:00	0	2017-04-23 00:00:00	2017-05-03 00:00:00
315299	117927	30007	4	20205	4	0	2017-04-22 00:00:00	2017-04-28 00:00:00	0	2017-04-23 00:00:00	2017-05-03 00:00:00
315299	117927	30008	9	20205	9	0	2017-04-22 00:00:00	2017-04-28 00:00:00	0	2017-04-23 00:00:00	2017-05-03 00:00:00
315299	117927	30011	7	20205	7	0	2017-04-22 00:00:00	2017-04-28 00:00:00	0	2017-04-23 00:00:00	2017-05-03 00:00:00
315299	117927	30013	9	20205	9	0	2017-04-22 00:00:00	2017-04-28 00:00:00	0	2017-04-23 00:00:00	2017-05-03 00:00:00
315299	117927	30014	10	20205	10	0	2017-04-22 00:00:00	2017-04-28 00:00:00	0	2017-04-23 00:00:00	2017-05-03 00:00:00
315299	117927	30015	27	20205	27	0	2017-04-22 00:00:00	2017-04-28 00:00:00	0	2017-04-23 00:00:00	2017-05-03 00:00:00
315299	117927	30016	6	20205	6	0	2017-04-22 00:00:00	2017-04-28 00:00:00	0	2017-04-23 00:00:00	2017-05-03 00:00:00
315299	117927	30018	8	20205	8	0	2017-04-22 00:00:00	2017-04-28 00:00:00	0	2017-04-23 00:00:00	2017-05-03 00:00:00
315299	117927	30020	11	20205	11	0	2017-04-22 00:00:00	2017-04-28 00:00:00	0	2017-04-23 00:00:00	2017-05-03 00:00:00
315299	117927	30030	11	20205	11	0	2017-04-22 00:00:00	2017-04-28 00:00:00	0	2017-04-23 00:00:00	2017-05-03 00:00:00
315299	117935	30001	9	22531	9	0	2017-04-22 00:00:00	2017-04-28 00:00:00	0	2017-04-23 00:00:00	2017-05-03 00:00:00
315299	117935	30003	2	22531	2	0	2017-04-22 00:00:00	2017-04-28 00:00:00	0	2017-04-23 00:00:00	2017-05-03 00:00:00
315299	117943	30001	8	28009	8	0	2017-04-22 00:00:00	2017-04-28 00:00:00	0	2017-04-23 00:00:00	2017-05-03 00:00:00
315299	117943	30003	4	28009	4	0	2017-04-22 00:00:00	2017-04-28 00:00:00	0	2017-04-23 00:00:00	2017-05-03 00:00:00
315299	117943	30006	13	28009	13	0	2017-04-22 00:00:00	2017-04-28 00:00:00	0	2017-04-23 00:00:00	2017-05-03 00:00:00
315299	117943	30011	6	28009	6	0	2017-04-22 00:00:00	2017-04-28 00:00:00	0	2017-04-23 00:00:00	2017-05-03 00:00:00
315299	117943	30013	7	28009	7	0	2017-04-22 00:00:00	2017-04-28 00:00:00	0	2017-04-23 00:00:00	2017-05-03 00:00:00
315299	117943	30015	27	28009	27	0	2017-04-22 00:00:00	2017-04-28 00:00:00	0	2017-04-23 00:00:00	2017-05-03 00:00:00
315299	117943	30016	7	28009	7	0	2017-04-22 00:00:00	2017-04-28 00:00:00	0	2017-04-23 00:00:00	2017-05-03 00:00:00
315299	117943	30030	9	28009	9	0	2017-04-22 00:00:00	2017-04-28 00:00:00	0	2017-04-23 00:00:00	2017-05-03 00:00:00
315299	117951	30006	9	28009	9	0	2017-04-22 00:00:00	2017-04-28 00:00:00	0	2017-04-23 00:00:00	2017-05-03 00:00:00
315299	117951	30020	14	28009	14	0	2017-04-22 00:00:00	2017-04-28 00:00:00	0	2017-04-23 00:00:00	2017-05-03 00:00:00
315299	134597	30006	12	10962	12	0	2017-04-22 00:00:00	2017-04-28 00:00:00	0	2017-04-23 00:00:00	2017-05-03 00:00:00
315299	134597	30014	12	10962	12	0	2017-04-22 00:00:00	2017-04-28 00:00:00	0	2017-04-23 00:00:00	2017-05-03 00:00:00
315299	134597	30015	24	10962	24	0	2017-04-22 00:00:00	2017-04-28 00:00:00	0	2017-04-23 00:00:00	2017-05-03 00:00:00
315299	134597	30020	12	10962	12	0	2017-04-22 00:00:00	2017-04-28 00:00:00	0	2017-04-23 00:00:00	2017-05-03 00:00:00
315299	134597	30030	12	10962	12	0	2017-04-22 00:00:00	2017-04-28 00:00:00	0	2017-04-23 00:00:00	2017-05-03 00:00:00
315299	134635	30006	24	4847	24	0	2017-04-22 00:00:00	2017-04-28 00:00:00	0	2017-04-23 00:00:00	2017-05-03 00:00:00
315299	134635	30015	24	4847	24	0	2017-04-22 00:00:00	2017-04-28 00:00:00	0	2017-04-23 00:00:00	2017-05-03 00:00:00
315299	134635	30020	24	4847	24	0	2017-04-22 00:00:00	2017-04-28 00:00:00	0	2017-04-23 00:00:00	2017-05-03 00:00:00
315299	134708	30006	12	2094	12	0	2017-04-22 00:00:00	2017-04-28 00:00:00	0	2017-04-23 00:00:00	2017-05-03 00:00:00
315299	134708	30014	12	2094	12	0	2017-04-22 00:00:00	2017-04-28 00:00:00	0	2017-04-23 00:00:00	2017-05-03 00:00:00
315299	134708	30015	24	2094	24	0	2017-04-22 00:00:00	2017-04-28 00:00:00	0	2017-04-23 00:00:00	2017-05-03 00:00:00
315299	134708	30020	24	2094	24	0	2017-04-22 00:00:00	2017-04-28 00:00:00	0	2017-04-23 00:00:00	2017-05-03 00:00:00
315299	134708	30030	12	2094	12	0	2017-04-22 00:00:00	2017-04-28 00:00:00	0	2017-04-23 00:00:00	2017-05-03 00:00:00
315299	134872	30006	21	25309	21	0	2017-04-22 00:00:00	2017-04-28 00:00:00	0	2017-04-23 00:00:00	2017-05-03 00:00:00
315299	134881	30006	31	31957	31	0	2017-04-22 00:00:00	2017-04-28 00:00:00	0	2017-04-23 00:00:00	2017-05-03 00:00:00
315299	134881	30016	11	31957	11	0	2017-04-22 00:00:00	2017-04-28 00:00:00	0	2017-04-23 00:00:00	2017-05-03 00:00:00
315299	134881	30020	32	31957	6	0	2017-04-22 00:00:00	2017-04-28 00:00:00	0	2017-04-23 00:00:00	2017-05-03 00:00:00
315299	134881	30030	11	31957	11	0	2017-04-22 00:00:00	2017-04-28 00:00:00	0	2017-04-23 00:00:00	2017-05-03 00:00:00
315299	137741	30001	2	31301	2	0	2017-04-22 00:00:00	2017-04-28 00:00:00	0	2017-04-23 00:00:00	2017-05-03 00:00:00
315299	137741	30003	2	31301	2	0	2017-04-22 00:00:00	2017-04-28 00:00:00	0	2017-04-23 00:00:00	2017-05-03 00:00:00
315299	137741	30011	11	31301	3	0	2017-04-22 00:00:00	2017-04-28 00:00:00	0	2017-04-23 00:00:00	2017-05-03 00:00:00
315299	137741	30014	17	31301	1	0	2017-04-22 00:00:00	2017-04-28 00:00:00	0	2017-04-23 00:00:00	2017-05-03 00:00:00
315299	137741	30016	14	31301	2	0	2017-04-22 00:00:00	2017-04-28 00:00:00	0	2017-04-23 00:00:00	2017-05-03 00:00:00
315299	137741	30018	6	31301	6	0	2017-04-22 00:00:00	2017-04-28 00:00:00	0	2017-04-23 00:00:00	2017-05-03 00:00:00
315299	137741	30020	19	31301	3	0	2017-04-22 00:00:00	2017-04-28 00:00:00	0	2017-04-23 00:00:00	2017-05-03 00:00:00
315299	137741	30030	15	31301	3	0	2017-04-22 00:00:00	2017-04-28 00:00:00	0	2017-04-23 00:00:00	2017-05-03 00:00:00
315299	137766	30001	15	31937	15	0	2017-04-22 00:00:00	2017-04-28 00:00:00	0	2017-04-23 00:00:00	2017-05-03 00:00:00
315299	137766	30003	8	31937	8	0	2017-04-22 00:00:00	2017-04-28 00:00:00	0	2017-04-23 00:00:00	2017-05-03 00:00:00
315299	137766	30006	64	31937	64	0	2017-04-22 00:00:00	2017-04-28 00:00:00	0	2017-04-23 00:00:00	2017-05-03 00:00:00
315299	137766	30007	10	31937	10	0	2017-04-22 00:00:00	2017-04-28 00:00:00	0	2017-04-23 00:00:00	2017-05-03 00:00:00
315299	137766	30008	11	31937	11	0	2017-04-22 00:00:00	2017-04-28 00:00:00	0	2017-04-23 00:00:00	2017-05-03 00:00:00
315299	137766	30011	12	31937	12	0	2017-04-22 00:00:00	2017-04-28 00:00:00	0	2017-04-23 00:00:00	2017-05-03 00:00:00
315299	137766	30013	22	31937	22	0	2017-04-22 00:00:00	2017-04-28 00:00:00	0	2017-04-23 00:00:00	2017-05-03 00:00:00
315299	137766	30014	21	31937	21	0	2017-04-22 00:00:00	2017-04-28 00:00:00	0	2017-04-23 00:00:00	2017-05-03 00:00:00
315299	137766	30015	78	31937	78	0	2017-04-22 00:00:00	2017-04-28 00:00:00	0	2017-04-23 00:00:00	2017-05-03 00:00:00
315299	137766	30016	15	31937	15	0	2017-04-22 00:00:00	2017-04-28 00:00:00	0	2017-04-23 00:00:00	2017-05-03 00:00:00
315299	137766	30018	16	31937	16	0	2017-04-22 00:00:00	2017-04-28 00:00:00	0	2017-04-23 00:00:00	2017-05-03 00:00:00
315299	137766	30020	40	31937	40	0	2017-04-22 00:00:00	2017-04-28 00:00:00	0	2017-04-23 00:00:00	2017-05-03 00:00:00
315299	137766	30030	18	31937	18	0	2017-04-22 00:00:00	2017-04-28 00:00:00	0	2017-04-23 00:00:00	2017-05-03 00:00:00