ComprasMuebles.dbo.comPedidosGral =>

Pedido, NumProveedor, FechaPedido, Condiciones, Descuento, Transporte, Flete, Notas, FechaSurtir, FacturaClx, facturarA, puertosalida, Eta, Etd, num_pedidotitular, idu_tipopedido, opc_creacionpedido

315299	64165	2017-03-15 00:00:00		 			P	2017-04-28 00:00:00	0	0	0	1900-01-01 00:00:00	1900-01-01 00:00:00	0	1	0