ComprasMuebles.dbo.comPedidosDet => 

Pedido, Codigo, Local, Cantidad, CostoFabrica, Saldo, ReferenciaPedido, fec_surtir, fec_cancelacion, idu_tipopedido, fec_surtirinicial, fec_surtirfinal

317903	900206	30001	1	14180	1	0	2017-05-01 00:00:00	2017-05-01 00:00:00	1	2017-04-26 00:00:00	2017-05-06 00:00:00
317903	900206	30009	1	14180	1	0	2017-05-01 00:00:00	2017-05-01 00:00:00	1	2017-04-26 00:00:00	2017-05-06 00:00:00
317903	900206	30018	1	14180	1	0	2017-05-01 00:00:00	2017-05-01 00:00:00	1	2017-04-26 00:00:00	2017-05-06 00:00:00
317903	900257	30001	5	1320	5	0	2017-05-01 00:00:00	2017-05-01 00:00:00	1	2017-04-26 00:00:00	2017-05-06 00:00:00
317903	900257	30003	1	1320	1	0	2017-05-01 00:00:00	2017-05-01 00:00:00	1	2017-04-26 00:00:00	2017-05-06 00:00:00
317903	900257	30004	1	1320	1	0	2017-05-01 00:00:00	2017-05-01 00:00:00	1	2017-04-26 00:00:00	2017-05-06 00:00:00
317903	900257	30006	1	1320	1	0	2017-05-01 00:00:00	2017-05-01 00:00:00	1	2017-04-26 00:00:00	2017-05-06 00:00:00
317903	900257	30007	2	1320	2	0	2017-05-01 00:00:00	2017-05-01 00:00:00	1	2017-04-26 00:00:00	2017-05-06 00:00:00
317903	900257	30010	2	1320	2	0	2017-05-01 00:00:00	2017-05-01 00:00:00	1	2017-04-26 00:00:00	2017-05-06 00:00:00
317903	900257	30014	2	1320	2	0	2017-05-01 00:00:00	2017-05-01 00:00:00	1	2017-04-26 00:00:00	2017-05-06 00:00:00
317903	900257	30015	6	1320	6	0	2017-05-01 00:00:00	2017-05-01 00:00:00	1	2017-04-26 00:00:00	2017-05-06 00:00:00
317903	900257	30018	2	1320	2	0	2017-05-01 00:00:00	2017-05-01 00:00:00	1	2017-04-26 00:00:00	2017-05-06 00:00:00
317903	900257	30019	3	1320	3	0	2017-05-01 00:00:00	2017-05-01 00:00:00	1	2017-04-26 00:00:00	2017-05-06 00:00:00
317903	900257	30020	6	1320	6	0	2017-05-01 00:00:00	2017-05-01 00:00:00	1	2017-04-26 00:00:00	2017-05-06 00:00:00
317903	901245	30001	2	14180	2	0	2017-05-01 00:00:00	2017-05-01 00:00:00	1	2017-04-26 00:00:00	2017-05-06 00:00:00
317903	901245	30002	1	14180	1	0	2017-05-01 00:00:00	2017-05-01 00:00:00	1	2017-04-26 00:00:00	2017-05-06 00:00:00
317903	901245	30003	2	14180	2	0	2017-05-01 00:00:00	2017-05-01 00:00:00	1	2017-04-26 00:00:00	2017-05-06 00:00:00
317903	901245	30007	1	14180	1	0	2017-05-01 00:00:00	2017-05-01 00:00:00	1	2017-04-26 00:00:00	2017-05-06 00:00:00
317903	901245	30009	1	14180	1	0	2017-05-01 00:00:00	2017-05-01 00:00:00	1	2017-04-26 00:00:00	2017-05-06 00:00:00
317903	901245	30010	1	14180	1	0	2017-05-01 00:00:00	2017-05-01 00:00:00	1	2017-04-26 00:00:00	2017-05-06 00:00:00
317903	901245	30020	1	14180	1	0	2017-05-01 00:00:00	2017-05-01 00:00:00	1	2017-04-26 00:00:00	2017-05-06 00:00:00
317903	901288	30001	2	14180	2	0	2017-05-01 00:00:00	2017-05-01 00:00:00	1	2017-04-26 00:00:00	2017-05-06 00:00:00
317903	901288	30006	6	14180	6	0	2017-05-01 00:00:00	2017-05-01 00:00:00	1	2017-04-26 00:00:00	2017-05-06 00:00:00
317903	901288	30008	1	14180	1	0	2017-05-01 00:00:00	2017-05-01 00:00:00	1	2017-04-26 00:00:00	2017-05-06 00:00:00
317903	901288	30009	3	14180	3	0	2017-05-01 00:00:00	2017-05-01 00:00:00	1	2017-04-26 00:00:00	2017-05-06 00:00:00
317903	901288	30010	3	14180	3	0	2017-05-01 00:00:00	2017-05-01 00:00:00	1	2017-04-26 00:00:00	2017-05-06 00:00:00
317903	901288	30014	2	14180	2	0	2017-05-01 00:00:00	2017-05-01 00:00:00	1	2017-04-26 00:00:00	2017-05-06 00:00:00
317903	901288	30016	1	14180	1	0	2017-05-01 00:00:00	2017-05-01 00:00:00	1	2017-04-26 00:00:00	2017-05-06 00:00:00
317903	901288	30018	1	14180	1	0	2017-05-01 00:00:00	2017-05-01 00:00:00	1	2017-04-26 00:00:00	2017-05-06 00:00:00
317903	901288	30019	2	14180	2	0	2017-05-01 00:00:00	2017-05-01 00:00:00	1	2017-04-26 00:00:00	2017-05-06 00:00:00
317903	901288	30030	1	14180	1	0	2017-05-01 00:00:00	2017-05-01 00:00:00	1	2017-04-26 00:00:00	2017-05-06 00:00:00
317903	902152	30001	4	14180	4	0	2017-05-01 00:00:00	2017-05-01 00:00:00	1	2017-04-26 00:00:00	2017-05-06 00:00:00
317903	902152	30004	1	14180	1	0	2017-05-01 00:00:00	2017-05-01 00:00:00	1	2017-04-26 00:00:00	2017-05-06 00:00:00
317903	902152	30009	1	14180	1	0	2017-05-01 00:00:00	2017-05-01 00:00:00	1	2017-04-26 00:00:00	2017-05-06 00:00:00
317903	902152	30010	2	14180	2	0	2017-05-01 00:00:00	2017-05-01 00:00:00	1	2017-04-26 00:00:00	2017-05-06 00:00:00
317903	902152	30011	1	14180	1	0	2017-05-01 00:00:00	2017-05-01 00:00:00	1	2017-04-26 00:00:00	2017-05-06 00:00:00
317903	902152	30013	2	14180	2	0	2017-05-01 00:00:00	2017-05-01 00:00:00	1	2017-04-26 00:00:00	2017-05-06 00:00:00
317903	902152	30014	3	14180	3	0	2017-05-01 00:00:00	2017-05-01 00:00:00	1	2017-04-26 00:00:00	2017-05-06 00:00:00
317903	902152	30016	2	14180	2	0	2017-05-01 00:00:00	2017-05-01 00:00:00	1	2017-04-26 00:00:00	2017-05-06 00:00:00
317903	902152	30018	5	14180	5	0	2017-05-01 00:00:00	2017-05-01 00:00:00	1	2017-04-26 00:00:00	2017-05-06 00:00:00
317903	902152	30019	3	14180	3	0	2017-05-01 00:00:00	2017-05-01 00:00:00	1	2017-04-26 00:00:00	2017-05-06 00:00:00
317903	905054	30001	5	14180	5	0	2017-05-01 00:00:00	2017-05-01 00:00:00	1	2017-04-26 00:00:00	2017-05-06 00:00:00
317903	905054	30002	1	14180	1	0	2017-05-01 00:00:00	2017-05-01 00:00:00	1	2017-04-26 00:00:00	2017-05-06 00:00:00
317903	905054	30004	1	14180	1	0	2017-05-01 00:00:00	2017-05-01 00:00:00	1	2017-04-26 00:00:00	2017-05-06 00:00:00
317903	905054	30008	1	14180	1	0	2017-05-01 00:00:00	2017-05-01 00:00:00	1	2017-04-26 00:00:00	2017-05-06 00:00:00
317903	905054	30009	1	14180	1	0	2017-05-01 00:00:00	2017-05-01 00:00:00	1	2017-04-26 00:00:00	2017-05-06 00:00:00
317903	905054	30010	4	14180	4	0	2017-05-01 00:00:00	2017-05-01 00:00:00	1	2017-04-26 00:00:00	2017-05-06 00:00:00
317903	905054	30014	3	14180	3	0	2017-05-01 00:00:00	2017-05-01 00:00:00	1	2017-04-26 00:00:00	2017-05-06 00:00:00
317903	905054	30018	1	14180	1	0	2017-05-01 00:00:00	2017-05-01 00:00:00	1	2017-04-26 00:00:00	2017-05-06 00:00:00
317903	905054	30020	4	14180	4	0	2017-05-01 00:00:00	2017-05-01 00:00:00	1	2017-04-26 00:00:00	2017-05-06 00:00:00
317903	905071	30001	2	14180	2	0	2017-05-01 00:00:00	2017-05-01 00:00:00	1	2017-04-26 00:00:00	2017-05-06 00:00:00
317903	905071	30002	1	14180	1	0	2017-05-01 00:00:00	2017-05-01 00:00:00	1	2017-04-26 00:00:00	2017-05-06 00:00:00
317903	905071	30006	1	14180	1	0	2017-05-01 00:00:00	2017-05-01 00:00:00	1	2017-04-26 00:00:00	2017-05-06 00:00:00
317903	905071	30007	3	14180	3	0	2017-05-01 00:00:00	2017-05-01 00:00:00	1	2017-04-26 00:00:00	2017-05-06 00:00:00
317903	905071	30009	3	14180	3	0	2017-05-01 00:00:00	2017-05-01 00:00:00	1	2017-04-26 00:00:00	2017-05-06 00:00:00
317903	905071	30010	3	14180	3	0	2017-05-01 00:00:00	2017-05-01 00:00:00	1	2017-04-26 00:00:00	2017-05-06 00:00:00
317903	905071	30015	2	14180	2	0	2017-05-01 00:00:00	2017-05-01 00:00:00	1	2017-04-26 00:00:00	2017-05-06 00:00:00
317903	905071	30018	3	14180	3	0	2017-05-01 00:00:00	2017-05-01 00:00:00	1	2017-04-26 00:00:00	2017-05-06 00:00:00
317903	905071	30019	2	14180	2	0	2017-05-01 00:00:00	2017-05-01 00:00:00	1	2017-04-26 00:00:00	2017-05-06 00:00:00
317903	905071	30020	5	14180	5	0	2017-05-01 00:00:00	2017-05-01 00:00:00	1	2017-04-26 00:00:00	2017-05-06 00:00:00
317903	905071	30030	1	14180	1	0	2017-05-01 00:00:00	2017-05-01 00:00:00	1	2017-04-26 00:00:00	2017-05-06 00:00:00
317903	905097	30001	1	14180	1	0	2017-05-01 00:00:00	2017-05-01 00:00:00	1	2017-04-26 00:00:00	2017-05-06 00:00:00
317903	905097	30002	2	14180	2	0	2017-05-01 00:00:00	2017-05-01 00:00:00	1	2017-04-26 00:00:00	2017-05-06 00:00:00
317903	905097	30003	1	14180	1	0	2017-05-01 00:00:00	2017-05-01 00:00:00	1	2017-04-26 00:00:00	2017-05-06 00:00:00
317903	905097	30004	2	14180	2	0	2017-05-01 00:00:00	2017-05-01 00:00:00	1	2017-04-26 00:00:00	2017-05-06 00:00:00
317903	905097	30006	2	14180	2	0	2017-05-01 00:00:00	2017-05-01 00:00:00	1	2017-04-26 00:00:00	2017-05-06 00:00:00
317903	905097	30007	2	14180	2	0	2017-05-01 00:00:00	2017-05-01 00:00:00	1	2017-04-26 00:00:00	2017-05-06 00:00:00
317903	905097	30009	4	14180	4	0	2017-05-01 00:00:00	2017-05-01 00:00:00	1	2017-04-26 00:00:00	2017-05-06 00:00:00
317903	905097	30010	3	14180	3	0	2017-05-01 00:00:00	2017-05-01 00:00:00	1	2017-04-26 00:00:00	2017-05-06 00:00:00
317903	905097	30018	4	14180	4	0	2017-05-01 00:00:00	2017-05-01 00:00:00	1	2017-04-26 00:00:00	2017-05-06 00:00:00
317903	905097	30019	2	14180	2	0	2017-05-01 00:00:00	2017-05-01 00:00:00	1	2017-04-26 00:00:00	2017-05-06 00:00:00
317903	905097	30020	2	14180	2	0	2017-05-01 00:00:00	2017-05-01 00:00:00	1	2017-04-26 00:00:00	2017-05-06 00:00:00
317903	905097	30030	2	14180	2	0	2017-05-01 00:00:00	2017-05-01 00:00:00	1	2017-04-26 00:00:00	2017-05-06 00:00:00
317903	905119	30002	1	14180	1	0	2017-05-01 00:00:00	2017-05-01 00:00:00	1	2017-04-26 00:00:00	2017-05-06 00:00:00
317903	905119	30003	1	14180	1	0	2017-05-01 00:00:00	2017-05-01 00:00:00	1	2017-04-26 00:00:00	2017-05-06 00:00:00
317903	905119	30004	2	14180	2	0	2017-05-01 00:00:00	2017-05-01 00:00:00	1	2017-04-26 00:00:00	2017-05-06 00:00:00
317903	905119	30006	1	14180	1	0	2017-05-01 00:00:00	2017-05-01 00:00:00	1	2017-04-26 00:00:00	2017-05-06 00:00:00
317903	905119	30007	3	14180	3	0	2017-05-01 00:00:00	2017-05-01 00:00:00	1	2017-04-26 00:00:00	2017-05-06 00:00:00
317903	905119	30009	5	14180	5	0	2017-05-01 00:00:00	2017-05-01 00:00:00	1	2017-04-26 00:00:00	2017-05-06 00:00:00
317903	905119	30010	2	14180	2	0	2017-05-01 00:00:00	2017-05-01 00:00:00	1	2017-04-26 00:00:00	2017-05-06 00:00:00
317903	905119	30013	2	14180	2	0	2017-05-01 00:00:00	2017-05-01 00:00:00	1	2017-04-26 00:00:00	2017-05-06 00:00:00
317903	905119	30018	3	14180	3	0	2017-05-01 00:00:00	2017-05-01 00:00:00	1	2017-04-26 00:00:00	2017-05-06 00:00:00
317903	905119	30019	2	14180	2	0	2017-05-01 00:00:00	2017-05-01 00:00:00	1	2017-04-26 00:00:00	2017-05-06 00:00:00
317903	905119	30030	1	14180	1	0	2017-05-01 00:00:00	2017-05-01 00:00:00	1	2017-04-26 00:00:00	2017-05-06 00:00:00
317903	905135	30001	1	14180	1	0	2017-05-01 00:00:00	2017-05-01 00:00:00	1	2017-04-26 00:00:00	2017-05-06 00:00:00
317903	905135	30002	1	14180	1	0	2017-05-01 00:00:00	2017-05-01 00:00:00	1	2017-04-26 00:00:00	2017-05-06 00:00:00
317903	905135	30003	1	14180	1	0	2017-05-01 00:00:00	2017-05-01 00:00:00	1	2017-04-26 00:00:00	2017-05-06 00:00:00
317903	905135	30006	1	14180	1	0	2017-05-01 00:00:00	2017-05-01 00:00:00	1	2017-04-26 00:00:00	2017-05-06 00:00:00
317903	905135	30007	1	14180	1	0	2017-05-01 00:00:00	2017-05-01 00:00:00	1	2017-04-26 00:00:00	2017-05-06 00:00:00
317903	905135	30008	1	14180	1	0	2017-05-01 00:00:00	2017-05-01 00:00:00	1	2017-04-26 00:00:00	2017-05-06 00:00:00
317903	905135	30010	1	14180	1	0	2017-05-01 00:00:00	2017-05-01 00:00:00	1	2017-04-26 00:00:00	2017-05-06 00:00:00
317903	905135	30011	1	14180	1	0	2017-05-01 00:00:00	2017-05-01 00:00:00	1	2017-04-26 00:00:00	2017-05-06 00:00:00
317903	905135	30018	2	14180	2	0	2017-05-01 00:00:00	2017-05-01 00:00:00	1	2017-04-26 00:00:00	2017-05-06 00:00:00
317903	905135	30019	1	14180	1	0	2017-05-01 00:00:00	2017-05-01 00:00:00	1	2017-04-26 00:00:00	2017-05-06 00:00:00
317903	905151	30001	1	14180	1	0	2017-05-01 00:00:00	2017-05-01 00:00:00	1	2017-04-26 00:00:00	2017-05-06 00:00:00
317903	905151	30006	2	14180	2	0	2017-05-01 00:00:00	2017-05-01 00:00:00	1	2017-04-26 00:00:00	2017-05-06 00:00:00
317903	905151	30007	2	14180	2	0	2017-05-01 00:00:00	2017-05-01 00:00:00	1	2017-04-26 00:00:00	2017-05-06 00:00:00
317903	905151	30009	1	14180	1	0	2017-05-01 00:00:00	2017-05-01 00:00:00	1	2017-04-26 00:00:00	2017-05-06 00:00:00
317903	905151	30016	1	14180	1	0	2017-05-01 00:00:00	2017-05-01 00:00:00	1	2017-04-26 00:00:00	2017-05-06 00:00:00
317903	905151	30018	1	14180	1	0	2017-05-01 00:00:00	2017-05-01 00:00:00	1	2017-04-26 00:00:00	2017-05-06 00:00:00
317903	905178	30001	2	14180	2	0	2017-05-01 00:00:00	2017-05-01 00:00:00	1	2017-04-26 00:00:00	2017-05-06 00:00:00
317903	905178	30003	2	14180	2	0	2017-05-01 00:00:00	2017-05-01 00:00:00	1	2017-04-26 00:00:00	2017-05-06 00:00:00
317903	905178	30006	1	14180	1	0	2017-05-01 00:00:00	2017-05-01 00:00:00	1	2017-04-26 00:00:00	2017-05-06 00:00:00
317903	905178	30007	2	14180	2	0	2017-05-01 00:00:00	2017-05-01 00:00:00	1	2017-04-26 00:00:00	2017-05-06 00:00:00
317903	905178	30008	1	14180	1	0	2017-05-01 00:00:00	2017-05-01 00:00:00	1	2017-04-26 00:00:00	2017-05-06 00:00:00
317903	905178	30009	6	14180	6	0	2017-05-01 00:00:00	2017-05-01 00:00:00	1	2017-04-26 00:00:00	2017-05-06 00:00:00
317903	905178	30010	2	14180	2	0	2017-05-01 00:00:00	2017-05-01 00:00:00	1	2017-04-26 00:00:00	2017-05-06 00:00:00
317903	905178	30014	1	14180	1	0	2017-05-01 00:00:00	2017-05-01 00:00:00	1	2017-04-26 00:00:00	2017-05-06 00:00:00
317903	905178	30015	1	14180	1	0	2017-05-01 00:00:00	2017-05-01 00:00:00	1	2017-04-26 00:00:00	2017-05-06 00:00:00
317903	905178	30016	1	14180	1	0	2017-05-01 00:00:00	2017-05-01 00:00:00	1	2017-04-26 00:00:00	2017-05-06 00:00:00
317903	905178	30018	5	14180	5	0	2017-05-01 00:00:00	2017-05-01 00:00:00	1	2017-04-26 00:00:00	2017-05-06 00:00:00
317903	905178	30019	2	14180	2	0	2017-05-01 00:00:00	2017-05-01 00:00:00	1	2017-04-26 00:00:00	2017-05-06 00:00:00
317903	905178	30030	4	14180	4	0	2017-05-01 00:00:00	2017-05-01 00:00:00	1	2017-04-26 00:00:00	2017-05-06 00:00:00
317903	908711	30020	1	13700	1	0	2017-05-01 00:00:00	2017-05-01 00:00:00	1	2017-04-26 00:00:00	2017-05-06 00:00:00
317903	908721	30007	2	13700	2	0	2017-05-01 00:00:00	2017-05-01 00:00:00	1	2017-04-26 00:00:00	2017-05-06 00:00:00
317903	908721	30020	1	13700	1	0	2017-05-01 00:00:00	2017-05-01 00:00:00	1	2017-04-26 00:00:00	2017-05-06 00:00:00
317903	908738	30007	2	13700	2	0	2017-05-01 00:00:00	2017-05-01 00:00:00	1	2017-04-26 00:00:00	2017-05-06 00:00:00
317903	908738	30018	1	13700	1	0	2017-05-01 00:00:00	2017-05-01 00:00:00	1	2017-04-26 00:00:00	2017-05-06 00:00:00
317903	908746	30004	3	13700	3	0	2017-05-01 00:00:00	2017-05-01 00:00:00	1	2017-04-26 00:00:00	2017-05-06 00:00:00
317903	908746	30006	3	13700	3	0	2017-05-01 00:00:00	2017-05-01 00:00:00	1	2017-04-26 00:00:00	2017-05-06 00:00:00
317903	908746	30007	1	13700	1	0	2017-05-01 00:00:00	2017-05-01 00:00:00	1	2017-04-26 00:00:00	2017-05-06 00:00:00
317903	908746	30008	1	13700	1	0	2017-05-01 00:00:00	2017-05-01 00:00:00	1	2017-04-26 00:00:00	2017-05-06 00:00:00
317903	908746	30009	10	13700	10	0	2017-05-01 00:00:00	2017-05-01 00:00:00	1	2017-04-26 00:00:00	2017-05-06 00:00:00
317903	908746	30010	3	13700	3	0	2017-05-01 00:00:00	2017-05-01 00:00:00	1	2017-04-26 00:00:00	2017-05-06 00:00:00
317903	908746	30011	1	13700	1	0	2017-05-01 00:00:00	2017-05-01 00:00:00	1	2017-04-26 00:00:00	2017-05-06 00:00:00
317903	908746	30013	1	13700	1	0	2017-05-01 00:00:00	2017-05-01 00:00:00	1	2017-04-26 00:00:00	2017-05-06 00:00:00
317903	908746	30014	1	13700	1	0	2017-05-01 00:00:00	2017-05-01 00:00:00	1	2017-04-26 00:00:00	2017-05-06 00:00:00
317903	908746	30015	7	13700	7	0	2017-05-01 00:00:00	2017-05-01 00:00:00	1	2017-04-26 00:00:00	2017-05-06 00:00:00
317903	908746	30019	4	13700	4	0	2017-05-01 00:00:00	2017-05-01 00:00:00	1	2017-04-26 00:00:00	2017-05-06 00:00:00
317903	908746	30030	2	13700	2	0	2017-05-01 00:00:00	2017-05-01 00:00:00	1	2017-04-26 00:00:00	2017-05-06 00:00:00
317903	908754	30006	5	13700	5	0	2017-05-01 00:00:00	2017-05-01 00:00:00	1	2017-04-26 00:00:00	2017-05-06 00:00:00
317903	908754	30007	1	13700	1	0	2017-05-01 00:00:00	2017-05-01 00:00:00	1	2017-04-26 00:00:00	2017-05-06 00:00:00
317903	908754	30009	6	13700	6	0	2017-05-01 00:00:00	2017-05-01 00:00:00	1	2017-04-26 00:00:00	2017-05-06 00:00:00
317903	908754	30011	1	13700	1	0	2017-05-01 00:00:00	2017-05-01 00:00:00	1	2017-04-26 00:00:00	2017-05-06 00:00:00
317903	908754	30016	1	13700	1	0	2017-05-01 00:00:00	2017-05-01 00:00:00	1	2017-04-26 00:00:00	2017-05-06 00:00:00
317903	908754	30018	2	13700	2	0	2017-05-01 00:00:00	2017-05-01 00:00:00	1	2017-04-26 00:00:00	2017-05-06 00:00:00
317903	908754	30019	2	13700	2	0	2017-05-01 00:00:00	2017-05-01 00:00:00	1	2017-04-26 00:00:00	2017-05-06 00:00:00
317903	908754	30030	2	13700	2	0	2017-05-01 00:00:00	2017-05-01 00:00:00	1	2017-04-26 00:00:00	2017-05-06 00:00:00
317903	908762	30001	2	13700	2	0	2017-05-01 00:00:00	2017-05-01 00:00:00	1	2017-04-26 00:00:00	2017-05-06 00:00:00
317903	908762	30002	1	13700	1	0	2017-05-01 00:00:00	2017-05-01 00:00:00	1	2017-04-26 00:00:00	2017-05-06 00:00:00
317903	908762	30003	2	13700	2	0	2017-05-01 00:00:00	2017-05-01 00:00:00	1	2017-04-26 00:00:00	2017-05-06 00:00:00
317903	908762	30007	1	13700	1	0	2017-05-01 00:00:00	2017-05-01 00:00:00	1	2017-04-26 00:00:00	2017-05-06 00:00:00
317903	908762	30009	1	13700	1	0	2017-05-01 00:00:00	2017-05-01 00:00:00	1	2017-04-26 00:00:00	2017-05-06 00:00:00
317903	908762	30013	3	13700	3	0	2017-05-01 00:00:00	2017-05-01 00:00:00	1	2017-04-26 00:00:00	2017-05-06 00:00:00
317903	908762	30014	1	13700	1	0	2017-05-01 00:00:00	2017-05-01 00:00:00	1	2017-04-26 00:00:00	2017-05-06 00:00:00
317903	908762	30020	1	13700	1	0	2017-05-01 00:00:00	2017-05-01 00:00:00	1	2017-04-26 00:00:00	2017-05-06 00:00:00
317903	908771	30001	3	13700	3	0	2017-05-01 00:00:00	2017-05-01 00:00:00	1	2017-04-26 00:00:00	2017-05-06 00:00:00
317903	908771	30003	3	13700	3	0	2017-05-01 00:00:00	2017-05-01 00:00:00	1	2017-04-26 00:00:00	2017-05-06 00:00:00
317903	908771	30004	3	13700	3	0	2017-05-01 00:00:00	2017-05-01 00:00:00	1	2017-04-26 00:00:00	2017-05-06 00:00:00
317903	908771	30006	2	13700	2	0	2017-05-01 00:00:00	2017-05-01 00:00:00	1	2017-04-26 00:00:00	2017-05-06 00:00:00
317903	908771	30007	2	13700	2	0	2017-05-01 00:00:00	2017-05-01 00:00:00	1	2017-04-26 00:00:00	2017-05-06 00:00:00
317903	908771	30008	2	13700	2	0	2017-05-01 00:00:00	2017-05-01 00:00:00	1	2017-04-26 00:00:00	2017-05-06 00:00:00
317903	908771	30009	7	13700	7	0	2017-05-01 00:00:00	2017-05-01 00:00:00	1	2017-04-26 00:00:00	2017-05-06 00:00:00
317903	908771	30010	1	13700	1	0	2017-05-01 00:00:00	2017-05-01 00:00:00	1	2017-04-26 00:00:00	2017-05-06 00:00:00
317903	908771	30013	1	13700	1	0	2017-05-01 00:00:00	2017-05-01 00:00:00	1	2017-04-26 00:00:00	2017-05-06 00:00:00
317903	908771	30014	2	13700	2	0	2017-05-01 00:00:00	2017-05-01 00:00:00	1	2017-04-26 00:00:00	2017-05-06 00:00:00
317903	908771	30016	1	13700	1	0	2017-05-01 00:00:00	2017-05-01 00:00:00	1	2017-04-26 00:00:00	2017-05-06 00:00:00
317903	908771	30019	4	13700	4	0	2017-05-01 00:00:00	2017-05-01 00:00:00	1	2017-04-26 00:00:00	2017-05-06 00:00:00
317903	908771	30030	1	13700	1	0	2017-05-01 00:00:00	2017-05-01 00:00:00	1	2017-04-26 00:00:00	2017-05-06 00:00:00
317903	917052	30001	152	1490	152	0	2017-05-01 00:00:00	2017-05-01 00:00:00	1	2017-04-26 00:00:00	2017-05-06 00:00:00
317903	917052	30002	62	1490	62	0	2017-05-01 00:00:00	2017-05-01 00:00:00	1	2017-04-26 00:00:00	2017-05-06 00:00:00
317903	917052	30003	84	1490	84	0	2017-05-01 00:00:00	2017-05-01 00:00:00	1	2017-04-26 00:00:00	2017-05-06 00:00:00
317903	917052	30004	31	1490	31	0	2017-05-01 00:00:00	2017-05-01 00:00:00	1	2017-04-26 00:00:00	2017-05-06 00:00:00
317903	917052	30006	134	1490	134	0	2017-05-01 00:00:00	2017-05-01 00:00:00	1	2017-04-26 00:00:00	2017-05-06 00:00:00
317903	917052	30007	75	1490	75	0	2017-05-01 00:00:00	2017-05-01 00:00:00	1	2017-04-26 00:00:00	2017-05-06 00:00:00
317903	917052	30008	102	1490	102	0	2017-05-01 00:00:00	2017-05-01 00:00:00	1	2017-04-26 00:00:00	2017-05-06 00:00:00
317903	917052	30011	36	1490	36	0	2017-05-01 00:00:00	2017-05-01 00:00:00	1	2017-04-26 00:00:00	2017-05-06 00:00:00
317903	917052	30013	152	1490	152	0	2017-05-01 00:00:00	2017-05-01 00:00:00	1	2017-04-26 00:00:00	2017-05-06 00:00:00
317903	917052	30014	148	1490	148	0	2017-05-01 00:00:00	2017-05-01 00:00:00	1	2017-04-26 00:00:00	2017-05-06 00:00:00
317903	917052	30016	100	1490	100	0	2017-05-01 00:00:00	2017-05-01 00:00:00	1	2017-04-26 00:00:00	2017-05-06 00:00:00
317903	917052	30018	111	1490	111	0	2017-05-01 00:00:00	2017-05-01 00:00:00	1	2017-04-26 00:00:00	2017-05-06 00:00:00
317903	917052	30020	182	1490	182	0	2017-05-01 00:00:00	2017-05-01 00:00:00	1	2017-04-26 00:00:00	2017-05-06 00:00:00
317903	917745	30002	4	8750	4	0	2017-05-01 00:00:00	2017-05-01 00:00:00	1	2017-04-26 00:00:00	2017-05-06 00:00:00
317903	917745	30003	5	8750	5	0	2017-05-01 00:00:00	2017-05-01 00:00:00	1	2017-04-26 00:00:00	2017-05-06 00:00:00
317903	917745	30006	19	8750	19	0	2017-05-01 00:00:00	2017-05-01 00:00:00	1	2017-04-26 00:00:00	2017-05-06 00:00:00
317903	917745	30007	2	8750	2	0	2017-05-01 00:00:00	2017-05-01 00:00:00	1	2017-04-26 00:00:00	2017-05-06 00:00:00
317903	917745	30008	8	8750	8	0	2017-05-01 00:00:00	2017-05-01 00:00:00	1	2017-04-26 00:00:00	2017-05-06 00:00:00
317903	917745	30009	20	8750	20	0	2017-05-01 00:00:00	2017-05-01 00:00:00	1	2017-04-26 00:00:00	2017-05-06 00:00:00
317903	917745	30010	10	8750	10	0	2017-05-01 00:00:00	2017-05-01 00:00:00	1	2017-04-26 00:00:00	2017-05-06 00:00:00
317903	917745	30011	1	8750	1	0	2017-05-01 00:00:00	2017-05-01 00:00:00	1	2017-04-26 00:00:00	2017-05-06 00:00:00
317903	917745	30013	6	8750	6	0	2017-05-01 00:00:00	2017-05-01 00:00:00	1	2017-04-26 00:00:00	2017-05-06 00:00:00
317903	917745	30014	8	8750	8	0	2017-05-01 00:00:00	2017-05-01 00:00:00	1	2017-04-26 00:00:00	2017-05-06 00:00:00
317903	917745	30016	6	8750	6	0	2017-05-01 00:00:00	2017-05-01 00:00:00	1	2017-04-26 00:00:00	2017-05-06 00:00:00
317903	917745	30018	15	8750	15	0	2017-05-01 00:00:00	2017-05-01 00:00:00	1	2017-04-26 00:00:00	2017-05-06 00:00:00
317903	917745	30019	8	8750	8	0	2017-05-01 00:00:00	2017-05-01 00:00:00	1	2017-04-26 00:00:00	2017-05-06 00:00:00
317903	917745	30020	7	8750	7	0	2017-05-01 00:00:00	2017-05-01 00:00:00	1	2017-04-26 00:00:00	2017-05-06 00:00:00
317903	917745	30030	9	8750	9	0	2017-05-01 00:00:00	2017-05-01 00:00:00	1	2017-04-26 00:00:00	2017-05-06 00:00:00
317903	980005	30001	1	14180	1	0	2017-05-01 00:00:00	2017-05-01 00:00:00	1	2017-04-26 00:00:00	2017-05-06 00:00:00
317903	980005	30007	1	14180	1	0	2017-05-01 00:00:00	2017-05-01 00:00:00	1	2017-04-26 00:00:00	2017-05-06 00:00:00
317903	980005	30009	4	14180	4	0	2017-05-01 00:00:00	2017-05-01 00:00:00	1	2017-04-26 00:00:00	2017-05-06 00:00:00
317903	980005	30010	2	14180	2	0	2017-05-01 00:00:00	2017-05-01 00:00:00	1	2017-04-26 00:00:00	2017-05-06 00:00:00
317903	980005	30015	1	14180	1	0	2017-05-01 00:00:00	2017-05-01 00:00:00	1	2017-04-26 00:00:00	2017-05-06 00:00:00
317903	980005	30019	2	14180	2	0	2017-05-01 00:00:00	2017-05-01 00:00:00	1	2017-04-26 00:00:00	2017-05-06 00:00:00
317903	980021	30018	2	14180	2	0	2017-05-01 00:00:00	2017-05-01 00:00:00	1	2017-04-26 00:00:00	2017-05-06 00:00:00
317903	980048	30003	2	14180	2	0	2017-05-01 00:00:00	2017-05-01 00:00:00	1	2017-04-26 00:00:00	2017-05-06 00:00:00
317903	980048	30006	6	14180	6	0	2017-05-01 00:00:00	2017-05-01 00:00:00	1	2017-04-26 00:00:00	2017-05-06 00:00:00
317903	980048	30007	3	14180	3	0	2017-05-01 00:00:00	2017-05-01 00:00:00	1	2017-04-26 00:00:00	2017-05-06 00:00:00
317903	980048	30009	9	14180	9	0	2017-05-01 00:00:00	2017-05-01 00:00:00	1	2017-04-26 00:00:00	2017-05-06 00:00:00
317903	980048	30010	3	14180	3	0	2017-05-01 00:00:00	2017-05-01 00:00:00	1	2017-04-26 00:00:00	2017-05-06 00:00:00
317903	980048	30014	2	14180	2	0	2017-05-01 00:00:00	2017-05-01 00:00:00	1	2017-04-26 00:00:00	2017-05-06 00:00:00
317903	980048	30015	3	14180	3	0	2017-05-01 00:00:00	2017-05-01 00:00:00	1	2017-04-26 00:00:00	2017-05-06 00:00:00
317903	980048	30018	1	14180	1	0	2017-05-01 00:00:00	2017-05-01 00:00:00	1	2017-04-26 00:00:00	2017-05-06 00:00:00
317903	980048	30019	3	14180	3	0	2017-05-01 00:00:00	2017-05-01 00:00:00	1	2017-04-26 00:00:00	2017-05-06 00:00:00
317903	980048	30020	2	14180	2	0	2017-05-01 00:00:00	2017-05-01 00:00:00	1	2017-04-26 00:00:00	2017-05-06 00:00:00
317903	980048	30030	4	14180	4	0	2017-05-01 00:00:00	2017-05-01 00:00:00	1	2017-04-26 00:00:00	2017-05-06 00:00:00
317903	980064	30009	1	14180	1	0	2017-05-01 00:00:00	2017-05-01 00:00:00	1	2017-04-26 00:00:00	2017-05-06 00:00:00
317903	980064	30010	1	14180	1	0	2017-05-01 00:00:00	2017-05-01 00:00:00	1	2017-04-26 00:00:00	2017-05-06 00:00:00
317903	980064	30013	1	14180	1	0	2017-05-01 00:00:00	2017-05-01 00:00:00	1	2017-04-26 00:00:00	2017-05-06 00:00:00
317903	980064	30019	1	14180	1	0	2017-05-01 00:00:00	2017-05-01 00:00:00	1	2017-04-26 00:00:00	2017-05-06 00:00:00
317903	980081	30020	3	14180	3	0	2017-05-01 00:00:00	2017-05-01 00:00:00	1	2017-04-26 00:00:00	2017-05-06 00:00:00
317903	990027	30001	20	770	20	0	2017-05-01 00:00:00	2017-05-01 00:00:00	1	2017-04-26 00:00:00	2017-05-06 00:00:00
317903	990027	30002	11	770	11	0	2017-05-01 00:00:00	2017-05-01 00:00:00	1	2017-04-26 00:00:00	2017-05-06 00:00:00
317903	990027	30003	11	770	11	0	2017-05-01 00:00:00	2017-05-01 00:00:00	1	2017-04-26 00:00:00	2017-05-06 00:00:00
317903	990027	30006	42	770	42	0	2017-05-01 00:00:00	2017-05-01 00:00:00	1	2017-04-26 00:00:00	2017-05-06 00:00:00
317903	990027	30007	23	770	23	0	2017-05-01 00:00:00	2017-05-01 00:00:00	1	2017-04-26 00:00:00	2017-05-06 00:00:00
317903	990027	30008	7	770	7	0	2017-05-01 00:00:00	2017-05-01 00:00:00	1	2017-04-26 00:00:00	2017-05-06 00:00:00
317903	990027	30009	22	770	22	0	2017-05-01 00:00:00	2017-05-01 00:00:00	1	2017-04-26 00:00:00	2017-05-06 00:00:00
317903	990027	30011	14	770	14	0	2017-05-01 00:00:00	2017-05-01 00:00:00	1	2017-04-26 00:00:00	2017-05-06 00:00:00
317903	990027	30013	14	770	14	0	2017-05-01 00:00:00	2017-05-01 00:00:00	1	2017-04-26 00:00:00	2017-05-06 00:00:00
317903	990027	30014	4	770	4	0	2017-05-01 00:00:00	2017-05-01 00:00:00	1	2017-04-26 00:00:00	2017-05-06 00:00:00
317903	990027	30015	18	770	18	0	2017-05-01 00:00:00	2017-05-01 00:00:00	1	2017-04-26 00:00:00	2017-05-06 00:00:00
317903	990027	30016	15	770	15	0	2017-05-01 00:00:00	2017-05-01 00:00:00	1	2017-04-26 00:00:00	2017-05-06 00:00:00
317903	990027	30018	16	770	16	0	2017-05-01 00:00:00	2017-05-01 00:00:00	1	2017-04-26 00:00:00	2017-05-06 00:00:00
317903	990027	30020	29	770	29	0	2017-05-01 00:00:00	2017-05-01 00:00:00	1	2017-04-26 00:00:00	2017-05-06 00:00:00
317903	990027	30030	19	770	19	0	2017-05-01 00:00:00	2017-05-01 00:00:00	1	2017-04-26 00:00:00	2017-05-06 00:00:00
317903	990043	30001	14	1320	14	0	2017-05-01 00:00:00	2017-05-01 00:00:00	1	2017-04-26 00:00:00	2017-05-06 00:00:00
317903	990043	30002	2	1320	2	0	2017-05-01 00:00:00	2017-05-01 00:00:00	1	2017-04-26 00:00:00	2017-05-06 00:00:00
317903	990043	30003	6	1320	6	0	2017-05-01 00:00:00	2017-05-01 00:00:00	1	2017-04-26 00:00:00	2017-05-06 00:00:00
317903	990043	30004	8	1320	8	0	2017-05-01 00:00:00	2017-05-01 00:00:00	1	2017-04-26 00:00:00	2017-05-06 00:00:00
317903	990043	30006	17	1320	17	0	2017-05-01 00:00:00	2017-05-01 00:00:00	1	2017-04-26 00:00:00	2017-05-06 00:00:00
317903	990043	30009	19	1320	19	0	2017-05-01 00:00:00	2017-05-01 00:00:00	1	2017-04-26 00:00:00	2017-05-06 00:00:00
317903	990043	30013	1	1320	1	0	2017-05-01 00:00:00	2017-05-01 00:00:00	1	2017-04-26 00:00:00	2017-05-06 00:00:00
317903	990043	30015	4	1320	4	0	2017-05-01 00:00:00	2017-05-01 00:00:00	1	2017-04-26 00:00:00	2017-05-06 00:00:00
317903	990043	30018	17	1320	17	0	2017-05-01 00:00:00	2017-05-01 00:00:00	1	2017-04-26 00:00:00	2017-05-06 00:00:00
317903	990043	30030	5	1320	5	0	2017-05-01 00:00:00	2017-05-01 00:00:00	1	2017-04-26 00:00:00	2017-05-06 00:00:00
317903	990124	30001	41	1870	41	0	2017-05-01 00:00:00	2017-05-01 00:00:00	1	2017-04-26 00:00:00	2017-05-06 00:00:00
317903	990124	30002	24	1870	24	0	2017-05-01 00:00:00	2017-05-01 00:00:00	1	2017-04-26 00:00:00	2017-05-06 00:00:00
317903	990124	30003	35	1870	35	0	2017-05-01 00:00:00	2017-05-01 00:00:00	1	2017-04-26 00:00:00	2017-05-06 00:00:00
317903	990124	30004	10	1870	10	0	2017-05-01 00:00:00	2017-05-01 00:00:00	1	2017-04-26 00:00:00	2017-05-06 00:00:00
317903	990124	30006	70	1870	70	0	2017-05-01 00:00:00	2017-05-01 00:00:00	1	2017-04-26 00:00:00	2017-05-06 00:00:00
317903	990124	30007	12	1870	12	0	2017-05-01 00:00:00	2017-05-01 00:00:00	1	2017-04-26 00:00:00	2017-05-06 00:00:00
317903	990124	30008	26	1870	26	0	2017-05-01 00:00:00	2017-05-01 00:00:00	1	2017-04-26 00:00:00	2017-05-06 00:00:00
317903	990124	30009	40	1870	40	0	2017-05-01 00:00:00	2017-05-01 00:00:00	1	2017-04-26 00:00:00	2017-05-06 00:00:00
317903	990124	30011	16	1870	16	0	2017-05-01 00:00:00	2017-05-01 00:00:00	1	2017-04-26 00:00:00	2017-05-06 00:00:00
317903	990124	30013	46	1870	46	0	2017-05-01 00:00:00	2017-05-01 00:00:00	1	2017-04-26 00:00:00	2017-05-06 00:00:00
317903	990124	30014	13	1870	13	0	2017-05-01 00:00:00	2017-05-01 00:00:00	1	2017-04-26 00:00:00	2017-05-06 00:00:00
317903	990124	30015	34	1870	34	0	2017-05-01 00:00:00	2017-05-01 00:00:00	1	2017-04-26 00:00:00	2017-05-06 00:00:00
317903	990124	30016	9	1870	9	0	2017-05-01 00:00:00	2017-05-01 00:00:00	1	2017-04-26 00:00:00	2017-05-06 00:00:00
317903	990124	30017	1	1870	1	0	2017-05-01 00:00:00	2017-05-01 00:00:00	1	2017-04-26 00:00:00	2017-05-06 00:00:00
317903	990124	30018	47	1870	47	0	2017-05-01 00:00:00	2017-05-01 00:00:00	1	2017-04-26 00:00:00	2017-05-06 00:00:00
317903	990124	30020	30	1870	30	0	2017-05-01 00:00:00	2017-05-01 00:00:00	1	2017-04-26 00:00:00	2017-05-06 00:00:00
317903	990124	30030	50	1870	50	0	2017-05-01 00:00:00	2017-05-01 00:00:00	1	2017-04-26 00:00:00	2017-05-06 00:00:00
317903	990345	30001	115	990	115	0	2017-05-01 00:00:00	2017-05-01 00:00:00	1	2017-04-26 00:00:00	2017-05-06 00:00:00
317903	990345	30002	64	990	64	0	2017-05-01 00:00:00	2017-05-01 00:00:00	1	2017-04-26 00:00:00	2017-05-06 00:00:00
317903	990345	30003	71	990	71	0	2017-05-01 00:00:00	2017-05-01 00:00:00	1	2017-04-26 00:00:00	2017-05-06 00:00:00
317903	990345	30004	83	990	83	0	2017-05-01 00:00:00	2017-05-01 00:00:00	1	2017-04-26 00:00:00	2017-05-06 00:00:00
317903	990345	30006	269	990	269	0	2017-05-01 00:00:00	2017-05-01 00:00:00	1	2017-04-26 00:00:00	2017-05-06 00:00:00
317903	990345	30007	84	990	84	0	2017-05-01 00:00:00	2017-05-01 00:00:00	1	2017-04-26 00:00:00	2017-05-06 00:00:00
317903	990345	30008	97	990	97	0	2017-05-01 00:00:00	2017-05-01 00:00:00	1	2017-04-26 00:00:00	2017-05-06 00:00:00
317903	990345	30011	74	990	74	0	2017-05-01 00:00:00	2017-05-01 00:00:00	1	2017-04-26 00:00:00	2017-05-06 00:00:00
317903	990345	30013	184	990	184	0	2017-05-01 00:00:00	2017-05-01 00:00:00	1	2017-04-26 00:00:00	2017-05-06 00:00:00
317903	990345	30014	130	990	130	0	2017-05-01 00:00:00	2017-05-01 00:00:00	1	2017-04-26 00:00:00	2017-05-06 00:00:00
317903	990345	30015	53	990	53	0	2017-05-01 00:00:00	2017-05-01 00:00:00	1	2017-04-26 00:00:00	2017-05-06 00:00:00
317903	990345	30016	106	990	106	0	2017-05-01 00:00:00	2017-05-01 00:00:00	1	2017-04-26 00:00:00	2017-05-06 00:00:00
317903	990345	30018	76	990	76	0	2017-05-01 00:00:00	2017-05-01 00:00:00	1	2017-04-26 00:00:00	2017-05-06 00:00:00
317903	990345	30020	211	990	211	0	2017-05-01 00:00:00	2017-05-01 00:00:00	1	2017-04-26 00:00:00	2017-05-06 00:00:00
317903	990345	30030	89	990	89	0	2017-05-01 00:00:00	2017-05-01 00:00:00	1	2017-04-26 00:00:00	2017-05-06 00:00:00
317903	990485	30001	4	4730	4	0	2017-05-01 00:00:00	2017-05-01 00:00:00	1	2017-04-26 00:00:00	2017-05-06 00:00:00
317903	990485	30004	5	4730	5	0	2017-05-01 00:00:00	2017-05-01 00:00:00	1	2017-04-26 00:00:00	2017-05-06 00:00:00
317903	990485	30006	6	4730	6	0	2017-05-01 00:00:00	2017-05-01 00:00:00	1	2017-04-26 00:00:00	2017-05-06 00:00:00
317903	990485	30007	3	4730	3	0	2017-05-01 00:00:00	2017-05-01 00:00:00	1	2017-04-26 00:00:00	2017-05-06 00:00:00
317903	990485	30008	1	4730	1	0	2017-05-01 00:00:00	2017-05-01 00:00:00	1	2017-04-26 00:00:00	2017-05-06 00:00:00
317903	990485	30009	11	4730	11	0	2017-05-01 00:00:00	2017-05-01 00:00:00	1	2017-04-26 00:00:00	2017-05-06 00:00:00
317903	990485	30010	1	4730	1	0	2017-05-01 00:00:00	2017-05-01 00:00:00	1	2017-04-26 00:00:00	2017-05-06 00:00:00
317903	990485	30013	1	4730	1	0	2017-05-01 00:00:00	2017-05-01 00:00:00	1	2017-04-26 00:00:00	2017-05-06 00:00:00
317903	990485	30015	5	4730	5	0	2017-05-01 00:00:00	2017-05-01 00:00:00	1	2017-04-26 00:00:00	2017-05-06 00:00:00