MaestroMuebles.dbo.CenEntComprasGeneral =>

LocalRecibe, FolioEntrada, Fecha, FechaActualizacion, CantidadTotal, Poliza, Cotejado, Pedimento, NvoFolioEntrada, LocalDestino, NumProveedor, TipoMovimiento, Referencia, FolioPadre

30001	315299	2014-10-15 00:00:00	2014-10-15 21:20:00	-120	0	T	 	0	30001	12599	C	315298	0
30007	315299	2013-04-04 00:00:00	2013-04-04 19:34:00	187	1077477	T	 	0	30007	64271	0	0	0