Base path: '/Applications/2019.4.28f1/Unity.app/Contents', plugins path '/Applications/2019.4.28f1/Unity.app/Contents/PlaybackEngines'
Cmd: initializeCompiler
Cmd: shutdown

Quitting shader compiler process
