[
  {
    "model": "geonode_themes.geonodethemecustomization",
    "pk": 1,
    "fields": {
      "name": "Unbranded",
      "date": "2021-06-03T15:05:05.667Z",
      "description": "Base Geonode Theme",
      "is_enabled": true,
      "logo": "",
      "jumbotron_bg": "",
      "jumbotron_welcome_hide": false,
      "welcome_theme": "SLIDE_SHOW",
      "jumbotron_welcome_title": "Benvenuto",
      "jumbotron_welcome_content": "",
      "jumbotron_cta_hide": false,
      "jumbotron_cta_text": null,
      "jumbotron_cta_link": null,
      "body_color": "#ffffff",
      "body_text_color": "#3a3a3a",
      "navbar_color": "#312258",
      "navbar_text_color": "#ffffff",
      "navbar_text_hover": "#312258",
      "navbar_text_hover_focus": "#312258",
      "navbar_dropdown_menu": "#312258",
      "navbar_dropdown_menu_text": "#ffffff",
      "navbar_dropdown_menu_hover": "#312258",
      "navbar_dropdown_menu_divider": "#ffffff",
      "jumbotron_color": "#4b62a0",
      "jumbotron_title_color": "#ffffff",
      "jumbotron_text_color": "#ffffff",
      "search_bg_color": "#333333",
      "search_title_color": "#ffffff",
      "search_link_color": "#ffffff",
      "contactus": false,
      "contact_name": null,
      "contact_position": null,
      "contact_administrative_area": null,
      "contact_street": null,
      "contact_postal_code": null,
      "contact_city": null,
      "contact_country": null,
      "contact_delivery_point": null,
      "contact_voice": null,
      "contact_facsimile": null,
      "contact_email": null,
      "partners_title": "Our Partners",
      "copyright": "&copy;",
      "copyright_color": "#4b62a0",
      "footer_bg_color": "#4472c4",
      "footer_text_color": "#ffffff",
      "footer_href_color": "#ffffff",
      "cookie_law_info_bar_enabled": true,
      "cookie_law_info_bar_head": "This website uses cookies",
      "cookie_law_info_bar_text": "This website uses cookies to improve your experience,         check <strong><a style=\"color:#fff\" href=\"/privacy_cookies/\">this page</a></strong> for details.         We'll assume you're ok with this, but you can opt-out if you wish.",
      "cookie_law_info_leave_url": "#",
      "cookie_law_info_showagain_head": "Privacy & Cookies Policy",
      "cookie_law_info_data_controller": "",
      "cookie_law_info_data_controller_address": "",
      "cookie_law_info_data_controller_phone": "",
      "cookie_law_info_data_controller_email": "",
      "cookie_law_info_animate_speed_hide": "500",
      "cookie_law_info_animate_speed_show": "500",
      "cookie_law_info_background": "#312258",
      "cookie_law_info_border": "#000000",
      "cookie_law_info_border_on": "false",
      "cookie_law_info_button_1_button_colour": "#4b62a0",
      "cookie_law_info_button_1_button_hover": "#4b62a0",
      "cookie_law_info_button_1_link_colour": "#ffffff",
      "cookie_law_info_button_1_as_button": "true",
      "cookie_law_info_button_1_new_win": "true",
      "cookie_law_info_button_2_button_colour": "#4b62a0",
      "cookie_law_info_button_2_button_hover": "#4b62a0",
      "cookie_law_info_button_2_link_colour": "#ffffff",
      "cookie_law_info_button_2_as_button": "true",
      "cookie_law_info_button_2_hidebar": "true",
      "cookie_law_info_button_3_button_colour": "#4b62a0",
      "cookie_law_info_button_3_button_hover": "#4b62a0",
      "cookie_law_info_button_3_link_colour": "#ffffff",
      "cookie_law_info_button_3_as_button": "true",
      "cookie_law_info_button_3_new_win": "false",
      "cookie_law_info_button_4_button_colour": "#4b62a0",
      "cookie_law_info_button_4_button_hover": "#4b62a0",
      "cookie_law_info_button_4_link_colour": "#ffffff",
      "cookie_law_info_button_4_as_button": "true",
      "cookie_law_info_font_family": "inherit",
      "cookie_law_info_header_fix": "false",
      "cookie_law_info_notify_animate_hide": "true",
      "cookie_law_info_notify_animate_show": "false",
      "cookie_law_info_notify_div_id": "#cookie-law-info-bar",
      "cookie_law_info_notify_position_horizontal": "right",
      "cookie_law_info_notify_position_vertical": "bottom",
      "cookie_law_info_scroll_close": "false",
      "cookie_law_info_scroll_close_reload": "false",
      "cookie_law_info_accept_close_reload": "false",
      "cookie_law_info_reject_close_reload": "false",
      "cookie_law_info_showagain_tab": "true",
      "cookie_law_info_showagain_background": "#000000",
      "cookie_law_info_showagain_border": "#000000",
      "cookie_law_info_showagain_div_id": "#cookie-law-info-again",
      "cookie_law_info_showagain_x_position": "30px",
      "cookie_law_info_text": "#ffffff",
      "cookie_law_info_show_once_yn": "false",
      "cookie_law_info_show_once": "10000",
      "cookie_law_info_logging_on": "false",
      "cookie_law_info_as_popup": "false",
      "cookie_law_info_popup_overlay": "true",
      "cookie_law_info_bar_heading_text": "This website uses cookies",
      "cookie_law_info_cookie_bar_as": "banner",
      "cookie_law_info_popup_showagain_position": "bottom-right",
      "cookie_law_info_widget_position": "left",
      "jumbotron_slide_show": [],
      "partners": []
    }
  }
]
