,token,box,label
0,Pre,"[100, 125, 178, 144]",B-name
1,##eti,"[100, 125, 178, 144]",I-name
2,Sa,"[179, 125, 297, 144]",I-name
3,##rva,"[179, 125, 297, 144]",I-name
4,##riya,"[179, 125, 297, 144]",I-name
5,-,"[298, 125, 299, 144]",MISC
6,NL,"[298, 125, 299, 144]",MISC
7,-,"[298, 125, 299, 144]",MISC
8,E,"[636, 125, 705, 142]",MISC
9,-,"[636, 125, 705, 142]",MISC
10,mail,"[636, 125, 705, 142]",MISC
11,:,"[636, 125, 705, 142]",MISC
12,pre,"[705, 125, 959, 142]",B-emails_email
13,##eti,"[705, 125, 959, 142]",I-emails_email
14,.,"[705, 125, 959, 142]",I-emails_email
15,sa,"[705, 125, 959, 142]",I-emails_email
16,##rva,"[705, 125, 959, 142]",I-emails_email
17,##riya,"[705, 125, 959, 142]",I-emails_email
18,@,"[705, 125, 959, 142]",I-emails_email
19,g,"[705, 125, 959, 142]",I-emails_email
20,##mail,"[705, 125, 959, 142]",I-emails_email
21,.,"[705, 125, 959, 142]",I-emails_email
22,com,"[705, 125, 959, 142]",I-emails_email
23,-,"[961, 125, 962, 142]",MISC
24,NL,"[961, 125, 962, 142]",MISC
25,-,"[961, 125, 962, 142]",MISC
26,Mobile,"[633, 144, 707, 162]",MISC
27,:,"[633, 144, 707, 162]",MISC
28,+,"[707, 144, 750, 162]",MISC
29,91,"[707, 144, 750, 162]",MISC
30,-,"[707, 144, 750, 162]",MISC
31,91,"[750, 144, 856, 162]",B-phones_phone
32,##46,"[750, 144, 856, 162]",I-phones_phone
33,##44,"[750, 144, 856, 162]",I-phones_phone
34,##34,"[750, 144, 856, 162]",I-phones_phone
35,##0,"[750, 144, 856, 162]",I-phones_phone
36,##6,"[750, 144, 856, 162]",I-phones_phone
37,-,"[857, 144, 858, 162]",MISC
38,NL,"[857, 144, 858, 162]",MISC
39,-,"[857, 144, 858, 162]",MISC
40,Professional,"[95, 181, 243, 202]",B-summary_heading
41,Su,"[243, 181, 342, 202]",I-summary_heading
42,##mma,"[243, 181, 342, 202]",I-summary_heading
43,##ry,"[243, 181, 342, 202]",I-summary_heading
44,:,"[243, 181, 342, 202]",I-summary_heading
45,-,"[342, 181, 343, 202]",MISC
46,NL,"[342, 181, 343, 202]",MISC
47,-,"[342, 181, 343, 202]",MISC
48,O,"[137, 226, 179, 240]",MISC
49,##C,"[137, 226, 179, 240]",MISC
50,##JP,"[137, 226, 179, 240]",MISC
51,certified,"[180, 226, 275, 240]",MISC
52,Java,"[276, 226, 318, 240]",MISC
53,1,"[318, 226, 350, 240]",MISC
54,.,"[318, 226, 350, 240]",MISC
55,7,"[318, 226, 350, 240]",MISC
56,professional,"[350, 226, 477, 240]",MISC
57,having,"[478, 226, 541, 240]",MISC
58,8,"[542, 226, 563, 240]",MISC
59,+,"[542, 226, 563, 240]",MISC
60,years,"[563, 226, 616, 240]",MISC
61,of,"[616, 226, 637, 240]",MISC
62,programming,"[638, 226, 754, 240]",MISC
63,experience,"[755, 226, 860, 240]",MISC
64,followed,"[861, 226, 946, 240]",MISC
65,A,"[946, 226, 999, 240]",MISC
66,##gi,"[946, 226, 999, 240]",MISC
67,##le,"[946, 226, 999, 240]",MISC
68,-,"[1000, 226, 1001, 240]",MISC
69,NL,"[1000, 226, 1001, 240]",MISC
70,-,"[1000, 226, 1001, 240]",MISC
71,methodology,"[158, 251, 283, 268]",MISC
72,with,"[285, 251, 331, 268]",MISC
73,good,"[331, 251, 377, 268]",MISC
74,exposure,"[377, 251, 469, 268]",MISC
75,in,"[469, 251, 492, 268]",MISC
76,Java,"[492, 251, 538, 268]",MISC
77,J,"[539, 251, 595, 268]",MISC
78,##2,"[539, 251, 595, 268]",MISC
79,##ee,"[539, 251, 595, 268]",MISC
80,",","[539, 251, 595, 268]",MISC
81,J,"[596, 251, 642, 268]",MISC
82,##SP,"[596, 251, 642, 268]",MISC
83,",","[596, 251, 642, 268]",MISC
84,Ser,"[642, 251, 734, 268]",MISC
85,##v,"[642, 251, 734, 268]",MISC
86,##let,"[642, 251, 734, 268]",MISC
87,",","[642, 251, 734, 268]",MISC
88,Spring,"[734, 251, 803, 268]",MISC
89,MV,"[804, 251, 849, 268]",MISC
90,##C,"[804, 251, 849, 268]",MISC
91,",","[804, 251, 849, 268]",MISC
92,Hi,"[850, 251, 964, 268]",MISC
93,##ber,"[850, 251, 964, 268]",MISC
94,##nate,"[850, 251, 964, 268]",MISC
95,",","[850, 251, 964, 268]",MISC
96,SV,"[965, 251, 998, 268]",MISC
97,##N,"[965, 251, 998, 268]",MISC
98,-,"[1000, 251, 1001, 268]",MISC
99,NL,"[1000, 251, 1001, 268]",MISC
100,-,"[1000, 251, 1001, 268]",MISC
101,and,"[158, 280, 186, 297]",MISC
102,Java,"[188, 280, 297, 297]",MISC
103,##s,"[188, 280, 297, 297]",MISC
104,##cript,"[188, 280, 297, 297]",MISC
105,.,"[188, 280, 297, 297]",MISC
106,-,"[298, 280, 299, 297]",MISC
107,NL,"[298, 280, 299, 297]",MISC
108,-,"[298, 280, 299, 297]",MISC
109,Work,"[95, 330, 146, 350]",B-work_experience_heading
110,Experience,"[146, 330, 288, 350]",I-work_experience_heading
111,:,"[146, 330, 288, 350]",I-work_experience_heading
112,-,"[289, 330, 291, 350]",MISC
113,NL,"[289, 330, 291, 350]",MISC
114,-,"[289, 330, 291, 350]",MISC
115,Working,"[169, 375, 243, 390]",MISC
116,as,"[244, 375, 265, 390]",MISC
117,Senior,"[266, 375, 329, 390]",MISC
118,Associate,"[330, 375, 426, 390]",MISC
119,with,"[427, 375, 470, 390]",MISC
120,Co,"[470, 375, 566, 390]",MISC
121,##gni,"[470, 375, 566, 390]",MISC
122,##zan,"[470, 375, 566, 390]",MISC
123,##t,"[470, 375, 566, 390]",MISC
124,technology,"[567, 375, 675, 390]",MISC
125,solutions,"[675, 375, 770, 390]",MISC
126,from,"[772, 375, 814, 390]",MISC
127,October,"[815, 375, 889, 390]",MISC
128,2015,"[890, 375, 932, 390]",MISC
129,to,"[933, 375, 954, 390]",MISC
130,till,"[955, 375, 997, 390]",MISC
131,-,"[998, 375, 1000, 390]",MISC
132,NL,"[998, 375, 1000, 390]",MISC
133,-,"[998, 375, 1000, 390]",MISC
134,date,"[190, 391, 231, 408]",MISC
135,.,"[190, 391, 231, 408]",MISC
136,-,"[231, 391, 232, 408]",MISC
137,NL,"[231, 391, 232, 408]",MISC
138,-,"[231, 391, 232, 408]",MISC
139,Work,"[171, 420, 245, 435]",MISC
140,##ed,"[171, 420, 245, 435]",MISC
141,as,"[245, 420, 269, 435]",MISC
142,a,"[269, 420, 282, 435]",MISC
143,Software,"[282, 420, 380, 435]",B-employer_role
144,Engineer,"[380, 420, 479, 435]",I-employer_role
145,with,"[479, 420, 529, 435]",MISC
146,A,"[529, 420, 640, 435]",MISC
147,##cc,"[529, 420, 640, 435]",MISC
148,##ent,"[529, 420, 640, 435]",MISC
149,##ure,"[529, 420, 640, 435]",MISC
150,Service,"[640, 420, 726, 435]",MISC
151,P,"[726, 420, 763, 435]",MISC
152,##v,"[726, 420, 763, 435]",MISC
153,##t,"[726, 420, 763, 435]",MISC
154,Ltd,"[763, 420, 800, 435]",MISC
155,from,"[800, 420, 850, 435]",MISC
156,August,"[850, 420, 924, 435]",MISC
157,2013,"[924, 420, 973, 435]",MISC
158,to,"[973, 420, 998, 435]",MISC
159,-,"[998, 420, 1000, 435]",MISC
160,NL,"[998, 420, 1000, 435]",MISC
161,-,"[998, 420, 1000, 435]",MISC
162,September,"[190, 435, 282, 452]",MISC
163,2015,"[282, 435, 331, 452]",MISC
164,.,"[282, 435, 331, 452]",MISC
165,-,"[333, 435, 335, 452]",MISC
166,NL,"[333, 435, 335, 452]",MISC
167,-,"[333, 435, 335, 452]",MISC
168,Work,"[170, 464, 237, 478]",MISC
169,##ed,"[170, 464, 237, 478]",MISC
170,as,"[237, 464, 259, 478]",MISC
171,a,"[260, 464, 271, 478]",MISC
172,Consul,"[271, 464, 384, 478]",B-employer_role
173,##tant,"[271, 464, 384, 478]",I-employer_role
174,with,"[384, 464, 429, 478]",MISC
175,Cap,"[430, 464, 530, 478]",MISC
176,##ge,"[430, 464, 530, 478]",MISC
177,##mini,"[430, 464, 530, 478]",MISC
178,India,"[532, 464, 588, 478]",MISC
179,P,"[588, 464, 622, 478]",MISC
180,##v,"[588, 464, 622, 478]",MISC
181,##t,"[588, 464, 622, 478]",MISC
182,Ltd,"[622, 464, 656, 478]",MISC
183,from,"[656, 464, 700, 478]",MISC
184,March,"[701, 464, 758, 478]",MISC
185,2010,"[758, 464, 802, 478]",MISC
186,to,"[803, 464, 824, 478]",MISC
187,August,"[826, 464, 893, 478]",MISC
188,2013,"[894, 464, 950, 478]",MISC
189,.,"[894, 464, 950, 478]",MISC
190,-,"[950, 464, 952, 478]",MISC
191,NL,"[950, 464, 952, 478]",MISC
192,-,"[950, 464, 952, 478]",MISC
193,Technical,"[95, 509, 192, 530]",B-skills_heading
194,Skills,"[193, 509, 269, 530]",I-skills_heading
195,:,"[193, 509, 269, 530]",I-skills_heading
196,-,"[269, 509, 271, 530]",MISC
197,NL,"[269, 509, 271, 530]",MISC
198,-,"[269, 509, 271, 530]",MISC
199,Framework,"[158, 551, 315, 568]",MISC
200,##s,"[158, 551, 315, 568]",MISC
201,:,"[316, 551, 330, 568]",MISC
202,Spring,"[332, 551, 425, 568]",MISC
203,MV,"[426, 551, 488, 568]",MISC
204,##C,"[426, 551, 488, 568]",MISC
205,",","[426, 551, 488, 568]",MISC
206,Hi,"[489, 551, 630, 568]",MISC
207,##ber,"[489, 551, 630, 568]",MISC
208,##nate,"[489, 551, 630, 568]",MISC
209,-,"[631, 551, 633, 568]",MISC
210,NL,"[631, 551, 633, 568]",MISC
211,-,"[631, 551, 633, 568]",MISC
212,Programming,"[158, 579, 292, 596]",MISC
213,Languages,"[293, 579, 402, 596]",MISC
214,:,"[403, 579, 413, 596]",MISC
215,Java,"[415, 579, 463, 596]",MISC
216,J,"[464, 579, 511, 596]",MISC
217,##2,"[464, 579, 511, 596]",MISC
218,##ee,"[464, 579, 511, 596]",MISC
219,-,"[513, 579, 514, 596]",MISC
220,NL,"[513, 579, 514, 596]",MISC
221,-,"[513, 579, 514, 596]",MISC
222,Web,"[158, 605, 206, 624]",MISC
223,Technologies,"[206, 605, 396, 624]",MISC
224,:,"[396, 605, 412, 624]",MISC
225,J,"[412, 605, 460, 624]",MISC
226,##SP,"[412, 605, 460, 624]",MISC
227,-,"[460, 605, 462, 624]",MISC
228,NL,"[460, 605, 462, 624]",MISC
229,-,"[460, 605, 462, 624]",MISC
230,Sc,"[158, 633, 338, 650]",MISC
231,##rip,"[158, 633, 338, 650]",MISC
232,##ting,"[158, 633, 338, 650]",MISC
233,:,"[339, 633, 358, 650]",MISC
234,J,"[359, 633, 479, 650]",MISC
235,##quer,"[359, 633, 479, 650]",MISC
236,##y,"[359, 633, 479, 650]",MISC
237,-,"[479, 633, 481, 650]",MISC
238,NL,"[479, 633, 481, 650]",MISC
239,-,"[479, 633, 481, 650]",MISC
240,Server,"[158, 661, 261, 678]",MISC
241,:,"[261, 661, 277, 678]",MISC
242,Tom,"[278, 661, 380, 678]",MISC
243,##cat,"[278, 661, 380, 678]",MISC
244,7,"[380, 661, 447, 678]",MISC
245,.,"[380, 661, 447, 678]",MISC
246,0,"[380, 661, 447, 678]",MISC
247,",","[380, 661, 447, 678]",MISC
248,Web,"[449, 661, 585, 678]",MISC
249,##log,"[449, 661, 585, 678]",MISC
250,##ic,"[449, 661, 585, 678]",MISC
251,10,"[585, 661, 652, 678]",MISC
252,.,"[585, 661, 652, 678]",MISC
253,3,"[585, 661, 652, 678]",MISC
254,-,"[654, 661, 656, 678]",MISC
255,NL,"[654, 661, 656, 678]",MISC
256,-,"[654, 661, 656, 678]",MISC
257,Rep,"[158, 689, 328, 706]",MISC
258,##os,"[158, 689, 328, 706]",MISC
259,##itor,"[158, 689, 328, 706]",MISC
260,##y,"[158, 689, 328, 706]",MISC
261,:,"[329, 689, 345, 706]",MISC
262,Clear,"[346, 689, 430, 706]",MISC
263,Case,"[431, 689, 516, 706]",MISC
264,",","[431, 689, 516, 706]",MISC
265,SV,"[516, 689, 567, 706]",MISC
266,##N,"[516, 689, 567, 706]",MISC
267,-,"[567, 689, 569, 706]",MISC
268,NL,"[567, 689, 569, 706]",MISC
269,-,"[567, 689, 569, 706]",MISC
270,Too,"[158, 715, 273, 734]",MISC
271,##ls,"[158, 715, 273, 734]",MISC
272,:,"[273, 715, 296, 734]",MISC
273,Eclipse,"[296, 715, 456, 734]",MISC
274,ID,"[456, 715, 525, 734]",MISC
275,##E,"[456, 715, 525, 734]",MISC
276,-,"[525, 715, 527, 734]",MISC
277,NL,"[525, 715, 527, 734]",MISC
278,-,"[525, 715, 527, 734]",MISC
279,Ce,"[95, 761, 236, 781]",MISC
280,##rt,"[95, 761, 236, 781]",MISC
281,##ification,"[95, 761, 236, 781]",MISC
282,:,"[95, 761, 236, 781]",MISC
283,-,"[236, 761, 238, 781]",MISC
284,NL,"[236, 761, 238, 781]",MISC
285,-,"[236, 761, 238, 781]",MISC
286,Oracle,"[137, 785, 199, 800]",MISC
287,certified,"[199, 785, 291, 800]",MISC
288,j,"[292, 785, 333, 800]",MISC
289,##ava,"[292, 785, 333, 800]",MISC
290,programmer,"[334, 785, 436, 800]",MISC
291,1,"[437, 785, 467, 800]",MISC
292,.,"[437, 785, 467, 800]",MISC
293,6,"[437, 785, 467, 800]",MISC
294,on,"[468, 785, 488, 800]",MISC
295,Java,"[489, 785, 530, 800]",MISC
296,platform,"[531, 785, 622, 800]",MISC
297,.,"[531, 785, 622, 800]",MISC
298,-,"[624, 785, 626, 800]",MISC
299,NL,"[624, 785, 626, 800]",MISC
300,-,"[624, 785, 626, 800]",MISC
301,PR,"[412, 837, 608, 858]",B-work_experience_heading
302,##O,"[412, 837, 608, 858]",I-work_experience_heading
303,##F,"[412, 837, 608, 858]",I-work_experience_heading
304,##ES,"[412, 837, 608, 858]",I-work_experience_heading
305,##SI,"[412, 837, 608, 858]",I-work_experience_heading
306,##ON,"[412, 837, 608, 858]",I-work_experience_heading
307,##AL,"[412, 837, 608, 858]",I-work_experience_heading
308,E,"[608, 837, 771, 858]",I-work_experience_heading
309,##X,"[608, 837, 771, 858]",I-work_experience_heading
310,##P,"[608, 837, 771, 858]",I-work_experience_heading
311,##ER,"[608, 837, 771, 858]",I-work_experience_heading
312,##IE,"[608, 837, 771, 858]",I-work_experience_heading
313,##NC,"[608, 837, 771, 858]",I-work_experience_heading
314,##E,"[608, 837, 771, 858]",I-work_experience_heading
315,-,"[772, 837, 774, 858]",MISC
316,NL,"[772, 837, 774, 858]",MISC
317,-,"[772, 837, 774, 858]",MISC
318,Project,"[95, 880, 174, 900]",MISC
319,#,"[175, 880, 208, 900]",MISC
320,1,"[175, 880, 208, 900]",MISC
321,:,"[175, 880, 208, 900]",MISC
322,-,"[209, 880, 211, 900]",MISC
323,NL,"[209, 880, 211, 900]",MISC
324,-,"[209, 880, 211, 900]",MISC
325,C,"[121, 923, 243, 940]",MISC
326,##lient,"[121, 923, 243, 940]",MISC
327,:,"[244, 923, 263, 940]",MISC
328,Sales,"[264, 923, 508, 940]",B-project_company_name
329,##com,"[264, 923, 508, 940]",I-project_company_name
330,##p,"[264, 923, 508, 940]",I-project_company_name
331,-,"[264, 923, 508, 940]",I-project_company_name
332,US,"[264, 923, 508, 940]",I-project_company_name
333,-,"[509, 923, 511, 940]",MISC
334,NL,"[509, 923, 511, 940]",MISC
335,-,"[509, 923, 511, 940]",MISC
336,Du,"[121, 940, 255, 958]",MISC
337,##ration,"[121, 940, 255, 958]",MISC
338,:,"[257, 940, 273, 958]",MISC
339,Dec,"[274, 940, 323, 958]",MISC
340,2017,"[325, 940, 392, 958]",MISC
341,to,"[393, 940, 426, 958]",MISC
342,till,"[426, 940, 493, 958]",MISC
343,Date,"[494, 940, 561, 958]",MISC
344,-,"[562, 940, 564, 958]",MISC
345,NL,"[562, 940, 564, 958]",MISC
346,-,"[562, 940, 564, 958]",MISC
347,1,"[989, 981, 1000, 1000]",MISC
348,-,"[1000, 981, 1001, 1000]",MISC
349,NL,"[1000, 981, 1001, 1000]",MISC
350,-,"[1000, 981, 1001, 1000]",MISC
351,Too,"[121, 71, 174, 88]",MISC
352,##ls,"[121, 71, 174, 88]",MISC
353,and,"[174, 71, 206, 88]",MISC
354,technology,"[206, 71, 312, 88]",MISC
355,used,"[312, 71, 354, 88]",MISC
356,:,"[355, 71, 365, 88]",MISC
357,Core,"[365, 71, 408, 88]",MISC
358,Java,"[408, 71, 461, 88]",MISC
359,",","[408, 71, 461, 88]",MISC
360,J,"[461, 71, 503, 88]",MISC
361,##sp,"[461, 71, 503, 88]",MISC
362,",","[461, 71, 503, 88]",MISC
363,S,"[503, 71, 545, 88]",MISC
364,##QL,"[503, 71, 545, 88]",MISC
365,",","[503, 71, 545, 88]",MISC
366,Spring,"[546, 71, 620, 88]",MISC
367,",","[546, 71, 620, 88]",MISC
368,Hi,"[620, 71, 715, 88]",MISC
369,##ber,"[620, 71, 715, 88]",MISC
370,##nate,"[620, 71, 715, 88]",MISC
371,and,"[715, 71, 747, 88]",MISC
372,J,"[747, 71, 821, 88]",MISC
373,##Q,"[747, 71, 821, 88]",MISC
374,##uer,"[747, 71, 821, 88]",MISC
375,##y,"[747, 71, 821, 88]",MISC
376,.,"[747, 71, 821, 88]",MISC
377,-,"[821, 71, 823, 88]",MISC
378,NL,"[821, 71, 823, 88]",MISC
379,-,"[821, 71, 823, 88]",MISC
380,Server,"[121, 89, 257, 107]",MISC
381,:,"[258, 89, 279, 107]",MISC
382,Web,"[281, 89, 463, 107]",MISC
383,##log,"[281, 89, 463, 107]",MISC
384,##ic,"[281, 89, 463, 107]",MISC
385,-,"[463, 89, 465, 107]",MISC
386,NL,"[463, 89, 465, 107]",MISC
387,-,"[463, 89, 465, 107]",MISC
388,Operating,"[121, 108, 255, 125]",MISC
389,System,"[256, 108, 344, 125]",MISC
390,:,"[346, 108, 360, 125]",MISC
391,Windows,"[360, 108, 465, 125]",MISC
392,X,"[465, 108, 493, 125]",MISC
393,##P,"[465, 108, 493, 125]",MISC
394,-,"[495, 108, 497, 125]",MISC
395,NL,"[495, 108, 497, 125]",MISC
396,-,"[495, 108, 497, 125]",MISC
397,ID,"[121, 125, 208, 144]",MISC
398,##E,"[121, 125, 208, 144]",MISC
399,:,"[209, 125, 237, 144]",MISC
400,Eclipse,"[239, 125, 443, 144]",MISC
401,-,"[444, 125, 446, 144]",MISC
402,NL,"[444, 125, 446, 144]",MISC
403,-,"[444, 125, 446, 144]",MISC
404,Role,"[121, 144, 208, 162]",MISC
405,:,"[208, 144, 229, 162]",MISC
406,Technical,"[230, 144, 426, 162]",MISC
407,Lead,"[426, 144, 512, 162]",MISC
408,-,"[513, 144, 514, 162]",MISC
409,NL,"[513, 144, 514, 162]",MISC
410,-,"[513, 144, 514, 162]",MISC
411,Project,"[95, 238, 167, 257]",MISC
412,Des,"[168, 238, 291, 257]",MISC
413,##cription,"[168, 238, 291, 257]",MISC
414,:,"[168, 238, 291, 257]",MISC
415,-,"[292, 238, 294, 257]",MISC
416,NL,"[292, 238, 294, 257]",MISC
417,-,"[292, 238, 294, 257]",MISC
418,In,"[95, 257, 114, 276]",MISC
419,Sales,"[115, 257, 218, 276]",MISC
420,##com,"[115, 257, 218, 276]",MISC
421,##p,"[115, 257, 218, 276]",MISC
422,",","[115, 257, 218, 276]",MISC
423,Its,"[219, 257, 249, 276]",MISC
424,Trade,"[250, 257, 302, 276]",MISC
425,base,"[302, 257, 343, 276]",MISC
426,application,"[344, 257, 457, 276]",MISC
427,where,"[458, 257, 509, 276]",MISC
428,we,"[510, 257, 529, 276]",MISC
429,provide,"[531, 257, 603, 276]",MISC
430,Use,"[603, 257, 644, 276]",MISC
431,##r,"[603, 257, 644, 276]",MISC
432,interface,"[645, 257, 737, 276]",MISC
433,to,"[738, 257, 758, 276]",MISC
434,Custom,"[759, 257, 842, 276]",MISC
435,##er,"[759, 257, 842, 276]",MISC
436,for,"[842, 257, 872, 276]",MISC
437,Trade,"[873, 257, 924, 276]",MISC
438,Search,"[925, 257, 997, 276]",MISC
439,.,"[925, 257, 997, 276]",MISC
440,-,"[998, 257, 1000, 276]",MISC
441,NL,"[998, 257, 1000, 276]",MISC
442,-,"[998, 257, 1000, 276]",MISC
443,Trade,"[95, 276, 146, 293]",MISC
444,Up,"[147, 276, 209, 293]",MISC
445,##load,"[147, 276, 209, 293]",MISC
446,and,"[210, 276, 240, 293]",MISC
447,A,"[242, 276, 335, 293]",MISC
448,##pp,"[242, 276, 335, 293]",MISC
449,##rov,"[242, 276, 335, 293]",MISC
450,##al,"[242, 276, 335, 293]",MISC
451,.,"[242, 276, 335, 293]",MISC
452,-,"[336, 276, 338, 293]",MISC
453,NL,"[336, 276, 338, 293]",MISC
454,-,"[336, 276, 338, 293]",MISC
455,Re,"[95, 329, 262, 347]",MISC
456,##sp,"[95, 329, 262, 347]",MISC
457,##ons,"[95, 329, 262, 347]",MISC
458,##ibi,"[95, 329, 262, 347]",MISC
459,##lities,"[95, 329, 262, 347]",MISC
460,:,"[95, 329, 262, 347]",MISC
461,-,"[95, 329, 262, 347]",MISC
462,-,"[262, 329, 264, 347]",MISC
463,NL,"[262, 329, 264, 347]",MISC
464,-,"[262, 329, 264, 347]",MISC
465,Re,"[155, 353, 291, 366]",MISC
466,##sponsible,"[155, 353, 291, 366]",MISC
467,for,"[292, 353, 329, 366]",MISC
468,deliver,"[329, 353, 478, 366]",MISC
469,##ables,"[329, 353, 478, 366]",MISC
470,of,"[479, 353, 504, 366]",MISC
471,project,"[504, 353, 590, 366]",MISC
472,and,"[591, 353, 628, 366]",MISC
473,team,"[629, 353, 678, 366]",MISC
474,update,"[679, 353, 753, 366]",MISC
475,status,"[753, 353, 827, 366]",MISC
476,to,"[828, 353, 853, 366]",MISC
477,-,"[853, 353, 855, 366]",MISC
478,NL,"[853, 353, 855, 366]",MISC
479,-,"[853, 353, 855, 366]",MISC
480,management,"[174, 366, 301, 384]",MISC
481,and,"[302, 366, 339, 384]",MISC
482,respective,"[340, 366, 467, 384]",MISC
483,stake,"[467, 366, 531, 384]",MISC
484,holders,"[531, 366, 619, 384]",MISC
485,on,"[620, 366, 645, 384]",MISC
486,daily,"[646, 366, 709, 384]",MISC
487,basis,"[710, 366, 785, 384]",MISC
488,.,"[710, 366, 785, 384]",MISC
489,-,"[786, 366, 788, 384]",MISC
490,NL,"[786, 366, 788, 384]",MISC
491,-,"[786, 366, 788, 384]",MISC
492,Re,"[154, 390, 287, 403]",MISC
493,##sponsible,"[154, 390, 287, 403]",MISC
494,for,"[287, 390, 322, 403]",MISC
495,Pre,"[323, 390, 431, 403]",MISC
496,##par,"[323, 390, 431, 403]",MISC
497,##ing,"[323, 390, 431, 403]",MISC
498,Technical,"[432, 390, 540, 403]",MISC
499,S,"[541, 390, 613, 403]",MISC
500,##pec,"[541, 390, 613, 403]",MISC
501,##s,"[541, 390, 613, 403]",MISC
502,",","[541, 390, 613, 403]",MISC
503,analyzing,"[613, 390, 721, 403]",MISC
504,Fun,"[722, 390, 842, 403]",MISC
505,##ctional,"[722, 390, 842, 403]",MISC
506,S,"[842, 390, 915, 403]",MISC
507,##pec,"[842, 390, 915, 403]",MISC
508,##s,"[842, 390, 915, 403]",MISC
509,",","[842, 390, 915, 403]",MISC
510,-,"[915, 390, 917, 403]",MISC
511,NL,"[915, 390, 917, 403]",MISC
512,-,"[915, 390, 917, 403]",MISC
513,Development,"[174, 403, 319, 421]",MISC
514,and,"[320, 403, 359, 421]",MISC
515,maintenance,"[360, 403, 505, 421]",MISC
516,of,"[506, 403, 533, 421]",MISC
517,code,"[533, 403, 598, 421]",MISC
518,.,"[533, 403, 598, 421]",MISC
519,-,"[599, 403, 601, 421]",MISC
520,NL,"[599, 403, 601, 421]",MISC
521,-,"[599, 403, 601, 421]",MISC
522,Re,"[155, 427, 289, 440]",MISC
523,##sponsible,"[155, 427, 289, 440]",MISC
524,for,"[289, 427, 324, 440]",MISC
525,the,"[326, 427, 361, 440]",MISC
526,complexity,"[362, 427, 484, 440]",MISC
527,determination,"[484, 427, 643, 440]",MISC
528,and,"[643, 427, 679, 440]",MISC
529,est,"[680, 427, 814, 440]",MISC
530,##imation,"[680, 427, 814, 440]",MISC
531,.,"[680, 427, 814, 440]",MISC
532,-,"[814, 427, 816, 440]",MISC
533,NL,"[814, 427, 816, 440]",MISC
534,-,"[814, 427, 816, 440]",MISC
535,Disc,"[155, 445, 282, 458]",MISC
536,##uss,"[155, 445, 282, 458]",MISC
537,##ing,"[155, 445, 282, 458]",MISC
538,the,"[283, 445, 320, 458]",MISC
539,technical,"[321, 445, 435, 458]",MISC
540,way,"[436, 445, 473, 458]",MISC
541,of,"[474, 445, 498, 458]",MISC
542,development,"[499, 445, 639, 458]",MISC
543,with,"[639, 445, 689, 458]",MISC
544,on,"[690, 445, 766, 458]",MISC
545,##site,"[690, 445, 766, 458]",MISC
546,and,"[767, 445, 804, 458]",MISC
547,offshore,"[805, 445, 906, 458]",MISC
548,leads,"[907, 445, 983, 458]",MISC
549,.,"[907, 445, 983, 458]",MISC
550,-,"[984, 445, 985, 458]",MISC
551,NL,"[984, 445, 985, 458]",MISC
552,-,"[984, 445, 985, 458]",MISC
553,Con,"[155, 464, 370, 477]",MISC
554,##duct,"[155, 464, 370, 477]",MISC
555,##ing,"[155, 464, 370, 477]",MISC
556,/,"[155, 464, 370, 477]",MISC
557,Giving,"[155, 464, 370, 477]",MISC
558,training,"[371, 464, 484, 477]",MISC
559,##s,"[371, 464, 484, 477]",MISC
560,and,"[486, 464, 523, 477]",MISC
561,knowledge,"[524, 464, 637, 477]",MISC
562,sharing,"[638, 464, 726, 477]",MISC
563,sessions,"[727, 464, 828, 477]",MISC
564,to,"[829, 464, 854, 477]",MISC
565,my,"[854, 464, 879, 477]",MISC
566,team,"[880, 464, 929, 477]",MISC
567,-,"[931, 464, 932, 477]",MISC
568,NL,"[931, 464, 932, 477]",MISC
569,-,"[931, 464, 932, 477]",MISC
570,members,"[174, 477, 271, 496]",MISC
571,and,"[271, 477, 312, 496]",MISC
572,other,"[313, 477, 382, 496]",MISC
573,team,"[382, 477, 437, 496]",MISC
574,members,"[438, 477, 535, 496]",MISC
575,as,"[535, 477, 561, 496]",MISC
576,well,"[563, 477, 617, 496]",MISC
577,on,"[618, 477, 645, 496]",MISC
578,request,"[646, 477, 743, 496]",MISC
579,basis,"[743, 477, 812, 496]",MISC
580,-,"[813, 477, 814, 496]",MISC
581,NL,"[813, 477, 814, 496]",MISC
582,-,"[813, 477, 814, 496]",MISC
583,Doing,"[156, 501, 221, 514]",MISC
584,the,"[221, 501, 260, 514]",MISC
585,peer,"[261, 501, 312, 514]",MISC
586,review,"[313, 501, 391, 514]",MISC
587,of,"[392, 501, 417, 514]",MISC
588,code,"[419, 501, 484, 514]",MISC
589,.,"[419, 501, 484, 514]",MISC
590,-,"[485, 501, 486, 514]",MISC
591,NL,"[485, 501, 486, 514]",MISC
592,-,"[485, 501, 486, 514]",MISC
593,Project,"[95, 537, 174, 558]",MISC
594,#,"[175, 537, 208, 558]",MISC
595,2,"[175, 537, 208, 558]",MISC
596,:,"[175, 537, 208, 558]",MISC
597,-,"[209, 537, 211, 558]",MISC
598,NL,"[209, 537, 211, 558]",MISC
599,-,"[209, 537, 211, 558]",MISC
600,C,"[121, 579, 202, 596]",MISC
601,##lient,"[121, 579, 202, 596]",MISC
602,:,"[203, 579, 216, 596]",MISC
603,Florida,"[217, 579, 312, 596]",B-project_company_name
604,Power,"[313, 579, 380, 596]",I-project_company_name
605,Light,"[382, 579, 449, 596]",I-project_company_name
606,company,"[450, 579, 560, 596]",I-project_company_name
607,-,"[450, 579, 560, 596]",I-project_company_name
608,Non,"[560, 579, 601, 596]",I-project_company_name
609,Standard,"[601, 579, 711, 596]",I-project_company_name
610,Met,"[711, 579, 792, 596]",I-project_company_name
611,##ers,"[711, 579, 792, 596]",I-project_company_name
612,operation,"[793, 579, 915, 596]",I-project_company_name
613,-,"[917, 579, 918, 596]",MISC
614,NL,"[917, 579, 918, 596]",MISC
615,-,"[917, 579, 918, 596]",MISC
616,Du,"[121, 597, 262, 615]",MISC
617,##ration,"[121, 597, 262, 615]",MISC
618,:,"[263, 597, 280, 615]",MISC
619,Nov,"[281, 597, 333, 615]",MISC
620,2016,"[334, 597, 404, 615]",MISC
621,to,"[404, 597, 440, 615]",MISC
622,March,"[440, 597, 528, 615]",MISC
623,2016,"[528, 597, 599, 615]",MISC
624,-,"[599, 597, 601, 615]",MISC
625,NL,"[599, 597, 601, 615]",MISC
626,-,"[599, 597, 601, 615]",MISC
627,Too,"[121, 616, 174, 633]",MISC
628,##ls,"[121, 616, 174, 633]",MISC
629,and,"[174, 616, 206, 633]",MISC
630,technology,"[206, 616, 312, 633]",MISC
631,used,"[312, 616, 354, 633]",MISC
632,:,"[355, 616, 365, 633]",MISC
633,Core,"[365, 616, 408, 633]",MISC
634,Java,"[408, 616, 461, 633]",MISC
635,",","[408, 616, 461, 633]",MISC
636,J,"[461, 616, 503, 633]",MISC
637,##sp,"[461, 616, 503, 633]",MISC
638,",","[461, 616, 503, 633]",MISC
639,S,"[503, 616, 545, 633]",MISC
640,##QL,"[503, 616, 545, 633]",MISC
641,",","[503, 616, 545, 633]",MISC
642,Spring,"[546, 616, 620, 633]",MISC
643,",","[546, 616, 620, 633]",MISC
644,Hi,"[620, 616, 715, 633]",MISC
645,##ber,"[620, 616, 715, 633]",MISC
646,##nate,"[620, 616, 715, 633]",MISC
647,and,"[715, 616, 747, 633]",MISC
648,J,"[747, 616, 821, 633]",MISC
649,##Q,"[747, 616, 821, 633]",MISC
650,##uer,"[747, 616, 821, 633]",MISC
651,##y,"[747, 616, 821, 633]",MISC
652,.,"[747, 616, 821, 633]",MISC
653,-,"[821, 616, 823, 633]",MISC
654,NL,"[821, 616, 823, 633]",MISC
655,-,"[821, 616, 823, 633]",MISC
656,Server,"[121, 633, 269, 652]",MISC
657,:,"[271, 633, 296, 652]",MISC
658,Tom,"[296, 633, 444, 652]",MISC
659,##cat,"[296, 633, 444, 652]",MISC
660,-,"[446, 633, 447, 652]",MISC
661,NL,"[446, 633, 447, 652]",MISC
662,-,"[446, 633, 447, 652]",MISC
663,Operating,"[121, 652, 255, 670]",MISC
664,System,"[256, 652, 344, 670]",MISC
665,:,"[346, 652, 360, 670]",MISC
666,Windows,"[360, 652, 465, 670]",MISC
667,X,"[465, 652, 493, 670]",MISC
668,##P,"[465, 652, 493, 670]",MISC
669,-,"[495, 652, 497, 670]",MISC
670,NL,"[495, 652, 497, 670]",MISC
671,-,"[495, 652, 497, 670]",MISC
672,ID,"[121, 670, 208, 687]",MISC
673,##E,"[121, 670, 208, 687]",MISC
674,:,"[209, 670, 237, 687]",MISC
675,Eclipse,"[239, 670, 443, 687]",MISC
676,-,"[444, 670, 446, 687]",MISC
677,NL,"[444, 670, 446, 687]",MISC
678,-,"[444, 670, 446, 687]",MISC
679,Role,"[121, 689, 208, 706]",MISC
680,:,"[208, 689, 229, 706]",MISC
681,Technical,"[230, 689, 426, 706]",MISC
682,Lead,"[426, 689, 512, 706]",MISC
683,-,"[513, 689, 514, 706]",MISC
684,NL,"[513, 689, 514, 706]",MISC
685,-,"[513, 689, 514, 706]",MISC
686,Project,"[95, 783, 167, 801]",MISC
687,Des,"[168, 783, 291, 801]",MISC
688,##cription,"[168, 783, 291, 801]",MISC
689,:,"[168, 783, 291, 801]",MISC
690,-,"[292, 783, 294, 801]",MISC
691,NL,"[292, 783, 294, 801]",MISC
692,-,"[292, 783, 294, 801]",MISC
693,In,"[95, 802, 116, 820]",MISC
694,F,"[116, 802, 159, 820]",MISC
695,##PL,"[116, 802, 159, 820]",MISC
696,",","[116, 802, 159, 820]",MISC
697,most,"[159, 802, 201, 820]",MISC
698,customers,"[202, 802, 297, 820]",MISC
699,are,"[299, 802, 330, 820]",MISC
700,provided,"[331, 802, 415, 820]",MISC
701,with,"[417, 802, 459, 820]",MISC
702,a,"[460, 802, 470, 820]",MISC
703,communicating,"[470, 802, 610, 820]",MISC
704,smart,"[610, 802, 663, 820]",MISC
705,meter,"[663, 802, 716, 820]",MISC
706,as,"[717, 802, 738, 820]",MISC
707,the,"[738, 802, 770, 820]",MISC
708,standard,"[771, 802, 855, 820]",MISC
709,meter,"[856, 802, 909, 820]",MISC
710,service,"[910, 802, 995, 820]",MISC
711,.,"[910, 802, 995, 820]",MISC
712,-,"[996, 802, 998, 820]",MISC
713,NL,"[996, 802, 998, 820]",MISC
714,-,"[996, 802, 998, 820]",MISC
715,Non,"[95, 821, 125, 838]",MISC
716,Standard,"[126, 821, 209, 838]",MISC
717,Met,"[209, 821, 260, 838]",MISC
718,##er,"[209, 821, 260, 838]",MISC
719,Op,"[261, 821, 323, 838]",MISC
720,##tion,"[261, 821, 323, 838]",MISC
721,(,"[323, 821, 385, 838]",MISC
722,N,"[323, 821, 385, 838]",MISC
723,##SM,"[323, 821, 385, 838]",MISC
724,##O,"[323, 821, 385, 838]",MISC
725,),"[323, 821, 385, 838]",MISC
726,is,"[385, 821, 405, 838]",MISC
727,available,"[406, 821, 498, 838]",MISC
728,for,"[500, 821, 530, 838]",MISC
729,certain,"[531, 821, 603, 838]",MISC
730,customers,"[603, 821, 695, 838]",MISC
731,who,"[697, 821, 727, 838]",MISC
732,refused,"[728, 821, 800, 838]",MISC
733,installation,"[801, 821, 924, 838]",MISC
734,of,"[925, 821, 944, 838]",MISC
735,smart,"[946, 821, 997, 838]",MISC
736,-,"[998, 821, 1000, 838]",MISC
737,NL,"[998, 821, 1000, 838]",MISC
738,-,"[998, 821, 1000, 838]",MISC
739,meters,"[95, 838, 165, 857]",MISC
740,.,"[95, 838, 165, 857]",MISC
741,The,"[167, 838, 197, 857]",MISC
742,Public,"[197, 838, 257, 857]",MISC
743,Service,"[259, 838, 329, 857]",MISC
744,Commission,"[331, 838, 433, 857]",MISC
745,(,"[433, 838, 493, 857]",MISC
746,PS,"[433, 838, 493, 857]",MISC
747,##C,"[433, 838, 493, 857]",MISC
748,),"[433, 838, 493, 857]",MISC
749,",","[433, 838, 493, 857]",MISC
750,a,"[495, 838, 504, 857]",MISC
751,regulatory,"[505, 838, 607, 857]",MISC
752,body,"[608, 838, 648, 857]",MISC
753,for,"[649, 838, 679, 857]",MISC
754,utilities,"[680, 838, 771, 857]",MISC
755,in,"[772, 838, 791, 857]",MISC
756,Florida,"[793, 838, 863, 857]",MISC
757,has,"[864, 838, 894, 857]",MISC
758,prescribed,"[895, 838, 997, 857]",MISC
759,-,"[998, 838, 1000, 857]",MISC
760,NL,"[998, 838, 1000, 857]",MISC
761,-,"[998, 838, 1000, 857]",MISC
762,regulatory,"[95, 857, 201, 875]",MISC
763,norms,"[202, 857, 255, 875]",MISC
764,to,"[256, 857, 277, 875]",MISC
765,test,"[277, 857, 320, 875]",MISC
766,in,"[320, 857, 426, 875]",MISC
767,-,"[320, 857, 426, 875]",MISC
768,service,"[320, 857, 426, 875]",MISC
769,meters,"[428, 857, 491, 875]",MISC
770,by,"[492, 857, 514, 875]",MISC
771,sampling,"[514, 857, 609, 875]",MISC
772,.,"[514, 857, 609, 875]",MISC
773,N,"[611, 857, 653, 875]",MISC
774,##SM,"[611, 857, 653, 875]",MISC
775,##O,"[611, 857, 653, 875]",MISC
776,service,"[654, 857, 728, 875]",MISC
777,sampling,"[729, 857, 814, 875]",MISC
778,functionality,"[815, 857, 954, 875]",MISC
779,will,"[955, 857, 997, 875]",MISC
780,-,"[998, 857, 1000, 875]",MISC
781,NL,"[998, 857, 1000, 875]",MISC
782,-,"[998, 857, 1000, 875]",MISC
783,facilitate,"[95, 875, 192, 892]",MISC
784,the,"[193, 875, 221, 892]",MISC
785,process,"[222, 875, 289, 892]",MISC
786,of,"[291, 875, 310, 892]",MISC
787,testing,"[310, 875, 377, 892]",MISC
788,N,"[379, 875, 417, 892]",MISC
789,##SM,"[379, 875, 417, 892]",MISC
790,##O,"[379, 875, 417, 892]",MISC
791,meters,"[418, 875, 485, 892]",MISC
792,.,"[418, 875, 485, 892]",MISC
793,-,"[486, 875, 488, 892]",MISC
794,NL,"[486, 875, 488, 892]",MISC
795,-,"[486, 875, 488, 892]",MISC
796,2,"[989, 981, 1000, 1000]",MISC
797,-,"[1000, 981, 1001, 1000]",MISC
798,NL,"[1000, 981, 1001, 1000]",MISC
799,-,"[1000, 981, 1001, 1000]",MISC
800,Re,"[95, 71, 262, 91]",MISC
801,##sp,"[95, 71, 262, 91]",MISC
802,##ons,"[95, 71, 262, 91]",MISC
803,##ibi,"[95, 71, 262, 91]",MISC
804,##lities,"[95, 71, 262, 91]",MISC
805,:,"[95, 71, 262, 91]",MISC
806,-,"[95, 71, 262, 91]",MISC
807,-,"[262, 71, 264, 91]",MISC
808,NL,"[262, 71, 264, 91]",MISC
809,-,"[262, 71, 264, 91]",MISC
810,Re,"[152, 91, 262, 108]",MISC
811,##sponsible,"[152, 91, 262, 108]",MISC
812,for,"[263, 91, 293, 108]",MISC
813,deliver,"[293, 91, 413, 108]",MISC
814,##ables,"[293, 91, 413, 108]",MISC
815,of,"[413, 91, 432, 108]",MISC
816,project,"[433, 91, 502, 108]",MISC
817,and,"[503, 91, 533, 108]",MISC
818,team,"[533, 91, 572, 108]",MISC
819,update,"[573, 91, 633, 108]",MISC
820,status,"[633, 91, 693, 108]",MISC
821,to,"[694, 91, 713, 108]",MISC
822,management,"[714, 91, 812, 108]",MISC
823,and,"[814, 91, 844, 108]",MISC
824,respective,"[844, 91, 943, 108]",MISC
825,stake,"[944, 91, 993, 108]",MISC
826,-,"[994, 91, 996, 108]",MISC
827,NL,"[994, 91, 996, 108]",MISC
828,-,"[994, 91, 996, 108]",MISC
829,holders,"[174, 109, 239, 126]",MISC
830,on,"[240, 109, 258, 126]",MISC
831,daily,"[259, 109, 305, 126]",MISC
832,basis,"[306, 109, 363, 126]",MISC
833,.,"[306, 109, 363, 126]",MISC
834,-,"[363, 109, 365, 126]",MISC
835,NL,"[363, 109, 365, 126]",MISC
836,-,"[363, 109, 365, 126]",MISC
837,Re,"[152, 132, 262, 145]",MISC
838,##sponsible,"[152, 132, 262, 145]",MISC
839,for,"[263, 132, 293, 145]",MISC
840,Pre,"[293, 132, 383, 145]",MISC
841,##par,"[293, 132, 383, 145]",MISC
842,##ing,"[293, 132, 383, 145]",MISC
843,Technical,"[383, 132, 473, 145]",MISC
844,S,"[474, 132, 534, 145]",MISC
845,##pec,"[474, 132, 534, 145]",MISC
846,##s,"[474, 132, 534, 145]",MISC
847,",","[474, 132, 534, 145]",MISC
848,analyzing,"[534, 132, 624, 145]",MISC
849,Fun,"[624, 132, 723, 145]",MISC
850,##ctional,"[624, 132, 723, 145]",MISC
851,S,"[725, 132, 785, 145]",MISC
852,##pec,"[725, 132, 785, 145]",MISC
853,##s,"[725, 132, 785, 145]",MISC
854,",","[725, 132, 785, 145]",MISC
855,Development,"[785, 132, 894, 145]",MISC
856,and,"[895, 132, 925, 145]",MISC
857,-,"[925, 132, 927, 145]",MISC
858,NL,"[925, 132, 927, 145]",MISC
859,-,"[925, 132, 927, 145]",MISC
860,maintenance,"[174, 145, 283, 164]",MISC
861,of,"[284, 145, 303, 164]",MISC
862,code,"[304, 145, 353, 164]",MISC
863,.,"[304, 145, 353, 164]",MISC
864,-,"[354, 145, 356, 164]",MISC
865,NL,"[354, 145, 356, 164]",MISC
866,-,"[354, 145, 356, 164]",MISC
867,Re,"[152, 169, 260, 182]",MISC
868,##sponsible,"[152, 169, 260, 182]",MISC
869,for,"[260, 169, 288, 182]",MISC
870,the,"[289, 169, 317, 182]",MISC
871,complexity,"[318, 169, 415, 182]",MISC
872,determination,"[416, 169, 543, 182]",MISC
873,and,"[543, 169, 572, 182]",MISC
874,est,"[573, 169, 680, 182]",MISC
875,##imation,"[573, 169, 680, 182]",MISC
876,.,"[573, 169, 680, 182]",MISC
877,-,"[680, 169, 682, 182]",MISC
878,NL,"[680, 169, 682, 182]",MISC
879,-,"[680, 169, 682, 182]",MISC
880,Disc,"[153, 187, 253, 199]",MISC
881,##uss,"[153, 187, 253, 199]",MISC
882,##ing,"[153, 187, 253, 199]",MISC
883,the,"[255, 187, 285, 199]",MISC
884,technical,"[285, 187, 377, 199]",MISC
885,way,"[377, 187, 407, 199]",MISC
886,of,"[408, 187, 427, 199]",MISC
887,development,"[428, 187, 539, 199]",MISC
888,with,"[540, 187, 581, 199]",MISC
889,on,"[581, 187, 641, 199]",MISC
890,##site,"[581, 187, 641, 199]",MISC
891,and,"[643, 187, 673, 199]",MISC
892,offshore,"[673, 187, 754, 199]",MISC
893,leads,"[755, 187, 815, 199]",MISC
894,.,"[755, 187, 815, 199]",MISC
895,-,"[816, 187, 818, 199]",MISC
896,NL,"[816, 187, 818, 199]",MISC
897,-,"[816, 187, 818, 199]",MISC
898,Con,"[153, 206, 329, 218]",MISC
899,##duct,"[153, 206, 329, 218]",MISC
900,##ing,"[153, 206, 329, 218]",MISC
901,/,"[153, 206, 329, 218]",MISC
902,Giving,"[153, 206, 329, 218]",MISC
903,training,"[331, 206, 424, 218]",MISC
904,##s,"[331, 206, 424, 218]",MISC
905,and,"[425, 206, 455, 218]",MISC
906,knowledge,"[457, 206, 550, 218]",MISC
907,sharing,"[551, 206, 623, 218]",MISC
908,sessions,"[624, 206, 707, 218]",MISC
909,to,"[708, 206, 727, 218]",MISC
910,my,"[729, 206, 748, 218]",MISC
911,team,"[750, 206, 790, 218]",MISC
912,members,"[792, 206, 864, 218]",MISC
913,and,"[865, 206, 895, 218]",MISC
914,other,"[896, 206, 948, 218]",MISC
915,team,"[949, 206, 989, 218]",MISC
916,-,"[991, 206, 992, 218]",MISC
917,NL,"[991, 206, 992, 218]",MISC
918,-,"[991, 206, 992, 218]",MISC
919,members,"[174, 219, 246, 236]",MISC
920,as,"[247, 219, 267, 236]",MISC
921,well,"[268, 219, 309, 236]",MISC
922,on,"[310, 219, 329, 236]",MISC
923,request,"[331, 219, 403, 236]",MISC
924,basis,"[404, 219, 455, 236]",MISC
925,-,"[456, 219, 458, 236]",MISC
926,NL,"[456, 219, 458, 236]",MISC
927,-,"[456, 219, 458, 236]",MISC
928,Doing,"[153, 242, 206, 255]",MISC
929,the,"[206, 242, 238, 255]",MISC
930,peer,"[238, 242, 281, 255]",MISC
931,review,"[281, 242, 344, 255]",MISC
932,of,"[345, 242, 366, 255]",MISC
933,code,"[366, 242, 419, 255]",MISC
934,.,"[366, 242, 419, 255]",MISC
935,-,"[419, 242, 421, 255]",MISC
936,NL,"[419, 242, 421, 255]",MISC
937,-,"[419, 242, 421, 255]",MISC
938,Project,"[95, 276, 174, 297]",MISC
939,#,"[175, 276, 208, 297]",MISC
940,3,"[175, 276, 208, 297]",MISC
941,:,"[175, 276, 208, 297]",MISC
942,-,"[209, 276, 211, 297]",MISC
943,NL,"[209, 276, 211, 297]",MISC
944,-,"[209, 276, 211, 297]",MISC
945,C,"[121, 320, 250, 337]",MISC
946,##lient,"[121, 320, 250, 337]",MISC
947,:,"[250, 320, 271, 337]",MISC
948,Them,"[271, 320, 400, 337]",B-project_company_name
949,##as,"[271, 320, 400, 337]",I-project_company_name
950,Water,"[400, 320, 506, 337]",I-project_company_name
951,-,"[507, 320, 509, 337]",MISC
952,NL,"[507, 320, 509, 337]",MISC
953,-,"[507, 320, 509, 337]",MISC
954,Du,"[121, 337, 261, 355]",MISC
955,##ration,"[121, 337, 261, 355]",MISC
956,:,"[261, 337, 277, 355]",MISC
957,March,"[279, 337, 365, 355]",MISC
958,2014,"[366, 337, 435, 355]",MISC
959,to,"[436, 337, 470, 355]",MISC
960,Sep,"[471, 337, 522, 355]",MISC
961,2015,"[524, 337, 593, 355]",MISC
962,-,"[594, 337, 596, 355]",MISC
963,NL,"[594, 337, 596, 355]",MISC
964,-,"[594, 337, 596, 355]",MISC
965,Too,"[121, 355, 174, 373]",MISC
966,##ls,"[121, 355, 174, 373]",MISC
967,and,"[175, 355, 207, 373]",MISC
968,technology,"[208, 355, 315, 373]",MISC
969,used,"[315, 355, 358, 373]",MISC
970,:,"[359, 355, 369, 373]",MISC
971,Core,"[369, 355, 412, 373]",MISC
972,Java,"[413, 355, 465, 373]",MISC
973,",","[413, 355, 465, 373]",MISC
974,J,"[466, 355, 509, 373]",MISC
975,##sp,"[466, 355, 509, 373]",MISC
976,",","[466, 355, 509, 373]",MISC
977,S,"[510, 355, 552, 373]",MISC
978,##QL,"[510, 355, 552, 373]",MISC
979,",","[510, 355, 552, 373]",MISC
980,Had,"[553, 355, 671, 373]",MISC
981,##oop,"[553, 355, 671, 373]",MISC
982,-,"[553, 355, 671, 373]",MISC
983,Pig,"[553, 355, 671, 373]",MISC
984,.,"[553, 355, 671, 373]",MISC
985,-,"[671, 355, 673, 373]",MISC
986,NL,"[671, 355, 673, 373]",MISC
987,-,"[671, 355, 673, 373]",MISC
988,Server,"[121, 374, 269, 391]",MISC
989,:,"[271, 374, 296, 391]",MISC
990,Tom,"[296, 374, 444, 391]",MISC
991,##cat,"[296, 374, 444, 391]",MISC
992,-,"[446, 374, 447, 391]",MISC
993,NL,"[446, 374, 447, 391]",MISC
994,-,"[446, 374, 447, 391]",MISC
995,Operating,"[121, 392, 255, 410]",MISC
996,System,"[256, 392, 344, 410]",MISC
997,:,"[346, 392, 360, 410]",MISC
998,Windows,"[360, 392, 465, 410]",MISC
999,X,"[465, 392, 493, 410]",MISC
1000,##P,"[465, 392, 493, 410]",MISC
1001,-,"[495, 392, 497, 410]",MISC
1002,NL,"[495, 392, 497, 410]",MISC
1003,-,"[495, 392, 497, 410]",MISC
1004,ID,"[121, 411, 208, 428]",MISC
1005,##E,"[121, 411, 208, 428]",MISC
1006,:,"[209, 411, 237, 428]",MISC
1007,Eclipse,"[239, 411, 443, 428]",MISC
1008,-,"[444, 411, 446, 428]",MISC
1009,NL,"[444, 411, 446, 428]",MISC
1010,-,"[444, 411, 446, 428]",MISC
1011,Role,"[121, 428, 208, 447]",MISC
1012,:,"[208, 428, 229, 447]",MISC
1013,Java,"[230, 428, 316, 447]",MISC
1014,Dev,"[317, 428, 513, 447]",MISC
1015,##elo,"[317, 428, 513, 447]",MISC
1016,##per,"[317, 428, 513, 447]",MISC
1017,-,"[513, 428, 514, 447]",MISC
1018,NL,"[513, 428, 514, 447]",MISC
1019,-,"[513, 428, 514, 447]",MISC
1020,Project,"[95, 484, 167, 502]",MISC
1021,Des,"[168, 484, 291, 502]",MISC
1022,##cription,"[168, 484, 291, 502]",MISC
1023,:,"[168, 484, 291, 502]",MISC
1024,-,"[292, 484, 294, 502]",MISC
1025,NL,"[292, 484, 294, 502]",MISC
1026,-,"[292, 484, 294, 502]",MISC
1027,Thames,"[95, 503, 164, 521]",MISC
1028,Water,"[165, 503, 223, 521]",MISC
1029,is,"[224, 503, 247, 521]",MISC
1030,the,"[247, 503, 281, 521]",MISC
1031,UK,"[282, 503, 328, 521]",MISC
1032,’,"[282, 503, 328, 521]",MISC
1033,s,"[282, 503, 328, 521]",MISC
1034,largest,"[329, 503, 410, 521]",MISC
1035,water,"[411, 503, 470, 521]",MISC
1036,company,"[470, 503, 563, 521]",MISC
1037,",","[470, 503, 563, 521]",MISC
1038,with,"[564, 503, 610, 521]",MISC
1039,8,"[611, 503, 621, 521]",MISC
1040,million,"[622, 503, 704, 521]",MISC
1041,water,"[705, 503, 763, 521]",MISC
1042,and,"[763, 503, 797, 521]",MISC
1043,14,"[798, 503, 821, 521]",MISC
1044,million,"[822, 503, 903, 521]",MISC
1045,sewer,"[904, 503, 997, 521]",MISC
1046,##age,"[904, 503, 997, 521]",MISC
1047,-,"[998, 503, 1000, 521]",MISC
1048,NL,"[998, 503, 1000, 521]",MISC
1049,-,"[998, 503, 1000, 521]",MISC
1050,customers,"[95, 521, 197, 539]",MISC
1051,.,"[95, 521, 197, 539]",MISC
1052,It,"[197, 521, 217, 539]",MISC
1053,is,"[218, 521, 237, 539]",MISC
1054,responsible,"[238, 521, 351, 539]",MISC
1055,for,"[351, 521, 381, 539]",MISC
1056,water,"[382, 521, 433, 539]",MISC
1057,supply,"[433, 521, 493, 539]",MISC
1058,in,"[495, 521, 514, 539]",MISC
1059,three,"[515, 521, 567, 539]",MISC
1060,regions,"[567, 521, 637, 539]",MISC
1061,(,"[639, 521, 720, 539]",MISC
1062,London,"[639, 521, 720, 539]",MISC
1063,",","[639, 521, 720, 539]",MISC
1064,Thames,"[721, 521, 781, 539]",MISC
1065,Valley,"[782, 521, 853, 539]",MISC
1066,",","[782, 521, 853, 539]",MISC
1067,Guild,"[854, 521, 946, 539]",MISC
1068,##ford,"[854, 521, 946, 539]",MISC
1069,area,"[946, 521, 998, 539]",MISC
1070,),"[946, 521, 998, 539]",MISC
1071,-,"[998, 521, 1000, 539]",MISC
1072,NL,"[998, 521, 1000, 539]",MISC
1073,-,"[998, 521, 1000, 539]",MISC
1074,and,"[95, 539, 125, 558]",MISC
1075,has,"[125, 539, 155, 558]",MISC
1076,one,"[156, 539, 186, 558]",MISC
1077,of,"[186, 539, 205, 558]",MISC
1078,the,"[206, 539, 236, 558]",MISC
1079,oldest,"[237, 539, 297, 558]",MISC
1080,water,"[298, 539, 347, 558]",MISC
1081,infrastructure,"[348, 539, 500, 558]",MISC
1082,##s,"[348, 539, 500, 558]",MISC
1083,in,"[501, 539, 520, 558]",MISC
1084,the,"[521, 539, 551, 558]",MISC
1085,world,"[551, 539, 601, 558]",MISC
1086,in,"[602, 539, 621, 558]",MISC
1087,London,"[622, 539, 693, 558]",MISC
1088,",","[622, 539, 693, 558]",MISC
1089,with,"[693, 539, 734, 558]",MISC
1090,Victorian,"[734, 539, 824, 558]",MISC
1091,main,"[825, 539, 875, 558]",MISC
1092,##s,"[825, 539, 875, 558]",MISC
1093,dating,"[876, 539, 936, 558]",MISC
1094,back,"[937, 539, 977, 558]",MISC
1095,to,"[977, 539, 997, 558]",MISC
1096,-,"[998, 539, 1000, 558]",MISC
1097,NL,"[998, 539, 1000, 558]",MISC
1098,-,"[998, 539, 1000, 558]",MISC
1099,the,"[95, 558, 126, 575]",MISC
1100,18th,"[127, 558, 169, 575]",MISC
1101,century,"[169, 558, 254, 575]",MISC
1102,.,"[169, 558, 254, 575]",MISC
1103,This,"[254, 558, 296, 575]",MISC
1104,Sol,"[297, 558, 381, 575]",MISC
1105,##ution,"[297, 558, 381, 575]",MISC
1106,is,"[382, 558, 403, 575]",MISC
1107,turning,"[403, 558, 477, 575]",MISC
1108,raw,"[477, 558, 509, 575]",MISC
1109,data,"[509, 558, 551, 575]",MISC
1110,into,"[552, 558, 594, 575]",MISC
1111,information,"[594, 558, 710, 575]",MISC
1112,and,"[711, 558, 743, 575]",MISC
1113,knowledge,"[743, 558, 838, 575]",MISC
1114,that,"[838, 558, 881, 575]",MISC
1115,allows,"[881, 558, 944, 575]",MISC
1116,clear,"[945, 558, 998, 575]",MISC
1117,-,"[998, 558, 1000, 575]",MISC
1118,NL,"[998, 558, 1000, 575]",MISC
1119,-,"[998, 558, 1000, 575]",MISC
1120,understanding,"[95, 576, 236, 593]",MISC
1121,",","[95, 576, 236, 593]",MISC
1122,enabling,"[237, 576, 318, 593]",MISC
1123,better,"[318, 576, 378, 593]",MISC
1124,insight,"[379, 576, 449, 593]",MISC
1125,and,"[450, 576, 480, 593]",MISC
1126,decisions,"[480, 576, 581, 593]",MISC
1127,.,"[480, 576, 581, 593]",MISC
1128,This,"[582, 576, 622, 593]",MISC
1129,is,"[622, 576, 642, 593]",MISC
1130,achieved,"[643, 576, 724, 593]",MISC
1131,by,"[724, 576, 743, 593]",MISC
1132,combining,"[744, 576, 834, 593]",MISC
1133,data,"[835, 576, 876, 593]",MISC
1134,from,"[876, 576, 917, 593]",MISC
1135,multiple,"[917, 576, 998, 593]",MISC
1136,-,"[998, 576, 1000, 593]",MISC
1137,NL,"[998, 576, 1000, 593]",MISC
1138,-,"[998, 576, 1000, 593]",MISC
1139,di,"[95, 595, 185, 612]",MISC
1140,##sp,"[95, 595, 185, 612]",MISC
1141,##arate,"[95, 595, 185, 612]",MISC
1142,sources,"[185, 595, 264, 612]",MISC
1143,",","[185, 595, 264, 612]",MISC
1144,s,"[265, 595, 364, 612]",MISC
1145,##tra,"[265, 595, 364, 612]",MISC
1146,##ddling,"[265, 595, 364, 612]",MISC
1147,O,"[366, 595, 385, 612]",MISC
1148,##T,"[366, 595, 385, 612]",MISC
1149,and,"[386, 595, 416, 612]",MISC
1150,IT,"[416, 595, 435, 612]",MISC
1151,systems,"[436, 595, 515, 612]",MISC
1152,.,"[436, 595, 515, 612]",MISC
1153,Seeing,"[516, 595, 576, 612]",MISC
1154,real,"[576, 595, 666, 612]",MISC
1155,-,"[576, 595, 666, 612]",MISC
1156,time,"[576, 595, 666, 612]",MISC
1157,and,"[667, 595, 697, 612]",MISC
1158,operational,"[697, 595, 806, 612]",MISC
1159,data,"[807, 595, 846, 612]",MISC
1160,presented,"[847, 595, 937, 612]",MISC
1161,on,"[938, 595, 957, 612]",MISC
1162,a,"[958, 595, 966, 612]",MISC
1163,map,"[968, 595, 998, 612]",MISC
1164,-,"[998, 595, 1000, 612]",MISC
1165,NL,"[998, 595, 1000, 612]",MISC
1166,-,"[998, 595, 1000, 612]",MISC
1167,with,"[95, 612, 135, 630]",MISC
1168,connectivity,"[135, 612, 257, 630]",MISC
1169,between,"[257, 612, 328, 630]",MISC
1170,assets,"[328, 612, 399, 630]",MISC
1171,.,"[328, 612, 399, 630]",MISC
1172,Co,"[399, 612, 489, 630]",MISC
1173,##mb,"[399, 612, 489, 630]",MISC
1174,##ining,"[399, 612, 489, 630]",MISC
1175,calculated,"[490, 612, 591, 630]",MISC
1176,K,"[592, 612, 641, 630]",MISC
1177,##PI,"[592, 612, 641, 630]",MISC
1178,’,"[592, 612, 641, 630]",MISC
1179,s,"[592, 612, 641, 630]",MISC
1180,with,"[643, 612, 683, 630]",MISC
1181,site,"[683, 612, 724, 630]",MISC
1182,s,"[724, 612, 824, 630]",MISC
1183,##che,"[724, 612, 824, 630]",MISC
1184,##matic,"[724, 612, 824, 630]",MISC
1185,##s,"[724, 612, 824, 630]",MISC
1186,and,"[825, 612, 855, 630]",MISC
1187,maps,"[856, 612, 905, 630]",MISC
1188,.,"[856, 612, 905, 630]",MISC
1189,Capt,"[906, 612, 996, 630]",MISC
1190,##uring,"[906, 612, 996, 630]",MISC
1191,-,"[998, 612, 1000, 630]",MISC
1192,NL,"[998, 612, 1000, 630]",MISC
1193,-,"[998, 612, 1000, 630]",MISC
1194,and,"[95, 630, 126, 649]",MISC
1195,using,"[127, 630, 180, 649]",MISC
1196,business,"[180, 630, 264, 649]",MISC
1197,intelligence,"[265, 630, 392, 649]",MISC
1198,in,"[392, 630, 413, 649]",MISC
1199,the,"[413, 630, 445, 649]",MISC
1200,form,"[445, 630, 488, 649]",MISC
1201,of,"[488, 630, 509, 649]",MISC
1202,analytical,"[509, 630, 615, 649]",MISC
1203,models,"[615, 630, 689, 649]",MISC
1204,",","[615, 630, 689, 649]",MISC
1205,driving,"[690, 630, 764, 649]",MISC
1206,them,"[764, 630, 806, 649]",MISC
1207,with,"[807, 630, 849, 649]",MISC
1208,real,"[849, 630, 944, 649]",MISC
1209,-,"[849, 630, 944, 649]",MISC
1210,time,"[849, 630, 944, 649]",MISC
1211,data,"[945, 630, 998, 649]",MISC
1212,.,"[945, 630, 998, 649]",MISC
1213,-,"[998, 630, 1000, 649]",MISC
1214,NL,"[998, 630, 1000, 649]",MISC
1215,-,"[998, 630, 1000, 649]",MISC
1216,Carr,"[95, 649, 174, 666]",MISC
1217,##ying,"[95, 649, 174, 666]",MISC
1218,out,"[175, 649, 205, 666]",MISC
1219,what,"[205, 649, 274, 666]",MISC
1220,-,"[205, 649, 274, 666]",MISC
1221,if,"[205, 649, 274, 666]",MISC
1222,analysis,"[275, 649, 355, 666]",MISC
1223,to,"[356, 649, 375, 666]",MISC
1224,op,"[376, 649, 455, 666]",MISC
1225,##ti,"[376, 649, 455, 666]",MISC
1226,##mize,"[376, 649, 455, 666]",MISC
1227,choices,"[456, 649, 525, 666]",MISC
1228,in,"[526, 649, 546, 666]",MISC
1229,water,"[546, 649, 596, 666]",MISC
1230,production,"[596, 649, 695, 666]",MISC
1231,based,"[697, 649, 746, 666]",MISC
1232,on,"[747, 649, 766, 666]",MISC
1233,cost,"[767, 649, 816, 666]",MISC
1234,",","[767, 649, 816, 666]",MISC
1235,within,"[817, 649, 877, 666]",MISC
1236,supply,"[877, 649, 937, 666]",MISC
1237,limits,"[938, 649, 998, 666]",MISC
1238,-,"[998, 649, 1000, 666]",MISC
1239,NL,"[998, 649, 1000, 666]",MISC
1240,-,"[998, 649, 1000, 666]",MISC
1241,while,"[95, 667, 144, 685]",MISC
1242,meeting,"[145, 667, 216, 685]",MISC
1243,demand,"[216, 667, 287, 685]",MISC
1244,.,"[216, 667, 287, 685]",MISC
1245,In,"[288, 667, 307, 685]",MISC
1246,short,"[308, 667, 368, 685]",MISC
1247,",","[308, 667, 368, 685]",MISC
1248,making,"[369, 667, 429, 685]",MISC
1249,a,"[430, 667, 438, 685]",MISC
1250,step,"[440, 667, 480, 685]",MISC
1251,change,"[480, 667, 540, 685]",MISC
1252,in,"[541, 667, 561, 685]",MISC
1253,translating,"[561, 667, 673, 685]",MISC
1254,data,"[673, 667, 714, 685]",MISC
1255,into,"[714, 667, 754, 685]",MISC
1256,action,"[754, 667, 855, 685]",MISC
1257,##able,"[754, 667, 855, 685]",MISC
1258,information,"[856, 667, 967, 685]",MISC
1259,and,"[967, 667, 997, 685]",MISC
1260,-,"[998, 667, 999, 685]",MISC
1261,NL,"[998, 667, 999, 685]",MISC
1262,-,"[998, 667, 999, 685]",MISC
1263,knowledge,"[95, 686, 185, 703]",MISC
1264,in,"[186, 686, 205, 703]",MISC
1265,line,"[206, 686, 245, 703]",MISC
1266,with,"[246, 686, 285, 703]",MISC
1267,the,"[287, 686, 317, 703]",MISC
1268,Information,"[317, 686, 428, 703]",MISC
1269,Mat,"[429, 686, 508, 703]",MISC
1270,##urity,"[429, 686, 508, 703]",MISC
1271,model,"[509, 686, 559, 703]",MISC
1272,included,"[560, 686, 639, 703]",MISC
1273,in,"[641, 686, 660, 703]",MISC
1274,the,"[661, 686, 691, 703]",MISC
1275,app,"[692, 686, 781, 703]",MISC
1276,##end,"[692, 686, 781, 703]",MISC
1277,##ix,"[692, 686, 781, 703]",MISC
1278,.,"[692, 686, 781, 703]",MISC
1279,-,"[783, 686, 784, 703]",MISC
1280,NL,"[783, 686, 784, 703]",MISC
1281,-,"[783, 686, 784, 703]",MISC
1282,Re,"[95, 738, 262, 757]",MISC
1283,##sp,"[95, 738, 262, 757]",MISC
1284,##ons,"[95, 738, 262, 757]",MISC
1285,##ibi,"[95, 738, 262, 757]",MISC
1286,##lities,"[95, 738, 262, 757]",MISC
1287,:,"[95, 738, 262, 757]",MISC
1288,-,"[95, 738, 262, 757]",MISC
1289,-,"[262, 738, 264, 757]",MISC
1290,NL,"[262, 738, 264, 757]",MISC
1291,-,"[262, 738, 264, 757]",MISC
1292,Re,"[153, 763, 266, 776]",MISC
1293,##sponsible,"[153, 763, 266, 776]",MISC
1294,for,"[266, 763, 296, 776]",MISC
1295,deliver,"[296, 763, 418, 776]",MISC
1296,##ables,"[296, 763, 418, 776]",MISC
1297,of,"[420, 763, 439, 776]",MISC
1298,Had,"[440, 763, 500, 776]",MISC
1299,##oop,"[440, 763, 500, 776]",MISC
1300,team,"[502, 763, 542, 776]",MISC
1301,and,"[543, 763, 573, 776]",MISC
1302,update,"[574, 763, 634, 776]",MISC
1303,status,"[635, 763, 695, 776]",MISC
1304,to,"[697, 763, 716, 776]",MISC
1305,management,"[717, 763, 820, 776]",MISC
1306,and,"[820, 763, 850, 776]",MISC
1307,respective,"[851, 763, 953, 776]",MISC
1308,-,"[954, 763, 955, 776]",MISC
1309,NL,"[954, 763, 955, 776]",MISC
1310,-,"[954, 763, 955, 776]",MISC
1311,stake,"[174, 776, 222, 793]",MISC
1312,holders,"[222, 776, 287, 793]",MISC
1313,on,"[288, 776, 306, 793]",MISC
1314,daily,"[307, 776, 355, 793]",MISC
1315,basis,"[355, 776, 411, 793]",MISC
1316,.,"[355, 776, 411, 793]",MISC
1317,-,"[412, 776, 414, 793]",MISC
1318,NL,"[412, 776, 414, 793]",MISC
1319,-,"[412, 776, 414, 793]",MISC
1320,Re,"[152, 800, 262, 812]",MISC
1321,##sponsible,"[152, 800, 262, 812]",MISC
1322,for,"[263, 800, 293, 812]",MISC
1323,Pre,"[293, 800, 383, 812]",MISC
1324,##par,"[293, 800, 383, 812]",MISC
1325,##ing,"[293, 800, 383, 812]",MISC
1326,Technical,"[383, 800, 473, 812]",MISC
1327,S,"[474, 800, 534, 812]",MISC
1328,##pec,"[474, 800, 534, 812]",MISC
1329,##s,"[474, 800, 534, 812]",MISC
1330,",","[474, 800, 534, 812]",MISC
1331,analyzing,"[534, 800, 624, 812]",MISC
1332,Fun,"[624, 800, 723, 812]",MISC
1333,##ctional,"[624, 800, 723, 812]",MISC
1334,S,"[725, 800, 785, 812]",MISC
1335,##pec,"[725, 800, 785, 812]",MISC
1336,##s,"[725, 800, 785, 812]",MISC
1337,",","[725, 800, 785, 812]",MISC
1338,Development,"[785, 800, 894, 812]",MISC
1339,and,"[895, 800, 925, 812]",MISC
1340,-,"[925, 800, 927, 812]",MISC
1341,NL,"[925, 800, 927, 812]",MISC
1342,-,"[925, 800, 927, 812]",MISC
1343,maintenance,"[174, 813, 283, 830]",MISC
1344,of,"[284, 813, 303, 830]",MISC
1345,code,"[304, 813, 353, 830]",MISC
1346,.,"[304, 813, 353, 830]",MISC
1347,-,"[354, 813, 356, 830]",MISC
1348,NL,"[354, 813, 356, 830]",MISC
1349,-,"[354, 813, 356, 830]",MISC
1350,Re,"[152, 835, 260, 849]",MISC
1351,##sponsible,"[152, 835, 260, 849]",MISC
1352,for,"[260, 835, 288, 849]",MISC
1353,the,"[289, 835, 317, 849]",MISC
1354,complexity,"[318, 835, 415, 849]",MISC
1355,determination,"[416, 835, 543, 849]",MISC
1356,and,"[543, 835, 572, 849]",MISC
1357,est,"[573, 835, 680, 849]",MISC
1358,##imation,"[573, 835, 680, 849]",MISC
1359,.,"[573, 835, 680, 849]",MISC
1360,-,"[680, 835, 682, 849]",MISC
1361,NL,"[680, 835, 682, 849]",MISC
1362,-,"[680, 835, 682, 849]",MISC
1363,Disc,"[153, 854, 255, 867]",MISC
1364,##uss,"[153, 854, 255, 867]",MISC
1365,##ing,"[153, 854, 255, 867]",MISC
1366,the,"[256, 854, 286, 867]",MISC
1367,technical,"[287, 854, 379, 867]",MISC
1368,way,"[380, 854, 410, 867]",MISC
1369,of,"[411, 854, 430, 867]",MISC
1370,development,"[431, 854, 544, 867]",MISC
1371,with,"[545, 854, 586, 867]",MISC
1372,on,"[586, 854, 648, 867]",MISC
1373,##site,"[586, 854, 648, 867]",MISC
1374,and,"[648, 854, 678, 867]",MISC
1375,offshore,"[679, 854, 760, 867]",MISC
1376,team,"[762, 854, 803, 867]",MISC
1377,lead,"[803, 854, 854, 867]",MISC
1378,.,"[803, 854, 854, 867]",MISC
1379,-,"[855, 854, 857, 867]",MISC
1380,NL,"[855, 854, 857, 867]",MISC
1381,-,"[855, 854, 857, 867]",MISC
1382,Con,"[153, 873, 329, 884]",MISC
1383,##duct,"[153, 873, 329, 884]",MISC
1384,##ing,"[153, 873, 329, 884]",MISC
1385,/,"[153, 873, 329, 884]",MISC
1386,Giving,"[153, 873, 329, 884]",MISC
1387,training,"[331, 873, 424, 884]",MISC
1388,##s,"[331, 873, 424, 884]",MISC
1389,and,"[425, 873, 455, 884]",MISC
1390,knowledge,"[457, 873, 550, 884]",MISC
1391,sharing,"[551, 873, 623, 884]",MISC
1392,sessions,"[624, 873, 707, 884]",MISC
1393,to,"[708, 873, 727, 884]",MISC
1394,my,"[729, 873, 748, 884]",MISC
1395,team,"[750, 873, 790, 884]",MISC
1396,members,"[792, 873, 864, 884]",MISC
1397,and,"[865, 873, 895, 884]",MISC
1398,other,"[896, 873, 948, 884]",MISC
1399,team,"[949, 873, 989, 884]",MISC
1400,-,"[991, 873, 992, 884]",MISC
1401,NL,"[991, 873, 992, 884]",MISC
1402,-,"[991, 873, 992, 884]",MISC
1403,members,"[174, 886, 246, 903]",MISC
1404,as,"[247, 886, 267, 903]",MISC
1405,well,"[268, 886, 309, 903]",MISC
1406,on,"[310, 886, 329, 903]",MISC
1407,request,"[331, 886, 403, 903]",MISC
1408,basis,"[404, 886, 455, 903]",MISC
1409,-,"[456, 886, 458, 903]",MISC
1410,NL,"[456, 886, 458, 903]",MISC
1411,-,"[456, 886, 458, 903]",MISC
1412,Demons,"[152, 908, 270, 921]",MISC
1413,##trate,"[152, 908, 270, 921]",MISC
1414,##s,"[152, 908, 270, 921]",MISC
1415,up,"[272, 908, 371, 921]",MISC
1416,-,"[272, 908, 371, 921]",MISC
1417,to,"[272, 908, 371, 921]",MISC
1418,-,"[272, 908, 371, 921]",MISC
1419,date,"[272, 908, 371, 921]",MISC
1420,expertise,"[372, 908, 460, 921]",MISC
1421,in,"[461, 908, 481, 921]",MISC
1422,Had,"[481, 908, 540, 921]",MISC
1423,##oop,"[481, 908, 540, 921]",MISC
1424,and,"[541, 908, 570, 921]",MISC
1425,applies,"[571, 908, 640, 921]",MISC
1426,this,"[641, 908, 680, 921]",MISC
1427,to,"[681, 908, 700, 921]",MISC
1428,the,"[701, 908, 729, 921]",MISC
1429,development,"[731, 908, 849, 921]",MISC
1430,",","[731, 908, 849, 921]",MISC
1431,execution,"[850, 908, 949, 921]",MISC
1432,",","[850, 908, 949, 921]",MISC
1433,and,"[950, 908, 978, 921]",MISC
1434,-,"[980, 908, 982, 921]",MISC
1435,NL,"[980, 908, 982, 921]",MISC
1436,-,"[980, 908, 982, 921]",MISC
1437,improvement,"[174, 921, 287, 940]",MISC
1438,-,"[287, 921, 289, 940]",MISC
1439,NL,"[287, 921, 289, 940]",MISC
1440,-,"[287, 921, 289, 940]",MISC
1441,Doing,"[153, 945, 206, 958]",MISC
1442,the,"[206, 945, 238, 958]",MISC
1443,peer,"[238, 945, 281, 958]",MISC
1444,review,"[281, 945, 344, 958]",MISC
1445,of,"[345, 945, 366, 958]",MISC
1446,code,"[366, 945, 419, 958]",MISC
1447,.,"[366, 945, 419, 958]",MISC
1448,-,"[419, 945, 421, 958]",MISC
1449,NL,"[419, 945, 421, 958]",MISC
1450,-,"[419, 945, 421, 958]",MISC
1451,3,"[989, 981, 1000, 1000]",MISC
1452,-,"[1000, 981, 1001, 1000]",MISC
1453,NL,"[1000, 981, 1001, 1000]",MISC
1454,-,"[1000, 981, 1001, 1000]",MISC
1455,Project,"[95, 108, 169, 126]",MISC
1456,#,"[170, 108, 202, 126]",MISC
1457,4,"[170, 108, 202, 126]",MISC
1458,:,"[170, 108, 202, 126]",MISC
1459,-,"[202, 108, 204, 126]",MISC
1460,NL,"[202, 108, 204, 126]",MISC
1461,-,"[202, 108, 204, 126]",MISC
1462,C,"[121, 148, 209, 165]",MISC
1463,##lient,"[121, 148, 209, 165]",MISC
1464,:,"[210, 148, 224, 165]",MISC
1465,Un,"[224, 148, 357, 165]",B-project_company_name
1466,##ic,"[224, 148, 357, 165]",I-project_company_name
1467,##red,"[224, 148, 357, 165]",I-project_company_name
1468,##it,"[224, 148, 357, 165]",I-project_company_name
1469,Global,"[357, 148, 445, 165]",I-project_company_name
1470,information,"[446, 148, 606, 165]",I-project_company_name
1471,system,"[608, 148, 696, 165]",I-project_company_name
1472,-,"[696, 148, 698, 165]",MISC
1473,NL,"[696, 148, 698, 165]",MISC
1474,-,"[696, 148, 698, 165]",MISC
1475,Du,"[121, 165, 261, 183]",MISC
1476,##ration,"[121, 165, 261, 183]",MISC
1477,:,"[261, 165, 277, 183]",MISC
1478,Sep,"[279, 165, 330, 183]",MISC
1479,2013,"[331, 165, 400, 183]",MISC
1480,to,"[401, 165, 435, 183]",MISC
1481,March,"[436, 165, 523, 183]",MISC
1482,2014,"[524, 165, 593, 183]",MISC
1483,-,"[594, 165, 596, 183]",MISC
1484,NL,"[594, 165, 596, 183]",MISC
1485,-,"[594, 165, 596, 183]",MISC
1486,Too,"[121, 183, 174, 201]",MISC
1487,##ls,"[121, 183, 174, 201]",MISC
1488,and,"[174, 183, 206, 201]",MISC
1489,technology,"[206, 183, 312, 201]",MISC
1490,used,"[312, 183, 355, 201]",MISC
1491,:,"[355, 183, 365, 201]",MISC
1492,Core,"[365, 183, 408, 201]",MISC
1493,Java,"[408, 183, 461, 201]",MISC
1494,",","[408, 183, 461, 201]",MISC
1495,Spring,"[461, 183, 524, 201]",MISC
1496,and,"[525, 183, 556, 201]",MISC
1497,Hi,"[557, 183, 652, 201]",MISC
1498,##ber,"[557, 183, 652, 201]",MISC
1499,##nate,"[557, 183, 652, 201]",MISC
1500,-,"[652, 183, 654, 201]",MISC
1501,NL,"[652, 183, 654, 201]",MISC
1502,-,"[652, 183, 654, 201]",MISC
1503,Server,"[121, 202, 262, 219]",MISC
1504,:,"[263, 202, 286, 219]",MISC
1505,Web,"[287, 202, 357, 219]",MISC
1506,Logic,"[358, 202, 476, 219]",MISC
1507,-,"[476, 202, 477, 219]",MISC
1508,NL,"[476, 202, 477, 219]",MISC
1509,-,"[476, 202, 477, 219]",MISC
1510,Operating,"[121, 220, 255, 238]",MISC
1511,System,"[256, 220, 344, 238]",MISC
1512,:,"[346, 220, 360, 238]",MISC
1513,Windows,"[360, 220, 465, 238]",MISC
1514,X,"[465, 220, 493, 238]",MISC
1515,##P,"[465, 220, 493, 238]",MISC
1516,-,"[495, 220, 497, 238]",MISC
1517,NL,"[495, 220, 497, 238]",MISC
1518,-,"[495, 220, 497, 238]",MISC
1519,ID,"[121, 239, 208, 256]",MISC
1520,##E,"[121, 239, 208, 256]",MISC
1521,:,"[209, 239, 237, 256]",MISC
1522,Eclipse,"[239, 239, 443, 256]",MISC
1523,-,"[444, 239, 446, 256]",MISC
1524,NL,"[444, 239, 446, 256]",MISC
1525,-,"[444, 239, 446, 256]",MISC
1526,Role,"[121, 256, 208, 275]",MISC
1527,:,"[208, 256, 229, 275]",MISC
1528,Java,"[230, 256, 316, 275]",MISC
1529,Dev,"[317, 256, 513, 275]",MISC
1530,##elo,"[317, 256, 513, 275]",MISC
1531,##per,"[317, 256, 513, 275]",MISC
1532,-,"[513, 256, 514, 275]",MISC
1533,NL,"[513, 256, 514, 275]",MISC
1534,-,"[513, 256, 514, 275]",MISC
1535,Project,"[95, 314, 167, 333]",MISC
1536,Des,"[168, 314, 291, 333]",MISC
1537,##cription,"[168, 314, 291, 333]",MISC
1538,:,"[168, 314, 291, 333]",MISC
1539,-,"[292, 314, 294, 333]",MISC
1540,NL,"[292, 314, 294, 333]",MISC
1541,-,"[292, 314, 294, 333]",MISC
1542,Si,"[95, 334, 179, 351]",MISC
1543,##m,"[95, 334, 179, 351]",MISC
1544,##L,"[95, 334, 179, 351]",MISC
1545,##ight,"[95, 334, 179, 351]",MISC
1546,described,"[181, 334, 276, 351]",MISC
1547,is,"[277, 334, 299, 351]",MISC
1548,implemented,"[299, 334, 417, 351]",MISC
1549,in,"[417, 334, 438, 351]",MISC
1550,Un,"[439, 334, 545, 351]",MISC
1551,##ic,"[439, 334, 545, 351]",MISC
1552,##red,"[439, 334, 545, 351]",MISC
1553,##it,"[439, 334, 545, 351]",MISC
1554,",","[439, 334, 545, 351]",MISC
1555,which,"[546, 334, 599, 351]",MISC
1556,is,"[600, 334, 621, 351]",MISC
1557,the,"[621, 334, 653, 351]",MISC
1558,credit,"[654, 334, 717, 351]",MISC
1559,risk,"[718, 334, 761, 351]",MISC
1560,management,"[761, 334, 867, 351]",MISC
1561,system,"[869, 334, 932, 351]",MISC
1562,used,"[933, 334, 976, 351]",MISC
1563,by,"[976, 334, 997, 351]",MISC
1564,-,"[998, 334, 1000, 351]",MISC
1565,NL,"[998, 334, 1000, 351]",MISC
1566,-,"[998, 334, 1000, 351]",MISC
1567,Un,"[95, 353, 194, 370]",MISC
1568,##ic,"[95, 353, 194, 370]",MISC
1569,##red,"[95, 353, 194, 370]",MISC
1570,##it,"[95, 353, 194, 370]",MISC
1571,.,"[95, 353, 194, 370]",MISC
1572,Currently,"[195, 353, 294, 370]",MISC
1573,",","[195, 353, 294, 370]",MISC
1574,AR,"[295, 353, 355, 370]",MISC
1575,##AM,"[295, 353, 355, 370]",MISC
1576,##IS,"[295, 353, 355, 370]",MISC
1577,enables,"[356, 353, 424, 370]",MISC
1578,the,"[426, 353, 456, 370]",MISC
1579,stress,"[456, 353, 546, 370]",MISC
1580,##ing,"[456, 353, 546, 370]",MISC
1581,of,"[546, 353, 566, 370]",MISC
1582,risk,"[566, 353, 605, 370]",MISC
1583,calculation,"[606, 353, 716, 370]",MISC
1584,(,"[717, 353, 747, 370]",MISC
1585,PD,"[717, 353, 747, 370]",MISC
1586,stress,"[747, 353, 837, 370]",MISC
1587,##ing,"[747, 353, 837, 370]",MISC
1588,and,"[837, 353, 867, 370]",MISC
1589,R,"[867, 353, 897, 370]",MISC
1590,##WA,"[867, 353, 897, 370]",MISC
1591,stress,"[897, 353, 996, 370]",MISC
1592,##ing,"[897, 353, 996, 370]",MISC
1593,),"[897, 353, 996, 370]",MISC
1594,-,"[998, 353, 1000, 370]",MISC
1595,NL,"[998, 353, 1000, 370]",MISC
1596,-,"[998, 353, 1000, 370]",MISC
1597,based,"[95, 370, 144, 388]",MISC
1598,on,"[144, 370, 164, 388]",MISC
1599,full,"[164, 370, 203, 388]",MISC
1600,calculation,"[204, 370, 311, 388]",MISC
1601,that,"[313, 370, 352, 388]",MISC
1602,ensures,"[353, 370, 422, 388]",MISC
1603,high,"[422, 370, 461, 388]",MISC
1604,precision,"[462, 370, 561, 388]",MISC
1605,",","[462, 370, 561, 388]",MISC
1606,but,"[561, 370, 589, 388]",MISC
1607,causes,"[591, 370, 649, 388]",MISC
1608,high,"[650, 370, 689, 388]",MISC
1609,system,"[690, 370, 748, 388]",MISC
1610,performance,"[750, 370, 868, 388]",MISC
1611,",","[750, 370, 868, 388]",MISC
1612,custom,"[869, 370, 997, 388]",MISC
1613,##ization,"[869, 370, 997, 388]",MISC
1614,-,"[998, 370, 1000, 388]",MISC
1615,NL,"[998, 370, 1000, 388]",MISC
1616,-,"[998, 370, 1000, 388]",MISC
1617,and,"[95, 388, 123, 406]",MISC
1618,storage,"[123, 388, 188, 406]",MISC
1619,requirements,"[189, 388, 311, 406]",MISC
1620,.,"[189, 388, 311, 406]",MISC
1621,-,"[312, 388, 313, 406]",MISC
1622,NL,"[312, 388, 313, 406]",MISC
1623,-,"[312, 388, 313, 406]",MISC
1624,The,"[95, 407, 128, 424]",MISC
1625,Si,"[129, 407, 219, 424]",MISC
1626,##m,"[129, 407, 219, 424]",MISC
1627,##L,"[129, 407, 219, 424]",MISC
1628,##ight,"[129, 407, 219, 424]",MISC
1629,is,"[219, 407, 240, 424]",MISC
1630,a,"[241, 407, 252, 424]",MISC
1631,replacement,"[253, 407, 376, 424]",MISC
1632,for,"[377, 407, 410, 424]",MISC
1633,local,"[411, 407, 467, 424]",MISC
1634,Austrian,"[467, 407, 557, 424]",MISC
1635,model,"[558, 407, 614, 424]",MISC
1636,S,"[614, 407, 681, 424]",MISC
1637,##IM,"[614, 407, 681, 424]",MISC
1638,##BA,"[614, 407, 681, 424]",MISC
1639,",","[614, 407, 681, 424]",MISC
1640,but,"[682, 407, 715, 424]",MISC
1641,can,"[716, 407, 749, 424]",MISC
1642,also,"[749, 407, 794, 424]",MISC
1643,be,"[795, 407, 816, 424]",MISC
1644,used,"[817, 407, 861, 424]",MISC
1645,by,"[862, 407, 883, 424]",MISC
1646,Holding,"[885, 407, 962, 424]",MISC
1647,and,"[964, 407, 997, 424]",MISC
1648,-,"[998, 407, 1000, 424]",MISC
1649,NL,"[998, 407, 1000, 424]",MISC
1650,-,"[998, 407, 1000, 424]",MISC
1651,H,"[95, 425, 137, 443]",MISC
1652,##VB,"[95, 425, 137, 443]",MISC
1653,.,"[95, 425, 137, 443]",MISC
1654,The,"[138, 425, 169, 443]",MISC
1655,light,"[170, 425, 223, 443]",MISC
1656,calculation,"[224, 425, 342, 443]",MISC
1657,method,"[342, 425, 405, 443]",MISC
1658,is,"[406, 425, 428, 443]",MISC
1659,not,"[428, 425, 460, 443]",MISC
1660,in,"[460, 425, 481, 443]",MISC
1661,every,"[482, 425, 535, 443]",MISC
1662,specific,"[535, 425, 620, 443]",MISC
1663,case,"[621, 425, 664, 443]",MISC
1664,as,"[664, 425, 686, 443]",MISC
1665,precise,"[686, 425, 771, 443]",MISC
1666,/,"[686, 425, 771, 443]",MISC
1667,custom,"[772, 425, 901, 443]",MISC
1668,##iza,"[772, 425, 901, 443]",MISC
1669,##ble,"[772, 425, 901, 443]",MISC
1670,as,"[901, 425, 922, 443]",MISC
1671,S,"[922, 425, 997, 443]",MISC
1672,##IM,"[922, 425, 997, 443]",MISC
1673,##F,"[922, 425, 997, 443]",MISC
1674,##U,"[922, 425, 997, 443]",MISC
1675,##LL,"[922, 425, 997, 443]",MISC
1676,-,"[998, 425, 1000, 443]",MISC
1677,NL,"[998, 425, 1000, 443]",MISC
1678,-,"[998, 425, 1000, 443]",MISC
1679,(,"[95, 444, 197, 461]",MISC
1680,requiring,"[95, 444, 197, 461]",MISC
1681,full,"[199, 444, 239, 461]",MISC
1682,calculation,"[240, 444, 353, 461]",MISC
1683,engine,"[354, 444, 416, 461]",MISC
1684,re,"[416, 444, 508, 461]",MISC
1685,-,"[416, 444, 508, 461]",MISC
1686,runs,"[416, 444, 508, 461]",MISC
1687,),"[416, 444, 508, 461]",MISC
1688,",","[416, 444, 508, 461]",MISC
1689,yet,"[510, 444, 540, 461]",MISC
1690,will,"[541, 444, 582, 461]",MISC
1691,reduce,"[583, 444, 644, 461]",MISC
1692,significantly,"[645, 444, 779, 461]",MISC
1693,the,"[780, 444, 810, 461]",MISC
1694,calculation,"[811, 444, 924, 461]",MISC
1695,time,"[925, 444, 966, 461]",MISC
1696,and,"[967, 444, 997, 461]",MISC
1697,-,"[998, 444, 1000, 461]",MISC
1698,NL,"[998, 444, 1000, 461]",MISC
1699,-,"[998, 444, 1000, 461]",MISC
1700,considering,"[95, 461, 206, 480]",MISC
1701,its,"[206, 461, 236, 480]",MISC
1702,flexible,"[237, 461, 318, 480]",MISC
1703,design,"[318, 461, 378, 480]",MISC
1704,allowing,"[379, 461, 460, 480]",MISC
1705,various,"[460, 461, 531, 480]",MISC
1706,users,"[531, 461, 580, 480]",MISC
1707,“,"[582, 461, 652, 480]",MISC
1708,ad,"[582, 461, 652, 480]",MISC
1709,##ho,"[582, 461, 652, 480]",MISC
1710,##c,"[582, 461, 652, 480]",MISC
1711,”,"[582, 461, 652, 480]",MISC
1712,stress,"[653, 461, 743, 480]",MISC
1713,##ing,"[653, 461, 743, 480]",MISC
1714,with,"[744, 461, 785, 480]",MISC
1715,less,"[785, 461, 825, 480]",MISC
1716,custom,"[825, 461, 956, 480]",MISC
1717,##ization,"[825, 461, 956, 480]",MISC
1718,than,"[957, 461, 998, 480]",MISC
1719,-,"[998, 461, 1000, 480]",MISC
1720,NL,"[998, 461, 1000, 480]",MISC
1721,-,"[998, 461, 1000, 480]",MISC
1722,S,"[95, 480, 185, 497]",MISC
1723,##IM,"[95, 480, 185, 497]",MISC
1724,##F,"[95, 480, 185, 497]",MISC
1725,##U,"[95, 480, 185, 497]",MISC
1726,##LL,"[95, 480, 185, 497]",MISC
1727,-,"[185, 480, 186, 497]",MISC
1728,NL,"[185, 480, 186, 497]",MISC
1729,-,"[185, 480, 186, 497]",MISC
1730,Project,"[95, 556, 169, 575]",MISC
1731,#,"[170, 556, 202, 575]",MISC
1732,5,"[170, 556, 202, 575]",MISC
1733,:,"[170, 556, 202, 575]",MISC
1734,-,"[202, 556, 204, 575]",MISC
1735,NL,"[202, 556, 204, 575]",MISC
1736,-,"[202, 556, 204, 575]",MISC
1737,C,"[121, 596, 215, 613]",MISC
1738,##lient,"[121, 596, 215, 613]",MISC
1739,:,"[215, 596, 229, 613]",MISC
1740,Un,"[231, 596, 418, 613]",B-project_company_name
1741,##em,"[231, 596, 418, 613]",I-project_company_name
1742,##p,"[231, 596, 418, 613]",I-project_company_name
1743,##loy,"[231, 596, 418, 613]",I-project_company_name
1744,##ment,"[231, 596, 418, 613]",I-project_company_name
1745,Insurance,"[419, 596, 558, 613]",I-project_company_name
1746,-,"[560, 596, 574, 613]",I-project_company_name
1747,State,"[575, 596, 653, 613]",I-project_company_name
1748,of,"[654, 596, 684, 613]",I-project_company_name
1749,Nevada,"[685, 596, 779, 613]",I-project_company_name
1750,-,"[779, 596, 781, 613]",MISC
1751,NL,"[779, 596, 781, 613]",MISC
1752,-,"[779, 596, 781, 613]",MISC
1753,Du,"[121, 613, 268, 632]",MISC
1754,##ration,"[121, 613, 268, 632]",MISC
1755,:,"[268, 613, 286, 632]",MISC
1756,May,"[287, 613, 342, 632]",MISC
1757,2011,"[342, 613, 414, 632]",MISC
1758,to,"[416, 613, 451, 632]",MISC
1759,Aug,"[453, 613, 507, 632]",MISC
1760,2013,"[508, 613, 580, 632]",MISC
1761,-,"[582, 613, 583, 632]",MISC
1762,NL,"[582, 613, 583, 632]",MISC
1763,-,"[582, 613, 583, 632]",MISC
1764,Too,"[121, 632, 172, 649]",MISC
1765,##ls,"[121, 632, 172, 649]",MISC
1766,and,"[174, 632, 204, 649]",MISC
1767,technology,"[205, 632, 309, 649]",MISC
1768,used,"[310, 632, 351, 649]",MISC
1769,:,"[352, 632, 361, 649]",MISC
1770,J,"[362, 632, 414, 649]",MISC
1771,##2,"[362, 632, 414, 649]",MISC
1772,##ee,"[362, 632, 414, 649]",MISC
1773,",","[362, 632, 414, 649]",MISC
1774,Spring,"[415, 632, 477, 649]",MISC
1775,m,"[478, 632, 518, 649]",MISC
1776,##v,"[478, 632, 518, 649]",MISC
1777,##c,"[478, 632, 518, 649]",MISC
1778,",","[478, 632, 518, 649]",MISC
1779,J,"[520, 632, 560, 649]",MISC
1780,##SP,"[520, 632, 560, 649]",MISC
1781,",","[520, 632, 560, 649]",MISC
1782,Hi,"[562, 632, 655, 649]",MISC
1783,##ber,"[562, 632, 655, 649]",MISC
1784,##nate,"[562, 632, 655, 649]",MISC
1785,and,"[656, 632, 686, 649]",MISC
1786,sq,"[688, 632, 728, 649]",MISC
1787,##l,"[688, 632, 728, 649]",MISC
1788,.,"[688, 632, 728, 649]",MISC
1789,-,"[730, 632, 731, 649]",MISC
1790,NL,"[730, 632, 731, 649]",MISC
1791,-,"[730, 632, 731, 649]",MISC
1792,Server,"[121, 650, 262, 667]",MISC
1793,:,"[263, 650, 286, 667]",MISC
1794,Web,"[287, 650, 357, 667]",MISC
1795,Logic,"[358, 650, 476, 667]",MISC
1796,-,"[476, 650, 477, 667]",MISC
1797,NL,"[476, 650, 477, 667]",MISC
1798,-,"[476, 650, 477, 667]",MISC
1799,Operating,"[121, 669, 255, 686]",MISC
1800,System,"[256, 669, 344, 686]",MISC
1801,:,"[346, 669, 360, 686]",MISC
1802,Windows,"[360, 669, 465, 686]",MISC
1803,X,"[465, 669, 493, 686]",MISC
1804,##P,"[465, 669, 493, 686]",MISC
1805,-,"[495, 669, 497, 686]",MISC
1806,NL,"[495, 669, 497, 686]",MISC
1807,-,"[495, 669, 497, 686]",MISC
1808,ID,"[121, 687, 208, 705]",MISC
1809,##E,"[121, 687, 208, 705]",MISC
1810,:,"[209, 687, 237, 705]",MISC
1811,Eclipse,"[239, 687, 443, 705]",MISC
1812,-,"[444, 687, 446, 705]",MISC
1813,NL,"[444, 687, 446, 705]",MISC
1814,-,"[444, 687, 446, 705]",MISC
1815,Role,"[121, 705, 208, 723]",MISC
1816,:,"[208, 705, 229, 723]",MISC
1817,Java,"[230, 705, 316, 723]",MISC
1818,Dev,"[317, 705, 513, 723]",MISC
1819,##elo,"[317, 705, 513, 723]",MISC
1820,##per,"[317, 705, 513, 723]",MISC
1821,-,"[513, 705, 514, 723]",MISC
1822,NL,"[513, 705, 514, 723]",MISC
1823,-,"[513, 705, 514, 723]",MISC
1824,Project,"[95, 763, 167, 781]",MISC
1825,Des,"[168, 763, 291, 781]",MISC
1826,##cription,"[168, 763, 291, 781]",MISC
1827,:,"[168, 763, 291, 781]",MISC
1828,-,"[292, 763, 294, 781]",MISC
1829,NL,"[292, 763, 294, 781]",MISC
1830,-,"[292, 763, 294, 781]",MISC
1831,For,"[95, 783, 126, 800]",MISC
1832,one,"[128, 783, 160, 800]",MISC
1833,of,"[161, 783, 182, 800]",MISC
1834,the,"[183, 783, 215, 800]",MISC
1835,US,"[216, 783, 237, 800]",MISC
1836,States,"[238, 783, 314, 800]",MISC
1837,",","[238, 783, 314, 800]",MISC
1838,the,"[315, 783, 347, 800]",MISC
1839,core,"[348, 783, 392, 800]",MISC
1840,U,"[392, 783, 414, 800]",MISC
1841,##I,"[392, 783, 414, 800]",MISC
1842,tax,"[414, 783, 446, 800]",MISC
1843,legacy,"[447, 783, 513, 800]",MISC
1844,system,"[514, 783, 579, 800]",MISC
1845,and,"[580, 783, 611, 800]",MISC
1846,the,"[613, 783, 645, 800]",MISC
1847,core,"[646, 783, 690, 800]",MISC
1848,U,"[690, 783, 711, 800]",MISC
1849,##I,"[690, 783, 711, 800]",MISC
1850,benefit,"[712, 783, 788, 800]",MISC
1851,system,"[789, 783, 854, 800]",MISC
1852,are,"[855, 783, 887, 800]",MISC
1853,both,"[888, 783, 932, 800]",MISC
1854,-,"[932, 783, 934, 800]",MISC
1855,NL,"[932, 783, 934, 800]",MISC
1856,-,"[932, 783, 934, 800]",MISC
1857,approximately,"[95, 800, 227, 818]",MISC
1858,30,"[228, 800, 247, 818]",MISC
1859,years,"[248, 800, 300, 818]",MISC
1860,old,"[300, 800, 340, 818]",MISC
1861,.,"[300, 800, 340, 818]",MISC
1862,Since,"[341, 800, 392, 818]",MISC
1863,1998,"[392, 800, 443, 818]",MISC
1864,",","[392, 800, 443, 818]",MISC
1865,over,"[443, 800, 484, 818]",MISC
1866,2,"[484, 800, 535, 818]",MISC
1867,",","[484, 800, 535, 818]",MISC
1868,000,"[484, 800, 535, 818]",MISC
1869,code,"[535, 800, 576, 818]",MISC
1870,enhance,"[576, 800, 698, 818]",MISC
1871,##ments,"[576, 800, 698, 818]",MISC
1872,and,"[699, 800, 729, 818]",MISC
1873,system,"[730, 800, 790, 818]",MISC
1874,disc,"[792, 800, 924, 818]",MISC
1875,##re,"[792, 800, 924, 818]",MISC
1876,##pan,"[792, 800, 924, 818]",MISC
1877,##cies,"[792, 800, 924, 818]",MISC
1878,have,"[925, 800, 966, 818]",MISC
1879,-,"[966, 800, 968, 818]",MISC
1880,NL,"[966, 800, 968, 818]",MISC
1881,-,"[966, 800, 968, 818]",MISC
1882,been,"[95, 818, 134, 837]",MISC
1883,requested,"[135, 818, 225, 837]",MISC
1884,to,"[225, 818, 245, 837]",MISC
1885,the,"[245, 818, 275, 837]",MISC
1886,U,"[275, 818, 295, 837]",MISC
1887,##I,"[275, 818, 295, 837]",MISC
1888,applications,"[295, 818, 424, 837]",MISC
1889,",","[295, 818, 424, 837]",MISC
1890,with,"[426, 818, 465, 837]",MISC
1891,a,"[466, 818, 475, 837]",MISC
1892,current,"[476, 818, 545, 837]",MISC
1893,back,"[546, 818, 615, 837]",MISC
1894,##log,"[546, 818, 615, 837]",MISC
1895,of,"[616, 818, 636, 837]",MISC
1896,200,"[637, 818, 675, 837]",MISC
1897,+,"[637, 818, 675, 837]",MISC
1898,more,"[677, 818, 715, 837]",MISC
1899,requests,"[717, 818, 807, 837]",MISC
1900,.,"[717, 818, 807, 837]",MISC
1901,The,"[807, 818, 837, 837]",MISC
1902,overall,"[837, 818, 906, 837]",MISC
1903,technical,"[907, 818, 997, 837]",MISC
1904,-,"[998, 818, 1000, 837]",MISC
1905,NL,"[998, 818, 1000, 837]",MISC
1906,-,"[998, 818, 1000, 837]",MISC
1907,architecture,"[95, 837, 213, 854]",MISC
1908,has,"[214, 837, 242, 854]",MISC
1909,reached,"[244, 837, 313, 854]",MISC
1910,maturity,"[314, 837, 393, 854]",MISC
1911,and,"[394, 837, 422, 854]",MISC
1912,requires,"[423, 837, 503, 854]",MISC
1913,replacement,"[503, 837, 612, 854]",MISC
1914,to,"[613, 837, 632, 854]",MISC
1915,more,"[633, 837, 671, 854]",MISC
1916,adequately,"[672, 837, 782, 854]",MISC
1917,",","[672, 837, 782, 854]",MISC
1918,and,"[782, 837, 810, 854]",MISC
1919,in,"[812, 837, 831, 854]",MISC
1920,a,"[832, 837, 841, 854]",MISC
1921,time,"[842, 837, 900, 854]",MISC
1922,##ly,"[842, 837, 900, 854]",MISC
1923,manner,"[902, 837, 970, 854]",MISC
1924,",","[902, 837, 970, 854]",MISC
1925,-,"[971, 837, 973, 854]",MISC
1926,NL,"[971, 837, 973, 854]",MISC
1927,-,"[971, 837, 973, 854]",MISC
1928,support,"[95, 855, 164, 873]",MISC
1929,future,"[164, 855, 222, 873]",MISC
1930,business,"[222, 855, 300, 873]",MISC
1931,needs,"[301, 855, 359, 873]",MISC
1932,.,"[301, 855, 359, 873]",MISC
1933,For,"[360, 855, 388, 873]",MISC
1934,this,"[390, 855, 437, 873]",MISC
1935,",","[390, 855, 437, 873]",MISC
1936,Cap,"[439, 855, 527, 873]",MISC
1937,##ge,"[439, 855, 527, 873]",MISC
1938,##mini,"[439, 855, 527, 873]",MISC
1939,proposes,"[527, 855, 605, 873]",MISC
1940,to,"[606, 855, 625, 873]",MISC
1941,present,"[625, 855, 694, 873]",MISC
1942,the,"[694, 855, 722, 873]",MISC
1943,industry,"[724, 855, 821, 873]",MISC
1944,’,"[724, 855, 821, 873]",MISC
1945,s,"[724, 855, 821, 873]",MISC
1946,next,"[822, 855, 861, 873]",MISC
1947,evolution,"[861, 855, 949, 873]",MISC
1948,in,"[950, 855, 969, 873]",MISC
1949,U,"[969, 855, 989, 873]",MISC
1950,##I,"[969, 855, 989, 873]",MISC
1951,-,"[989, 855, 991, 873]",MISC
1952,NL,"[989, 855, 991, 873]",MISC
1953,-,"[989, 855, 991, 873]",MISC
1954,application,"[95, 874, 206, 891]",MISC
1955,solutions,"[207, 874, 307, 891]",MISC
1956,",","[207, 874, 307, 891]",MISC
1957,by,"[309, 874, 328, 891]",MISC
1958,combining,"[329, 874, 421, 891]",MISC
1959,the,"[421, 874, 451, 891]",MISC
1960,benefits,"[452, 874, 533, 891]",MISC
1961,of,"[533, 874, 553, 891]",MISC
1962,a,"[554, 874, 562, 891]",MISC
1963,proven,"[564, 874, 634, 891]",MISC
1964,",","[564, 874, 634, 891]",MISC
1965,domain,"[635, 874, 695, 891]",MISC
1966,rich,"[696, 874, 737, 891]",MISC
1967,CO,"[737, 874, 778, 891]",MISC
1968,##TS,"[737, 874, 778, 891]",MISC
1969,packages,"[778, 874, 859, 891]",MISC
1970,with,"[859, 874, 900, 891]",MISC
1971,the,"[900, 874, 930, 891]",MISC
1972,-,"[931, 874, 932, 891]",MISC
1973,NL,"[931, 874, 932, 891]",MISC
1974,-,"[931, 874, 932, 891]",MISC
1975,advantages,"[95, 891, 199, 910]",MISC
1976,of,"[200, 891, 219, 910]",MISC
1977,proven,"[221, 891, 282, 910]",MISC
1978,U,"[284, 891, 303, 910]",MISC
1979,##I,"[284, 891, 303, 910]",MISC
1980,framework,"[305, 891, 419, 910]",MISC
1981,##s,"[305, 891, 419, 910]",MISC
1982,.,"[305, 891, 419, 910]",MISC
1983,This,"[420, 891, 461, 910]",MISC
1984,involves,"[462, 891, 545, 910]",MISC
1985,the,"[546, 891, 576, 910]",MISC
1986,implementation,"[577, 891, 724, 910]",MISC
1987,of,"[724, 891, 744, 910]",MISC
1988,Oracle,"[745, 891, 807, 910]",MISC
1989,ET,"[808, 891, 849, 910]",MISC
1990,##M,"[808, 891, 849, 910]",MISC
1991,",","[808, 891, 849, 910]",MISC
1992,which,"[850, 891, 901, 910]",MISC
1993,is,"[903, 891, 922, 910]",MISC
1994,a,"[924, 891, 933, 910]",MISC
1995,-,"[934, 891, 936, 910]",MISC
1996,NL,"[934, 891, 936, 910]",MISC
1997,-,"[934, 891, 936, 910]",MISC
1998,commercially,"[95, 910, 222, 928]",MISC
1999,supported,"[222, 910, 318, 928]",MISC
2000,CO,"[318, 910, 360, 928]",MISC
2001,##TS,"[318, 910, 360, 928]",MISC
2002,tax,"[360, 910, 392, 928]",MISC
2003,application,"[392, 910, 519, 928]",MISC
2004,",","[392, 910, 519, 928]",MISC
2005,and,"[520, 910, 552, 928]",MISC
2006,the,"[552, 910, 583, 928]",MISC
2007,new,"[584, 910, 615, 928]",MISC
2008,framework,"[616, 910, 711, 928]",MISC
2009,which,"[711, 910, 764, 928]",MISC
2010,adds,"[764, 910, 807, 928]",MISC
2011,methods,"[807, 910, 881, 928]",MISC
2012,and,"[881, 910, 913, 928]",MISC
2013,-,"[913, 910, 915, 928]",MISC
2014,NL,"[913, 910, 915, 928]",MISC
2015,-,"[913, 910, 915, 928]",MISC
2016,implementation,"[95, 928, 234, 945]",MISC
2017,approaches,"[235, 928, 334, 945]",MISC
2018,of,"[335, 928, 354, 945]",MISC
2019,an,"[355, 928, 374, 945]",MISC
2020,industry,"[375, 928, 564, 945]",MISC
2021,-,"[375, 928, 564, 945]",MISC
2022,recognized,"[375, 928, 564, 945]",MISC
2023,U,"[565, 928, 584, 945]",MISC
2024,##I,"[565, 928, 584, 945]",MISC
2025,framework,"[585, 928, 675, 945]",MISC
2026,-,"[675, 928, 677, 945]",MISC
2027,NL,"[675, 928, 677, 945]",MISC
2028,-,"[675, 928, 677, 945]",MISC
2029,4,"[989, 981, 1000, 1000]",MISC
2030,-,"[1000, 981, 1001, 1000]",MISC
2031,NL,"[1000, 981, 1001, 1000]",MISC
2032,-,"[1000, 981, 1001, 1000]",MISC
2033,Role,"[95, 89, 146, 108]",MISC
2034,##s,"[95, 89, 146, 108]",MISC
2035,and,"[147, 89, 177, 108]",MISC
2036,Re,"[178, 89, 355, 108]",MISC
2037,##sp,"[178, 89, 355, 108]",MISC
2038,##ons,"[178, 89, 355, 108]",MISC
2039,##ibi,"[178, 89, 355, 108]",MISC
2040,##lities,"[178, 89, 355, 108]",MISC
2041,:,"[178, 89, 355, 108]",MISC
2042,-,"[356, 89, 358, 108]",MISC
2043,NL,"[356, 89, 358, 108]",MISC
2044,-,"[356, 89, 358, 108]",MISC
2045,Understanding,"[200, 130, 331, 145]",MISC
2046,the,"[332, 130, 362, 145]",MISC
2047,flow,"[362, 130, 401, 145]",MISC
2048,specifications,"[403, 130, 544, 145]",MISC
2049,and,"[545, 130, 575, 145]",MISC
2050,responsible,"[575, 130, 686, 145]",MISC
2051,for,"[687, 130, 717, 145]",MISC
2052,the,"[717, 130, 747, 145]",MISC
2053,development,"[747, 130, 859, 145]",MISC
2054,of,"[859, 130, 878, 145]",MISC
2055,the,"[879, 130, 909, 145]",MISC
2056,-,"[910, 130, 911, 145]",MISC
2057,NL,"[910, 130, 911, 145]",MISC
2058,-,"[910, 130, 911, 145]",MISC
2059,application,"[227, 145, 335, 164]",MISC
2060,which,"[335, 145, 383, 164]",MISC
2061,is,"[385, 145, 404, 164]",MISC
2062,totally,"[404, 145, 473, 164]",MISC
2063,based,"[473, 145, 521, 164]",MISC
2064,on,"[522, 145, 542, 164]",MISC
2065,MV,"[542, 145, 570, 164]",MISC
2066,##C,"[542, 145, 570, 164]",MISC
2067,architecture,"[572, 145, 699, 164]",MISC
2068,.,"[572, 145, 699, 164]",MISC
2069,-,"[700, 145, 701, 164]",MISC
2070,NL,"[700, 145, 701, 164]",MISC
2071,-,"[700, 145, 701, 164]",MISC
2072,Inter,"[200, 167, 309, 182]",MISC
2073,##action,"[200, 167, 309, 182]",MISC
2074,with,"[310, 167, 349, 182]",MISC
2075,the,"[350, 167, 378, 182]",MISC
2076,client,"[380, 167, 448, 182]",MISC
2077,",","[380, 167, 448, 182]",MISC
2078,gathering,"[449, 167, 538, 182]",MISC
2079,requirements,"[539, 167, 657, 182]",MISC
2080,and,"[659, 167, 687, 182]",MISC
2081,identify,"[689, 167, 768, 182]",MISC
2082,The,"[769, 167, 797, 182]",MISC
2083,Use,"[799, 167, 827, 182]",MISC
2084,Case,"[829, 167, 887, 182]",MISC
2085,##s,"[829, 167, 887, 182]",MISC
2086,.,"[829, 167, 887, 182]",MISC
2087,-,"[888, 167, 890, 182]",MISC
2088,NL,"[888, 167, 890, 182]",MISC
2089,-,"[888, 167, 890, 182]",MISC
2090,In,"[200, 185, 279, 199]",MISC
2091,##volved,"[200, 185, 279, 199]",MISC
2092,in,"[280, 185, 299, 199]",MISC
2093,Co,"[300, 185, 358, 199]",MISC
2094,##ding,"[300, 185, 358, 199]",MISC
2095,spring,"[359, 185, 428, 199]",MISC
2096,",","[359, 185, 428, 199]",MISC
2097,J,"[429, 185, 468, 199]",MISC
2098,##SP,"[429, 185, 468, 199]",MISC
2099,",","[429, 185, 468, 199]",MISC
2100,Ser,"[469, 185, 557, 199]",MISC
2101,##v,"[469, 185, 557, 199]",MISC
2102,##lets,"[469, 185, 557, 199]",MISC
2103,",","[469, 185, 557, 199]",MISC
2104,hi,"[559, 185, 647, 199]",MISC
2105,##ber,"[559, 185, 647, 199]",MISC
2106,##nate,"[559, 185, 647, 199]",MISC
2107,and,"[648, 185, 677, 199]",MISC
2108,Java,"[678, 185, 788, 199]",MISC
2109,##Script,"[678, 185, 788, 199]",MISC
2110,.,"[678, 185, 788, 199]",MISC
2111,-,"[788, 185, 790, 199]",MISC
2112,NL,"[788, 185, 790, 199]",MISC
2113,-,"[788, 185, 790, 199]",MISC
2114,Used,"[201, 203, 243, 218]",MISC
2115,Clear,"[243, 203, 296, 218]",MISC
2116,case,"[296, 203, 339, 218]",MISC
2117,for,"[339, 203, 371, 218]",MISC
2118,version,"[371, 203, 445, 218]",MISC
2119,control,"[445, 203, 519, 218]",MISC
2120,-,"[520, 203, 522, 218]",MISC
2121,NL,"[520, 203, 522, 218]",MISC
2122,-,"[520, 203, 522, 218]",MISC
2123,Work,"[201, 222, 266, 236]",MISC
2124,##ed,"[201, 222, 266, 236]",MISC
2125,in,"[268, 222, 289, 236]",MISC
2126,a,"[290, 222, 345, 236]",MISC
2127,##gi,"[290, 222, 345, 236]",MISC
2128,##le,"[290, 222, 345, 236]",MISC
2129,methodology,"[346, 222, 478, 236]",MISC
2130,.,"[346, 222, 478, 236]",MISC
2131,-,"[479, 222, 481, 236]",MISC
2132,NL,"[479, 222, 481, 236]",MISC
2133,-,"[479, 222, 481, 236]",MISC
2134,Right,"[200, 242, 249, 256]",MISC
2135,shore,"[250, 242, 392, 256]",MISC
2136,-,"[250, 242, 392, 256]",MISC
2137,Off,"[250, 242, 392, 256]",MISC
2138,##shore,"[250, 242, 392, 256]",MISC
2139,coordination,"[392, 242, 512, 256]",MISC
2140,-,"[513, 242, 514, 256]",MISC
2141,NL,"[513, 242, 514, 256]",MISC
2142,-,"[513, 242, 514, 256]",MISC
2143,Co,"[201, 263, 266, 277]",MISC
2144,##ding,"[201, 263, 266, 277]",MISC
2145,and,"[266, 263, 298, 277]",MISC
2146,unit,"[299, 263, 341, 277]",MISC
2147,testing,"[343, 263, 419, 277]",MISC
2148,-,"[419, 263, 421, 277]",MISC
2149,NL,"[419, 263, 421, 277]",MISC
2150,-,"[419, 263, 421, 277]",MISC
2151,Maintenance,"[200, 283, 324, 297]",MISC
2152,",","[200, 283, 324, 297]",MISC
2153,defect,"[324, 283, 386, 297]",MISC
2154,fixing,"[386, 283, 447, 297]",MISC
2155,-,"[447, 283, 449, 297]",MISC
2156,NL,"[447, 283, 449, 297]",MISC
2157,-,"[447, 283, 449, 297]",MISC
2158,Doc,"[201, 304, 338, 318]",MISC
2159,##ume,"[201, 304, 338, 318]",MISC
2160,##ntation,"[201, 304, 338, 318]",MISC
2161,(,"[339, 304, 455, 318]",MISC
2162,De,"[339, 304, 455, 318]",MISC
2163,##p,"[339, 304, 455, 318]",MISC
2164,##loy,"[339, 304, 455, 318]",MISC
2165,##ment,"[339, 304, 455, 318]",MISC
2166,guide,"[455, 304, 519, 318]",MISC
2167,",","[455, 304, 519, 318]",MISC
2168,Impact,"[519, 304, 582, 318]",MISC
2169,Analysis,"[583, 304, 667, 318]",MISC
2170,document,"[668, 304, 752, 318]",MISC
2171,etc,"[752, 304, 795, 318]",MISC
2172,),"[752, 304, 795, 318]",MISC
2173,-,"[795, 304, 797, 318]",MISC
2174,NL,"[795, 304, 797, 318]",MISC
2175,-,"[795, 304, 797, 318]",MISC
2176,Academic,"[95, 358, 179, 378]",B-education_heading
2177,Qualification,"[181, 358, 341, 378]",I-education_heading
2178,##s,"[181, 358, 341, 378]",I-education_heading
2179,:,"[181, 358, 341, 378]",I-education_heading
2180,-,"[342, 358, 343, 378]",MISC
2181,NL,"[342, 358, 343, 378]",MISC
2182,-,"[342, 358, 343, 378]",MISC
2183,MCA,"[170, 390, 203, 404]",B-education_degree
2184,from,"[204, 390, 250, 404]",MISC
2185,School,"[250, 390, 319, 404]",B-education_institute
2186,Of,"[320, 390, 343, 404]",I-education_institute
2187,Computer,"[343, 390, 434, 404]",I-education_institute
2188,Science,"[435, 390, 527, 404]",I-education_institute
2189,",","[435, 390, 527, 404]",I-education_institute
2190,D,"[527, 390, 573, 404]",I-education_institute
2191,##AV,"[527, 390, 573, 404]",I-education_institute
2192,##V,"[527, 390, 573, 404]",I-education_institute
2193,Indo,"[573, 390, 642, 404]",I-education_institute
2194,##re,"[573, 390, 642, 404]",I-education_institute
2195,in,"[642, 390, 665, 404]",MISC
2196,2009,"[665, 390, 711, 404]",MISC
2197,with,"[712, 390, 757, 404]",MISC
2198,an,"[758, 390, 781, 404]",MISC
2199,aggregate,"[781, 390, 883, 404]",MISC
2200,of,"[884, 390, 907, 404]",MISC
2201,75,"[908, 390, 953, 404]",MISC
2202,%,"[908, 390, 953, 404]",MISC
2203,.,"[908, 390, 953, 404]",MISC
2204,-,"[954, 390, 955, 404]",MISC
2205,NL,"[954, 390, 955, 404]",MISC
2206,-,"[954, 390, 955, 404]",MISC
2207,B,"[169, 416, 201, 429]",B-education_degree
2208,##s,"[169, 416, 201, 429]",I-education_degree
2209,##c,"[169, 416, 201, 429]",I-education_degree
2210,(,"[202, 416, 257, 429]",MISC
2211,Co,"[202, 416, 257, 429]",B-education_course
2212,##mp,"[202, 416, 257, 429]",I-education_course
2213,Sc,"[258, 416, 302, 429]",I-education_course
2214,.,"[258, 416, 302, 429]",MISC
2215,),"[258, 416, 302, 429]",MISC
2216,from,"[302, 416, 346, 429]",MISC
2217,Govt,"[346, 416, 401, 429]",B-education_institute
2218,.,"[346, 416, 401, 429]",I-education_institute
2219,post,"[401, 416, 445, 429]",I-education_institute
2220,graduate,"[445, 416, 533, 429]",I-education_institute
2221,College,"[534, 416, 622, 429]",I-education_institute
2222,",","[534, 416, 622, 429]",I-education_institute
2223,M,"[622, 416, 666, 429]",I-education_institute
2224,##how,"[622, 416, 666, 429]",I-education_institute
2225,in,"[666, 416, 687, 429]",MISC
2226,2005,"[688, 416, 732, 429]",MISC
2227,with,"[732, 416, 776, 429]",MISC
2228,an,"[777, 416, 798, 429]",MISC
2229,aggregate,"[799, 416, 897, 429]",MISC
2230,of,"[898, 416, 919, 429]",MISC
2231,60,"[920, 416, 964, 429]",MISC
2232,%,"[920, 416, 964, 429]",MISC
2233,.,"[920, 416, 964, 429]",MISC
2234,-,"[964, 416, 966, 429]",MISC
2235,NL,"[964, 416, 966, 429]",MISC
2236,-,"[964, 416, 966, 429]",MISC
2237,12,"[170, 441, 193, 456]",B-education_degree
2238,Standard,"[194, 441, 289, 456]",MISC
2239,from,"[290, 441, 338, 456]",MISC
2240,Jai,"[338, 441, 373, 456]",MISC
2241,Go,"[374, 441, 445, 456]",MISC
2242,##vin,"[374, 441, 445, 456]",MISC
2243,##d,"[374, 441, 445, 456]",MISC
2244,Go,"[446, 441, 541, 456]",MISC
2245,##pina,"[446, 441, 541, 456]",MISC
2246,##th,"[446, 441, 541, 456]",MISC
2247,higher,"[542, 441, 613, 456]",MISC
2248,secondary,"[614, 441, 722, 456]",MISC
2249,school,"[722, 441, 805, 456]",MISC
2250,",","[722, 441, 805, 456]",MISC
2251,M,"[806, 441, 853, 456]",MISC
2252,##how,"[806, 441, 853, 456]",MISC
2253,in,"[854, 441, 877, 456]",MISC
2254,2002,"[878, 441, 925, 456]",MISC
2255,with,"[926, 441, 973, 456]",MISC
2256,an,"[974, 441, 997, 456]",MISC
2257,-,"[998, 441, 1000, 456]",MISC
2258,NL,"[998, 441, 1000, 456]",MISC
2259,-,"[998, 441, 1000, 456]",MISC
2260,aggregate,"[190, 457, 282, 474]",MISC
2261,of,"[282, 457, 301, 474]",MISC
2262,61,"[302, 457, 343, 474]",MISC
2263,%,"[302, 457, 343, 474]",MISC
2264,.,"[302, 457, 343, 474]",MISC
2265,-,"[343, 457, 345, 474]",MISC
2266,NL,"[343, 457, 345, 474]",MISC
2267,-,"[343, 457, 345, 474]",MISC
2268,Personal,"[105, 556, 188, 575]",B-personal_details_heading
2269,Det,"[188, 556, 271, 575]",I-personal_details_heading
2270,##ails,"[188, 556, 271, 575]",I-personal_details_heading
2271,:,"[188, 556, 271, 575]",I-personal_details_heading
2272,-,"[271, 556, 273, 575]",MISC
2273,NL,"[271, 556, 273, 575]",MISC
2274,-,"[271, 556, 273, 575]",MISC
2275,Name,"[158, 576, 248, 593]",MISC
2276,:,"[249, 576, 270, 593]",MISC
2277,Pre,"[271, 576, 405, 593]",B-name
2278,##eti,"[271, 576, 405, 593]",I-name
2279,Sa,"[407, 576, 609, 593]",I-name
2280,##rva,"[407, 576, 609, 593]",I-name
2281,##riya,"[407, 576, 609, 593]",I-name
2282,-,"[610, 576, 611, 593]",MISC
2283,NL,"[610, 576, 611, 593]",MISC
2284,-,"[610, 576, 611, 593]",MISC
2285,Date,"[158, 593, 236, 612]",MISC
2286,of,"[236, 593, 275, 612]",MISC
2287,birth,"[275, 593, 372, 612]",MISC
2288,:,"[373, 593, 392, 612]",MISC
2289,30,"[392, 593, 431, 612]",MISC
2290,July,"[431, 593, 509, 612]",MISC
2291,1989,"[509, 593, 586, 612]",MISC
2292,-,"[587, 593, 589, 612]",MISC
2293,NL,"[587, 593, 589, 612]",MISC
2294,-,"[587, 593, 589, 612]",MISC
2295,Sex,"[158, 616, 271, 634]",MISC
2296,:,"[272, 616, 309, 634]",MISC
2297,Female,"[310, 616, 537, 634]",MISC
2298,-,"[537, 616, 539, 634]",MISC
2299,NL,"[537, 616, 539, 634]",MISC
2300,-,"[537, 616, 539, 634]",MISC
2301,Languages,"[158, 638, 299, 656]",MISC
2302,Known,"[300, 638, 377, 656]",MISC
2303,:,"[378, 638, 392, 656]",MISC
2304,English,"[394, 638, 503, 656]",MISC
2305,and,"[504, 638, 549, 656]",MISC
2306,Hindi,"[551, 638, 628, 656]",MISC
2307,-,"[629, 638, 631, 656]",MISC
2308,NL,"[629, 638, 631, 656]",MISC
2309,-,"[629, 638, 631, 656]",MISC
2310,Mari,"[158, 661, 287, 678]",MISC
2311,##tal,"[158, 661, 287, 678]",MISC
2312,Status,"[288, 661, 399, 678]",MISC
2313,:,"[399, 661, 417, 678]",MISC
2314,Single,"[417, 661, 529, 678]",MISC
2315,-,"[529, 661, 530, 678]",MISC
2316,NL,"[529, 661, 530, 678]",MISC
2317,-,"[529, 661, 530, 678]",MISC
2318,National,"[158, 679, 384, 697]",MISC
2319,##ity,"[158, 679, 384, 697]",MISC
2320,:,"[385, 679, 404, 697]",MISC
2321,Indian,"[405, 679, 529, 697]",MISC
2322,-,"[529, 679, 530, 697]",MISC
2323,NL,"[529, 679, 530, 697]",MISC
2324,-,"[529, 679, 530, 697]",MISC
2325,Pass,"[158, 697, 320, 715]",MISC
2326,##port,"[158, 697, 320, 715]",MISC
2327,No,"[320, 697, 380, 715]",MISC
2328,.,"[320, 697, 380, 715]",MISC
2329,:,"[381, 697, 401, 715]",MISC
2330,H,"[402, 697, 564, 715]",MISC
2331,##25,"[402, 697, 564, 715]",MISC
2332,##10,"[402, 697, 564, 715]",MISC
2333,##6,"[402, 697, 564, 715]",MISC
2334,##9,"[402, 697, 564, 715]",MISC
2335,##5,"[402, 697, 564, 715]",MISC
2336,-,"[564, 697, 566, 715]",MISC
2337,NL,"[564, 697, 566, 715]",MISC
2338,-,"[564, 697, 566, 715]",MISC
2339,5,"[989, 981, 1000, 1000]",MISC
2340,-,"[1000, 981, 1001, 1000]",MISC
2341,NL,"[1000, 981, 1001, 1000]",MISC
2342,-,"[1000, 981, 1001, 1000]",MISC
