,token,box,label
0,Mohammed,"[396, 99, 518, 125]",B-name
1,Ha,"[519, 99, 580, 125]",I-name
2,##ja,"[519, 99, 580, 125]",I-name
3,Ba,"[581, 99, 734, 125]",I-name
4,##hur,"[581, 99, 734, 125]",I-name
5,##ude,"[581, 99, 734, 125]",I-name
6,##en,"[581, 99, 734, 125]",I-name
7,-,"[735, 99, 737, 125]",MISC
8,NL,"[735, 99, 737, 125]",MISC
9,-,"[735, 99, 737, 125]",MISC
10,54,"[300, 122, 333, 142]",MISC
11,",","[300, 122, 333, 142]",MISC
12,Peel,"[333, 122, 389, 142]",MISC
13,##i,"[333, 122, 389, 142]",MISC
14,Am,"[390, 122, 446, 142]",MISC
15,##man,"[390, 122, 446, 142]",MISC
16,Ko,"[447, 122, 491, 142]",MISC
17,##il,"[447, 122, 491, 142]",MISC
18,Street,"[492, 122, 570, 142]",MISC
19,",","[492, 122, 570, 142]",MISC
20,Tara,"[571, 122, 671, 142]",MISC
21,##mani,"[571, 122, 671, 142]",MISC
22,",","[571, 122, 671, 142]",MISC
23,Chennai,"[673, 122, 750, 142]",MISC
24,–,"[752, 122, 763, 142]",MISC
25,600,"[763, 122, 796, 142]",MISC
26,113,"[797, 122, 830, 142]",MISC
27,-,"[831, 122, 833, 142]",MISC
28,NL,"[831, 122, 833, 142]",MISC
29,-,"[831, 122, 833, 142]",MISC
30,Mobile,"[333, 139, 407, 161]",MISC
31,:,"[333, 139, 407, 161]",MISC
32,+,"[333, 139, 407, 161]",B-phones_phone
33,91,"[333, 139, 407, 161]",I-phones_phone
34,900,"[407, 139, 439, 161]",I-phones_phone
35,##37,"[407, 139, 439, 161]",I-phones_phone
36,95,"[439, 139, 491, 161]",I-phones_phone
37,##10,"[439, 139, 491, 161]",I-phones_phone
38,##5,"[439, 139, 491, 161]",I-phones_phone
39,|,"[545, 139, 554, 161]",MISC
40,E,"[556, 139, 630, 161]",MISC
41,-,"[556, 139, 630, 161]",MISC
42,mail,"[556, 139, 630, 161]",MISC
43,:,"[556, 139, 630, 161]",MISC
44,v,"[630, 139, 798, 161]",B-emails_email
45,##hm,"[630, 139, 798, 161]",I-emails_email
46,##h,"[630, 139, 798, 161]",I-emails_email
47,##0,"[630, 139, 798, 161]",I-emails_email
48,##7,"[630, 139, 798, 161]",I-emails_email
49,@,"[630, 139, 798, 161]",I-emails_email
50,g,"[630, 139, 798, 161]",I-emails_email
51,##mail,"[630, 139, 798, 161]",I-emails_email
52,.,"[630, 139, 798, 161]",I-emails_email
53,com,"[630, 139, 798, 161]",I-emails_email
54,-,"[800, 139, 801, 161]",MISC
55,NL,"[800, 139, 801, 161]",MISC
56,-,"[800, 139, 801, 161]",MISC
57,Career,"[133, 177, 198, 200]",B-summary_heading
58,O,"[198, 177, 294, 200]",I-summary_heading
59,##bject,"[198, 177, 294, 200]",I-summary_heading
60,##ive,"[198, 177, 294, 200]",I-summary_heading
61,-,"[296, 177, 298, 200]",MISC
62,NL,"[296, 177, 298, 200]",MISC
63,-,"[296, 177, 298, 200]",MISC
64,An,"[200, 210, 220, 232]",MISC
65,enthusiastic,"[221, 210, 351, 232]",MISC
66,Des,"[353, 210, 428, 232]",B-employer_role
67,##kt,"[353, 210, 428, 232]",I-employer_role
68,##op,"[353, 210, 428, 232]",I-employer_role
69,Support,"[429, 210, 505, 232]",I-employer_role
70,Engineer,"[506, 210, 593, 232]",I-employer_role
71,with,"[593, 210, 636, 232]",MISC
72,the,"[637, 210, 668, 232]",MISC
73,necessary,"[670, 210, 768, 232]",MISC
74,drive,"[768, 210, 822, 232]",MISC
75,and,"[823, 210, 854, 232]",MISC
76,determination,"[856, 210, 996, 232]",MISC
77,-,"[998, 210, 1000, 232]",MISC
78,NL,"[998, 210, 1000, 232]",MISC
79,-,"[998, 210, 1000, 232]",MISC
80,needed,"[133, 228, 196, 251]",MISC
81,to,"[197, 228, 217, 251]",MISC
82,resolve,"[218, 228, 292, 251]",MISC
83,complex,"[293, 228, 367, 251]",MISC
84,networking,"[368, 228, 473, 251]",MISC
85,issues,"[474, 228, 549, 251]",MISC
86,.,"[474, 228, 549, 251]",MISC
87,Po,"[549, 228, 655, 251]",MISC
88,##sses,"[549, 228, 655, 251]",MISC
89,##sing,"[549, 228, 655, 251]",MISC
90,effective,"[656, 228, 750, 251]",MISC
91,organizational,"[752, 228, 900, 251]",MISC
92,skills,"[902, 228, 965, 251]",MISC
93,and,"[966, 228, 997, 251]",MISC
94,-,"[998, 228, 1000, 251]",MISC
95,NL,"[998, 228, 1000, 251]",MISC
96,-,"[998, 228, 1000, 251]",MISC
97,excellent,"[133, 248, 231, 270]",MISC
98,working,"[231, 248, 307, 270]",MISC
99,knowledge,"[308, 248, 406, 270]",MISC
100,of,"[407, 248, 427, 270]",MISC
101,networking,"[428, 248, 538, 270]",MISC
102,technologies,"[538, 248, 668, 270]",MISC
103,and,"[669, 248, 701, 270]",MISC
104,having,"[702, 248, 767, 270]",MISC
105,a,"[768, 248, 777, 270]",MISC
106,commitment,"[779, 248, 888, 270]",MISC
107,to,"[888, 248, 909, 270]",MISC
108,keep,"[910, 248, 953, 270]",MISC
109,up,"[954, 248, 974, 270]",MISC
110,to,"[976, 248, 996, 270]",MISC
111,-,"[998, 248, 1000, 270]",MISC
112,NL,"[998, 248, 1000, 270]",MISC
113,-,"[998, 248, 1000, 270]",MISC
114,date,"[133, 267, 172, 290]",MISC
115,with,"[173, 267, 212, 290]",MISC
116,the,"[213, 267, 242, 290]",MISC
117,latest,"[243, 267, 302, 290]",MISC
118,developments,"[303, 267, 432, 290]",MISC
119,.,"[303, 267, 432, 290]",MISC
120,-,"[433, 267, 435, 290]",MISC
121,NL,"[433, 267, 435, 290]",MISC
122,-,"[433, 267, 435, 290]",MISC
123,Key,"[133, 301, 164, 324]",B-skills_heading
124,Skills,"[164, 301, 227, 324]",I-skills_heading
125,-,"[227, 301, 229, 324]",MISC
126,NL,"[227, 301, 229, 324]",MISC
127,-,"[227, 301, 229, 324]",MISC
128,Operating,"[179, 343, 290, 362]",MISC
129,System,"[291, 343, 378, 362]",MISC
130,:,"[291, 343, 378, 362]",MISC
131,Windows,"[379, 343, 466, 362]",MISC
132,7,"[467, 343, 478, 362]",MISC
133,/,"[479, 343, 490, 362]",MISC
134,10,"[492, 343, 516, 362]",MISC
135,&,"[517, 343, 528, 362]",MISC
136,Windows,"[529, 343, 616, 362]",MISC
137,Server,"[617, 343, 691, 362]",MISC
138,2008,"[692, 343, 742, 362]",MISC
139,/,"[742, 343, 754, 362]",MISC
140,2012,"[755, 343, 805, 362]",MISC
141,-,"[805, 343, 807, 362]",MISC
142,NL,"[805, 343, 807, 362]",MISC
143,-,"[805, 343, 807, 362]",MISC
144,Basic,"[178, 362, 237, 382]",MISC
145,knowledge,"[237, 362, 343, 382]",MISC
146,in,"[344, 362, 366, 382]",MISC
147,Linux,"[368, 362, 427, 382]",MISC
148,operating,"[427, 362, 532, 382]",MISC
149,System,"[534, 362, 604, 382]",MISC
150,(,"[605, 362, 686, 382]",MISC
151,U,"[605, 362, 686, 382]",MISC
152,##bu,"[605, 362, 686, 382]",MISC
153,##nt,"[605, 362, 686, 382]",MISC
154,##u,"[605, 362, 686, 382]",MISC
155,&,"[688, 362, 699, 382]",MISC
156,R,"[700, 362, 759, 382]",MISC
157,##H,"[700, 362, 759, 382]",MISC
158,##EL,"[700, 362, 759, 382]",MISC
159,),"[700, 362, 759, 382]",MISC
160,-,"[759, 362, 761, 382]",MISC
161,NL,"[759, 362, 761, 382]",MISC
162,-,"[759, 362, 761, 382]",MISC
163,A,"[179, 383, 270, 401]",MISC
164,##bility,"[179, 383, 270, 401]",MISC
165,to,"[271, 383, 297, 401]",MISC
166,deploy,"[298, 383, 375, 401]",MISC
167,AD,"[376, 383, 402, 401]",MISC
168,DS,"[403, 383, 442, 401]",MISC
169,",","[403, 383, 442, 401]",MISC
170,GP,"[442, 383, 494, 401]",MISC
171,##O,"[442, 383, 494, 401]",MISC
172,",","[442, 383, 494, 401]",MISC
173,D,"[495, 383, 547, 401]",MISC
174,##NS,"[495, 383, 547, 401]",MISC
175,",","[495, 383, 547, 401]",MISC
176,D,"[547, 383, 612, 401]",MISC
177,##HC,"[547, 383, 612, 401]",MISC
178,##P,"[547, 383, 612, 401]",MISC
179,",","[547, 383, 612, 401]",MISC
180,D,"[613, 383, 665, 401]",MISC
181,##FS,"[613, 383, 665, 401]",MISC
182,",","[613, 383, 665, 401]",MISC
183,F,"[665, 383, 717, 401]",MISC
184,##SR,"[665, 383, 717, 401]",MISC
185,##M,"[665, 383, 717, 401]",MISC
186,-,"[718, 383, 720, 401]",MISC
187,NL,"[718, 383, 720, 401]",MISC
188,-,"[718, 383, 720, 401]",MISC
189,Basic,"[177, 403, 231, 422]",MISC
190,knowledge,"[231, 403, 328, 422]",MISC
191,in,"[329, 403, 349, 422]",MISC
192,migration,"[350, 403, 447, 422]",MISC
193,of,"[448, 403, 468, 422]",MISC
194,virtual,"[470, 403, 544, 422]",MISC
195,machine,"[546, 403, 620, 422]",MISC
196,from,"[621, 403, 664, 422]",MISC
197,Physical,"[665, 403, 750, 422]",MISC
198,to,"[752, 403, 772, 422]",MISC
199,virtual,"[773, 403, 847, 422]",MISC
200,and,"[849, 403, 881, 422]",MISC
201,Vice,"[882, 403, 924, 422]",MISC
202,versa,"[925, 403, 979, 422]",MISC
203,-,"[979, 403, 981, 422]",MISC
204,NL,"[979, 403, 981, 422]",MISC
205,-,"[979, 403, 981, 422]",MISC
206,Con,"[177, 423, 318, 442]",MISC
207,##fi,"[177, 423, 318, 442]",MISC
208,##gu,"[177, 423, 318, 442]",MISC
209,##ration,"[177, 423, 318, 442]",MISC
210,of,"[319, 423, 339, 442]",MISC
211,C,"[341, 423, 394, 442]",MISC
212,##isco,"[341, 423, 394, 442]",MISC
213,route,"[395, 423, 471, 442]",MISC
214,##rs,"[395, 423, 471, 442]",MISC
215,&,"[472, 423, 481, 442]",MISC
216,S,"[483, 423, 570, 442]",MISC
217,##witch,"[483, 423, 570, 442]",MISC
218,##es,"[483, 423, 570, 442]",MISC
219,-,"[570, 423, 572, 442]",MISC
220,NL,"[570, 423, 572, 442]",MISC
221,-,"[570, 423, 572, 442]",MISC
222,Good,"[179, 443, 227, 463]",MISC
223,knowledge,"[228, 443, 339, 463]",MISC
224,in,"[340, 443, 364, 463]",MISC
225,configuration,"[365, 443, 526, 463]",MISC
226,of,"[526, 443, 550, 463]",MISC
227,VP,"[551, 443, 599, 463]",MISC
228,##N,"[551, 443, 599, 463]",MISC
229,",","[551, 443, 599, 463]",MISC
230,V,"[601, 443, 662, 463]",MISC
231,##LA,"[601, 443, 662, 463]",MISC
232,##N,"[601, 443, 662, 463]",MISC
233,",","[601, 443, 662, 463]",MISC
234,AC,"[663, 443, 711, 463]",MISC
235,##L,"[663, 443, 711, 463]",MISC
236,",","[663, 443, 711, 463]",MISC
237,N,"[712, 443, 749, 463]",MISC
238,##AT,"[712, 443, 749, 463]",MISC
239,-,"[750, 443, 751, 463]",MISC
240,NL,"[750, 443, 751, 463]",MISC
241,-,"[750, 443, 751, 463]",MISC
242,R,"[179, 464, 266, 483]",MISC
243,##out,"[179, 464, 266, 483]",MISC
244,##ing,"[179, 464, 266, 483]",MISC
245,protocol,"[267, 464, 380, 483]",MISC
246,:,"[267, 464, 380, 483]",MISC
247,R,"[381, 464, 418, 483]",MISC
248,##IP,"[381, 464, 418, 483]",MISC
249,v,"[419, 464, 456, 483]",MISC
250,##2,"[419, 464, 456, 483]",MISC
251,",","[419, 464, 456, 483]",MISC
252,E,"[457, 464, 520, 483]",MISC
253,##IG,"[457, 464, 520, 483]",MISC
254,##RP,"[457, 464, 520, 483]",MISC
255,&,"[520, 464, 531, 483]",MISC
256,OS,"[532, 464, 582, 483]",MISC
257,##P,"[532, 464, 582, 483]",MISC
258,##F,"[532, 464, 582, 483]",MISC
259,-,"[583, 464, 585, 483]",MISC
260,NL,"[583, 464, 585, 483]",MISC
261,-,"[583, 464, 585, 483]",MISC
262,Hands,"[177, 483, 262, 503]",MISC
263,-,"[177, 483, 262, 503]",MISC
264,on,"[177, 483, 262, 503]",MISC
265,experience,"[263, 483, 368, 503]",MISC
266,in,"[370, 483, 390, 503]",MISC
267,replacing,"[391, 483, 488, 503]",MISC
268,cables,"[488, 483, 551, 503]",MISC
269,and,"[552, 483, 584, 503]",MISC
270,followed,"[584, 483, 670, 503]",MISC
271,color,"[670, 483, 722, 503]",MISC
272,coding,"[724, 483, 787, 503]",MISC
273,procedure,"[788, 483, 884, 503]",MISC
274,-,"[885, 483, 887, 503]",MISC
275,NL,"[885, 483, 887, 503]",MISC
276,-,"[885, 483, 887, 503]",MISC
277,Employment,"[133, 520, 248, 543]",B-work_experience_heading
278,History,"[249, 520, 331, 543]",I-work_experience_heading
279,-,"[331, 520, 333, 543]",MISC
280,NL,"[331, 520, 333, 543]",MISC
281,-,"[331, 520, 333, 543]",MISC
282,Des,"[133, 560, 218, 581]",B-employer_role
283,##kt,"[133, 560, 218, 581]",I-employer_role
284,##op,"[133, 560, 218, 581]",I-employer_role
285,Support,"[220, 560, 305, 581]",I-employer_role
286,Engineer,"[306, 560, 417, 581]",I-employer_role
287,",","[306, 560, 417, 581]",MISC
288,G,"[418, 560, 455, 581]",B-employer_company_name
289,##yr,"[418, 560, 455, 581]",I-employer_company_name
290,Technology,"[455, 560, 577, 581]",I-employer_company_name
291,LLC,"[579, 560, 627, 581]",I-employer_company_name
292,",","[579, 560, 627, 581]",MISC
293,Dubai,"[629, 560, 690, 581]",MISC
294,–,"[691, 560, 702, 581]",MISC
295,UAE,"[703, 560, 740, 581]",MISC
296,-,"[740, 560, 742, 581]",MISC
297,NL,"[740, 560, 742, 581]",MISC
298,-,"[740, 560, 742, 581]",MISC
299,(,"[133, 580, 229, 601]",MISC
300,January,"[133, 580, 229, 601]",MISC
301,2016,"[231, 580, 279, 601]",MISC
302,–,"[280, 580, 291, 601]",MISC
303,May,"[292, 580, 327, 601]",MISC
304,2016,"[329, 580, 390, 601]",MISC
305,),"[329, 580, 390, 601]",MISC
306,-,"[390, 580, 392, 601]",MISC
307,NL,"[390, 580, 392, 601]",MISC
308,-,"[390, 580, 392, 601]",MISC
309,Role,"[133, 616, 183, 640]",MISC
310,##s,"[133, 616, 183, 640]",MISC
311,and,"[184, 616, 213, 640]",MISC
312,Re,"[214, 616, 386, 640]",MISC
313,##sp,"[214, 616, 386, 640]",MISC
314,##ons,"[214, 616, 386, 640]",MISC
315,##ibi,"[214, 616, 386, 640]",MISC
316,##lities,"[214, 616, 386, 640]",MISC
317,:,"[214, 616, 386, 640]",MISC
318,-,"[387, 616, 388, 640]",MISC
319,NL,"[387, 616, 388, 640]",MISC
320,-,"[387, 616, 388, 640]",MISC
321,Hand,"[177, 656, 253, 677]",MISC
322,##led,"[177, 656, 253, 677]",MISC
323,routine,"[255, 656, 331, 677]",MISC
324,desktop,"[332, 656, 408, 677]",MISC
325,support,"[410, 656, 486, 677]",MISC
326,issues,"[488, 656, 564, 677]",MISC
327,",","[488, 656, 564, 677]",MISC
328,which,"[565, 656, 619, 677]",MISC
329,include,"[621, 656, 697, 677]",MISC
330,installing,"[698, 656, 808, 677]",MISC
331,and,"[809, 656, 841, 677]",MISC
332,reins,"[842, 656, 974, 677]",MISC
333,##tal,"[842, 656, 974, 677]",MISC
334,##ling,"[842, 656, 974, 677]",MISC
335,of,"[975, 656, 996, 677]",MISC
336,-,"[998, 656, 1000, 677]",MISC
337,NL,"[998, 656, 1000, 677]",MISC
338,-,"[998, 656, 1000, 677]",MISC
339,Operating,"[200, 675, 287, 697]",MISC
340,system,"[288, 675, 346, 697]",MISC
341,and,"[347, 675, 375, 697]",MISC
342,applications,"[377, 675, 505, 697]",MISC
343,",","[377, 675, 505, 697]",MISC
344,up,"[505, 675, 583, 697]",MISC
345,##dating,"[505, 675, 583, 697]",MISC
346,anti,"[584, 675, 682, 697]",MISC
347,##virus,"[584, 675, 682, 697]",MISC
348,.,"[584, 675, 682, 697]",MISC
349,-,"[683, 675, 685, 697]",MISC
350,NL,"[683, 675, 685, 697]",MISC
351,-,"[683, 675, 685, 697]",MISC
352,Pro,"[177, 695, 266, 718]",MISC
353,##vide,"[177, 695, 266, 718]",MISC
354,##d,"[177, 695, 266, 718]",MISC
355,on,"[266, 695, 333, 718]",MISC
356,##site,"[266, 695, 333, 718]",MISC
357,and,"[333, 695, 366, 718]",MISC
358,remote,"[366, 695, 433, 718]",MISC
359,support,"[433, 695, 511, 718]",MISC
360,to,"[511, 695, 533, 718]",MISC
361,users,"[533, 695, 588, 718]",MISC
362,-,"[588, 695, 590, 718]",MISC
363,NL,"[588, 695, 590, 718]",MISC
364,-,"[588, 695, 590, 718]",MISC
365,Updated,"[177, 716, 255, 737]",MISC
366,and,"[255, 716, 288, 737]",MISC
367,modified,"[288, 716, 377, 737]",MISC
368,price,"[377, 716, 477, 737]",MISC
369,##list,"[377, 716, 477, 737]",MISC
370,in,"[477, 716, 500, 737]",MISC
371,em,"[500, 716, 555, 737]",MISC
372,##bed,"[500, 716, 555, 737]",MISC
373,software,"[555, 716, 644, 737]",MISC
374,-,"[644, 716, 646, 737]",MISC
375,NL,"[644, 716, 646, 737]",MISC
376,-,"[644, 716, 646, 737]",MISC
377,Gene,"[178, 737, 279, 758]",MISC
378,##rated,"[178, 737, 279, 758]",MISC
379,weekly,"[280, 737, 347, 758]",MISC
380,&,"[349, 737, 360, 758]",MISC
381,monthly,"[360, 737, 440, 758]",MISC
382,reports,"[440, 737, 520, 758]",MISC
383,and,"[520, 737, 553, 758]",MISC
384,exported,"[554, 737, 645, 758]",MISC
385,to,"[646, 737, 668, 758]",MISC
386,ex,"[668, 737, 724, 758]",MISC
387,##cel,"[668, 737, 724, 758]",MISC
388,-,"[725, 737, 727, 758]",MISC
389,NL,"[725, 737, 727, 758]",MISC
390,-,"[725, 737, 727, 758]",MISC
391,Per,"[177, 757, 275, 779]",MISC
392,##formed,"[177, 757, 275, 779]",MISC
393,new,"[277, 757, 308, 779]",MISC
394,user,"[310, 757, 353, 779]",MISC
395,creation,"[354, 757, 442, 779]",MISC
396,for,"[443, 757, 475, 779]",MISC
397,newly,"[476, 757, 530, 779]",MISC
398,hired,"[532, 757, 585, 779]",MISC
399,in,"[587, 757, 607, 779]",MISC
400,Active,"[609, 757, 674, 779]",MISC
401,Directory,"[676, 757, 774, 779]",MISC
402,-,"[775, 757, 777, 779]",MISC
403,NL,"[775, 757, 777, 779]",MISC
404,-,"[775, 757, 777, 779]",MISC
405,In,"[177, 778, 273, 799]",MISC
406,##stal,"[177, 778, 273, 799]",MISC
407,##led,"[177, 778, 273, 799]",MISC
408,necessary,"[274, 778, 370, 799]",MISC
409,applications,"[371, 778, 499, 799]",MISC
410,and,"[500, 778, 532, 799]",MISC
411,OS,"[532, 778, 553, 799]",MISC
412,for,"[554, 778, 585, 799]",MISC
413,newly,"[586, 778, 640, 799]",MISC
414,hired,"[640, 778, 694, 799]",MISC
415,-,"[694, 778, 696, 799]",MISC
416,NL,"[694, 778, 696, 799]",MISC
417,-,"[694, 778, 696, 799]",MISC
418,Created,"[177, 799, 251, 820]",MISC
419,Group,"[251, 799, 303, 820]",MISC
420,Pol,"[304, 799, 387, 820]",MISC
421,##ici,"[304, 799, 387, 820]",MISC
422,##es,"[304, 799, 387, 820]",MISC
423,according,"[388, 799, 483, 820]",MISC
424,to,"[484, 799, 504, 820]",MISC
425,corporate,"[505, 799, 599, 820]",MISC
426,rules,"[600, 799, 652, 820]",MISC
427,and,"[653, 799, 685, 820]",MISC
428,regulations,"[685, 799, 800, 820]",MISC
429,-,"[801, 799, 803, 820]",MISC
430,NL,"[801, 799, 803, 820]",MISC
431,-,"[801, 799, 803, 820]",MISC
432,Mail,"[177, 818, 220, 841]",MISC
433,C,"[221, 818, 297, 841]",MISC
434,##lient,"[221, 818, 297, 841]",MISC
435,##s,"[221, 818, 297, 841]",MISC
436,configuration,"[297, 818, 449, 841]",MISC
437,",","[297, 818, 449, 841]",MISC
438,backup,"[451, 818, 515, 841]",MISC
439,&,"[516, 818, 525, 841]",MISC
440,Trouble,"[527, 818, 690, 841]",MISC
441,##sh,"[527, 818, 690, 841]",MISC
442,##oot,"[527, 818, 690, 841]",MISC
443,##ing,"[527, 818, 690, 841]",MISC
444,(,"[691, 818, 723, 841]",MISC
445,MS,"[691, 818, 723, 841]",MISC
446,Out,"[724, 818, 811, 841]",MISC
447,##look,"[724, 818, 811, 841]",MISC
448,",","[724, 818, 811, 841]",MISC
449,Out,"[811, 818, 887, 841]",MISC
450,##look,"[811, 818, 887, 841]",MISC
451,Express,"[888, 818, 975, 841]",MISC
452,),"[888, 818, 975, 841]",MISC
453,-,"[975, 818, 977, 841]",MISC
454,NL,"[975, 818, 977, 841]",MISC
455,-,"[975, 818, 977, 841]",MISC
456,Back,"[178, 839, 246, 860]",MISC
457,##up,"[178, 839, 246, 860]",MISC
458,and,"[248, 839, 281, 860]",MISC
459,restore,"[282, 839, 362, 860]",MISC
460,of,"[364, 839, 386, 860]",MISC
461,Server,"[387, 839, 456, 860]",MISC
462,-,"[457, 839, 459, 860]",MISC
463,NL,"[457, 839, 459, 860]",MISC
464,-,"[457, 839, 459, 860]",MISC
465,Local,"[177, 860, 229, 881]",MISC
466,and,"[229, 860, 261, 881]",MISC
467,Network,"[261, 860, 333, 881]",MISC
468,Print,"[334, 860, 406, 881]",MISC
469,##er,"[334, 860, 406, 881]",MISC
470,configuration,"[408, 860, 554, 881]",MISC
471,",","[408, 860, 554, 881]",MISC
472,troubles,"[555, 860, 712, 881]",MISC
473,##hoot,"[555, 860, 712, 881]",MISC
474,##ing,"[555, 860, 712, 881]",MISC
475,-,"[712, 860, 714, 881]",MISC
476,NL,"[712, 860, 714, 881]",MISC
477,-,"[712, 860, 714, 881]",MISC
478,Software,"[177, 880, 258, 902]",MISC
479,troubles,"[260, 880, 415, 902]",MISC
480,##hoot,"[260, 880, 415, 902]",MISC
481,##ing,"[260, 880, 415, 902]",MISC
482,update,"[415, 880, 476, 902]",MISC
483,and,"[477, 880, 507, 902]",MISC
484,patch,"[508, 880, 560, 902]",MISC
485,installation,"[560, 880, 684, 902]",MISC
486,-,"[685, 880, 687, 902]",MISC
487,NL,"[685, 880, 687, 902]",MISC
488,-,"[685, 880, 687, 902]",MISC
489,Man,"[178, 900, 257, 921]",MISC
490,##aged,"[178, 900, 257, 921]",MISC
491,Anti,"[259, 900, 363, 921]",MISC
492,##virus,"[259, 900, 363, 921]",MISC
493,(,"[363, 900, 478, 921]",MISC
494,S,"[363, 900, 478, 921]",MISC
495,##yman,"[363, 900, 478, 921]",MISC
496,##tec,"[363, 900, 478, 921]",MISC
497,),"[363, 900, 478, 921]",MISC
498,-,"[479, 900, 481, 921]",MISC
499,NL,"[479, 900, 481, 921]",MISC
500,-,"[479, 900, 481, 921]",MISC
501,Issue,"[178, 921, 235, 942]",MISC
502,H,"[236, 921, 282, 942]",MISC
503,/,"[236, 921, 282, 942]",MISC
504,W,"[236, 921, 282, 942]",MISC
505,",","[236, 921, 282, 942]",MISC
506,S,"[282, 921, 316, 942]",MISC
507,/,"[282, 921, 316, 942]",MISC
508,W,"[282, 921, 316, 942]",MISC
509,and,"[317, 921, 350, 942]",MISC
510,accessories,"[352, 921, 478, 942]",MISC
511,to,"[479, 921, 502, 942]",MISC
512,users,"[503, 921, 560, 942]",MISC
513,-,"[561, 921, 562, 942]",MISC
514,NL,"[561, 921, 562, 942]",MISC
515,-,"[561, 921, 562, 942]",MISC
516,Doc,"[177, 941, 287, 963]",MISC
517,##ume,"[177, 941, 287, 963]",MISC
518,##nted,"[177, 941, 287, 963]",MISC
519,and,"[288, 941, 319, 963]",MISC
520,maintained,"[321, 941, 430, 963]",MISC
521,supply,"[432, 941, 497, 963]",MISC
522,of,"[498, 941, 519, 963]",MISC
523,all,"[521, 941, 552, 963]",MISC
524,required,"[554, 941, 641, 963]",MISC
525,inventory,"[642, 941, 741, 963]",MISC
526,-,"[742, 941, 744, 963]",MISC
527,NL,"[742, 941, 744, 963]",MISC
528,-,"[742, 941, 744, 963]",MISC
529,IT,"[133, 54, 157, 76]",B-employer_role
530,Engineer,"[157, 54, 267, 76]",I-employer_role
531,",","[157, 54, 267, 76]",MISC
532,Al,"[267, 54, 292, 76]",B-employer_company_name
533,T,"[292, 54, 364, 76]",I-employer_company_name
534,##hari,"[292, 54, 364, 76]",I-employer_company_name
535,##q,"[292, 54, 364, 76]",I-employer_company_name
536,transport,"[365, 54, 475, 76]",I-employer_company_name
537,LLC,"[476, 54, 524, 76]",I-employer_company_name
538,",","[476, 54, 524, 76]",MISC
539,Dubai,"[525, 54, 586, 76]",MISC
540,-,"[586, 54, 597, 76]",MISC
541,UAE,"[598, 54, 633, 76]",MISC
542,-,"[635, 54, 637, 76]",MISC
543,NL,"[635, 54, 637, 76]",MISC
544,-,"[635, 54, 637, 76]",MISC
545,(,"[133, 75, 251, 96]",MISC
546,September,"[133, 75, 251, 96]",MISC
547,2013,"[253, 75, 299, 96]",MISC
548,–,"[300, 75, 312, 96]",MISC
549,December,"[312, 75, 407, 96]",MISC
550,2015,"[408, 75, 467, 96]",MISC
551,),"[408, 75, 467, 96]",MISC
552,-,"[468, 75, 470, 96]",MISC
553,NL,"[468, 75, 470, 96]",MISC
554,-,"[468, 75, 470, 96]",MISC
555,Role,"[133, 111, 183, 133]",MISC
556,##s,"[133, 111, 183, 133]",MISC
557,and,"[184, 111, 213, 133]",MISC
558,Re,"[214, 111, 386, 133]",MISC
559,##sp,"[214, 111, 386, 133]",MISC
560,##ons,"[214, 111, 386, 133]",MISC
561,##ibi,"[214, 111, 386, 133]",MISC
562,##lities,"[214, 111, 386, 133]",MISC
563,:,"[214, 111, 386, 133]",MISC
564,-,"[387, 111, 388, 133]",MISC
565,NL,"[387, 111, 388, 133]",MISC
566,-,"[387, 111, 388, 133]",MISC
567,Pro,"[177, 152, 260, 172]",MISC
568,##vide,"[177, 152, 260, 172]",MISC
569,##d,"[177, 152, 260, 172]",MISC
570,technical,"[261, 152, 356, 172]",MISC
571,support,"[356, 152, 428, 172]",MISC
572,to,"[430, 152, 450, 172]",MISC
573,the,"[451, 152, 483, 172]",MISC
574,issues,"[483, 152, 546, 172]",MISC
575,related,"[546, 152, 618, 172]",MISC
576,to,"[620, 152, 640, 172]",MISC
577,Computer,"[641, 152, 725, 172]",MISC
578,hardware,"[726, 152, 903, 172]",MISC
579,/,"[726, 152, 903, 172]",MISC
580,software,"[726, 152, 903, 172]",MISC
581,-,"[905, 152, 907, 172]",MISC
582,NL,"[905, 152, 907, 172]",MISC
583,-,"[905, 152, 907, 172]",MISC
584,In,"[177, 171, 275, 193]",MISC
585,##stal,"[177, 171, 275, 193]",MISC
586,##led,"[177, 171, 275, 193]",MISC
587,and,"[275, 171, 307, 193]",MISC
588,upgraded,"[308, 171, 395, 193]",MISC
589,PC,"[395, 171, 416, 193]",MISC
590,hardware,"[417, 171, 515, 193]",MISC
591,",","[417, 171, 515, 193]",MISC
592,Software,"[515, 171, 613, 193]",MISC
593,",","[515, 171, 613, 193]",MISC
594,and,"[613, 171, 645, 193]",MISC
595,peripheral,"[646, 171, 754, 193]",MISC
596,components,"[755, 171, 863, 193]",MISC
597,-,"[864, 171, 866, 193]",MISC
598,NL,"[864, 171, 866, 193]",MISC
599,-,"[864, 171, 866, 193]",MISC
600,I,"[178, 192, 304, 213]",MISC
601,##mple,"[178, 192, 304, 213]",MISC
602,##mented,"[178, 192, 304, 213]",MISC
603,the,"[304, 192, 337, 213]",MISC
604,new,"[339, 192, 372, 213]",MISC
605,La,"[373, 192, 532, 213]",MISC
606,##pt,"[373, 192, 532, 213]",MISC
607,##op,"[373, 192, 532, 213]",MISC
608,/,"[373, 192, 532, 213]",MISC
609,desktop,"[373, 192, 532, 213]",MISC
610,and,"[534, 192, 567, 213]",MISC
611,End,"[568, 192, 602, 213]",MISC
612,user,"[603, 192, 647, 213]",MISC
613,devices,"[649, 192, 728, 213]",MISC
614,-,"[729, 192, 731, 213]",MISC
615,NL,"[729, 192, 731, 213]",MISC
616,-,"[729, 192, 731, 213]",MISC
617,In,"[178, 213, 288, 234]",MISC
618,##stal,"[178, 213, 288, 234]",MISC
619,##led,"[178, 213, 288, 234]",MISC
620,Operating,"[289, 213, 399, 234]",MISC
621,Systems,"[400, 213, 485, 234]",MISC
622,(,"[486, 213, 535, 234]",MISC
623,X,"[486, 213, 535, 234]",MISC
624,##P,"[486, 213, 535, 234]",MISC
625,",","[486, 213, 535, 234]",MISC
626,W,"[536, 213, 571, 234]",MISC
627,##IN,"[536, 213, 571, 234]",MISC
628,7,"[573, 213, 584, 234]",MISC
629,&,"[585, 213, 596, 234]",MISC
630,W,"[597, 213, 632, 234]",MISC
631,##IN,"[597, 213, 632, 234]",MISC
632,8,"[634, 213, 658, 234]",MISC
633,),"[634, 213, 658, 234]",MISC
634,-,"[659, 213, 661, 234]",MISC
635,NL,"[659, 213, 661, 234]",MISC
636,-,"[659, 213, 661, 234]",MISC
637,Con,"[177, 232, 288, 255]",MISC
638,##figured,"[177, 232, 288, 255]",MISC
639,and,"[288, 232, 322, 255]",MISC
640,troubles,"[322, 232, 455, 255]",MISC
641,##hoot,"[322, 232, 455, 255]",MISC
642,Em,"[455, 232, 511, 255]",MISC
643,##ail,"[455, 232, 511, 255]",MISC
644,client,"[511, 232, 577, 255]",MISC
645,(,"[577, 232, 611, 255]",MISC
646,MS,"[577, 232, 611, 255]",MISC
647,Out,"[611, 232, 700, 255]",MISC
648,##look,"[611, 232, 700, 255]",MISC
649,),"[611, 232, 700, 255]",MISC
650,-,"[700, 232, 701, 255]",MISC
651,NL,"[700, 232, 701, 255]",MISC
652,-,"[700, 232, 701, 255]",MISC
653,In,"[177, 253, 269, 274]",MISC
654,##stal,"[177, 253, 269, 274]",MISC
655,##led,"[177, 253, 269, 274]",MISC
656,local,"[271, 253, 323, 274]",MISC
657,and,"[324, 253, 355, 274]",MISC
658,network,"[355, 253, 427, 274]",MISC
659,printer,"[429, 253, 512, 274]",MISC
660,##s,"[429, 253, 512, 274]",MISC
661,-,"[512, 253, 514, 274]",MISC
662,NL,"[512, 253, 514, 274]",MISC
663,-,"[512, 253, 514, 274]",MISC
664,Re,"[178, 274, 268, 295]",MISC
665,##sol,"[178, 274, 268, 295]",MISC
666,##ved,"[178, 274, 268, 295]",MISC
667,technical,"[269, 274, 371, 295]",MISC
668,problems,"[372, 274, 463, 295]",MISC
669,with,"[464, 274, 509, 295]",MISC
670,LA,"[510, 274, 543, 295]",MISC
671,##N,"[510, 274, 543, 295]",MISC
672,and,"[544, 274, 578, 295]",MISC
673,other,"[579, 274, 634, 295]",MISC
674,systems,"[636, 274, 716, 295]",MISC
675,-,"[716, 274, 718, 295]",MISC
676,NL,"[716, 274, 718, 295]",MISC
677,-,"[716, 274, 718, 295]",MISC
678,Gene,"[177, 294, 282, 316]",MISC
679,##rating,"[177, 294, 282, 316]",MISC
680,daily,"[283, 294, 335, 316]",MISC
681,reports,"[336, 294, 410, 316]",MISC
682,of,"[410, 294, 430, 316]",MISC
683,the,"[431, 294, 463, 316]",MISC
684,fleet,"[463, 294, 515, 316]",MISC
685,-,"[516, 294, 518, 316]",MISC
686,NL,"[516, 294, 518, 316]",MISC
687,-,"[516, 294, 518, 316]",MISC
688,Updated,"[178, 315, 257, 336]",MISC
689,companies,"[258, 315, 360, 336]",MISC
690,daily,"[361, 315, 419, 336]",MISC
691,income,"[419, 315, 487, 336]",MISC
692,and,"[488, 315, 521, 336]",MISC
693,expense,"[522, 315, 602, 336]",MISC
694,in,"[602, 315, 625, 336]",MISC
695,Fleet,"[625, 315, 683, 336]",MISC
696,-,"[683, 315, 685, 336]",MISC
697,NL,"[683, 315, 685, 336]",MISC
698,-,"[683, 315, 685, 336]",MISC
699,Gene,"[178, 336, 279, 357]",MISC
700,##rated,"[178, 336, 279, 357]",MISC
701,monthly,"[280, 336, 360, 357]",MISC
702,reports,"[360, 336, 440, 357]",MISC
703,of,"[440, 336, 462, 357]",MISC
704,company,"[462, 336, 564, 357]",MISC
705,’,"[462, 336, 564, 357]",MISC
706,s,"[462, 336, 564, 357]",MISC
707,income,"[565, 336, 632, 357]",MISC
708,and,"[633, 336, 667, 357]",MISC
709,expenses,"[668, 336, 758, 357]",MISC
710,-,"[759, 336, 761, 357]",MISC
711,NL,"[759, 336, 761, 357]",MISC
712,-,"[759, 336, 761, 357]",MISC
713,Man,"[178, 355, 257, 377]",MISC
714,##aged,"[178, 355, 257, 377]",MISC
715,In,"[259, 355, 385, 377]",MISC
716,##vent,"[259, 355, 385, 377]",MISC
717,##ories,"[259, 355, 385, 377]",MISC
718,-,"[387, 355, 388, 377]",MISC
719,NL,"[387, 355, 388, 377]",MISC
720,-,"[387, 355, 388, 377]",MISC
721,Education,"[133, 394, 229, 417]",B-education_heading
722,-,"[229, 394, 231, 417]",MISC
723,NL,"[229, 394, 231, 417]",MISC
724,-,"[229, 394, 231, 417]",MISC
725,A,"[177, 433, 264, 456]",MISC
726,##chi,"[177, 433, 264, 456]",MISC
727,##eve,"[177, 433, 264, 456]",MISC
728,##d,"[177, 433, 264, 456]",MISC
729,Bachelor,"[264, 433, 372, 456]",B-education_degree
730,',"[264, 433, 372, 456]",I-education_degree
731,s,"[264, 433, 372, 456]",I-education_degree
732,degree,"[373, 433, 438, 456]",I-education_degree
733,in,"[439, 433, 459, 456]",MISC
734,Electronics,"[461, 433, 579, 456]",B-education_course
735,and,"[581, 433, 612, 456]",I-education_course
736,Communication,"[614, 433, 754, 456]",I-education_course
737,Engineering,"[755, 433, 874, 456]",I-education_course
738,-,"[875, 433, 877, 456]",MISC
739,NL,"[875, 433, 877, 456]",MISC
740,-,"[875, 433, 877, 456]",MISC
741,-,"[194, 451, 205, 474]",MISC
742,A,"[205, 451, 261, 474]",B-education_institute
743,##ali,"[205, 451, 261, 474]",I-education_institute
744,##m,"[205, 451, 261, 474]",I-education_institute
745,Mu,"[261, 451, 350, 474]",I-education_institute
746,##ham,"[261, 451, 350, 474]",I-education_institute
747,##med,"[261, 451, 350, 474]",I-education_institute
748,Sale,"[351, 451, 418, 474]",I-education_institute
749,##gh,"[351, 451, 418, 474]",I-education_institute
750,College,"[419, 451, 497, 474]",I-education_institute
751,of,"[498, 451, 520, 474]",I-education_institute
752,Engineering,"[520, 451, 642, 474]",I-education_institute
753,(,"[644, 451, 699, 474]",MISC
754,Anna,"[644, 451, 699, 474]",MISC
755,University,"[700, 451, 822, 474]",MISC
756,),"[700, 451, 822, 474]",MISC
757,in,"[824, 451, 846, 474]",MISC
758,the,"[846, 451, 880, 474]",MISC
759,year,"[880, 451, 924, 474]",MISC
760,2013,"[925, 451, 969, 474]",MISC
761,-,"[970, 451, 972, 474]",MISC
762,NL,"[970, 451, 972, 474]",MISC
763,-,"[970, 451, 972, 474]",MISC
764,H,"[178, 474, 211, 495]",B-education_degree
765,##SC,"[178, 474, 211, 495]",I-education_degree
766,from,"[213, 474, 259, 495]",MISC
767,N,"[260, 474, 328, 495]",B-education_institute
768,##eel,"[260, 474, 328, 495]",I-education_institute
769,##an,"[260, 474, 328, 495]",I-education_institute
770,Mat,"[330, 474, 482, 495]",I-education_institute
771,##ric,"[330, 474, 482, 495]",I-education_institute
772,##ulation,"[330, 474, 482, 495]",I-education_institute
773,Higher,"[482, 474, 551, 495]",I-education_institute
774,Secondary,"[553, 474, 656, 495]",I-education_institute
775,School,"[658, 474, 740, 495]",I-education_institute
776,",","[658, 474, 740, 495]",MISC
777,Need,"[740, 474, 892, 495]",MISC
778,##aman,"[740, 474, 892, 495]",MISC
779,##gal,"[740, 474, 892, 495]",MISC
780,##am,"[740, 474, 892, 495]",MISC
781,in,"[892, 474, 914, 495]",MISC
782,the,"[916, 474, 949, 495]",MISC
783,year,"[951, 474, 997, 495]",MISC
784,-,"[998, 474, 1000, 495]",MISC
785,NL,"[998, 474, 1000, 495]",MISC
786,-,"[998, 474, 1000, 495]",MISC
787,2009,"[200, 492, 244, 514]",MISC
788,-,"[244, 492, 246, 514]",MISC
789,NL,"[244, 492, 246, 514]",MISC
790,-,"[244, 492, 246, 514]",MISC
791,SS,"[178, 513, 224, 535]",B-education_degree
792,##LC,"[178, 513, 224, 535]",I-education_degree
793,from,"[224, 513, 270, 535]",MISC
794,N,"[270, 513, 339, 535]",B-education_institute
795,##eel,"[270, 513, 339, 535]",I-education_institute
796,##an,"[270, 513, 339, 535]",I-education_institute
797,Mat,"[340, 513, 490, 535]",I-education_institute
798,##ric,"[340, 513, 490, 535]",I-education_institute
799,##ulation,"[340, 513, 490, 535]",I-education_institute
800,Higher,"[490, 513, 559, 535]",I-education_institute
801,Secondary,"[560, 513, 663, 535]",I-education_institute
802,School,"[664, 513, 743, 535]",I-education_institute
803,",","[664, 513, 743, 535]",MISC
804,Need,"[745, 513, 895, 535]",MISC
805,##aman,"[745, 513, 895, 535]",MISC
806,##gal,"[745, 513, 895, 535]",MISC
807,##am,"[745, 513, 895, 535]",MISC
808,in,"[895, 513, 918, 535]",MISC
809,the,"[918, 513, 952, 535]",MISC
810,year,"[953, 513, 1000, 535]",MISC
811,-,"[1000, 513, 1001, 535]",MISC
812,NL,"[1000, 513, 1001, 535]",MISC
813,-,"[1000, 513, 1001, 535]",MISC
814,2007,"[200, 531, 244, 553]",MISC
815,-,"[244, 531, 246, 553]",MISC
816,NL,"[244, 531, 246, 553]",MISC
817,-,"[244, 531, 246, 553]",MISC
818,Professional,"[133, 570, 255, 594]",B-others_heading
819,Training,"[256, 570, 338, 594]",I-others_heading
820,-,"[338, 570, 340, 594]",MISC
821,NL,"[338, 570, 340, 594]",MISC
822,-,"[338, 570, 340, 594]",MISC
823,C,"[178, 610, 235, 633]",MISC
824,##isco,"[178, 610, 235, 633]",MISC
825,Certified,"[236, 610, 340, 633]",MISC
826,Network,"[341, 610, 423, 633]",MISC
827,Associate,"[423, 610, 527, 633]",MISC
828,|,"[528, 610, 539, 633]",MISC
829,CC,"[540, 610, 586, 633]",MISC
830,##NA,"[540, 610, 586, 633]",MISC
831,-,"[587, 610, 588, 633]",MISC
832,NL,"[587, 610, 588, 633]",MISC
833,-,"[587, 610, 588, 633]",MISC
834,Microsoft,"[178, 631, 291, 652]",MISC
835,##®,"[178, 631, 291, 652]",MISC
836,Certified,"[292, 631, 393, 652]",MISC
837,Solutions,"[394, 631, 496, 652]",MISC
838,Ex,"[497, 631, 564, 652]",MISC
839,##pert,"[497, 631, 564, 652]",MISC
840,|,"[565, 631, 576, 652]",MISC
841,MC,"[577, 631, 621, 652]",MISC
842,##SE,"[577, 631, 621, 652]",MISC
843,2012,"[622, 631, 667, 652]",MISC
844,-,"[668, 631, 670, 652]",MISC
845,NL,"[668, 631, 670, 652]",MISC
846,-,"[668, 631, 670, 652]",MISC
847,Personal,"[133, 669, 212, 693]",B-personal_details_heading
848,Det,"[214, 669, 284, 693]",I-personal_details_heading
849,##ails,"[214, 669, 284, 693]",I-personal_details_heading
850,-,"[285, 669, 287, 693]",MISC
851,NL,"[285, 669, 287, 693]",MISC
852,-,"[285, 669, 287, 693]",MISC
853,Father,"[200, 707, 288, 729]",MISC
854,name,"[289, 707, 348, 729]",MISC
855,:,"[348, 707, 363, 729]",MISC
856,V,"[363, 707, 482, 729]",MISC
857,.,"[363, 707, 482, 729]",MISC
858,A,"[363, 707, 482, 729]",MISC
859,.,"[363, 707, 482, 729]",MISC
860,Ha,"[363, 707, 482, 729]",MISC
861,##ji,"[363, 707, 482, 729]",MISC
862,Mohamed,"[482, 707, 586, 729]",MISC
863,-,"[587, 707, 588, 729]",MISC
864,NL,"[587, 707, 588, 729]",MISC
865,-,"[587, 707, 588, 729]",MISC
866,D,"[200, 726, 266, 748]",MISC
867,##O,"[200, 726, 266, 748]",MISC
868,##B,"[200, 726, 266, 748]",MISC
869,:,"[267, 726, 289, 748]",MISC
870,10,"[289, 726, 511, 748]",MISC
871,/,"[289, 726, 511, 748]",MISC
872,04,"[289, 726, 511, 748]",MISC
873,/,"[289, 726, 511, 748]",MISC
874,1991,"[289, 726, 511, 748]",MISC
875,-,"[512, 726, 514, 748]",MISC
876,NL,"[512, 726, 514, 748]",MISC
877,-,"[512, 726, 514, 748]",MISC
878,Pass,"[200, 746, 325, 768]",MISC
879,##port,"[200, 746, 325, 768]",MISC
880,No,"[327, 746, 358, 768]",MISC
881,:,"[358, 746, 373, 768]",MISC
882,L,"[374, 746, 500, 768]",MISC
883,##60,"[374, 746, 500, 768]",MISC
884,##7,"[374, 746, 500, 768]",MISC
885,##13,"[374, 746, 500, 768]",MISC
886,##13,"[374, 746, 500, 768]",MISC
887,-,"[501, 746, 503, 768]",MISC
888,NL,"[501, 746, 503, 768]",MISC
889,-,"[501, 746, 503, 768]",MISC
890,Sex,"[200, 765, 303, 788]",MISC
891,:,"[304, 765, 338, 788]",MISC
892,Sex,"[339, 765, 443, 788]",MISC
893,-,"[444, 765, 446, 788]",MISC
894,NL,"[444, 765, 446, 788]",MISC
895,-,"[444, 765, 446, 788]",MISC
896,National,"[200, 785, 362, 807]",MISC
897,##ity,"[200, 785, 362, 807]",MISC
898,:,"[362, 785, 377, 807]",MISC
899,Indian,"[377, 785, 466, 807]",MISC
900,-,"[466, 785, 468, 807]",MISC
901,NL,"[466, 785, 468, 807]",MISC
902,-,"[466, 785, 468, 807]",MISC
903,Mari,"[200, 803, 292, 825]",MISC
904,##tal,"[200, 803, 292, 825]",MISC
905,Status,"[293, 803, 373, 825]",MISC
906,:,"[374, 803, 387, 825]",MISC
907,Single,"[387, 803, 467, 825]",MISC
908,-,"[468, 803, 470, 825]",MISC
909,NL,"[468, 803, 470, 825]",MISC
910,-,"[468, 803, 470, 825]",MISC
911,Permanent,"[200, 825, 300, 845]",MISC
912,Ad,"[300, 825, 378, 845]",MISC
913,##dress,"[300, 825, 378, 845]",MISC
914,:,"[378, 825, 389, 845]",MISC
915,38,"[389, 825, 434, 845]",MISC
916,##7,"[389, 825, 434, 845]",MISC
917,",","[389, 825, 434, 845]",MISC
918,West,"[434, 825, 479, 845]",MISC
919,Street,"[479, 825, 557, 845]",MISC
920,",","[479, 825, 557, 845]",MISC
921,At,"[557, 825, 668, 845]",MISC
922,##hi,"[557, 825, 668, 845]",MISC
923,##ka,"[557, 825, 668, 845]",MISC
924,##dai,"[557, 825, 668, 845]",MISC
925,",","[557, 825, 668, 845]",MISC
926,T,"[669, 825, 780, 845]",MISC
927,##hir,"[669, 825, 780, 845]",MISC
928,##u,"[669, 825, 780, 845]",MISC
929,##var,"[669, 825, 780, 845]",MISC
930,##ur,"[669, 825, 780, 845]",MISC
931,–,"[781, 825, 792, 845]",MISC
932,61,"[792, 825, 825, 845]",MISC
933,##3,"[792, 825, 825, 845]",MISC
934,70,"[825, 825, 859, 845]",MISC
935,##2,"[825, 825, 859, 845]",MISC
936,-,"[859, 825, 861, 845]",MISC
937,NL,"[859, 825, 861, 845]",MISC
938,-,"[859, 825, 861, 845]",MISC
939,Languages,"[200, 842, 311, 864]",MISC
940,known,"[311, 842, 372, 864]",MISC
941,:,"[373, 842, 384, 864]",MISC
942,English,"[386, 842, 484, 864]",MISC
943,",","[386, 842, 484, 864]",MISC
944,Tamil,"[485, 842, 546, 864]",MISC
945,&,"[547, 842, 558, 864]",MISC
946,Hindi,"[560, 842, 621, 864]",MISC
947,-,"[622, 842, 624, 864]",MISC
948,NL,"[622, 842, 624, 864]",MISC
949,-,"[622, 842, 624, 864]",MISC
950,Declaration,"[133, 881, 242, 905]",B-others_heading
951,-,"[242, 881, 244, 905]",MISC
952,NL,"[242, 881, 244, 905]",MISC
953,-,"[242, 881, 244, 905]",MISC
954,I,"[133, 919, 142, 941]",MISC
955,here,"[144, 919, 206, 941]",MISC
956,##by,"[144, 919, 206, 941]",MISC
957,declare,"[208, 919, 282, 941]",MISC
958,that,"[282, 919, 325, 941]",MISC
959,the,"[325, 919, 357, 941]",MISC
960,information,"[357, 919, 474, 941]",MISC
961,furnished,"[475, 919, 569, 941]",MISC
962,above,"[571, 919, 623, 941]",MISC
963,is,"[624, 919, 645, 941]",MISC
964,true,"[646, 919, 688, 941]",MISC
965,to,"[688, 919, 709, 941]",MISC
966,the,"[710, 919, 741, 941]",MISC
967,best,"[742, 919, 785, 941]",MISC
968,of,"[785, 919, 805, 941]",MISC
969,my,"[806, 919, 826, 941]",MISC
970,knowledge,"[827, 919, 922, 941]",MISC
971,-,"[924, 919, 925, 941]",MISC
972,NL,"[924, 919, 925, 941]",MISC
973,-,"[924, 919, 925, 941]",MISC
974,Date,"[133, 958, 192, 981]",MISC
975,:,"[192, 958, 207, 981]",MISC
976,-,"[207, 958, 209, 981]",MISC
977,NL,"[207, 958, 209, 981]",MISC
978,-,"[207, 958, 209, 981]",MISC
979,Sign,"[800, 958, 892, 981]",MISC
980,##ature,"[800, 958, 892, 981]",MISC
981,-,"[892, 958, 894, 981]",MISC
982,NL,"[892, 958, 894, 981]",MISC
983,-,"[892, 958, 894, 981]",MISC
984,Place,"[133, 977, 190, 1000]",MISC
985,:,"[191, 977, 202, 1000]",MISC
986,Chennai,"[203, 977, 284, 1000]",MISC
987,-,"[285, 977, 287, 1000]",MISC
988,NL,"[285, 977, 287, 1000]",MISC
989,-,"[285, 977, 287, 1000]",MISC
990,Mohammed,"[694, 977, 790, 1000]",B-name
991,Ha,"[791, 977, 839, 1000]",I-name
992,##ja,"[791, 977, 839, 1000]",I-name
993,Ba,"[839, 977, 960, 1000]",I-name
994,##hur,"[839, 977, 960, 1000]",I-name
995,##ude,"[839, 977, 960, 1000]",I-name
996,##en,"[839, 977, 960, 1000]",I-name
997,-,"[961, 977, 962, 1000]",MISC
998,NL,"[961, 977, 962, 1000]",MISC
999,-,"[961, 977, 962, 1000]",MISC
