,token,box,label
0,Is,"[73, 62, 154, 99]",B-name
1,##ha,"[73, 62, 154, 99]",I-name
2,De,"[155, 62, 215, 99]",I-name
3,##y,"[155, 62, 215, 99]",I-name
4,-,"[216, 62, 218, 99]",MISC
5,NL,"[216, 62, 218, 99]",MISC
6,-,"[216, 62, 218, 99]",MISC
7,Em,"[73, 130, 132, 148]",MISC
8,##ail,"[73, 130, 132, 148]",MISC
9,:,"[73, 130, 132, 148]",MISC
10,is,"[132, 130, 337, 148]",B-emails_email
11,##had,"[132, 130, 337, 148]",I-emails_email
12,##ey,"[132, 130, 337, 148]",I-emails_email
13,##11,"[132, 130, 337, 148]",I-emails_email
14,##0,"[132, 130, 337, 148]",I-emails_email
15,##5,"[132, 130, 337, 148]",I-emails_email
16,@,"[132, 130, 337, 148]",I-emails_email
17,g,"[132, 130, 337, 148]",I-emails_email
18,##mail,"[132, 130, 337, 148]",I-emails_email
19,.,"[132, 130, 337, 148]",I-emails_email
20,com,"[132, 130, 337, 148]",I-emails_email
21,Mobile,"[339, 130, 555, 148]",MISC
22,:,"[339, 130, 555, 148]",MISC
23,(,"[339, 130, 555, 148]",MISC
24,+,"[339, 130, 555, 148]",MISC
25,91,"[339, 130, 555, 148]",MISC
26,),"[339, 130, 555, 148]",MISC
27,70,"[339, 130, 555, 148]",B-phones_phone
28,##5,"[339, 130, 555, 148]",I-phones_phone
29,##9,"[339, 130, 555, 148]",I-phones_phone
30,##8,"[339, 130, 555, 148]",I-phones_phone
31,##41,"[339, 130, 555, 148]",I-phones_phone
32,##0,"[339, 130, 555, 148]",I-phones_phone
33,##25,"[339, 130, 555, 148]",I-phones_phone
34,-,"[555, 130, 557, 148]",MISC
35,NL,"[555, 130, 557, 148]",MISC
36,-,"[555, 130, 557, 148]",MISC
37,E,"[75, 163, 183, 183]",B-education_heading
38,##D,"[75, 163, 183, 183]",I-education_heading
39,##UC,"[75, 163, 183, 183]",I-education_heading
40,##AT,"[75, 163, 183, 183]",I-education_heading
41,##ION,"[75, 163, 183, 183]",I-education_heading
42,-,"[183, 163, 185, 183]",MISC
43,NL,"[183, 163, 185, 183]",MISC
44,-,"[183, 163, 185, 183]",MISC
45,Kali,"[75, 193, 139, 211]",B-education_institute
46,##nga,"[75, 193, 139, 211]",I-education_institute
47,Institute,"[141, 193, 225, 211]",I-education_institute
48,of,"[226, 193, 244, 211]",I-education_institute
49,Industrial,"[245, 193, 338, 211]",I-education_institute
50,Technology,"[339, 193, 442, 211]",I-education_institute
51,",","[339, 193, 442, 211]",I-education_institute
52,B,"[443, 193, 564, 211]",I-education_institute
53,##hu,"[443, 193, 564, 211]",I-education_institute
54,##ban,"[443, 193, 564, 211]",I-education_institute
55,##esh,"[443, 193, 564, 211]",I-education_institute
56,##war,"[443, 193, 564, 211]",I-education_institute
57,",","[443, 193, 564, 211]",I-education_institute
58,India,"[565, 193, 611, 211]",I-education_institute
59,-,"[612, 193, 614, 211]",MISC
60,NL,"[612, 193, 614, 211]",MISC
61,-,"[612, 193, 614, 211]",MISC
62,2016,"[689, 193, 732, 211]",MISC
63,-,"[733, 193, 742, 211]",MISC
64,2020,"[743, 193, 786, 211]",MISC
65,-,"[787, 193, 788, 211]",MISC
66,NL,"[787, 193, 788, 211]",MISC
67,-,"[787, 193, 788, 211]",MISC
68,GP,"[888, 193, 928, 211]",MISC
69,##A,"[888, 193, 928, 211]",MISC
70,-,"[888, 193, 928, 211]",MISC
71,7,"[928, 193, 998, 211]",MISC
72,.,"[928, 193, 998, 211]",MISC
73,23,"[928, 193, 998, 211]",MISC
74,/,"[928, 193, 998, 211]",MISC
75,10,"[928, 193, 998, 211]",MISC
76,-,"[1000, 193, 1001, 211]",MISC
77,NL,"[1000, 193, 1001, 211]",MISC
78,-,"[1000, 193, 1001, 211]",MISC
79,Bachelor,"[75, 216, 150, 234]",B-education_degree
80,of,"[151, 216, 169, 234]",I-education_degree
81,Technology,"[170, 216, 272, 234]",I-education_degree
82,",","[170, 216, 272, 234]",MISC
83,Electronics,"[274, 216, 377, 234]",B-education_course
84,and,"[378, 216, 406, 234]",I-education_course
85,Telecom,"[407, 216, 567, 234]",I-education_course
86,##munication,"[407, 216, 567, 234]",I-education_course
87,-,"[568, 216, 570, 234]",MISC
88,NL,"[568, 216, 570, 234]",MISC
89,-,"[568, 216, 570, 234]",MISC
90,Engineering,"[75, 240, 172, 259]",MISC
91,-,"[172, 240, 174, 259]",MISC
92,NL,"[172, 240, 174, 259]",MISC
93,-,"[172, 240, 174, 259]",MISC
94,PR,"[75, 283, 209, 303]",B-work_experience_heading
95,##O,"[75, 283, 209, 303]",I-work_experience_heading
96,##F,"[75, 283, 209, 303]",I-work_experience_heading
97,##ES,"[75, 283, 209, 303]",I-work_experience_heading
98,##SI,"[75, 283, 209, 303]",I-work_experience_heading
99,##ON,"[75, 283, 209, 303]",I-work_experience_heading
100,##AL,"[75, 283, 209, 303]",I-work_experience_heading
101,E,"[210, 283, 322, 303]",I-work_experience_heading
102,##X,"[210, 283, 322, 303]",I-work_experience_heading
103,##P,"[210, 283, 322, 303]",I-work_experience_heading
104,##ER,"[210, 283, 322, 303]",I-work_experience_heading
105,##IE,"[210, 283, 322, 303]",I-work_experience_heading
106,##NC,"[210, 283, 322, 303]",I-work_experience_heading
107,##E,"[210, 283, 322, 303]",I-work_experience_heading
108,-,"[322, 283, 324, 303]",MISC
109,NL,"[322, 283, 324, 303]",MISC
110,-,"[322, 283, 324, 303]",MISC
111,BS,"[75, 311, 130, 334]",B-employer_company_name
112,##NL,"[75, 311, 130, 334]",I-employer_company_name
113,",","[75, 311, 130, 334]",MISC
114,Kolkata,"[131, 311, 221, 334]",MISC
115,",","[131, 311, 221, 334]",MISC
116,India,"[222, 311, 277, 334]",MISC
117,-,"[278, 311, 280, 334]",MISC
118,NL,"[278, 311, 280, 334]",MISC
119,-,"[278, 311, 280, 334]",MISC
120,Inter,"[75, 341, 139, 361]",B-employer_role
121,##n,"[75, 341, 139, 361]",I-employer_role
122,(,"[140, 341, 312, 361]",I-employer_role
123,Network,"[140, 341, 312, 361]",I-employer_role
124,##ing,"[140, 341, 312, 361]",I-employer_role
125,),"[140, 341, 312, 361]",I-employer_role
126,(,"[140, 341, 312, 361]",MISC
127,May,"[140, 341, 312, 361]",MISC
128,2018,"[312, 341, 355, 361]",MISC
129,–,"[356, 341, 365, 361]",MISC
130,June,"[366, 341, 409, 361]",MISC
131,2018,"[410, 341, 463, 361]",MISC
132,),"[410, 341, 463, 361]",MISC
133,-,"[464, 341, 466, 361]",MISC
134,NL,"[464, 341, 466, 361]",MISC
135,-,"[464, 341, 466, 361]",MISC
136,Re,"[75, 366, 203, 384]",MISC
137,##sp,"[75, 366, 203, 384]",MISC
138,##ons,"[75, 366, 203, 384]",MISC
139,##ibi,"[75, 366, 203, 384]",MISC
140,##lities,"[75, 366, 203, 384]",MISC
141,-,"[204, 366, 212, 384]",MISC
142,-,"[212, 366, 214, 384]",MISC
143,NL,"[212, 366, 214, 384]",MISC
144,-,"[212, 366, 214, 384]",MISC
145,•,"[75, 384, 86, 407]",MISC
146,Dev,"[86, 384, 185, 407]",MISC
147,##elo,"[86, 384, 185, 407]",MISC
148,##ped,"[86, 384, 185, 407]",MISC
149,the,"[185, 384, 218, 407]",MISC
150,knowledge,"[219, 384, 318, 407]",MISC
151,of,"[318, 384, 340, 407]",MISC
152,networking,"[340, 384, 450, 407]",MISC
153,-,"[451, 384, 453, 407]",MISC
154,NL,"[451, 384, 453, 407]",MISC
155,-,"[451, 384, 453, 407]",MISC
156,•,"[75, 407, 84, 430]",MISC
157,Dev,"[85, 407, 179, 430]",MISC
158,##elo,"[85, 407, 179, 430]",MISC
159,##ped,"[85, 407, 179, 430]",MISC
160,the,"[180, 407, 211, 430]",MISC
161,knowledge,"[212, 407, 305, 430]",MISC
162,of,"[306, 407, 327, 430]",MISC
163,the,"[327, 407, 359, 430]",MISC
164,hardware,"[359, 407, 442, 430]",MISC
165,and,"[443, 407, 474, 430]",MISC
166,software,"[475, 407, 557, 430]",MISC
167,used,"[559, 407, 599, 430]",MISC
168,at,"[601, 407, 621, 430]",MISC
169,the,"[622, 407, 653, 430]",MISC
170,beginning,"[654, 407, 758, 430]",MISC
171,.,"[654, 407, 758, 430]",MISC
172,-,"[759, 407, 761, 430]",MISC
173,NL,"[759, 407, 761, 430]",MISC
174,-,"[759, 407, 761, 430]",MISC
175,•,"[75, 430, 84, 453]",MISC
176,Train,"[85, 430, 155, 453]",MISC
177,##ed,"[85, 430, 155, 453]",MISC
178,and,"[156, 430, 186, 453]",MISC
179,tested,"[187, 430, 247, 453]",MISC
180,the,"[248, 430, 277, 453]",MISC
181,basic,"[279, 430, 328, 453]",MISC
182,connection,"[330, 430, 441, 453]",MISC
183,.,"[330, 430, 441, 453]",MISC
184,-,"[442, 430, 444, 453]",MISC
185,NL,"[442, 430, 444, 453]",MISC
186,-,"[442, 430, 444, 453]",MISC
187,•,"[75, 453, 84, 476]",MISC
188,Hand,"[86, 453, 172, 476]",MISC
189,##ling,"[86, 453, 172, 476]",MISC
190,of,"[173, 453, 194, 476]",MISC
191,hardware,"[195, 453, 282, 476]",MISC
192,based,"[283, 453, 336, 476]",MISC
193,key,"[338, 453, 369, 476]",MISC
194,management,"[371, 453, 490, 476]",MISC
195,.,"[371, 453, 490, 476]",MISC
196,-,"[491, 453, 493, 476]",MISC
197,NL,"[491, 453, 493, 476]",MISC
198,-,"[491, 453, 493, 476]",MISC
199,H,"[75, 529, 133, 549]",MISC
200,##O,"[75, 529, 133, 549]",MISC
201,##BB,"[75, 529, 133, 549]",MISC
202,##Y,"[75, 529, 133, 549]",MISC
203,PR,"[135, 529, 230, 549]",MISC
204,##O,"[135, 529, 230, 549]",MISC
205,##J,"[135, 529, 230, 549]",MISC
206,##EC,"[135, 529, 230, 549]",MISC
207,##TS,"[135, 529, 230, 549]",MISC
208,-,"[231, 529, 233, 549]",MISC
209,NL,"[231, 529, 233, 549]",MISC
210,-,"[231, 529, 233, 549]",MISC
211,I,"[75, 554, 100, 572]",B-project_title
212,##OT,"[75, 554, 100, 572]",I-project_title
213,Based,"[102, 554, 146, 572]",I-project_title
214,automatic,"[148, 554, 228, 572]",I-project_title
215,electricity,"[229, 554, 329, 572]",I-project_title
216,using,"[330, 554, 374, 572]",I-project_title
217,Ultra,"[375, 554, 465, 572]",I-project_title
218,##sonic,"[375, 554, 465, 572]",I-project_title
219,Sen,"[466, 554, 528, 572]",I-project_title
220,##sors,"[466, 554, 528, 572]",I-project_title
221,-,"[530, 554, 532, 572]",MISC
222,NL,"[530, 554, 532, 572]",MISC
223,-,"[530, 554, 532, 572]",MISC
224,•,"[75, 574, 84, 597]",MISC
225,Dev,"[85, 574, 179, 597]",MISC
226,##elo,"[85, 574, 179, 597]",MISC
227,##ped,"[85, 574, 179, 597]",MISC
228,an,"[180, 574, 201, 597]",MISC
229,RF,"[202, 574, 244, 597]",MISC
230,##ID,"[202, 574, 244, 597]",MISC
231,based,"[244, 574, 295, 597]",MISC
232,link,"[297, 574, 339, 597]",MISC
233,of,"[339, 574, 359, 597]",MISC
234,sensors,"[360, 574, 434, 597]",MISC
235,with,"[434, 574, 476, 597]",MISC
236,I,"[476, 574, 508, 597]",MISC
237,##OT,"[476, 574, 508, 597]",MISC
238,based,"[508, 574, 560, 597]",MISC
239,link,"[561, 574, 603, 597]",MISC
240,to,"[603, 574, 623, 597]",MISC
241,a,"[624, 574, 634, 597]",MISC
242,My,"[635, 574, 686, 597]",MISC
243,##S,"[635, 574, 686, 597]",MISC
244,##QL,"[635, 574, 686, 597]",MISC
245,database,"[688, 574, 781, 597]",MISC
246,.,"[688, 574, 781, 597]",MISC
247,-,"[783, 574, 785, 597]",MISC
248,NL,"[783, 574, 785, 597]",MISC
249,-,"[783, 574, 785, 597]",MISC
250,•,"[75, 597, 84, 620]",MISC
251,The,"[85, 597, 117, 620]",MISC
252,hardware,"[117, 597, 201, 620]",MISC
253,was,"[202, 597, 233, 620]",MISC
254,made,"[234, 597, 276, 620]",MISC
255,using,"[276, 597, 327, 620]",MISC
256,the,"[329, 597, 360, 620]",MISC
257,connections,"[361, 597, 476, 620]",MISC
258,with,"[477, 597, 519, 620]",MISC
259,the,"[519, 597, 551, 620]",MISC
260,help,"[551, 597, 593, 620]",MISC
261,of,"[593, 597, 614, 620]",MISC
262,necessary,"[615, 597, 708, 620]",MISC
263,items,"[710, 597, 761, 620]",MISC
264,-,"[763, 597, 765, 620]",MISC
265,NL,"[763, 597, 765, 620]",MISC
266,-,"[763, 597, 765, 620]",MISC
267,Made,"[66, 623, 104, 641]",B-project_title
268,A,"[105, 623, 114, 641]",I-project_title
269,Car,"[115, 623, 144, 641]",I-project_title
270,Robot,"[144, 623, 192, 641]",I-project_title
271,for,"[194, 623, 223, 641]",I-project_title
272,the,"[223, 623, 253, 641]",I-project_title
273,Technical,"[253, 623, 341, 641]",I-project_title
274,Fest,"[342, 623, 380, 641]",I-project_title
275,of,"[381, 623, 399, 641]",I-project_title
276,University,"[401, 623, 498, 641]",I-project_title
277,in,"[499, 623, 518, 641]",MISC
278,2016,"[519, 623, 567, 641]",MISC
279,.,"[519, 623, 567, 641]",MISC
280,-,"[568, 623, 570, 641]",MISC
281,NL,"[568, 623, 570, 641]",MISC
282,-,"[568, 623, 570, 641]",MISC
283,Po,"[66, 646, 144, 665]",MISC
284,##si,"[66, 646, 144, 665]",MISC
285,##tions,"[66, 646, 144, 665]",MISC
286,Re,"[145, 646, 250, 665]",MISC
287,##sp,"[145, 646, 250, 665]",MISC
288,##ons,"[145, 646, 250, 665]",MISC
289,##ibi,"[145, 646, 250, 665]",MISC
290,##ty,"[145, 646, 250, 665]",MISC
291,:,"[251, 646, 259, 665]",MISC
292,-,"[260, 646, 262, 665]",MISC
293,NL,"[260, 646, 262, 665]",MISC
294,-,"[260, 646, 262, 665]",MISC
295,1,"[99, 668, 119, 686]",MISC
296,.,"[99, 668, 119, 686]",MISC
297,Ka,"[119, 668, 200, 686]",MISC
298,##rta,"[119, 668, 200, 686]",MISC
299,##vy,"[119, 668, 200, 686]",MISC
300,##a,"[119, 668, 200, 686]",MISC
301,Team,"[200, 668, 240, 686]",MISC
302,Leader,"[241, 668, 301, 686]",MISC
303,(,"[302, 668, 311, 686]",MISC
304,Street,"[312, 668, 372, 686]",MISC
305,Play,"[373, 668, 413, 686]",MISC
306,),"[413, 668, 422, 686]",MISC
307,-,"[423, 668, 425, 686]",MISC
308,NL,"[423, 668, 425, 686]",MISC
309,-,"[423, 668, 425, 686]",MISC
310,2,"[99, 691, 117, 709]",MISC
311,.,"[99, 691, 117, 709]",MISC
312,Assistant,"[118, 691, 202, 709]",MISC
313,Coordinator,"[204, 691, 308, 709]",MISC
314,of,"[309, 691, 327, 709]",MISC
315,the,"[328, 691, 356, 709]",MISC
316,Marketing,"[357, 691, 441, 709]",MISC
317,Society,"[443, 691, 509, 709]",MISC
318,-,"[510, 691, 511, 709]",MISC
319,NL,"[510, 691, 511, 709]",MISC
320,-,"[510, 691, 511, 709]",MISC
321,3,"[99, 712, 119, 731]",MISC
322,.,"[99, 712, 119, 731]",MISC
323,Minor,"[119, 712, 168, 731]",MISC
324,Project,"[170, 712, 240, 731]",MISC
325,Leader,"[241, 712, 302, 731]",MISC
326,-,"[302, 712, 304, 731]",MISC
327,NL,"[302, 712, 304, 731]",MISC
328,-,"[302, 712, 304, 731]",MISC
329,Additional,"[66, 734, 150, 752]",B-others_heading
330,Det,"[150, 734, 209, 752]",I-others_heading
331,##ails,"[150, 734, 209, 752]",I-others_heading
332,:,"[209, 734, 217, 752]",I-others_heading
333,-,"[218, 734, 220, 752]",MISC
334,NL,"[218, 734, 220, 752]",MISC
335,-,"[218, 734, 220, 752]",MISC
336,1,"[93, 757, 111, 775]",MISC
337,.,"[93, 757, 111, 775]",MISC
338,Se,"[113, 757, 183, 775]",MISC
339,##cure,"[113, 757, 183, 775]",MISC
340,##d,"[113, 757, 183, 775]",MISC
341,1st,"[183, 757, 212, 775]",MISC
342,Rank,"[213, 757, 251, 775]",MISC
343,in,"[253, 757, 271, 775]",MISC
344,Street,"[273, 757, 332, 775]",MISC
345,Play,"[333, 757, 371, 775]",MISC
346,in,"[373, 757, 391, 775]",MISC
347,II,"[393, 757, 422, 775]",MISC
348,##T,"[393, 757, 422, 775]",MISC
349,B,"[423, 757, 542, 775]",MISC
350,##hu,"[423, 757, 542, 775]",MISC
351,##ban,"[423, 757, 542, 775]",MISC
352,##esh,"[423, 757, 542, 775]",MISC
353,##war,"[423, 757, 542, 775]",MISC
354,-,"[543, 757, 544, 775]",MISC
355,NL,"[543, 757, 544, 775]",MISC
356,-,"[543, 757, 544, 775]",MISC
357,2,"[93, 778, 111, 797]",MISC
358,.,"[93, 778, 111, 797]",MISC
359,Se,"[113, 778, 180, 797]",MISC
360,##cure,"[113, 778, 180, 797]",MISC
361,##d,"[113, 778, 180, 797]",MISC
362,first,"[181, 778, 228, 797]",MISC
363,rank,"[229, 778, 268, 797]",MISC
364,in,"[268, 778, 287, 797]",MISC
365,Street,"[288, 778, 345, 797]",MISC
366,Play,"[346, 778, 385, 797]",MISC
367,in,"[385, 778, 404, 797]",MISC
368,SS,"[405, 778, 432, 797]",MISC
369,##U,"[405, 778, 432, 797]",MISC
370,Cut,"[434, 778, 502, 797]",MISC
371,##ta,"[434, 778, 502, 797]",MISC
372,##ck,"[434, 778, 502, 797]",MISC
373,-,"[502, 778, 504, 797]",MISC
374,NL,"[502, 778, 504, 797]",MISC
375,-,"[502, 778, 504, 797]",MISC
376,3,"[93, 801, 113, 820]",MISC
377,.,"[93, 801, 113, 820]",MISC
378,V,"[113, 801, 174, 820]",MISC
379,##er,"[113, 801, 174, 820]",MISC
380,##bal,"[113, 801, 174, 820]",MISC
381,Mention,"[174, 801, 244, 820]",MISC
382,",","[245, 801, 254, 820]",MISC
383,K,"[255, 801, 296, 820]",MISC
384,##II,"[255, 801, 296, 820]",MISC
385,##T,"[255, 801, 296, 820]",MISC
386,Model,"[296, 801, 345, 820]",MISC
387,United,"[346, 801, 407, 820]",MISC
388,Nations,"[407, 801, 477, 820]",MISC
389,(,"[478, 801, 539, 820]",MISC
390,2016,"[478, 801, 539, 820]",MISC
391,),"[478, 801, 539, 820]",MISC
392,-,"[539, 801, 541, 820]",MISC
393,NL,"[539, 801, 541, 820]",MISC
394,-,"[539, 801, 541, 820]",MISC
395,4,"[93, 823, 113, 841]",MISC
396,.,"[93, 823, 113, 841]",MISC
397,National,"[114, 823, 196, 841]",MISC
398,Level,"[197, 823, 249, 841]",MISC
399,S,"[249, 823, 321, 841]",MISC
400,##wi,"[249, 823, 321, 841]",MISC
401,##mmer,"[249, 823, 321, 841]",MISC
402,-,"[322, 823, 324, 841]",MISC
403,NL,"[322, 823, 324, 841]",MISC
404,-,"[322, 823, 324, 841]",MISC
405,5,"[93, 846, 111, 864]",MISC
406,.,"[93, 846, 111, 864]",MISC
407,Digital,"[112, 846, 176, 864]",MISC
408,Marketing,"[178, 846, 262, 864]",MISC
409,officer,"[262, 846, 326, 864]",MISC
410,(,"[328, 846, 337, 864]",MISC
411,Ki,"[337, 846, 374, 864]",MISC
412,##it,"[337, 846, 374, 864]",MISC
413,Model,"[375, 846, 421, 864]",MISC
414,United,"[422, 846, 477, 864]",MISC
415,Nations,"[478, 846, 552, 864]",MISC
416,),"[478, 846, 552, 864]",MISC
417,-,"[554, 846, 555, 864]",MISC
418,NL,"[554, 846, 555, 864]",MISC
419,-,"[554, 846, 555, 864]",MISC
420,.,"[66, 867, 69, 886]",MISC
421,-,"[69, 867, 71, 886]",MISC
422,NL,"[69, 867, 71, 886]",MISC
423,-,"[69, 867, 71, 886]",MISC
424,T,"[75, 957, 170, 976]",B-skills_heading
425,##EC,"[75, 957, 170, 976]",I-skills_heading
426,##H,"[75, 957, 170, 976]",I-skills_heading
427,##NI,"[75, 957, 170, 976]",I-skills_heading
428,##CA,"[75, 957, 170, 976]",I-skills_heading
429,##L,"[75, 957, 170, 976]",I-skills_heading
430,SK,"[172, 957, 236, 976]",I-skills_heading
431,##IL,"[172, 957, 236, 976]",I-skills_heading
432,##LS,"[172, 957, 236, 976]",I-skills_heading
433,-,"[236, 957, 238, 976]",MISC
434,NL,"[236, 957, 238, 976]",MISC
435,-,"[236, 957, 238, 976]",MISC
436,•,"[75, 976, 84, 1000]",MISC
437,Programming,"[85, 976, 191, 1000]",MISC
438,languages,"[192, 976, 289, 1000]",MISC
439,:,"[192, 976, 289, 1000]",MISC
440,C,"[290, 976, 347, 1000]",MISC
441,/,"[290, 976, 347, 1000]",MISC
442,C,"[290, 976, 347, 1000]",MISC
443,+,"[290, 976, 347, 1000]",MISC
444,+,"[290, 976, 347, 1000]",MISC
445,",","[290, 976, 347, 1000]",MISC
446,Java,"[348, 976, 446, 1000]",MISC
447,##s,"[348, 976, 446, 1000]",MISC
448,##cript,"[348, 976, 446, 1000]",MISC
449,",","[446, 976, 543, 1000]",MISC
450,H,"[446, 976, 543, 1000]",MISC
451,##TM,"[446, 976, 543, 1000]",MISC
452,##L,"[446, 976, 543, 1000]",MISC
453,",","[446, 976, 543, 1000]",MISC
454,Data,"[446, 976, 543, 1000]",MISC
455,Structure,"[544, 976, 641, 1000]",MISC
456,##s,"[544, 976, 641, 1000]",MISC
457,",","[642, 976, 651, 1000]",MISC
458,A,"[652, 976, 729, 1000]",MISC
459,##rd,"[652, 976, 729, 1000]",MISC
460,##uin,"[652, 976, 729, 1000]",MISC
461,##o,"[652, 976, 729, 1000]",MISC
462,.,"[652, 976, 729, 1000]",MISC
463,-,"[730, 976, 732, 1000]",MISC
464,NL,"[730, 976, 732, 1000]",MISC
465,-,"[730, 976, 732, 1000]",MISC
