,token,box,label
0,S,"[246, 39, 377, 80]",B-name
1,##ham,"[246, 39, 377, 80]",I-name
2,##s,"[246, 39, 377, 80]",I-name
3,Patel,"[377, 39, 508, 80]",I-name
4,-,"[508, 39, 510, 80]",MISC
5,NL,"[508, 39, 510, 80]",MISC
6,-,"[508, 39, 510, 80]",MISC
7,Audi,"[246, 84, 605, 105]",MISC
8,##t,"[246, 84, 605, 105]",MISC
9,/,"[246, 84, 605, 105]",MISC
10,A,"[246, 84, 605, 105]",MISC
11,##cco,"[246, 84, 605, 105]",MISC
12,##unts,"[246, 84, 605, 105]",MISC
13,/,"[246, 84, 605, 105]",MISC
14,Tax,"[246, 84, 605, 105]",MISC
15,##ation,"[246, 84, 605, 105]",MISC
16,/,"[246, 84, 605, 105]",MISC
17,Finance,"[246, 84, 605, 105]",MISC
18,-,"[605, 84, 607, 105]",MISC
19,NL,"[605, 84, 607, 105]",MISC
20,-,"[605, 84, 607, 105]",MISC
21,Bangalore,"[246, 109, 335, 125]",MISC
22,",","[246, 109, 335, 125]",MISC
23,India,"[336, 109, 380, 125]",MISC
24,|,"[381, 109, 389, 125]",MISC
25,(,"[390, 109, 525, 125]",MISC
26,+,"[390, 109, 525, 125]",MISC
27,91,"[390, 109, 525, 125]",MISC
28,),"[390, 109, 525, 125]",MISC
29,95,"[390, 109, 525, 125]",MISC
30,##90,"[390, 109, 525, 125]",MISC
31,##5,"[390, 109, 525, 125]",MISC
32,##47,"[390, 109, 525, 125]",MISC
33,##22,"[390, 109, 525, 125]",MISC
34,##7,"[390, 109, 525, 125]",MISC
35,|,"[525, 109, 533, 125]",MISC
36,hood,"[534, 109, 722, 125]",B-emails_email
37,##apa,"[534, 109, 722, 125]",I-emails_email
38,##tel,"[534, 109, 722, 125]",I-emails_email
39,@,"[534, 109, 722, 125]",I-emails_email
40,i,"[534, 109, 722, 125]",I-emails_email
41,##c,"[534, 109, 722, 125]",I-emails_email
42,##lou,"[534, 109, 722, 125]",I-emails_email
43,##d,"[534, 109, 722, 125]",I-emails_email
44,.,"[534, 109, 722, 125]",I-emails_email
45,com,"[534, 109, 722, 125]",I-emails_email
46,-,"[723, 109, 725, 125]",MISC
47,NL,"[723, 109, 725, 125]",MISC
48,-,"[723, 109, 725, 125]",MISC
49,Career,"[93, 189, 171, 214]",B-summary_heading
50,O,"[172, 189, 290, 214]",I-summary_heading
51,##bject,"[172, 189, 290, 214]",I-summary_heading
52,##ive,"[172, 189, 290, 214]",I-summary_heading
53,-,"[290, 189, 292, 214]",MISC
54,NL,"[290, 189, 292, 214]",MISC
55,-,"[290, 189, 292, 214]",MISC
56,Smart,"[93, 236, 138, 252]",MISC
57,working,"[138, 236, 198, 252]",MISC
58,individual,"[200, 236, 288, 252]",MISC
59,with,"[288, 236, 323, 252]",MISC
60,proven,"[323, 236, 375, 252]",MISC
61,leadership,"[376, 236, 465, 252]",MISC
62,&,"[465, 236, 472, 252]",MISC
63,org,"[474, 236, 597, 252]",MISC
64,##ini,"[474, 236, 597, 252]",MISC
65,##zation,"[474, 236, 597, 252]",MISC
66,##al,"[474, 236, 597, 252]",MISC
67,skills,"[597, 236, 649, 252]",MISC
68,with,"[651, 236, 686, 252]",MISC
69,attention,"[686, 236, 765, 252]",MISC
70,to,"[766, 236, 782, 252]",MISC
71,minute,"[783, 236, 835, 252]",MISC
72,details,"[836, 236, 906, 252]",MISC
73,.,"[836, 236, 906, 252]",MISC
74,See,"[907, 236, 968, 252]",MISC
75,##king,"[907, 236, 968, 252]",MISC
76,to,"[969, 236, 985, 252]",MISC
77,-,"[987, 236, 988, 252]",MISC
78,NL,"[987, 236, 988, 252]",MISC
79,-,"[987, 236, 988, 252]",MISC
80,apply,"[93, 254, 141, 270]",MISC
81,my,"[141, 254, 160, 270]",MISC
82,abilities,"[161, 254, 245, 270]",MISC
83,for,"[247, 254, 275, 270]",MISC
84,the,"[276, 254, 303, 270]",MISC
85,growth,"[304, 254, 362, 270]",MISC
86,of,"[362, 254, 380, 270]",MISC
87,the,"[381, 254, 409, 270]",MISC
88,firm,"[410, 254, 447, 270]",MISC
89,and,"[448, 254, 476, 270]",MISC
90,myself,"[477, 254, 543, 270]",MISC
91,.,"[477, 254, 543, 270]",MISC
92,I,"[544, 254, 572, 270]",MISC
93,’,"[544, 254, 572, 270]",MISC
94,m,"[544, 254, 572, 270]",MISC
95,a,"[573, 254, 582, 270]",MISC
96,dedicated,"[583, 254, 667, 270]",MISC
97,team,"[669, 254, 706, 270]",MISC
98,player,"[707, 254, 774, 270]",MISC
99,",","[707, 254, 774, 270]",MISC
100,who,"[774, 254, 802, 270]",MISC
101,can,"[803, 254, 831, 270]",MISC
102,be,"[832, 254, 850, 270]",MISC
103,relied,"[851, 254, 908, 270]",MISC
104,upon,"[909, 254, 946, 270]",MISC
105,to,"[947, 254, 966, 270]",MISC
106,-,"[966, 254, 968, 270]",MISC
107,NL,"[966, 254, 968, 270]",MISC
108,-,"[966, 254, 968, 270]",MISC
109,achieve,"[93, 270, 152, 286]",MISC
110,the,"[153, 270, 177, 286]",MISC
111,firm,"[178, 270, 228, 286]",MISC
112,’,"[178, 270, 228, 286]",MISC
113,s,"[178, 270, 228, 286]",MISC
114,goals,"[229, 270, 278, 286]",MISC
115,.,"[229, 270, 278, 286]",MISC
116,-,"[279, 270, 281, 286]",MISC
117,NL,"[279, 270, 281, 286]",MISC
118,-,"[279, 270, 281, 286]",MISC
119,Work,"[93, 308, 151, 332]",B-work_experience_heading
120,Experience,"[151, 308, 293, 332]",I-work_experience_heading
121,-,"[294, 308, 296, 332]",MISC
122,NL,"[294, 308, 296, 332]",MISC
123,-,"[294, 308, 296, 332]",MISC
124,August,"[93, 356, 151, 388]",MISC
125,31,"[151, 356, 169, 388]",MISC
126,2018,"[170, 356, 206, 388]",MISC
127,-,"[208, 356, 217, 388]",MISC
128,August,"[217, 356, 274, 388]",MISC
129,27,"[274, 356, 293, 388]",MISC
130,2019,"[293, 356, 330, 388]",MISC
131,Associate,"[331, 356, 425, 388]",B-employer_role
132,/,"[331, 356, 425, 388]",I-employer_role
133,Article,"[426, 356, 493, 388]",I-employer_role
134,-,"[493, 356, 495, 388]",MISC
135,NL,"[493, 356, 495, 388]",MISC
136,-,"[493, 356, 495, 388]",MISC
137,Mal,"[346, 376, 412, 392]",B-employer_company_name
138,##pan,"[346, 376, 412, 392]",I-employer_company_name
139,&,"[413, 376, 424, 392]",I-employer_company_name
140,Pa,"[424, 376, 468, 392]",I-employer_company_name
141,##i,"[424, 376, 468, 392]",I-employer_company_name
142,/,"[424, 376, 468, 392]",I-employer_company_name
143,Ken,"[468, 376, 502, 392]",I-employer_company_name
144,&,"[502, 376, 513, 392]",I-employer_company_name
145,Co,"[513, 376, 535, 392]",I-employer_company_name
146,-,"[535, 376, 537, 392]",MISC
147,NL,"[535, 376, 537, 392]",MISC
148,-,"[535, 376, 537, 392]",MISC
149,Finance,"[346, 394, 410, 410]",MISC
150,Associate,"[411, 394, 494, 410]",MISC
151,with,"[495, 394, 531, 410]",MISC
152,a,"[532, 394, 541, 410]",MISC
153,year,"[541, 394, 578, 410]",MISC
154,of,"[578, 394, 597, 410]",MISC
155,experience,"[597, 394, 689, 410]",MISC
156,in,"[690, 394, 708, 410]",MISC
157,-,"[709, 394, 710, 410]",MISC
158,NL,"[709, 394, 710, 410]",MISC
159,-,"[709, 394, 710, 410]",MISC
160,Accounting,"[373, 418, 465, 434]",MISC
161,-,"[465, 418, 475, 434]",MISC
162,which,"[475, 418, 521, 434]",MISC
163,includes,"[521, 418, 594, 434]",MISC
164,Book,"[594, 418, 631, 434]",MISC
165,Keeping,"[631, 418, 705, 434]",MISC
166,",","[631, 418, 705, 434]",MISC
167,Journal,"[705, 418, 769, 434]",MISC
168,En,"[769, 418, 843, 434]",MISC
169,##tries,"[769, 418, 843, 434]",MISC
170,",","[769, 418, 843, 434]",MISC
171,V,"[843, 418, 926, 434]",MISC
172,##ou,"[843, 418, 926, 434]",MISC
173,##ching,"[843, 418, 926, 434]",MISC
174,",","[843, 418, 926, 434]",MISC
175,A,"[926, 418, 1000, 434]",MISC
176,##cco,"[926, 418, 1000, 434]",MISC
177,##unts,"[926, 418, 1000, 434]",MISC
178,-,"[1000, 418, 1001, 434]",MISC
179,NL,"[1000, 418, 1001, 434]",MISC
180,-,"[1000, 418, 1001, 434]",MISC
181,Re,"[373, 434, 480, 450]",MISC
182,##cie,"[373, 434, 480, 450]",MISC
183,##ve,"[373, 434, 480, 450]",MISC
184,##ables,"[373, 434, 480, 450]",MISC
185,&,"[481, 434, 489, 450]",MISC
186,Pay,"[490, 434, 569, 450]",MISC
187,##ables,"[490, 434, 569, 450]",MISC
188,",","[490, 434, 569, 450]",MISC
189,V,"[571, 434, 625, 450]",MISC
190,##end,"[571, 434, 625, 450]",MISC
191,##or,"[571, 434, 625, 450]",MISC
192,Pay,"[625, 434, 704, 450]",MISC
193,##ments,"[625, 434, 704, 450]",MISC
194,",","[625, 434, 704, 450]",MISC
195,MI,"[706, 434, 732, 450]",MISC
196,##S,"[706, 434, 732, 450]",MISC
197,Report,"[733, 434, 822, 450]",MISC
198,##ing,"[733, 434, 822, 450]",MISC
199,",","[733, 434, 822, 450]",MISC
200,Re,"[823, 434, 958, 450]",MISC
201,##con,"[823, 434, 958, 450]",MISC
202,##ci,"[823, 434, 958, 450]",MISC
203,##lia,"[823, 434, 958, 450]",MISC
204,##tions,"[823, 434, 958, 450]",MISC
205,etc,"[958, 434, 993, 450]",MISC
206,.,"[958, 434, 993, 450]",MISC
207,-,"[994, 434, 996, 450]",MISC
208,NL,"[994, 434, 996, 450]",MISC
209,-,"[994, 434, 996, 450]",MISC
210,Tax,"[373, 452, 447, 468]",MISC
211,##ation,"[373, 452, 447, 468]",MISC
212,-,"[448, 452, 457, 468]",MISC
213,which,"[457, 452, 503, 468]",MISC
214,includes,"[504, 452, 578, 468]",MISC
215,G,"[578, 452, 606, 468]",MISC
216,##ST,"[578, 452, 606, 468]",MISC
217,-,"[606, 452, 634, 468]",MISC
218,1,"[606, 452, 634, 468]",MISC
219,",","[606, 452, 634, 468]",MISC
220,2,"[634, 452, 662, 468]",MISC
221,##A,"[634, 452, 662, 468]",MISC
222,",","[634, 452, 662, 468]",MISC
223,3,"[662, 452, 690, 468]",MISC
224,##B,"[662, 452, 690, 468]",MISC
225,",","[662, 452, 690, 468]",MISC
226,AR,"[690, 452, 727, 468]",MISC
227,##9,"[690, 452, 727, 468]",MISC
228,",","[690, 452, 727, 468]",MISC
229,Re,"[728, 452, 875, 468]",MISC
230,##con,"[728, 452, 875, 468]",MISC
231,##ci,"[728, 452, 875, 468]",MISC
232,##lia,"[728, 452, 875, 468]",MISC
233,##tions,"[728, 452, 875, 468]",MISC
234,",","[728, 452, 875, 468]",MISC
235,Inc,"[877, 452, 932, 468]",MISC
236,##ome,"[877, 452, 932, 468]",MISC
237,Tax,"[933, 452, 960, 468]",MISC
238,of,"[961, 452, 979, 468]",MISC
239,-,"[979, 452, 981, 468]",MISC
240,NL,"[979, 452, 981, 468]",MISC
241,-,"[979, 452, 981, 468]",MISC
242,individuals,"[373, 468, 471, 484]",MISC
243,&,"[472, 468, 480, 484]",MISC
244,others,"[481, 468, 535, 484]",MISC
245,alike,"[535, 468, 579, 484]",MISC
246,and,"[580, 468, 606, 484]",MISC
247,International,"[607, 468, 723, 484]",MISC
248,Tax,"[724, 468, 750, 484]",MISC
249,like,"[751, 468, 786, 484]",MISC
250,15,"[787, 468, 831, 484]",MISC
251,##CA,"[787, 468, 831, 484]",MISC
252,",","[787, 468, 831, 484]",MISC
253,15,"[832, 468, 867, 484]",MISC
254,##C,"[832, 468, 867, 484]",MISC
255,##B,"[832, 468, 867, 484]",MISC
256,etc,"[868, 468, 903, 484]",MISC
257,.,"[868, 468, 903, 484]",MISC
258,-,"[904, 468, 906, 484]",MISC
259,NL,"[904, 468, 906, 484]",MISC
260,-,"[904, 468, 906, 484]",MISC
261,Audi,"[373, 484, 441, 500]",MISC
262,##ting,"[373, 484, 441, 500]",MISC
263,-,"[442, 484, 449, 500]",MISC
264,St,"[451, 484, 535, 500]",MISC
265,##at,"[451, 484, 535, 500]",MISC
266,##uto,"[451, 484, 535, 500]",MISC
267,##ry,"[451, 484, 535, 500]",MISC
268,",","[451, 484, 535, 500]",MISC
269,Con,"[536, 484, 621, 500]",MISC
270,##current,"[536, 484, 621, 500]",MISC
271,",","[622, 484, 630, 500]",MISC
272,Internal,"[631, 484, 706, 500]",MISC
273,",","[631, 484, 706, 500]",MISC
274,External,"[708, 484, 784, 500]",MISC
275,",","[708, 484, 784, 500]",MISC
276,Fi,"[785, 484, 828, 500]",MISC
277,##xed,"[785, 484, 828, 500]",MISC
278,As,"[828, 484, 878, 500]",MISC
279,##set,"[828, 484, 878, 500]",MISC
280,",","[828, 484, 878, 500]",MISC
281,-,"[880, 484, 882, 500]",MISC
282,NL,"[880, 484, 882, 500]",MISC
283,-,"[880, 484, 882, 500]",MISC
284,Re,"[373, 500, 499, 516]",MISC
285,##im,"[373, 500, 499, 516]",MISC
286,##bur,"[373, 500, 499, 516]",MISC
287,##se,"[373, 500, 499, 516]",MISC
288,##ment,"[373, 500, 499, 516]",MISC
289,Audi,"[499, 500, 556, 516]",MISC
290,##ts,"[499, 500, 556, 516]",MISC
291,etc,"[557, 500, 585, 516]",MISC
292,and,"[586, 500, 614, 516]",MISC
293,Bank,"[615, 500, 654, 516]",MISC
294,Audi,"[654, 500, 711, 516]",MISC
295,##ts,"[654, 500, 711, 516]",MISC
296,with,"[712, 500, 751, 516]",MISC
297,products,"[751, 500, 828, 516]",MISC
298,like,"[828, 500, 867, 516]",MISC
299,CC,"[867, 500, 905, 516]",MISC
300,##R,"[867, 500, 905, 516]",MISC
301,",","[867, 500, 905, 516]",MISC
302,DC,"[906, 500, 944, 516]",MISC
303,##R,"[906, 500, 944, 516]",MISC
304,",","[906, 500, 944, 516]",MISC
305,T,"[944, 500, 983, 516]",MISC
306,##CR,"[944, 500, 983, 516]",MISC
307,",","[944, 500, 983, 516]",MISC
308,-,"[983, 500, 985, 516]",MISC
309,NL,"[983, 500, 985, 516]",MISC
310,-,"[983, 500, 985, 516]",MISC
311,Bill,"[373, 518, 410, 534]",MISC
312,Des,"[411, 518, 457, 534]",MISC
313,##k,"[411, 518, 457, 534]",MISC
314,",","[411, 518, 457, 534]",MISC
315,UP,"[459, 518, 544, 534]",MISC
316,##I,"[459, 518, 544, 534]",MISC
317,/,"[459, 518, 544, 534]",MISC
318,I,"[459, 518, 544, 534]",MISC
319,##MP,"[459, 518, 544, 534]",MISC
320,##S,"[459, 518, 544, 534]",MISC
321,",","[459, 518, 544, 534]",MISC
322,E,"[544, 518, 581, 534]",MISC
323,##com,"[544, 518, 581, 534]",MISC
324,&,"[582, 518, 592, 534]",MISC
325,Po,"[592, 518, 619, 534]",MISC
326,##S,"[592, 518, 619, 534]",MISC
327,A,"[620, 518, 714, 534]",MISC
328,##c,"[620, 518, 714, 534]",MISC
329,##qui,"[620, 518, 714, 534]",MISC
330,##ring,"[620, 518, 714, 534]",MISC
331,",","[620, 518, 714, 534]",MISC
332,AT,"[715, 518, 761, 534]",MISC
333,##MR,"[715, 518, 761, 534]",MISC
334,",","[715, 518, 761, 534]",MISC
335,ET,"[763, 518, 800, 534]",MISC
336,##C,"[763, 518, 800, 534]",MISC
337,",","[763, 518, 800, 534]",MISC
338,Z,"[801, 518, 847, 534]",MISC
339,##ET,"[801, 518, 847, 534]",MISC
340,##A,"[801, 518, 847, 534]",MISC
341,",","[801, 518, 847, 534]",MISC
342,Di,"[848, 518, 915, 534]",MISC
343,##sp,"[848, 518, 915, 534]",MISC
344,##ute,"[848, 518, 915, 534]",MISC
345,-,"[915, 518, 917, 534]",MISC
346,NL,"[915, 518, 917, 534]",MISC
347,-,"[915, 518, 917, 534]",MISC
348,Management,"[373, 534, 471, 550]",MISC
349,etc,"[472, 534, 511, 550]",MISC
350,.,"[472, 534, 511, 550]",MISC
351,-,"[511, 534, 513, 550]",MISC
352,NL,"[511, 534, 513, 550]",MISC
353,-,"[511, 534, 513, 550]",MISC
354,Other,"[373, 550, 419, 566]",MISC
355,-,"[420, 550, 429, 566]",MISC
356,Other,"[429, 550, 475, 566]",MISC
357,areas,"[476, 550, 522, 566]",MISC
358,I,"[522, 550, 531, 566]",MISC
359,have,"[531, 550, 568, 566]",MISC
360,worked,"[569, 550, 624, 566]",MISC
361,includes,"[624, 550, 698, 566]",MISC
362,P,"[699, 550, 726, 566]",MISC
363,##F,"[699, 550, 726, 566]",MISC
364,",","[699, 550, 726, 566]",MISC
365,E,"[727, 550, 763, 566]",MISC
366,##SI,"[727, 550, 763, 566]",MISC
367,",","[727, 550, 763, 566]",MISC
368,Tax,"[764, 550, 791, 566]",MISC
369,Pro,"[792, 550, 838, 566]",MISC
370,##of,"[792, 550, 838, 566]",MISC
371,V,"[838, 550, 958, 566]",MISC
372,##eri,"[838, 550, 958, 566]",MISC
373,##fication,"[838, 550, 958, 566]",MISC
374,",","[838, 550, 958, 566]",MISC
375,-,"[959, 550, 961, 566]",MISC
376,NL,"[959, 550, 961, 566]",MISC
377,-,"[959, 550, 961, 566]",MISC
378,V,"[373, 566, 429, 582]",MISC
379,##end,"[373, 566, 429, 582]",MISC
380,##or,"[373, 566, 429, 582]",MISC
381,Pay,"[429, 566, 503, 582]",MISC
382,##outs,"[429, 566, 503, 582]",MISC
383,",","[429, 566, 503, 582]",MISC
384,Karnataka,"[504, 566, 587, 582]",MISC
385,Shop,"[588, 566, 634, 582]",MISC
386,##s,"[588, 566, 634, 582]",MISC
387,&,"[634, 566, 643, 582]",MISC
388,Establishment,"[644, 566, 782, 582]",MISC
389,##s,"[644, 566, 782, 582]",MISC
390,",","[644, 566, 782, 582]",MISC
391,MCA,"[783, 566, 820, 582]",MISC
392,",","[783, 566, 820, 582]",MISC
393,other,"[821, 566, 867, 582]",MISC
394,V,"[867, 566, 987, 582]",MISC
395,##eri,"[867, 566, 987, 582]",MISC
396,##fication,"[867, 566, 987, 582]",MISC
397,##s,"[867, 566, 987, 582]",MISC
398,&,"[988, 566, 998, 582]",MISC
399,-,"[998, 566, 1000, 582]",MISC
400,NL,"[998, 566, 1000, 582]",MISC
401,-,"[998, 566, 1000, 582]",MISC
402,Re,"[373, 584, 515, 600]",MISC
403,##con,"[373, 584, 515, 600]",MISC
404,##ci,"[373, 584, 515, 600]",MISC
405,##lia,"[373, 584, 515, 600]",MISC
406,##tions,"[373, 584, 515, 600]",MISC
407,",","[373, 584, 515, 600]",MISC
408,Audi,"[515, 584, 559, 600]",MISC
409,##t,"[515, 584, 559, 600]",MISC
410,Reports,"[560, 584, 629, 600]",MISC
411,",","[560, 584, 629, 600]",MISC
412,Board,"[630, 584, 675, 600]",MISC
413,Reports,"[675, 584, 736, 600]",MISC
414,and,"[737, 584, 763, 600]",MISC
415,Resolution,"[763, 584, 859, 600]",MISC
416,##s,"[763, 584, 859, 600]",MISC
417,etc,"[861, 584, 896, 600]",MISC
418,.,"[861, 584, 896, 600]",MISC
419,-,"[896, 584, 898, 600]",MISC
420,NL,"[896, 584, 898, 600]",MISC
421,-,"[896, 584, 898, 600]",MISC
422,With,"[346, 606, 381, 622]",MISC
423,a,"[381, 606, 389, 622]",MISC
424,demonstrated,"[390, 606, 495, 622]",MISC
425,history,"[497, 606, 558, 622]",MISC
426,of,"[559, 606, 576, 622]",MISC
427,convincing,"[577, 606, 675, 622]",MISC
428,",","[577, 606, 675, 622]",MISC
429,leadership,"[675, 606, 763, 622]",MISC
430,&,"[764, 606, 771, 622]",MISC
431,organisation,"[773, 606, 896, 622]",MISC
432,##al,"[773, 606, 896, 622]",MISC
433,skill,"[897, 606, 942, 622]",MISC
434,with,"[942, 606, 977, 622]",MISC
435,-,"[977, 606, 979, 622]",MISC
436,NL,"[977, 606, 979, 622]",MISC
437,-,"[977, 606, 979, 622]",MISC
438,attention,"[346, 622, 429, 638]",MISC
439,to,"[429, 622, 447, 638]",MISC
440,minute,"[447, 622, 502, 638]",MISC
441,detail,"[502, 622, 567, 638]",MISC
442,.,"[502, 622, 567, 638]",MISC
443,Strong,"[567, 622, 622, 638]",MISC
444,finance,"[622, 622, 686, 638]",MISC
445,guy,"[686, 622, 714, 638]",MISC
446,graduated,"[714, 622, 797, 638]",MISC
447,with,"[797, 622, 834, 638]",MISC
448,B,"[834, 622, 871, 638]",MISC
449,##com,"[834, 622, 871, 638]",MISC
450,Professional,"[871, 622, 981, 638]",MISC
451,-,"[981, 622, 983, 638]",MISC
452,NL,"[981, 622, 983, 638]",MISC
453,-,"[981, 622, 983, 638]",MISC
454,from,"[346, 638, 381, 655]",MISC
455,historic,"[382, 638, 454, 655]",MISC
456,St,"[456, 638, 472, 655]",B-education_institute
457,Al,"[474, 638, 546, 655]",I-education_institute
458,##oy,"[474, 638, 546, 655]",I-education_institute
459,##sius,"[474, 638, 546, 655]",I-education_institute
460,College,"[548, 638, 610, 655]",I-education_institute
461,(,"[612, 638, 730, 655]",I-education_institute
462,Autonomous,"[612, 638, 730, 655]",I-education_institute
463,),"[612, 638, 730, 655]",I-education_institute
464,",","[612, 638, 730, 655]",I-education_institute
465,Man,"[731, 638, 812, 655]",I-education_institute
466,##gal,"[731, 638, 812, 655]",I-education_institute
467,##ore,"[731, 638, 812, 655]",I-education_institute
468,with,"[814, 638, 849, 655]",MISC
469,special,"[851, 638, 978, 655]",MISC
470,##isation,"[851, 638, 978, 655]",MISC
471,in,"[979, 638, 996, 655]",MISC
472,-,"[998, 638, 1000, 655]",MISC
473,NL,"[998, 638, 1000, 655]",MISC
474,-,"[998, 638, 1000, 655]",MISC
475,Finance,"[346, 655, 408, 671]",MISC
476,-,"[409, 655, 417, 671]",MISC
477,A,"[418, 655, 500, 671]",MISC
478,##cco,"[418, 655, 500, 671]",MISC
479,##unts,"[418, 655, 500, 671]",MISC
480,",","[418, 655, 500, 671]",MISC
481,Audi,"[500, 655, 581, 671]",MISC
482,##ting,"[500, 655, 581, 671]",MISC
483,",","[500, 655, 581, 671]",MISC
484,Investment,"[582, 655, 672, 671]",MISC
485,Analysis,"[673, 655, 754, 671]",MISC
486,",","[673, 655, 754, 671]",MISC
487,Port,"[755, 655, 836, 671]",MISC
488,##fo,"[755, 655, 836, 671]",MISC
489,##lio,"[755, 655, 836, 671]",MISC
490,Management,"[837, 655, 927, 671]",MISC
491,&,"[928, 655, 935, 671]",MISC
492,-,"[937, 655, 939, 671]",MISC
493,NL,"[937, 655, 939, 671]",MISC
494,-,"[937, 655, 939, 671]",MISC
495,Tax,"[346, 672, 418, 688]",MISC
496,##ation,"[346, 672, 418, 688]",MISC
497,.,"[346, 672, 418, 688]",MISC
498,-,"[418, 672, 419, 688]",MISC
499,NL,"[418, 672, 419, 688]",MISC
500,-,"[418, 672, 419, 688]",MISC
501,Over,"[346, 696, 379, 712]",MISC
502,the,"[380, 696, 404, 712]",MISC
503,year,"[406, 696, 439, 712]",MISC
504,I,"[440, 696, 473, 712]",MISC
505,’,"[440, 696, 473, 712]",MISC
506,ve,"[440, 696, 473, 712]",MISC
507,worked,"[474, 696, 524, 712]",MISC
508,for,"[525, 696, 549, 712]",MISC
509,clients,"[551, 696, 610, 712]",MISC
510,that,"[611, 696, 644, 712]",MISC
511,operate,"[645, 696, 704, 712]",MISC
512,in,"[705, 696, 722, 712]",MISC
513,areas,"[722, 696, 764, 712]",MISC
514,like,"[765, 696, 798, 712]",MISC
515,Art,"[799, 696, 884, 712]",MISC
516,##ific,"[799, 696, 884, 712]",MISC
517,##ial,"[799, 696, 884, 712]",MISC
518,Intelligence,"[885, 696, 995, 712]",MISC
519,",","[885, 696, 995, 712]",MISC
520,-,"[996, 696, 998, 712]",MISC
521,NL,"[996, 696, 998, 712]",MISC
522,-,"[996, 696, 998, 712]",MISC
523,Automobile,"[346, 712, 443, 728]",MISC
524,",","[346, 712, 443, 728]",MISC
525,Banking,"[444, 712, 514, 728]",MISC
526,",","[444, 712, 514, 728]",MISC
527,BP,"[515, 712, 550, 728]",MISC
528,##O,"[515, 712, 550, 728]",MISC
529,",","[515, 712, 550, 728]",MISC
530,B,"[550, 712, 639, 728]",MISC
531,##roke,"[550, 712, 639, 728]",MISC
532,##ring,"[550, 712, 639, 728]",MISC
533,",","[550, 712, 639, 728]",MISC
534,Capital,"[639, 712, 700, 728]",MISC
535,Market,"[702, 712, 763, 728]",MISC
536,",","[702, 712, 763, 728]",MISC
537,Consul,"[764, 712, 871, 728]",MISC
538,##tan,"[764, 712, 871, 728]",MISC
539,##cy,"[764, 712, 871, 728]",MISC
540,",","[764, 712, 871, 728]",MISC
541,Design,"[871, 712, 932, 728]",MISC
542,",","[871, 712, 932, 728]",MISC
543,-,"[933, 712, 935, 728]",MISC
544,NL,"[933, 712, 935, 728]",MISC
545,-,"[933, 712, 935, 728]",MISC
546,Healthcare,"[346, 728, 436, 744]",MISC
547,Solutions,"[436, 728, 526, 744]",MISC
548,",","[436, 728, 526, 744]",MISC
549,Investment,"[526, 728, 624, 744]",MISC
550,",","[526, 728, 624, 744]",MISC
551,Music,"[625, 728, 679, 744]",MISC
552,",","[625, 728, 679, 744]",MISC
553,Ph,"[680, 728, 814, 744]",MISC
554,##arma,"[680, 728, 814, 744]",MISC
555,##ce,"[680, 728, 814, 744]",MISC
556,##utical,"[680, 728, 814, 744]",MISC
557,##s,"[680, 728, 814, 744]",MISC
558,etc,"[815, 728, 850, 744]",MISC
559,.,"[815, 728, 850, 744]",MISC
560,These,"[851, 728, 895, 744]",MISC
561,companies,"[896, 728, 977, 744]",MISC
562,-,"[977, 728, 979, 744]",MISC
563,NL,"[977, 728, 979, 744]",MISC
564,-,"[977, 728, 979, 744]",MISC
565,include,"[346, 744, 410, 760]",MISC
566,one,"[410, 744, 438, 760]",MISC
567,man,"[438, 744, 466, 760]",MISC
568,companies,"[466, 744, 558, 760]",MISC
569,",","[466, 744, 558, 760]",MISC
570,partnerships,"[558, 744, 678, 760]",MISC
571,",","[558, 744, 678, 760]",MISC
572,banks,"[678, 744, 724, 760]",MISC
573,&,"[724, 744, 734, 760]",MISC
574,start,"[734, 744, 807, 760]",MISC
575,##ups,"[734, 744, 807, 760]",MISC
576,to,"[808, 744, 826, 760]",MISC
577,multinational,"[826, 744, 964, 760]",MISC
578,##s,"[826, 744, 964, 760]",MISC
579,.,"[826, 744, 964, 760]",MISC
580,-,"[965, 744, 966, 760]",MISC
581,NL,"[965, 744, 966, 760]",MISC
582,-,"[965, 744, 966, 760]",MISC
583,This,"[346, 762, 384, 778]",MISC
584,means,"[385, 762, 433, 778]",MISC
585,experience,"[433, 762, 529, 778]",MISC
586,comes,"[531, 762, 578, 778]",MISC
587,not,"[579, 762, 607, 778]",MISC
588,only,"[608, 762, 647, 778]",MISC
589,with,"[647, 762, 686, 778]",MISC
590,time,"[686, 762, 725, 778]",MISC
591,but,"[725, 762, 753, 778]",MISC
592,mostly,"[754, 762, 811, 778]",MISC
593,with,"[813, 762, 851, 778]",MISC
594,efforts,"[852, 762, 918, 778]",MISC
595,put,"[920, 762, 947, 778]",MISC
596,in,"[949, 762, 977, 778]",MISC
597,.,"[949, 762, 977, 778]",MISC
598,My,"[978, 762, 997, 778]",MISC
599,-,"[998, 762, 1000, 778]",MISC
600,NL,"[998, 762, 1000, 778]",MISC
601,-,"[998, 762, 1000, 778]",MISC
602,efforts,"[346, 778, 412, 794]",MISC
603,and,"[413, 778, 441, 794]",MISC
604,dedication,"[442, 778, 538, 794]",MISC
605,gave,"[539, 778, 576, 794]",MISC
606,me,"[577, 778, 596, 794]",MISC
607,the,"[597, 778, 624, 794]",MISC
608,3,"[626, 778, 635, 794]",MISC
609,years,"[635, 778, 683, 794]",MISC
610,worth,"[684, 778, 731, 794]",MISC
611,or,"[732, 778, 750, 794]",MISC
612,exposure,"[751, 778, 827, 794]",MISC
613,in,"[828, 778, 847, 794]",MISC
614,just,"[848, 778, 885, 794]",MISC
615,a,"[886, 778, 896, 794]",MISC
616,year,"[896, 778, 944, 794]",MISC
617,.,"[896, 778, 944, 794]",MISC
618,-,"[944, 778, 946, 794]",MISC
619,NL,"[944, 778, 946, 794]",MISC
620,-,"[944, 778, 946, 794]",MISC
621,And,"[346, 801, 373, 818]",MISC
622,most,"[374, 801, 411, 818]",MISC
623,importantly,"[413, 801, 527, 818]",MISC
624,",","[413, 801, 527, 818]",MISC
625,I,"[528, 801, 537, 818]",MISC
626,am,"[537, 801, 556, 818]",MISC
627,hungry,"[556, 801, 623, 818]",MISC
628,.,"[556, 801, 623, 818]",MISC
629,Very,"[623, 801, 660, 818]",MISC
630,hungry,"[662, 801, 728, 818]",MISC
631,.,"[662, 801, 728, 818]",MISC
632,-,"[729, 801, 731, 818]",MISC
633,NL,"[729, 801, 731, 818]",MISC
634,-,"[729, 801, 731, 818]",MISC
635,Fun,"[93, 879, 224, 902]",MISC
636,##ctional,"[93, 879, 224, 902]",MISC
637,Area,"[225, 879, 277, 902]",MISC
638,-,"[278, 879, 279, 902]",MISC
639,NL,"[278, 879, 279, 902]",MISC
640,-,"[278, 879, 279, 902]",MISC
641,Accounting,"[93, 926, 187, 942]",MISC
642,",","[93, 926, 187, 942]",MISC
643,Audi,"[189, 926, 257, 942]",MISC
644,##ting,"[189, 926, 257, 942]",MISC
645,-,"[258, 926, 265, 942]",MISC
646,(,"[266, 926, 351, 942]",MISC
647,Internal,"[266, 926, 351, 942]",MISC
648,",","[266, 926, 351, 942]",MISC
649,External,"[353, 926, 430, 942]",MISC
650,",","[353, 926, 430, 942]",MISC
651,St,"[431, 926, 515, 942]",MISC
652,##at,"[431, 926, 515, 942]",MISC
653,##uto,"[431, 926, 515, 942]",MISC
654,##ry,"[431, 926, 515, 942]",MISC
655,",","[431, 926, 515, 942]",MISC
656,Con,"[517, 926, 611, 942]",MISC
657,##current,"[517, 926, 611, 942]",MISC
658,",","[517, 926, 611, 942]",MISC
659,Re,"[612, 926, 732, 942]",MISC
660,##im,"[612, 926, 732, 942]",MISC
661,##bur,"[612, 926, 732, 942]",MISC
662,##se,"[612, 926, 732, 942]",MISC
663,##ment,"[612, 926, 732, 942]",MISC
664,",","[612, 926, 732, 942]",MISC
665,Fi,"[733, 926, 775, 942]",MISC
666,##xed,"[733, 926, 775, 942]",MISC
667,As,"[776, 926, 835, 942]",MISC
668,##sets,"[776, 926, 835, 942]",MISC
669,",","[776, 926, 835, 942]",MISC
670,Bank,"[837, 926, 870, 942]",MISC
671,Audi,"[871, 926, 940, 942]",MISC
672,##ts,"[871, 926, 940, 942]",MISC
673,),"[871, 926, 940, 942]",MISC
674,",","[871, 926, 940, 942]",MISC
675,-,"[941, 926, 942, 942]",MISC
676,NL,"[941, 926, 942, 942]",MISC
677,-,"[941, 926, 942, 942]",MISC
678,Co,"[93, 942, 193, 958]",MISC
679,##mp,"[93, 942, 193, 958]",MISC
680,##liance,"[93, 942, 193, 958]",MISC
681,##s,"[93, 942, 193, 958]",MISC
682,-,"[193, 942, 200, 958]",MISC
683,(,"[202, 942, 255, 958]",MISC
684,MCA,"[202, 942, 255, 958]",MISC
685,),"[202, 942, 255, 958]",MISC
686,",","[202, 942, 255, 958]",MISC
687,Pay,"[256, 942, 319, 958]",MISC
688,##roll,"[256, 942, 319, 958]",MISC
689,Process,"[320, 942, 419, 958]",MISC
690,##ing,"[320, 942, 419, 958]",MISC
691,",","[320, 942, 419, 958]",MISC
692,Tax,"[419, 942, 491, 958]",MISC
693,##ation,"[419, 942, 491, 958]",MISC
694,-,"[491, 942, 499, 958]",MISC
695,(,"[500, 942, 545, 958]",MISC
696,ID,"[500, 942, 545, 958]",MISC
697,##T,"[500, 942, 545, 958]",MISC
698,",","[500, 942, 545, 958]",MISC
699,G,"[546, 942, 581, 958]",MISC
700,##ST,"[546, 942, 581, 958]",MISC
701,-,"[546, 942, 581, 958]",MISC
702,1,"[582, 942, 598, 958]",MISC
703,",","[582, 942, 598, 958]",MISC
704,2,"[600, 942, 626, 958]",MISC
705,##A,"[600, 942, 626, 958]",MISC
706,",","[600, 942, 626, 958]",MISC
707,3,"[627, 942, 653, 958]",MISC
708,##B,"[627, 942, 653, 958]",MISC
709,",","[627, 942, 653, 958]",MISC
710,9,"[654, 942, 671, 958]",MISC
711,),"[654, 942, 671, 958]",MISC
712,etc,"[672, 942, 698, 958]",MISC
713,-,"[699, 942, 701, 958]",MISC
714,NL,"[699, 942, 701, 958]",MISC
715,-,"[699, 942, 701, 958]",MISC
716,Education,"[93, 42, 211, 66]",B-education_heading
717,-,"[211, 42, 213, 66]",MISC
718,NL,"[211, 42, 213, 66]",MISC
719,-,"[211, 42, 213, 66]",MISC
720,Bachelor,"[346, 89, 432, 105]",B-education_degree
721,of,"[432, 89, 453, 105]",I-education_degree
722,Commerce,"[454, 89, 541, 105]",I-education_degree
723,-,"[541, 89, 543, 105]",MISC
724,NL,"[541, 89, 543, 105]",MISC
725,-,"[541, 89, 543, 105]",MISC
726,St,"[346, 108, 362, 125]",B-education_institute
727,Al,"[364, 108, 436, 125]",I-education_institute
728,##oy,"[364, 108, 436, 125]",I-education_institute
729,##sius,"[364, 108, 436, 125]",I-education_institute
730,College,"[437, 108, 500, 125]",I-education_institute
731,(,"[501, 108, 619, 125]",I-education_institute
732,Autonomous,"[501, 108, 619, 125]",I-education_institute
733,),"[501, 108, 619, 125]",I-education_institute
734,",","[501, 108, 619, 125]",I-education_institute
735,Man,"[621, 108, 702, 125]",I-education_institute
736,##gal,"[621, 108, 702, 125]",I-education_institute
737,##ore,"[621, 108, 702, 125]",I-education_institute
738,-,"[703, 108, 705, 125]",MISC
739,NL,"[703, 108, 705, 125]",MISC
740,-,"[703, 108, 705, 125]",MISC
741,Graduate,"[346, 128, 432, 144]",MISC
742,##d,"[346, 128, 432, 144]",MISC
743,with,"[434, 128, 473, 144]",MISC
744,GP,"[473, 128, 501, 144]",MISC
745,##A,"[473, 128, 501, 144]",MISC
746,of,"[502, 128, 521, 144]",MISC
747,6,"[522, 128, 561, 144]",MISC
748,.,"[522, 128, 561, 144]",MISC
749,5,"[522, 128, 561, 144]",MISC
750,.,"[522, 128, 561, 144]",MISC
751,-,"[561, 128, 563, 144]",MISC
752,NL,"[561, 128, 563, 144]",MISC
753,-,"[561, 128, 563, 144]",MISC
754,Con,"[346, 144, 465, 160]",MISC
755,##cent,"[346, 144, 465, 160]",MISC
756,##ration,"[346, 144, 465, 160]",MISC
757,in,"[466, 144, 485, 160]",MISC
758,Security,"[485, 144, 558, 160]",MISC
759,Analysis,"[559, 144, 633, 160]",MISC
760,&,"[633, 144, 642, 160]",MISC
761,Port,"[642, 144, 725, 160]",MISC
762,##fo,"[642, 144, 725, 160]",MISC
763,##lio,"[642, 144, 725, 160]",MISC
764,Management,"[726, 144, 818, 160]",MISC
765,&,"[818, 144, 828, 160]",MISC
766,Tax,"[828, 144, 901, 160]",MISC
767,##ation,"[828, 144, 901, 160]",MISC
768,-,"[902, 144, 904, 160]",MISC
769,NL,"[902, 144, 904, 160]",MISC
770,-,"[902, 144, 904, 160]",MISC
771,Pre,"[346, 170, 373, 186]",B-education_degree
772,University,"[375, 170, 471, 186]",I-education_degree
773,Course,"[472, 170, 529, 186]",I-education_degree
774,-,"[530, 170, 532, 186]",MISC
775,NL,"[530, 170, 532, 186]",MISC
776,-,"[530, 170, 532, 186]",MISC
777,An,"[346, 189, 410, 205]",B-education_institute
778,##ju,"[346, 189, 410, 205]",I-education_institute
779,##man,"[346, 189, 410, 205]",I-education_institute
780,Pre,"[410, 189, 438, 205]",I-education_institute
781,University,"[438, 189, 530, 205]",I-education_institute
782,College,"[530, 189, 594, 205]",I-education_institute
783,-,"[594, 189, 596, 205]",MISC
784,NL,"[594, 189, 596, 205]",MISC
785,-,"[594, 189, 596, 205]",MISC
786,Graduate,"[346, 209, 436, 225]",MISC
787,##d,"[346, 209, 436, 225]",MISC
788,with,"[436, 209, 475, 225]",MISC
789,GP,"[477, 209, 506, 225]",MISC
790,##A,"[477, 209, 506, 225]",MISC
791,of,"[507, 209, 526, 225]",MISC
792,9,"[527, 209, 557, 225]",MISC
793,.,"[527, 209, 557, 225]",MISC
794,1,"[527, 209, 557, 225]",MISC
795,-,"[558, 209, 559, 225]",MISC
796,NL,"[558, 209, 559, 225]",MISC
797,-,"[558, 209, 559, 225]",MISC
798,Secondary,"[346, 234, 430, 250]",B-education_institute
799,School,"[431, 234, 486, 250]",I-education_institute
800,Leaving,"[488, 234, 554, 250]",I-education_institute
801,Certificate,"[554, 234, 658, 250]",I-education_institute
802,-,"[659, 234, 661, 250]",MISC
803,NL,"[659, 234, 661, 250]",MISC
804,-,"[659, 234, 661, 250]",MISC
805,I,"[346, 254, 394, 270]",B-education_degree
806,##A,"[346, 254, 394, 270]",I-education_degree
807,##U,"[346, 254, 394, 270]",I-education_degree
808,##HS,"[346, 254, 394, 270]",I-education_degree
809,School,"[395, 254, 454, 270]",I-education_degree
810,-,"[454, 254, 456, 270]",MISC
811,NL,"[454, 254, 456, 270]",MISC
812,-,"[454, 254, 456, 270]",MISC
813,Graduate,"[346, 272, 436, 288]",MISC
814,##d,"[346, 272, 436, 288]",MISC
815,with,"[436, 272, 475, 288]",MISC
816,GP,"[477, 272, 506, 288]",MISC
817,##A,"[477, 272, 506, 288]",MISC
818,of,"[507, 272, 526, 288]",MISC
819,7,"[527, 272, 557, 288]",MISC
820,.,"[527, 272, 557, 288]",MISC
821,6,"[527, 272, 557, 288]",MISC
822,-,"[558, 272, 559, 288]",MISC
823,NL,"[558, 272, 559, 288]",MISC
824,-,"[558, 272, 559, 288]",MISC
825,Projects,"[93, 311, 189, 336]",B-others_heading
826,-,"[189, 311, 191, 336]",MISC
827,NL,"[189, 311, 191, 336]",MISC
828,-,"[189, 311, 191, 336]",MISC
829,•,"[346, 358, 355, 374]",MISC
830,Investment,"[355, 358, 449, 374]",B-project_title
831,Avenue,"[450, 358, 516, 374]",I-project_title
832,##s,"[450, 358, 516, 374]",I-project_title
833,for,"[516, 358, 544, 374]",I-project_title
834,In,"[545, 358, 630, 374]",I-project_title
835,##ves,"[545, 358, 630, 374]",I-project_title
836,##tors,"[545, 358, 630, 374]",I-project_title
837,in,"[630, 358, 649, 374]",I-project_title
838,Man,"[649, 358, 734, 374]",I-project_title
839,##gal,"[649, 358, 734, 374]",I-project_title
840,##ore,"[649, 358, 734, 374]",I-project_title
841,-,"[735, 358, 744, 374]",MISC
842,6,"[744, 358, 753, 374]",MISC
843,Month,"[753, 358, 809, 374]",MISC
844,##s,"[753, 358, 809, 374]",MISC
845,at,"[810, 358, 829, 374]",MISC
846,St,"[829, 358, 848, 374]",B-project_company_name
847,Al,"[848, 358, 924, 374]",I-project_company_name
848,##oy,"[848, 358, 924, 374]",I-project_company_name
849,##sius,"[848, 358, 924, 374]",I-project_company_name
850,Col,"[924, 358, 979, 374]",I-project_company_name
851,##lge,"[924, 358, 979, 374]",I-project_company_name
852,-,"[981, 358, 983, 374]",I-project_company_name
853,NL,"[981, 358, 983, 374]",I-project_company_name
854,-,"[981, 358, 983, 374]",I-project_company_name
855,(,"[346, 376, 464, 392]",I-project_company_name
856,Autonomous,"[346, 376, 464, 392]",I-project_company_name
857,),"[346, 376, 464, 392]",I-project_company_name
858,.,"[346, 376, 464, 392]",I-project_company_name
859,-,"[464, 376, 465, 392]",MISC
860,NL,"[464, 376, 465, 392]",MISC
861,-,"[464, 376, 465, 392]",MISC
862,•,"[346, 392, 355, 408]",MISC
863,Computer,"[356, 392, 433, 408]",MISC
864,-,"[435, 392, 444, 408]",MISC
865,Tall,"[445, 392, 542, 408]",MISC
866,##y,"[445, 392, 542, 408]",MISC
867,##ER,"[445, 392, 542, 408]",MISC
868,##P,"[445, 392, 542, 408]",MISC
869,##9,"[445, 392, 542, 408]",MISC
870,",","[445, 392, 542, 408]",MISC
871,Ms,"[544, 392, 562, 408]",MISC
872,Ex,"[563, 392, 622, 408]",MISC
873,##cel,"[563, 392, 622, 408]",MISC
874,",","[563, 392, 622, 408]",MISC
875,Ms,"[623, 392, 641, 408]",MISC
876,Word,"[642, 392, 690, 408]",MISC
877,",","[642, 392, 690, 408]",MISC
878,Ms,"[692, 392, 710, 408]",MISC
879,Power,"[712, 392, 820, 408]",MISC
880,##point,"[712, 392, 820, 408]",MISC
881,",","[712, 392, 820, 408]",MISC
882,Ms,"[821, 392, 839, 408]",MISC
883,Access,"[840, 392, 899, 408]",MISC
884,at,"[900, 392, 918, 408]",MISC
885,I,"[919, 392, 958, 408]",MISC
886,##CA,"[919, 392, 958, 408]",MISC
887,##I,"[919, 392, 958, 408]",MISC
888,-,"[959, 392, 961, 408]",MISC
889,NL,"[959, 392, 961, 408]",MISC
890,-,"[959, 392, 961, 408]",MISC
891,B,"[346, 408, 406, 424]",MISC
892,##ha,"[346, 408, 406, 424]",MISC
893,##van,"[346, 408, 406, 424]",MISC
894,",","[346, 408, 406, 424]",MISC
895,B,"[408, 408, 452, 424]",MISC
896,##unts,"[408, 408, 452, 424]",MISC
897,Host,"[452, 408, 503, 424]",MISC
898,##el,"[452, 408, 503, 424]",MISC
899,Circle,"[505, 408, 566, 424]",MISC
900,",","[505, 408, 566, 424]",MISC
901,Man,"[567, 408, 655, 424]",MISC
902,##gal,"[567, 408, 655, 424]",MISC
903,##ore,"[567, 408, 655, 424]",MISC
904,",","[567, 408, 655, 424]",MISC
905,Karnataka,"[655, 408, 744, 424]",MISC
906,",","[655, 408, 744, 424]",MISC
907,India,"[744, 408, 795, 424]",MISC
908,.,"[744, 408, 795, 424]",MISC
909,-,"[797, 408, 799, 424]",MISC
910,NL,"[797, 408, 799, 424]",MISC
911,-,"[797, 408, 799, 424]",MISC
912,•,"[346, 424, 353, 440]",MISC
913,Paper,"[355, 424, 399, 440]",MISC
914,presentation,"[399, 424, 504, 440]",MISC
915,on,"[505, 424, 522, 440]",MISC
916,financial,"[523, 424, 611, 440]",MISC
917,##s,"[523, 424, 611, 440]",MISC
918,of,"[611, 424, 628, 440]",MISC
919,Te,"[629, 424, 680, 440]",MISC
920,##sla,"[629, 424, 680, 440]",MISC
921,",","[629, 424, 680, 440]",MISC
922,Inc,"[682, 424, 717, 440]",MISC
923,.,"[682, 424, 717, 440]",MISC
924,at,"[717, 424, 734, 440]",MISC
925,the,"[735, 424, 761, 440]",MISC
926,I,"[762, 424, 797, 440]",MISC
927,##CA,"[762, 424, 797, 440]",MISC
928,##I,"[762, 424, 797, 440]",MISC
929,B,"[797, 424, 858, 440]",MISC
930,##ha,"[797, 424, 858, 440]",MISC
931,##van,"[797, 424, 858, 440]",MISC
932,",","[797, 424, 858, 440]",MISC
933,Pa,"[859, 424, 903, 440]",MISC
934,##di,"[859, 424, 903, 440]",MISC
935,##l,"[859, 424, 903, 440]",MISC
936,Junction,"[903, 424, 982, 440]",MISC
937,",","[903, 424, 982, 440]",MISC
938,-,"[983, 424, 985, 440]",MISC
939,NL,"[983, 424, 985, 440]",MISC
940,-,"[983, 424, 985, 440]",MISC
941,Man,"[346, 442, 434, 458]",MISC
942,##gal,"[346, 442, 434, 458]",MISC
943,##ore,"[346, 442, 434, 458]",MISC
944,",","[346, 442, 434, 458]",MISC
945,Karnataka,"[434, 442, 523, 458]",MISC
946,.,"[434, 442, 523, 458]",MISC
947,-,"[523, 442, 524, 458]",MISC
948,NL,"[523, 442, 524, 458]",MISC
949,-,"[523, 442, 524, 458]",MISC
950,Technical,"[93, 480, 198, 504]",B-skills_heading
951,Skills,"[198, 480, 268, 504]",I-skills_heading
952,-,"[268, 480, 270, 504]",MISC
953,NL,"[268, 480, 270, 504]",MISC
954,-,"[268, 480, 270, 504]",MISC
955,•,"[93, 528, 174, 544]",MISC
956,Fin,"[93, 528, 174, 544]",MISC
957,##acle,"[93, 528, 174, 544]",MISC
958,•,"[175, 528, 265, 544]",MISC
959,F,"[175, 528, 265, 544]",MISC
960,##lex,"[175, 528, 265, 544]",MISC
961,##cu,"[175, 528, 265, 544]",MISC
962,##be,"[175, 528, 265, 544]",MISC
963,•,"[266, 528, 327, 544]",MISC
964,Tall,"[266, 528, 327, 544]",MISC
965,##y,"[266, 528, 327, 544]",MISC
966,ER,"[327, 528, 367, 544]",MISC
967,##P,"[327, 528, 367, 544]",MISC
968,##9,"[327, 528, 367, 544]",MISC
969,•,"[367, 528, 397, 544]",MISC
970,Ms,"[367, 528, 397, 544]",MISC
971,Ex,"[398, 528, 448, 544]",MISC
972,##cel,"[398, 528, 448, 544]",MISC
973,•,"[449, 528, 489, 544]",MISC
974,Gen,"[449, 528, 489, 544]",MISC
975,Pay,"[489, 528, 559, 544]",MISC
976,##roll,"[489, 528, 559, 544]",MISC
977,•,"[560, 528, 630, 544]",MISC
978,Win,"[560, 528, 630, 544]",MISC
979,##man,"[560, 528, 630, 544]",MISC
980,CA,"[631, 528, 652, 544]",MISC
981,ER,"[652, 528, 681, 544]",MISC
982,##P,"[652, 528, 681, 544]",MISC
983,•,"[682, 528, 783, 544]",MISC
984,Win,"[682, 528, 783, 544]",MISC
985,##man,"[682, 528, 783, 544]",MISC
986,##GS,"[682, 528, 783, 544]",MISC
987,##T,"[682, 528, 783, 544]",MISC
988,•,"[784, 528, 813, 544]",MISC
989,Ms,"[784, 528, 813, 544]",MISC
990,Word,"[814, 528, 855, 544]",MISC
991,•,"[855, 528, 884, 544]",MISC
992,Ms,"[855, 528, 884, 544]",MISC
993,Power,"[885, 528, 986, 544]",MISC
994,##P,"[885, 528, 986, 544]",MISC
995,##oint,"[885, 528, 986, 544]",MISC
996,-,"[987, 528, 988, 544]",MISC
997,NL,"[987, 528, 988, 544]",MISC
998,-,"[987, 528, 988, 544]",MISC
999,•,"[97, 544, 127, 560]",MISC
1000,Ms,"[97, 544, 127, 560]",MISC
1001,Access,"[127, 544, 186, 560]",MISC
1002,-,"[186, 544, 187, 560]",MISC
1003,NL,"[186, 544, 187, 560]",MISC
1004,-,"[186, 544, 187, 560]",MISC
1005,St,"[93, 582, 208, 607]",B-skills_heading
1006,##ren,"[93, 582, 208, 607]",I-skills_heading
1007,##gth,"[93, 582, 208, 607]",I-skills_heading
1008,##s,"[93, 582, 208, 607]",I-skills_heading
1009,-,"[208, 582, 209, 607]",MISC
1010,NL,"[208, 582, 209, 607]",MISC
1011,-,"[208, 582, 209, 607]",MISC
1012,•,"[93, 630, 184, 646]",MISC
1013,Ana,"[93, 630, 184, 646]",MISC
1014,##lat,"[93, 630, 184, 646]",MISC
1015,##y,"[93, 630, 184, 646]",MISC
1016,##cal,"[93, 630, 184, 646]",MISC
1017,•,"[184, 630, 265, 646]",MISC
1018,adapt,"[184, 630, 265, 646]",MISC
1019,##able,"[184, 630, 265, 646]",MISC
1020,•,"[267, 630, 341, 646]",MISC
1021,creative,"[267, 630, 341, 646]",MISC
1022,•,"[341, 630, 455, 646]",MISC
1023,co,"[341, 630, 455, 646]",MISC
1024,##llo,"[341, 630, 455, 646]",MISC
1025,##bor,"[341, 630, 455, 646]",MISC
1026,##ative,"[341, 630, 455, 646]",MISC
1027,•,"[457, 630, 531, 646]",MISC
1028,conflict,"[457, 630, 531, 646]",MISC
1029,resolve,"[531, 630, 596, 646]",MISC
1030,##r,"[531, 630, 596, 646]",MISC
1031,•,"[597, 630, 678, 646]",MISC
1032,efficient,"[597, 630, 678, 646]",MISC
1033,•,"[680, 630, 754, 646]",MISC
1034,exposure,"[680, 630, 754, 646]",MISC
1035,to,"[754, 630, 769, 646]",MISC
1036,client,"[771, 630, 819, 646]",MISC
1037,interaction,"[820, 630, 910, 646]",MISC
1038,-,"[911, 630, 913, 646]",MISC
1039,NL,"[911, 630, 913, 646]",MISC
1040,-,"[911, 630, 913, 646]",MISC
1041,•,"[93, 646, 193, 662]",MISC
1042,interactive,"[93, 646, 193, 662]",MISC
1043,&,"[194, 646, 201, 662]",MISC
1044,di,"[202, 646, 311, 662]",MISC
1045,##sse,"[202, 646, 311, 662]",MISC
1046,##mina,"[202, 646, 311, 662]",MISC
1047,##tive,"[202, 646, 311, 662]",MISC
1048,skills,"[311, 646, 361, 662]",MISC
1049,•,"[361, 646, 451, 662]",MISC
1050,leadership,"[361, 646, 451, 662]",MISC
1051,•,"[453, 646, 543, 662]",MISC
1052,organ,"[453, 646, 543, 662]",MISC
1053,##iz,"[453, 646, 543, 662]",MISC
1054,##ive,"[453, 646, 543, 662]",MISC
1055,•,"[545, 646, 635, 662]",MISC
1056,pu,"[545, 646, 635, 662]",MISC
1057,##rs,"[545, 646, 635, 662]",MISC
1058,##ua,"[545, 646, 635, 662]",MISC
1059,##sive,"[545, 646, 635, 662]",MISC
1060,•,"[637, 646, 762, 662]",MISC
1061,self,"[637, 646, 762, 662]",MISC
1062,-,"[637, 646, 762, 662]",MISC
1063,motivated,"[637, 646, 762, 662]",MISC
1064,etc,"[763, 646, 787, 662]",MISC
1065,-,"[788, 646, 790, 662]",MISC
1066,NL,"[788, 646, 790, 662]",MISC
1067,-,"[788, 646, 790, 662]",MISC
1068,Awards,"[93, 684, 182, 709]",B-others_heading
1069,&,"[184, 684, 198, 709]",I-others_heading
1070,Achievement,"[199, 684, 377, 709]",I-others_heading
1071,##s,"[199, 684, 377, 709]",I-others_heading
1072,-,"[379, 684, 381, 709]",MISC
1073,NL,"[379, 684, 381, 709]",MISC
1074,-,"[379, 684, 381, 709]",MISC
1075,•,"[93, 732, 103, 749]",MISC
1076,My,"[103, 732, 121, 749]",MISC
1077,independent,"[122, 732, 227, 749]",MISC
1078,audit,"[227, 732, 273, 749]",MISC
1079,report,"[275, 732, 332, 749]",MISC
1080,and,"[333, 732, 360, 749]",MISC
1081,observations,"[361, 732, 476, 749]",MISC
1082,let,"[476, 732, 504, 749]",MISC
1083,us,"[505, 732, 523, 749]",MISC
1084,almost,"[524, 732, 581, 749]",MISC
1085,secure,"[582, 732, 639, 749]",MISC
1086,an,"[639, 732, 657, 749]",MISC
1087,outs,"[658, 732, 763, 749]",MISC
1088,##our,"[658, 732, 763, 749]",MISC
1089,##cing,"[658, 732, 763, 749]",MISC
1090,contract,"[763, 732, 839, 749]",MISC
1091,to,"[840, 732, 858, 749]",MISC
1092,manage,"[859, 732, 916, 749]",MISC
1093,fixed,"[917, 732, 963, 749]",MISC
1094,-,"[965, 732, 966, 749]",MISC
1095,NL,"[965, 732, 966, 749]",MISC
1096,-,"[965, 732, 966, 749]",MISC
1097,assets,"[93, 749, 149, 765]",MISC
1098,at,"[150, 749, 169, 765]",MISC
1099,a,"[169, 749, 178, 765]",MISC
1100,Bangalore,"[179, 749, 263, 765]",MISC
1101,based,"[264, 749, 310, 765]",MISC
1102,major,"[311, 749, 357, 765]",MISC
1103,health,"[358, 749, 414, 765]",MISC
1104,solutions,"[415, 749, 500, 765]",MISC
1105,M,"[500, 749, 546, 765]",MISC
1106,##NC,"[500, 749, 546, 765]",MISC
1107,’,"[500, 749, 546, 765]",MISC
1108,s,"[500, 749, 546, 765]",MISC
1109,Bangalore,"[547, 749, 632, 765]",MISC
1110,branches,"[633, 749, 717, 765]",MISC
1111,.,"[633, 749, 717, 765]",MISC
1112,-,"[718, 749, 720, 765]",MISC
1113,NL,"[718, 749, 720, 765]",MISC
1114,-,"[718, 749, 720, 765]",MISC
1115,•,"[93, 765, 103, 782]",MISC
1116,Best,"[103, 765, 142, 782]",MISC
1117,Out,"[142, 765, 219, 782]",MISC
1118,##going,"[142, 765, 219, 782]",MISC
1119,Student,"[219, 765, 285, 782]",MISC
1120,Award,"[287, 765, 335, 782]",MISC
1121,-,"[335, 765, 344, 782]",MISC
1122,Pre,"[345, 765, 372, 782]",MISC
1123,Un,"[374, 765, 460, 782]",MISC
1124,##ivers,"[374, 765, 460, 782]",MISC
1125,##i,"[374, 765, 460, 782]",MISC
1126,##y,"[374, 765, 460, 782]",MISC
1127,Course,"[461, 765, 518, 782]",MISC
1128,-,"[519, 765, 521, 782]",MISC
1129,NL,"[519, 765, 521, 782]",MISC
1130,-,"[519, 765, 521, 782]",MISC
1131,•,"[93, 782, 103, 798]",MISC
1132,Part,"[103, 782, 213, 798]",MISC
1133,##ici,"[103, 782, 213, 798]",MISC
1134,##pate,"[103, 782, 213, 798]",MISC
1135,##d,"[103, 782, 213, 798]",MISC
1136,&,"[214, 782, 223, 798]",MISC
1137,Won,"[223, 782, 251, 798]",MISC
1138,in,"[251, 782, 269, 798]",MISC
1139,a,"[269, 782, 278, 798]",MISC
1140,number,"[278, 782, 334, 798]",MISC
1141,of,"[334, 782, 352, 798]",MISC
1142,National,"[352, 782, 435, 798]",MISC
1143,",","[352, 782, 435, 798]",MISC
1144,State,"[436, 782, 491, 798]",MISC
1145,",","[436, 782, 491, 798]",MISC
1146,Local,"[491, 782, 537, 798]",MISC
1147,&,"[537, 782, 546, 798]",MISC
1148,Col,"[547, 782, 602, 798]",MISC
1149,##lge,"[547, 782, 602, 798]",MISC
1150,level,"[602, 782, 648, 798]",MISC
1151,festivals,"[648, 782, 731, 798]",MISC
1152,&,"[731, 782, 741, 798]",MISC
1153,events,"[741, 782, 796, 798]",MISC
1154,in,"[796, 782, 815, 798]",MISC
1155,areas,"[815, 782, 861, 798]",MISC
1156,like,"[861, 782, 898, 798]",MISC
1157,business,"[898, 782, 972, 798]",MISC
1158,-,"[972, 782, 974, 798]",MISC
1159,NL,"[972, 782, 974, 798]",MISC
1160,-,"[972, 782, 974, 798]",MISC
1161,q,"[93, 798, 136, 815]",MISC
1162,##uiz,"[93, 798, 136, 815]",MISC
1163,",","[93, 798, 136, 815]",MISC
1164,essays,"[137, 798, 196, 815]",MISC
1165,",","[137, 798, 196, 815]",MISC
1166,s,"[198, 798, 275, 815]",MISC
1167,##pe,"[198, 798, 275, 815]",MISC
1168,##ache,"[198, 798, 275, 815]",MISC
1169,##s,"[198, 798, 275, 815]",MISC
1170,",","[198, 798, 275, 815]",MISC
1171,poetry,"[276, 798, 327, 815]",MISC
1172,etc,"[328, 798, 361, 815]",MISC
1173,.,"[328, 798, 361, 815]",MISC
1174,-,"[362, 798, 364, 815]",MISC
1175,NL,"[362, 798, 364, 815]",MISC
1176,-,"[362, 798, 364, 815]",MISC
1177,•,"[93, 815, 103, 831]",MISC
1178,State,"[103, 815, 149, 831]",MISC
1179,Level,"[149, 815, 195, 831]",MISC
1180,Sports,"[196, 815, 251, 831]",MISC
1181,-,"[252, 815, 261, 831]",MISC
1182,B,"[261, 815, 298, 831]",MISC
1183,##B,"[261, 815, 298, 831]",MISC
1184,##T,"[261, 815, 298, 831]",MISC
1185,",","[261, 815, 298, 831]",MISC
1186,Bad,"[298, 815, 390, 831]",MISC
1187,##min,"[298, 815, 390, 831]",MISC
1188,##ton,"[298, 815, 390, 831]",MISC
1189,",","[298, 815, 390, 831]",MISC
1190,Ka,"[391, 815, 465, 831]",MISC
1191,##bba,"[391, 815, 465, 831]",MISC
1192,##di,"[391, 815, 465, 831]",MISC
1193,.,"[391, 815, 465, 831]",MISC
1194,-,"[465, 815, 467, 831]",MISC
1195,NL,"[465, 815, 467, 831]",MISC
1196,-,"[465, 815, 467, 831]",MISC
1197,Other,"[93, 854, 152, 877]",B-others_heading
1198,Activities,"[153, 854, 271, 877]",I-others_heading
1199,-,"[272, 854, 274, 877]",MISC
1200,NL,"[272, 854, 274, 877]",MISC
1201,-,"[272, 854, 274, 877]",MISC
1202,•,"[93, 901, 103, 917]",MISC
1203,Sa,"[103, 901, 160, 917]",MISC
1204,##hay,"[103, 901, 160, 917]",MISC
1205,##a,"[103, 901, 160, 917]",MISC
1206,-,"[160, 901, 169, 917]",MISC
1207,A,"[170, 901, 179, 917]",MISC
1208,20,"[179, 901, 198, 917]",MISC
1209,Month,"[198, 901, 255, 917]",MISC
1210,##s,"[198, 901, 255, 917]",MISC
1211,project,"[255, 901, 322, 917]",MISC
1212,on,"[322, 901, 340, 917]",MISC
1213,Social,"[341, 901, 398, 917]",MISC
1214,Welfare,"[398, 901, 464, 917]",MISC
1215,by,"[465, 901, 483, 917]",MISC
1216,visiting,"[484, 901, 559, 917]",MISC
1217,old,"[560, 901, 588, 917]",MISC
1218,age,"[589, 901, 616, 917]",MISC
1219,homes,"[617, 901, 674, 917]",MISC
1220,",","[617, 901, 674, 917]",MISC
1221,orphanage,"[674, 901, 777, 917]",MISC
1222,##s,"[674, 901, 777, 917]",MISC
1223,",","[674, 901, 777, 917]",MISC
1224,go,"[779, 901, 816, 917]",MISC
1225,##v,"[779, 901, 816, 917]",MISC
1226,##t,"[779, 901, 816, 917]",MISC
1227,schools,"[817, 901, 893, 917]",MISC
1228,",","[817, 901, 893, 917]",MISC
1229,go,"[893, 901, 930, 917]",MISC
1230,##v,"[893, 901, 930, 917]",MISC
1231,##t,"[893, 901, 930, 917]",MISC
1232,-,"[931, 901, 933, 917]",MISC
1233,NL,"[931, 901, 933, 917]",MISC
1234,-,"[931, 901, 933, 917]",MISC
1235,hospitals,"[93, 917, 176, 933]",MISC
1236,etc,"[178, 917, 205, 933]",MISC
1237,on,"[206, 917, 224, 933]",MISC
1238,the,"[224, 917, 252, 933]",MISC
1239,weekends,"[252, 917, 335, 933]",MISC
1240,.,"[252, 917, 335, 933]",MISC
1241,-,"[337, 917, 338, 933]",MISC
1242,NL,"[337, 917, 338, 933]",MISC
1243,-,"[337, 917, 338, 933]",MISC
1244,Personal,"[93, 975, 191, 1000]",B-personal_details_heading
1245,Profile,"[193, 975, 279, 1000]",I-personal_details_heading
1246,-,"[279, 975, 281, 1000]",MISC
1247,NL,"[279, 975, 281, 1000]",MISC
1248,-,"[279, 975, 281, 1000]",MISC
1249,•,"[93, 42, 103, 58]",MISC
1250,Date,"[103, 42, 140, 58]",MISC
1251,of,"[141, 42, 159, 58]",MISC
1252,Birth,"[160, 42, 206, 58]",MISC
1253,:,"[207, 42, 216, 58]",MISC
1254,16,"[216, 42, 310, 58]",MISC
1255,-,"[216, 42, 310, 58]",MISC
1256,07,"[216, 42, 310, 58]",MISC
1257,-,"[216, 42, 310, 58]",MISC
1258,1996,"[216, 42, 310, 58]",MISC
1259,-,"[311, 42, 313, 58]",MISC
1260,NL,"[311, 42, 313, 58]",MISC
1261,-,"[311, 42, 313, 58]",MISC
1262,•,"[93, 58, 103, 74]",MISC
1263,Known,"[103, 58, 149, 74]",MISC
1264,Languages,"[150, 58, 235, 74]",MISC
1265,:,"[235, 58, 245, 74]",MISC
1266,English,"[245, 58, 320, 74]",MISC
1267,",","[245, 58, 320, 74]",MISC
1268,Hindi,"[321, 58, 376, 74]",MISC
1269,",","[321, 58, 376, 74]",MISC
1270,Kannada,"[377, 58, 453, 74]",MISC
1271,",","[377, 58, 453, 74]",MISC
1272,Urdu,"[453, 58, 499, 74]",MISC
1273,",","[453, 58, 499, 74]",MISC
1274,Ko,"[500, 58, 565, 74]",MISC
1275,##nka,"[500, 58, 565, 74]",MISC
1276,##ni,"[500, 58, 565, 74]",MISC
1277,-,"[567, 58, 569, 74]",MISC
1278,NL,"[567, 58, 569, 74]",MISC
1279,-,"[567, 58, 569, 74]",MISC
1280,•,"[93, 74, 101, 90]",MISC
1281,Interest,"[102, 74, 172, 90]",MISC
1282,&,"[174, 74, 181, 90]",MISC
1283,Ho,"[182, 74, 243, 90]",MISC
1284,##bb,"[182, 74, 243, 90]",MISC
1285,##ies,"[182, 74, 243, 90]",MISC
1286,:,"[245, 74, 252, 90]",MISC
1287,Adventure,"[254, 74, 342, 90]",MISC
1288,",","[254, 74, 342, 90]",MISC
1289,Food,"[343, 74, 387, 90]",MISC
1290,",","[343, 74, 387, 90]",MISC
1291,Fitness,"[387, 74, 457, 90]",MISC
1292,",","[387, 74, 457, 90]",MISC
1293,Travel,"[458, 74, 519, 90]",MISC
1294,.,"[458, 74, 519, 90]",MISC
1295,-,"[521, 74, 523, 90]",MISC
1296,NL,"[521, 74, 523, 90]",MISC
1297,-,"[521, 74, 523, 90]",MISC
1298,Declaration,"[93, 133, 230, 156]",B-others_heading
1299,-,"[230, 133, 232, 156]",MISC
1300,NL,"[230, 133, 232, 156]",MISC
1301,-,"[230, 133, 232, 156]",MISC
1302,I,"[93, 180, 103, 196]",MISC
1303,here,"[103, 180, 158, 196]",MISC
1304,##by,"[103, 180, 158, 196]",MISC
1305,declare,"[160, 180, 224, 196]",MISC
1306,that,"[226, 180, 263, 196]",MISC
1307,the,"[264, 180, 291, 196]",MISC
1308,details,"[292, 180, 357, 196]",MISC
1309,furnished,"[358, 180, 443, 196]",MISC
1310,here,"[444, 180, 480, 196]",MISC
1311,are,"[481, 180, 509, 196]",MISC
1312,true,"[510, 180, 547, 196]",MISC
1313,to,"[548, 180, 566, 196]",MISC
1314,the,"[567, 180, 594, 196]",MISC
1315,best,"[595, 180, 632, 196]",MISC
1316,of,"[633, 180, 651, 196]",MISC
1317,my,"[652, 180, 755, 196]",MISC
1318,##k,"[652, 180, 755, 196]",MISC
1319,##no,"[652, 180, 755, 196]",MISC
1320,##wl,"[652, 180, 755, 196]",MISC
1321,##ed,"[652, 180, 755, 196]",MISC
1322,##ge,"[652, 180, 755, 196]",MISC
1323,and,"[756, 180, 783, 196]",MISC
1324,understanding,"[784, 180, 915, 196]",MISC
1325,.,"[784, 180, 915, 196]",MISC
1326,-,"[917, 180, 918, 196]",MISC
1327,NL,"[917, 180, 918, 196]",MISC
1328,-,"[917, 180, 918, 196]",MISC
