,token,box,label
0,SH,"[169, 104, 233, 120]",B-name
1,##I,"[169, 104, 233, 120]",I-name
2,##VA,"[169, 104, 233, 120]",I-name
3,THE,"[234, 104, 297, 120]",MISC
4,##J,"[234, 104, 297, 120]",MISC
5,##A,"[234, 104, 297, 120]",MISC
6,-,"[298, 104, 300, 120]",MISC
7,NL,"[298, 104, 300, 120]",MISC
8,-,"[298, 104, 300, 120]",MISC
9,Em,"[655, 104, 734, 120]",MISC
10,##ail,"[655, 104, 734, 120]",MISC
11,-,"[655, 104, 734, 120]",MISC
12,I,"[655, 104, 734, 120]",MISC
13,##d,"[655, 104, 734, 120]",MISC
14,:,"[734, 104, 744, 120]",MISC
15,si,"[744, 104, 983, 120]",B-emails_email
16,##vate,"[744, 104, 983, 120]",I-emails_email
17,##ja,"[744, 104, 983, 120]",I-emails_email
18,.,"[744, 104, 983, 120]",I-emails_email
19,j,"[744, 104, 983, 120]",I-emails_email
20,##ava,"[744, 104, 983, 120]",I-emails_email
21,##1,"[744, 104, 983, 120]",I-emails_email
22,@,"[744, 104, 983, 120]",I-emails_email
23,g,"[744, 104, 983, 120]",I-emails_email
24,##mail,"[744, 104, 983, 120]",I-emails_email
25,.,"[744, 104, 983, 120]",I-emails_email
26,com,"[744, 104, 983, 120]",I-emails_email
27,-,"[984, 104, 986, 120]",MISC
28,NL,"[984, 104, 986, 120]",MISC
29,-,"[984, 104, 986, 120]",MISC
30,Mobile,"[655, 121, 724, 137]",MISC
31,:,"[725, 121, 736, 137]",MISC
32,+,"[736, 121, 782, 137]",MISC
33,91,"[736, 121, 782, 137]",MISC
34,-,"[736, 121, 782, 137]",MISC
35,96,"[783, 121, 898, 137]",B-phones_phone
36,##86,"[783, 121, 898, 137]",I-phones_phone
37,##40,"[783, 121, 898, 137]",I-phones_phone
38,##0,"[783, 121, 898, 137]",I-phones_phone
39,##42,"[783, 121, 898, 137]",I-phones_phone
40,##2,"[783, 121, 898, 137]",I-phones_phone
41,-,"[899, 121, 901, 137]",MISC
42,NL,"[899, 121, 901, 137]",MISC
43,-,"[899, 121, 901, 137]",MISC
44,Professional,"[169, 175, 300, 190]",B-summary_heading
45,Su,"[300, 175, 376, 190]",I-summary_heading
46,##mma,"[300, 175, 376, 190]",I-summary_heading
47,##ry,"[300, 175, 376, 190]",I-summary_heading
48,-,"[377, 175, 379, 190]",MISC
49,NL,"[377, 175, 379, 190]",MISC
50,-,"[377, 175, 379, 190]",MISC
51,Having,"[214, 231, 278, 247]",MISC
52,4,"[278, 231, 288, 247]",MISC
53,+,"[289, 231, 299, 247]",MISC
54,Years,"[300, 231, 352, 247]",MISC
55,of,"[353, 231, 374, 247]",MISC
56,IT,"[374, 231, 396, 247]",MISC
57,experience,"[396, 231, 502, 247]",MISC
58,in,"[502, 231, 524, 247]",MISC
59,developing,"[524, 231, 630, 247]",MISC
60,and,"[630, 231, 661, 247]",MISC
61,maintaining,"[662, 231, 778, 247]",MISC
62,C,"[780, 231, 928, 247]",MISC
63,##lient,"[780, 231, 928, 247]",MISC
64,/,"[780, 231, 928, 247]",MISC
65,Server,"[780, 231, 928, 247]",MISC
66,",","[780, 231, 928, 247]",MISC
67,Web,"[929, 231, 960, 247]",MISC
68,-,"[961, 231, 963, 247]",MISC
69,NL,"[961, 231, 963, 247]",MISC
70,-,"[961, 231, 963, 247]",MISC
71,based,"[238, 255, 290, 271]",MISC
72,Applications,"[291, 255, 416, 271]",MISC
73,using,"[417, 255, 469, 271]",MISC
74,Java,"[469, 255, 510, 271]",MISC
75,and,"[511, 255, 542, 271]",MISC
76,J,"[542, 255, 594, 271]",MISC
77,##2,"[542, 255, 594, 271]",MISC
78,##EE,"[542, 255, 594, 271]",MISC
79,.,"[542, 255, 594, 271]",MISC
80,-,"[595, 255, 597, 271]",MISC
81,NL,"[595, 255, 597, 271]",MISC
82,-,"[595, 255, 597, 271]",MISC
83,Strong,"[215, 279, 280, 296]",MISC
84,Programming,"[281, 279, 403, 296]",MISC
85,knowledge,"[403, 279, 502, 296]",MISC
86,in,"[503, 279, 524, 296]",MISC
87,Java,"[525, 279, 579, 296]",MISC
88,",","[525, 279, 579, 296]",MISC
89,Java,"[581, 279, 625, 296]",MISC
90,Bean,"[625, 279, 691, 296]",MISC
91,##s,"[625, 279, 691, 296]",MISC
92,",","[625, 279, 691, 296]",MISC
93,J,"[692, 279, 736, 296]",MISC
94,##SP,"[692, 279, 736, 296]",MISC
95,",","[692, 279, 736, 296]",MISC
96,Ser,"[736, 279, 834, 296]",MISC
97,##v,"[736, 279, 834, 296]",MISC
98,##lets,"[736, 279, 834, 296]",MISC
99,",","[736, 279, 834, 296]",MISC
100,-,"[836, 279, 838, 296]",MISC
101,NL,"[836, 279, 838, 296]",MISC
102,-,"[836, 279, 838, 296]",MISC
103,Hi,"[242, 305, 339, 320]",MISC
104,##ber,"[242, 305, 339, 320]",MISC
105,##nate,"[242, 305, 339, 320]",MISC
106,",","[242, 305, 339, 320]",MISC
107,St,"[339, 305, 407, 320]",MISC
108,##ru,"[339, 305, 407, 320]",MISC
109,##ts,"[339, 305, 407, 320]",MISC
110,",","[339, 305, 407, 320]",MISC
111,Spring,"[407, 305, 475, 320]",MISC
112,.,"[407, 305, 475, 320]",MISC
113,-,"[475, 305, 477, 320]",MISC
114,NL,"[475, 305, 477, 320]",MISC
115,-,"[475, 305, 477, 320]",MISC
116,Experience,"[214, 329, 320, 344]",MISC
117,in,"[322, 329, 343, 344]",MISC
118,core,"[343, 329, 386, 344]",MISC
119,j,"[386, 329, 429, 344]",MISC
120,##ava,"[386, 329, 429, 344]",MISC
121,technologies,"[429, 329, 557, 344]",MISC
122,(,"[558, 329, 622, 344]",MISC
123,J,"[558, 329, 622, 344]",MISC
124,##D,"[558, 329, 622, 344]",MISC
125,##BC,"[558, 329, 622, 344]",MISC
126,",","[558, 329, 622, 344]",MISC
127,J,"[623, 329, 686, 344]",MISC
128,##ND,"[623, 329, 686, 344]",MISC
129,##I,"[623, 329, 686, 344]",MISC
130,),"[623, 329, 686, 344]",MISC
131,.,"[623, 329, 686, 344]",MISC
132,-,"[687, 329, 689, 344]",MISC
133,NL,"[687, 329, 689, 344]",MISC
134,-,"[687, 329, 689, 344]",MISC
135,Experience,"[215, 353, 329, 368]",MISC
136,on,"[329, 353, 350, 368]",MISC
137,web,"[352, 353, 385, 368]",MISC
138,services,"[386, 353, 488, 368]",MISC
139,.,"[386, 353, 488, 368]",MISC
140,-,"[489, 353, 491, 368]",MISC
141,NL,"[489, 353, 491, 368]",MISC
142,-,"[489, 353, 491, 368]",MISC
143,Dev,"[215, 378, 292, 394]",MISC
144,##elo,"[215, 378, 292, 394]",MISC
145,##p,"[215, 378, 292, 394]",MISC
146,components,"[292, 378, 402, 394]",MISC
147,using,"[403, 378, 457, 394]",MISC
148,Hi,"[459, 378, 569, 394]",MISC
149,##ber,"[459, 378, 569, 394]",MISC
150,##nate,"[459, 378, 569, 394]",MISC
151,.,"[459, 378, 569, 394]",MISC
152,-,"[570, 378, 572, 394]",MISC
153,NL,"[570, 378, 572, 394]",MISC
154,-,"[570, 378, 572, 394]",MISC
155,Good,"[215, 411, 257, 426]",MISC
156,understanding,"[259, 411, 401, 426]",MISC
157,over,"[402, 411, 444, 426]",MISC
158,the,"[446, 411, 479, 426]",MISC
159,web,"[479, 411, 512, 426]",MISC
160,and,"[512, 411, 545, 426]",MISC
161,application,"[545, 411, 664, 426]",MISC
162,servers,"[666, 411, 741, 426]",MISC
163,like,"[743, 411, 785, 426]",MISC
164,Tom,"[787, 411, 862, 426]",MISC
165,##cat,"[787, 411, 862, 426]",MISC
166,",","[787, 411, 862, 426]",MISC
167,Web,"[864, 411, 962, 426]",MISC
168,##S,"[864, 411, 962, 426]",MISC
169,##phere,"[864, 411, 962, 426]",MISC
170,-,"[963, 411, 965, 426]",MISC
171,NL,"[963, 411, 965, 426]",MISC
172,-,"[963, 411, 965, 426]",MISC
173,and,"[238, 435, 271, 450]",MISC
174,Web,"[271, 435, 369, 450]",MISC
175,##log,"[271, 435, 369, 450]",MISC
176,##ic,"[271, 435, 369, 450]",MISC
177,.,"[271, 435, 369, 450]",MISC
178,-,"[369, 435, 371, 450]",MISC
179,NL,"[369, 435, 371, 450]",MISC
180,-,"[369, 435, 371, 450]",MISC
181,Good,"[214, 459, 257, 474]",MISC
182,Programming,"[257, 459, 385, 474]",MISC
183,",","[257, 459, 385, 474]",MISC
184,Ana,"[386, 459, 492, 474]",MISC
185,##ly,"[386, 459, 492, 474]",MISC
186,##tical,"[386, 459, 492, 474]",MISC
187,and,"[494, 459, 525, 474]",MISC
188,Trouble,"[526, 459, 601, 474]",MISC
189,Shooting,"[601, 459, 686, 474]",MISC
190,skills,"[687, 459, 762, 474]",MISC
191,.,"[687, 459, 762, 474]",MISC
192,-,"[763, 459, 764, 474]",MISC
193,NL,"[763, 459, 764, 474]",MISC
194,-,"[763, 459, 764, 474]",MISC
195,Good,"[214, 483, 252, 500]",MISC
196,analytical,"[253, 483, 352, 500]",MISC
197,abilities,"[352, 483, 451, 500]",MISC
198,",","[352, 483, 451, 500]",MISC
199,quick,"[452, 483, 500, 500]",MISC
200,grasping,"[501, 483, 580, 500]",MISC
201,power,"[581, 483, 629, 500]",MISC
202,z,"[630, 483, 669, 500]",MISC
203,##eal,"[630, 483, 669, 500]",MISC
204,for,"[670, 483, 699, 500]",MISC
205,learning,"[700, 483, 779, 500]",MISC
206,new,"[779, 483, 808, 500]",MISC
207,things,"[809, 483, 878, 500]",MISC
208,.,"[809, 483, 878, 500]",MISC
209,-,"[878, 483, 880, 500]",MISC
210,NL,"[878, 483, 880, 500]",MISC
211,-,"[878, 483, 880, 500]",MISC
212,Good,"[215, 508, 259, 524]",MISC
213,Understanding,"[260, 508, 404, 524]",MISC
214,Oracle,"[405, 508, 482, 524]",MISC
215,",","[405, 508, 482, 524]",MISC
216,My,"[483, 508, 537, 524]",MISC
217,##S,"[483, 508, 537, 524]",MISC
218,##q,"[483, 508, 537, 524]",MISC
219,##l,"[483, 508, 537, 524]",MISC
220,database,"[539, 508, 639, 524]",MISC
221,.,"[539, 508, 639, 524]",MISC
222,-,"[639, 508, 641, 524]",MISC
223,NL,"[639, 508, 641, 524]",MISC
224,-,"[639, 508, 641, 524]",MISC
225,D,"[214, 532, 291, 548]",MISC
226,##ynamic,"[214, 532, 291, 548]",MISC
227,",","[214, 532, 291, 548]",MISC
228,highly,"[292, 532, 350, 548]",MISC
229,motivated,"[351, 532, 438, 548]",MISC
230,and,"[439, 532, 468, 548]",MISC
231,result,"[469, 532, 615, 548]",MISC
232,-,"[469, 532, 615, 548]",MISC
233,oriented,"[469, 532, 615, 548]",MISC
234,professional,"[616, 532, 743, 548]",MISC
235,.,"[616, 532, 743, 548]",MISC
236,-,"[743, 532, 745, 548]",MISC
237,NL,"[743, 532, 745, 548]",MISC
238,-,"[743, 532, 745, 548]",MISC
239,Education,"[169, 576, 256, 591]",B-education_heading
240,Qualification,"[256, 576, 391, 591]",I-education_heading
241,:,"[256, 576, 391, 591]",I-education_heading
242,-,"[391, 576, 393, 591]",MISC
243,NL,"[391, 576, 393, 591]",MISC
244,-,"[391, 576, 393, 591]",MISC
245,B,"[215, 608, 285, 624]",B-education_degree
246,.,"[215, 608, 285, 624]",I-education_degree
247,Tech,"[215, 608, 285, 624]",I-education_degree
248,Complete,"[286, 608, 390, 624]",MISC
249,##d,"[286, 608, 390, 624]",MISC
250,from,"[391, 608, 437, 624]",MISC
251,J,"[438, 608, 496, 624]",B-education_institute
252,##NT,"[438, 608, 496, 624]",I-education_institute
253,##U,"[438, 608, 496, 624]",I-education_institute
254,",","[438, 608, 496, 624]",I-education_institute
255,Ana,"[497, 608, 635, 624]",I-education_institute
256,##nt,"[497, 608, 635, 624]",I-education_institute
257,##ha,"[497, 608, 635, 624]",I-education_institute
258,##ph,"[497, 608, 635, 624]",I-education_institute
259,##ur,"[497, 608, 635, 624]",I-education_institute
260,.,"[497, 608, 635, 624]",MISC
261,-,"[637, 608, 639, 624]",MISC
262,NL,"[637, 608, 639, 624]",MISC
263,-,"[637, 608, 639, 624]",MISC
264,Professional,"[169, 641, 289, 656]",B-work_experience_heading
265,Experience,"[289, 641, 397, 656]",I-work_experience_heading
266,:,"[289, 641, 397, 656]",I-work_experience_heading
267,-,"[398, 641, 400, 656]",MISC
268,NL,"[398, 641, 400, 656]",MISC
269,-,"[398, 641, 400, 656]",MISC
270,Working,"[215, 673, 292, 689]",MISC
271,as,"[293, 673, 315, 689]",MISC
272,a,"[316, 673, 325, 689]",MISC
273,Software,"[327, 673, 416, 689]",MISC
274,Engineer,"[417, 673, 505, 689]",MISC
275,for,"[506, 673, 539, 689]",MISC
276,K,"[540, 673, 573, 689]",B-employer_company_name
277,##MG,"[540, 673, 573, 689]",I-employer_company_name
278,In,"[574, 673, 662, 689]",I-employer_company_name
279,##fo,"[574, 673, 662, 689]",I-employer_company_name
280,##tech,"[574, 673, 662, 689]",I-employer_company_name
281,P,"[663, 673, 696, 689]",I-employer_company_name
282,##v,"[663, 673, 696, 689]",I-employer_company_name
283,##t,"[663, 673, 696, 689]",I-employer_company_name
284,Ltd,"[697, 673, 741, 689]",I-employer_company_name
285,",","[697, 673, 741, 689]",MISC
286,since,"[742, 673, 798, 689]",MISC
287,Aug,"[798, 673, 831, 689]",MISC
288,2018,"[831, 673, 876, 689]",MISC
289,to,"[876, 673, 897, 689]",MISC
290,Till,"[899, 673, 943, 689]",MISC
291,Date,"[943, 673, 999, 689]",MISC
292,.,"[943, 673, 999, 689]",MISC
293,-,"[1000, 673, 1001, 689]",MISC
294,NL,"[1000, 673, 1001, 689]",MISC
295,-,"[1000, 673, 1001, 689]",MISC
296,Work,"[215, 697, 280, 714]",MISC
297,##ed,"[215, 697, 280, 714]",MISC
298,as,"[282, 697, 303, 714]",MISC
299,a,"[304, 697, 314, 714]",MISC
300,Software,"[315, 697, 404, 714]",MISC
301,Engineer,"[405, 697, 494, 714]",MISC
302,for,"[494, 697, 527, 714]",MISC
303,Quinn,"[528, 697, 605, 714]",B-employer_company_name
304,##ox,"[528, 697, 605, 714]",I-employer_company_name
305,consult,"[606, 697, 727, 714]",I-employer_company_name
306,##ancy,"[606, 697, 727, 714]",I-employer_company_name
307,services,"[729, 697, 818, 714]",I-employer_company_name
308,P,"[818, 697, 851, 714]",I-employer_company_name
309,##v,"[818, 697, 851, 714]",I-employer_company_name
310,##t,"[818, 697, 851, 714]",I-employer_company_name
311,Ltd,"[852, 697, 896, 714]",I-employer_company_name
312,",","[852, 697, 896, 714]",MISC
313,since,"[897, 697, 952, 714]",MISC
314,Jan,"[952, 697, 985, 714]",MISC
315,-,"[986, 697, 988, 714]",MISC
316,NL,"[986, 697, 988, 714]",MISC
317,-,"[986, 697, 988, 714]",MISC
318,2015,"[238, 723, 285, 738]",MISC
319,to,"[285, 723, 308, 738]",MISC
320,Aug,"[308, 723, 342, 738]",MISC
321,2018,"[342, 723, 400, 738]",MISC
322,.,"[342, 723, 400, 738]",MISC
323,-,"[400, 723, 402, 738]",MISC
324,NL,"[400, 723, 402, 738]",MISC
325,-,"[400, 723, 402, 738]",MISC
326,Technical,"[169, 775, 252, 790]",B-skills_heading
327,Skills,"[254, 775, 319, 790]",I-skills_heading
328,:,"[254, 775, 319, 790]",I-skills_heading
329,-,"[319, 775, 321, 790]",MISC
330,NL,"[319, 775, 321, 790]",MISC
331,-,"[319, 775, 321, 790]",MISC
332,Operating,"[204, 807, 358, 823]",MISC
333,Systems,"[359, 807, 479, 823]",MISC
334,:,"[480, 807, 496, 823]",MISC
335,Windows,"[498, 807, 617, 823]",MISC
336,and,"[618, 807, 669, 823]",MISC
337,UN,"[670, 807, 755, 823]",MISC
338,##IX,"[670, 807, 755, 823]",MISC
339,.,"[670, 807, 755, 823]",MISC
340,-,"[757, 807, 759, 823]",MISC
341,NL,"[757, 807, 759, 823]",MISC
342,-,"[757, 807, 759, 823]",MISC
343,J,"[204, 823, 271, 838]",MISC
344,##2,"[204, 823, 271, 838]",MISC
345,##EE,"[204, 823, 271, 838]",MISC
346,Technologies,"[273, 823, 479, 838]",MISC
347,:,"[480, 823, 496, 838]",MISC
348,Core,"[497, 823, 565, 838]",MISC
349,Java,"[567, 823, 651, 838]",MISC
350,",","[567, 823, 651, 838]",MISC
351,J,"[653, 823, 738, 838]",MISC
352,##D,"[653, 823, 738, 838]",MISC
353,##BC,"[653, 823, 738, 838]",MISC
354,.,"[653, 823, 738, 838]",MISC
355,-,"[739, 823, 741, 838]",MISC
356,NL,"[739, 823, 741, 838]",MISC
357,-,"[739, 823, 741, 838]",MISC
358,Framework,"[204, 840, 327, 855]",MISC
359,##s,"[204, 840, 327, 855]",MISC
360,/,"[204, 840, 327, 855]",MISC
361,Method,"[328, 840, 475, 855]",MISC
362,##ologies,"[328, 840, 475, 855]",MISC
363,:,"[476, 840, 485, 855]",MISC
364,",","[487, 840, 497, 855]",MISC
365,Hi,"[498, 840, 610, 855]",MISC
366,##ber,"[498, 840, 610, 855]",MISC
367,##nate,"[498, 840, 610, 855]",MISC
368,",","[498, 840, 610, 855]",MISC
369,spring,"[612, 840, 974, 855]",MISC
370,",","[612, 840, 974, 855]",MISC
371,Spring,"[612, 840, 974, 855]",MISC
372,##B,"[612, 840, 974, 855]",MISC
373,##oot,"[612, 840, 974, 855]",MISC
374,",","[612, 840, 974, 855]",MISC
375,Micro,"[612, 840, 974, 855]",MISC
376,##S,"[612, 840, 974, 855]",MISC
377,##er,"[612, 840, 974, 855]",MISC
378,##vice,"[612, 840, 974, 855]",MISC
379,##s,"[612, 840, 974, 855]",MISC
380,.,"[612, 840, 974, 855]",MISC
381,-,"[974, 840, 976, 855]",MISC
382,NL,"[974, 840, 976, 855]",MISC
383,-,"[974, 840, 976, 855]",MISC
384,Internet,"[204, 855, 321, 871]",MISC
385,Technologies,"[322, 855, 497, 871]",MISC
386,:,"[498, 855, 512, 871]",MISC
387,H,"[513, 855, 586, 871]",MISC
388,##TM,"[513, 855, 586, 871]",MISC
389,##L,"[513, 855, 586, 871]",MISC
390,",","[513, 855, 586, 871]",MISC
391,Java,"[587, 855, 645, 871]",MISC
392,Sc,"[646, 855, 748, 871]",MISC
393,##rip,"[646, 855, 748, 871]",MISC
394,##t,"[646, 855, 748, 871]",MISC
395,.,"[646, 855, 748, 871]",MISC
396,-,"[749, 855, 751, 871]",MISC
397,NL,"[749, 855, 751, 871]",MISC
398,-,"[749, 855, 751, 871]",MISC
399,Database,"[204, 872, 391, 888]",MISC
400,##s,"[204, 872, 391, 888]",MISC
401,:,"[392, 872, 412, 888]",MISC
402,Oracle,"[413, 872, 539, 888]",MISC
403,10,"[539, 872, 622, 888]",MISC
404,##g,"[539, 872, 622, 888]",MISC
405,",","[539, 872, 622, 888]",MISC
406,My,"[623, 872, 748, 888]",MISC
407,##S,"[623, 872, 748, 888]",MISC
408,##q,"[623, 872, 748, 888]",MISC
409,##l,"[623, 872, 748, 888]",MISC
410,.,"[623, 872, 748, 888]",MISC
411,-,"[749, 872, 751, 888]",MISC
412,NL,"[749, 872, 751, 888]",MISC
413,-,"[749, 872, 751, 888]",MISC
414,Server,"[204, 888, 344, 903]",MISC
415,##s,"[204, 888, 344, 903]",MISC
416,:,"[346, 888, 366, 903]",MISC
417,Apache,"[367, 888, 488, 903]",MISC
418,Tom,"[489, 888, 629, 903]",MISC
419,##cat,"[489, 888, 629, 903]",MISC
420,",","[489, 888, 629, 903]",MISC
421,Web,"[631, 888, 814, 903]",MISC
422,##log,"[631, 888, 814, 903]",MISC
423,##ic,"[631, 888, 814, 903]",MISC
424,",","[631, 888, 814, 903]",MISC
425,-,"[815, 888, 816, 903]",MISC
426,NL,"[815, 888, 816, 903]",MISC
427,-,"[815, 888, 816, 903]",MISC
428,ID,"[204, 905, 265, 920]",MISC
429,##E,"[204, 905, 265, 920]",MISC
430,Too,"[266, 905, 370, 920]",MISC
431,##ls,"[266, 905, 370, 920]",MISC
432,:,"[370, 905, 390, 920]",MISC
433,Eclipse,"[391, 905, 557, 920]",MISC
434,",","[391, 905, 557, 920]",MISC
435,My,"[558, 905, 745, 920]",MISC
436,##E,"[558, 905, 745, 920]",MISC
437,##c,"[558, 905, 745, 920]",MISC
438,##lip,"[558, 905, 745, 920]",MISC
439,##se,"[558, 905, 745, 920]",MISC
440,-,"[745, 905, 747, 920]",MISC
441,NL,"[745, 905, 747, 920]",MISC
442,-,"[745, 905, 747, 920]",MISC
443,CO,"[169, 104, 223, 120]",MISC
444,##RE,"[169, 104, 223, 120]",MISC
445,ST,"[223, 104, 344, 120]",MISC
446,##RE,"[223, 104, 344, 120]",MISC
447,##NG,"[223, 104, 344, 120]",MISC
448,##HS,"[223, 104, 344, 120]",MISC
449,:,"[223, 104, 344, 120]",MISC
450,-,"[344, 104, 346, 120]",MISC
451,NL,"[344, 104, 346, 120]",MISC
452,-,"[344, 104, 346, 120]",MISC
453,o,"[204, 137, 213, 153]",MISC
454,Good,"[214, 137, 254, 153]",MISC
455,analytical,"[255, 137, 355, 153]",MISC
456,skills,"[357, 137, 416, 153]",MISC
457,-,"[418, 137, 420, 153]",MISC
458,NL,"[418, 137, 420, 153]",MISC
459,-,"[418, 137, 420, 153]",MISC
460,o,"[204, 153, 213, 170]",MISC
461,Working,"[214, 153, 287, 170]",MISC
462,in,"[288, 153, 307, 170]",MISC
463,teams,"[309, 153, 361, 170]",MISC
464,with,"[361, 153, 402, 170]",MISC
465,high,"[404, 153, 444, 170]",MISC
466,productivity,"[446, 153, 571, 170]",MISC
467,-,"[572, 153, 574, 170]",MISC
468,NL,"[572, 153, 574, 170]",MISC
469,-,"[572, 153, 574, 170]",MISC
470,Projects,"[169, 172, 246, 187]",B-others_heading
471,Det,"[246, 172, 314, 187]",I-others_heading
472,##ails,"[246, 172, 314, 187]",I-others_heading
473,-,"[314, 172, 315, 187]",MISC
474,NL,"[314, 172, 315, 187]",MISC
475,-,"[314, 172, 315, 187]",MISC
476,Project,"[169, 204, 240, 220]",MISC
477,#,"[241, 204, 260, 220]",MISC
478,1,"[241, 204, 260, 220]",MISC
479,-,"[262, 204, 263, 220]",MISC
480,NL,"[262, 204, 263, 220]",MISC
481,-,"[262, 204, 263, 220]",MISC
482,Name,"[169, 237, 238, 252]",MISC
483,:,"[240, 237, 258, 252]",MISC
484,SC,"[258, 237, 418, 252]",B-project_title
485,##H,"[258, 237, 418, 252]",I-project_title
486,##ED,"[258, 237, 418, 252]",I-project_title
487,##U,"[258, 237, 418, 252]",I-project_title
488,##LE,"[258, 237, 418, 252]",I-project_title
489,##R,"[258, 237, 418, 252]",I-project_title
490,2,"[418, 237, 470, 252]",I-project_title
491,.,"[418, 237, 470, 252]",I-project_title
492,0,"[418, 237, 470, 252]",I-project_title
493,-,"[472, 237, 473, 252]",MISC
494,NL,"[472, 237, 473, 252]",MISC
495,-,"[472, 237, 473, 252]",MISC
496,Team,"[169, 252, 235, 268]",MISC
497,Si,"[235, 252, 301, 268]",MISC
498,##ze,"[235, 252, 301, 268]",MISC
499,:,"[302, 252, 317, 268]",MISC
500,6,"[318, 252, 334, 268]",MISC
501,-,"[335, 252, 337, 268]",MISC
502,NL,"[335, 252, 337, 268]",MISC
503,-,"[335, 252, 337, 268]",MISC
504,C,"[169, 269, 273, 285]",MISC
505,##lient,"[169, 269, 273, 285]",MISC
506,:,"[274, 269, 291, 285]",MISC
507,Me,"[291, 269, 396, 285]",MISC
508,##d,"[291, 269, 396, 285]",MISC
509,##US,"[291, 269, 396, 285]",MISC
510,##A,"[291, 269, 396, 285]",MISC
511,-,"[396, 269, 398, 285]",MISC
512,NL,"[396, 269, 398, 285]",MISC
513,-,"[396, 269, 398, 285]",MISC
514,Du,"[169, 285, 271, 300]",MISC
515,##ration,"[169, 285, 271, 300]",MISC
516,:,"[272, 285, 284, 300]",MISC
517,Aug,"[285, 285, 324, 300]",MISC
518,2018,"[324, 285, 374, 300]",MISC
519,to,"[375, 285, 400, 300]",MISC
520,Till,"[401, 285, 451, 300]",MISC
521,To,"[453, 285, 478, 300]",MISC
522,Date,"[478, 285, 542, 300]",MISC
523,.,"[478, 285, 542, 300]",MISC
524,-,"[543, 285, 545, 300]",MISC
525,NL,"[543, 285, 545, 300]",MISC
526,-,"[543, 285, 545, 300]",MISC
527,Re,"[169, 334, 323, 350]",MISC
528,##sp,"[169, 334, 323, 350]",MISC
529,##ons,"[169, 334, 323, 350]",MISC
530,##ibi,"[169, 334, 323, 350]",MISC
531,##lities,"[169, 334, 323, 350]",MISC
532,:,"[169, 334, 323, 350]",MISC
533,-,"[323, 334, 325, 350]",MISC
534,NL,"[323, 334, 325, 350]",MISC
535,-,"[323, 334, 325, 350]",MISC
536,Pre,"[215, 367, 317, 382]",MISC
537,##par,"[215, 367, 317, 382]",MISC
538,##ing,"[215, 367, 317, 382]",MISC
539,Design,"[318, 367, 385, 382]",MISC
540,documents,"[386, 367, 488, 382]",MISC
541,from,"[488, 367, 533, 382]",MISC
542,H,"[534, 367, 578, 382]",MISC
543,##LD,"[534, 367, 578, 382]",MISC
544,.,"[534, 367, 578, 382]",MISC
545,-,"[579, 367, 581, 382]",MISC
546,NL,"[579, 367, 581, 382]",MISC
547,-,"[579, 367, 581, 382]",MISC
548,I,"[215, 382, 334, 399]",MISC
549,##mple,"[215, 382, 334, 399]",MISC
550,##mented,"[215, 382, 334, 399]",MISC
551,Service,"[335, 382, 410, 399]",MISC
552,Class,"[411, 382, 498, 399]",MISC
553,##es,"[411, 382, 498, 399]",MISC
554,.,"[411, 382, 498, 399]",MISC
555,-,"[499, 382, 500, 399]",MISC
556,NL,"[499, 382, 500, 399]",MISC
557,-,"[499, 382, 500, 399]",MISC
558,I,"[214, 399, 332, 415]",MISC
559,##mple,"[214, 399, 332, 415]",MISC
560,##mented,"[214, 399, 332, 415]",MISC
561,Business,"[332, 399, 417, 415]",MISC
562,logic,"[418, 399, 470, 415]",MISC
563,based,"[472, 399, 524, 415]",MISC
564,on,"[525, 399, 546, 415]",MISC
565,the,"[547, 399, 578, 415]",MISC
566,requirements,"[579, 399, 718, 415]",MISC
567,.,"[579, 399, 718, 415]",MISC
568,-,"[718, 399, 720, 415]",MISC
569,NL,"[718, 399, 720, 415]",MISC
570,-,"[718, 399, 720, 415]",MISC
571,I,"[215, 415, 332, 432]",MISC
572,##mple,"[215, 415, 332, 432]",MISC
573,##mented,"[215, 415, 332, 432]",MISC
574,Da,"[333, 415, 387, 432]",MISC
575,##o,"[333, 415, 387, 432]",MISC
576,’,"[333, 415, 387, 432]",MISC
577,s,"[333, 415, 387, 432]",MISC
578,and,"[387, 415, 418, 432]",MISC
579,their,"[420, 415, 474, 432]",MISC
580,implementation,"[474, 415, 636, 432]",MISC
581,##s,"[474, 415, 636, 432]",MISC
582,With,"[636, 415, 678, 432]",MISC
583,DB,"[679, 415, 721, 432]",MISC
584,##2,"[679, 415, 721, 432]",MISC
585,.,"[679, 415, 721, 432]",MISC
586,-,"[722, 415, 724, 432]",MISC
587,NL,"[722, 415, 724, 432]",MISC
588,-,"[722, 415, 724, 432]",MISC
589,I,"[215, 432, 340, 447]",MISC
590,##mple,"[215, 432, 340, 447]",MISC
591,##mented,"[215, 432, 340, 447]",MISC
592,Em,"[341, 432, 397, 447]",MISC
593,##ail,"[341, 432, 397, 447]",MISC
594,Service,"[398, 432, 477, 447]",MISC
595,and,"[478, 432, 511, 447]",MISC
596,Message,"[513, 432, 592, 447]",MISC
597,-,"[593, 432, 595, 447]",MISC
598,NL,"[593, 432, 595, 447]",MISC
599,-,"[593, 432, 595, 447]",MISC
600,I,"[215, 449, 340, 464]",MISC
601,##mple,"[215, 449, 340, 464]",MISC
602,##mented,"[215, 449, 340, 464]",MISC
603,AS,"[341, 449, 396, 464]",MISC
604,##40,"[341, 449, 396, 464]",MISC
605,##0,"[341, 449, 396, 464]",MISC
606,services,"[398, 449, 488, 464]",MISC
607,-,"[489, 449, 491, 464]",MISC
608,NL,"[489, 449, 491, 464]",MISC
609,-,"[489, 449, 491, 464]",MISC
610,I,"[215, 464, 334, 480]",MISC
611,##mple,"[215, 464, 334, 480]",MISC
612,##mented,"[215, 464, 334, 480]",MISC
613,Pay,"[335, 464, 487, 480]",MISC
614,##ment,"[335, 464, 487, 480]",MISC
615,##G,"[335, 464, 487, 480]",MISC
616,##ate,"[335, 464, 487, 480]",MISC
617,##W,"[335, 464, 487, 480]",MISC
618,##ay,"[335, 464, 487, 480]",MISC
619,for,"[488, 464, 520, 480]",MISC
620,payment,"[520, 464, 596, 480]",MISC
621,confirmation,"[597, 464, 728, 480]",MISC
622,-,"[728, 464, 730, 480]",MISC
623,NL,"[728, 464, 730, 480]",MISC
624,-,"[728, 464, 730, 480]",MISC
625,Pre,"[215, 481, 301, 497]",MISC
626,##par,"[215, 481, 301, 497]",MISC
627,##ed,"[215, 481, 301, 497]",MISC
628,the,"[303, 481, 336, 497]",MISC
629,Unit,"[336, 481, 379, 497]",MISC
630,Test,"[381, 481, 423, 497]",MISC
631,plan,"[425, 481, 467, 497]",MISC
632,and,"[469, 481, 502, 497]",MISC
633,Results,"[502, 481, 579, 497]",MISC
634,and,"[580, 481, 612, 497]",MISC
635,System,"[613, 481, 678, 497]",MISC
636,Test,"[679, 481, 722, 497]",MISC
637,plan,"[723, 481, 766, 497]",MISC
638,and,"[768, 481, 800, 497]",MISC
639,Results,"[801, 481, 878, 497]",MISC
640,-,"[878, 481, 880, 497]",MISC
641,NL,"[878, 481, 880, 497]",MISC
642,-,"[878, 481, 880, 497]",MISC
643,Doc,"[238, 497, 341, 512]",MISC
644,##ume,"[238, 497, 341, 512]",MISC
645,##nts,"[238, 497, 341, 512]",MISC
646,.,"[238, 497, 341, 512]",MISC
647,-,"[341, 497, 342, 512]",MISC
648,NL,"[341, 497, 342, 512]",MISC
649,-,"[341, 497, 342, 512]",MISC
650,Des,"[169, 546, 281, 562]",MISC
651,##cription,"[169, 546, 281, 562]",MISC
652,:,"[169, 546, 281, 562]",MISC
653,-,"[281, 546, 283, 562]",MISC
654,NL,"[281, 546, 283, 562]",MISC
655,-,"[281, 546, 283, 562]",MISC
656,The,"[308, 579, 337, 594]",MISC
657,Custom,"[337, 579, 416, 594]",MISC
658,##er,"[337, 579, 416, 594]",MISC
659,enters,"[417, 579, 474, 594]",MISC
660,to,"[476, 579, 495, 594]",MISC
661,the,"[496, 579, 525, 594]",MISC
662,Facility,"[525, 579, 614, 594]",MISC
663,",","[525, 579, 614, 594]",MISC
664,Front,"[614, 579, 663, 594]",MISC
665,desk,"[664, 579, 702, 594]",MISC
666,Officer,"[703, 579, 771, 594]",MISC
667,will,"[773, 579, 811, 594]",MISC
668,check,"[812, 579, 860, 594]",MISC
669,that,"[862, 579, 900, 594]",MISC
670,whether,"[901, 579, 969, 594]",MISC
671,-,"[971, 579, 973, 594]",MISC
672,NL,"[971, 579, 973, 594]",MISC
673,-,"[971, 579, 973, 594]",MISC
674,the,"[231, 594, 260, 610]",MISC
675,C,"[261, 594, 320, 610]",MISC
676,##lient,"[261, 594, 320, 610]",MISC
677,has,"[321, 594, 350, 610]",MISC
678,come,"[351, 594, 389, 610]",MISC
679,First,"[391, 594, 439, 610]",MISC
680,Time,"[441, 594, 479, 610]",MISC
681,",","[481, 594, 529, 610]",MISC
682,then,"[481, 594, 529, 610]",MISC
683,the,"[531, 594, 559, 610]",MISC
684,Front,"[561, 594, 609, 610]",MISC
685,Des,"[610, 594, 649, 610]",MISC
686,##k,"[610, 594, 649, 610]",MISC
687,Officer,"[650, 594, 720, 610]",MISC
688,will,"[720, 594, 759, 610]",MISC
689,enter,"[760, 594, 809, 610]",MISC
690,the,"[810, 594, 839, 610]",MISC
691,details,"[840, 594, 910, 610]",MISC
692,of,"[910, 594, 930, 610]",MISC
693,Like,"[930, 594, 969, 610]",MISC
694,",","[970, 594, 980, 610]",MISC
695,-,"[980, 594, 982, 610]",MISC
696,NL,"[980, 594, 982, 610]",MISC
697,-,"[980, 594, 982, 610]",MISC
698,For,"[231, 611, 260, 627]",MISC
699,which,"[261, 611, 311, 627]",MISC
700,Disease,"[311, 611, 381, 627]",MISC
701,the,"[382, 611, 411, 627]",MISC
702,customer,"[412, 611, 491, 627]",MISC
703,has,"[493, 611, 522, 627]",MISC
704,arrived,"[523, 611, 593, 627]",MISC
705,to,"[594, 611, 613, 627]",MISC
706,Facility,"[614, 611, 705, 627]",MISC
707,",","[614, 611, 705, 627]",MISC
708,Book,"[705, 611, 774, 627]",MISC
709,##ing,"[705, 611, 774, 627]",MISC
710,A,"[776, 611, 885, 627]",MISC
711,##pp,"[776, 611, 885, 627]",MISC
712,##oint,"[776, 611, 885, 627]",MISC
713,##ment,"[776, 611, 885, 627]",MISC
714,For,"[887, 611, 915, 627]",MISC
715,Pro,"[917, 611, 996, 627]",MISC
716,##vide,"[917, 611, 996, 627]",MISC
717,##r,"[917, 611, 996, 627]",MISC
718,-,"[998, 611, 1000, 627]",MISC
719,NL,"[998, 611, 1000, 627]",MISC
720,-,"[998, 611, 1000, 627]",MISC
721,.,"[231, 627, 321, 642]",MISC
722,C,"[231, 627, 321, 642]",MISC
723,##rea,"[231, 627, 321, 642]",MISC
724,##ting,"[231, 627, 321, 642]",MISC
725,Te,"[322, 627, 401, 642]",MISC
726,##mp,"[322, 627, 401, 642]",MISC
727,##late,"[322, 627, 401, 642]",MISC
728,For,"[402, 627, 431, 642]",MISC
729,Pro,"[433, 627, 512, 642]",MISC
730,##vide,"[433, 627, 512, 642]",MISC
731,##r,"[433, 627, 512, 642]",MISC
732,",","[513, 627, 623, 642]",MISC
733,Sc,"[513, 627, 623, 642]",MISC
734,##hed,"[513, 627, 623, 642]",MISC
735,##ulin,"[513, 627, 623, 642]",MISC
736,##g,"[513, 627, 623, 642]",MISC
737,the,"[624, 627, 653, 642]",MISC
738,A,"[655, 627, 764, 642]",MISC
739,##pp,"[655, 627, 764, 642]",MISC
740,##oint,"[655, 627, 764, 642]",MISC
741,##ment,"[655, 627, 764, 642]",MISC
742,as,"[765, 627, 785, 642]",MISC
743,the,"[786, 627, 815, 642]",MISC
744,customer,"[816, 627, 895, 642]",MISC
745,required,"[897, 627, 976, 642]",MISC
746,at,"[977, 627, 997, 642]",MISC
747,-,"[998, 627, 1000, 642]",MISC
748,NL,"[998, 627, 1000, 642]",MISC
749,-,"[998, 627, 1000, 642]",MISC
750,different,"[231, 644, 321, 659]",MISC
751,Tim,"[323, 644, 404, 659]",MISC
752,##ings,"[323, 644, 404, 659]",MISC
753,",","[323, 644, 404, 659]",MISC
754,Once,"[405, 644, 445, 659]",MISC
755,A,"[446, 644, 557, 659]",MISC
756,##pp,"[446, 644, 557, 659]",MISC
757,##oint,"[446, 644, 557, 659]",MISC
758,##ment,"[446, 644, 557, 659]",MISC
759,is,"[558, 644, 578, 659]",MISC
760,Schedule,"[579, 644, 681, 659]",MISC
761,##d,"[579, 644, 681, 659]",MISC
762,",","[579, 644, 681, 659]",MISC
763,We,"[681, 644, 701, 659]",MISC
764,can,"[702, 644, 731, 659]",MISC
765,cancel,"[732, 644, 792, 659]",MISC
766,the,"[794, 644, 823, 659]",MISC
767,A,"[825, 644, 946, 659]",MISC
768,##pp,"[825, 644, 946, 659]",MISC
769,##oint,"[825, 644, 946, 659]",MISC
770,##ment,"[825, 644, 946, 659]",MISC
771,",","[825, 644, 946, 659]",MISC
772,-,"[947, 644, 949, 659]",MISC
773,NL,"[947, 644, 949, 659]",MISC
774,-,"[947, 644, 949, 659]",MISC
775,re,"[231, 659, 337, 675]",MISC
776,##sche,"[231, 659, 337, 675]",MISC
777,##du,"[231, 659, 337, 675]",MISC
778,##le,"[231, 659, 337, 675]",MISC
779,the,"[337, 659, 368, 675]",MISC
780,A,"[368, 659, 496, 675]",MISC
781,##pp,"[368, 659, 496, 675]",MISC
782,##oint,"[368, 659, 496, 675]",MISC
783,##ment,"[368, 659, 496, 675]",MISC
784,",","[368, 659, 496, 675]",MISC
785,We,"[496, 659, 517, 675]",MISC
786,can,"[517, 659, 548, 675]",MISC
787,add,"[549, 659, 579, 675]",MISC
788,the,"[580, 659, 611, 675]",MISC
789,Rule,"[612, 659, 655, 675]",MISC
790,For,"[655, 659, 685, 675]",MISC
791,provider,"[686, 659, 771, 675]",MISC
792,by,"[771, 659, 792, 675]",MISC
793,day,"[792, 659, 823, 675]",MISC
794,to,"[824, 659, 845, 675]",MISC
795,day,"[845, 659, 888, 675]",MISC
796,.,"[845, 659, 888, 675]",MISC
797,Main,"[888, 659, 973, 675]",MISC
798,##tain,"[888, 659, 973, 675]",MISC
799,-,"[973, 659, 974, 675]",MISC
800,NL,"[973, 659, 974, 675]",MISC
801,-,"[973, 659, 974, 675]",MISC
802,the,"[231, 676, 260, 692]",MISC
803,Total,"[260, 676, 308, 692]",MISC
804,Family,"[308, 676, 366, 692]",MISC
805,Information,"[367, 676, 482, 692]",MISC
806,",","[367, 676, 482, 692]",MISC
807,and,"[483, 676, 512, 692]",MISC
808,Cal,"[512, 676, 599, 692]",MISC
809,##culate,"[512, 676, 599, 692]",MISC
810,the,"[600, 676, 628, 692]",MISC
811,total,"[629, 676, 677, 692]",MISC
812,amount,"[677, 676, 735, 692]",MISC
813,for,"[735, 676, 764, 692]",MISC
814,the,"[765, 676, 794, 692]",MISC
815,Pro,"[794, 676, 871, 692]",MISC
816,##vide,"[794, 676, 871, 692]",MISC
817,##r,"[794, 676, 871, 692]",MISC
818,",","[871, 676, 968, 692]",MISC
819,Including,"[871, 676, 968, 692]",MISC
820,the,"[968, 676, 997, 692]",MISC
821,-,"[998, 676, 1000, 692]",MISC
822,NL,"[998, 676, 1000, 692]",MISC
823,-,"[998, 676, 1000, 692]",MISC
824,Insurance,"[231, 692, 319, 707]",MISC
825,and,"[320, 692, 349, 707]",MISC
826,then,"[350, 692, 389, 707]",MISC
827,re,"[390, 692, 459, 707]",MISC
828,##ceipt,"[390, 692, 459, 707]",MISC
829,Print,"[460, 692, 508, 707]",MISC
830,for,"[509, 692, 538, 707]",MISC
831,the,"[539, 692, 568, 707]",MISC
832,Custom,"[569, 692, 658, 707]",MISC
833,##er,"[569, 692, 658, 707]",MISC
834,.,"[569, 692, 658, 707]",MISC
835,-,"[658, 692, 660, 707]",MISC
836,NL,"[658, 692, 660, 707]",MISC
837,-,"[658, 692, 660, 707]",MISC
838,Environment,"[169, 724, 292, 740]",MISC
839,:,"[169, 724, 292, 740]",MISC
840,-,"[292, 724, 294, 740]",MISC
841,NL,"[292, 724, 294, 740]",MISC
842,-,"[292, 724, 294, 740]",MISC
843,Java,"[210, 757, 262, 772]",MISC
844,",","[210, 757, 262, 772]",MISC
845,Ang,"[263, 757, 336, 772]",MISC
846,##ular,"[263, 757, 336, 772]",MISC
847,J,"[337, 757, 368, 772]",MISC
848,##S,"[337, 757, 368, 772]",MISC
849,",","[337, 757, 368, 772]",MISC
850,DB,"[368, 757, 411, 772]",MISC
851,##2,"[368, 757, 411, 772]",MISC
852,",","[368, 757, 411, 772]",MISC
853,Spring,"[411, 757, 474, 772]",MISC
854,MV,"[474, 757, 505, 772]",MISC
855,##C,"[474, 757, 505, 772]",MISC
856,",","[506, 757, 601, 772]",MISC
857,Rest,"[506, 757, 601, 772]",MISC
858,##AP,"[506, 757, 601, 772]",MISC
859,##I,"[506, 757, 601, 772]",MISC
860,",","[506, 757, 601, 772]",MISC
861,web,"[602, 757, 696, 772]",MISC
862,##S,"[602, 757, 696, 772]",MISC
863,##phere,"[602, 757, 696, 772]",MISC
864,Server,"[697, 757, 770, 772]",MISC
865,",","[697, 757, 770, 772]",MISC
866,Oracle,"[771, 757, 835, 772]",MISC
867,Server,"[835, 757, 908, 772]",MISC
868,.,"[835, 757, 908, 772]",MISC
869,-,"[909, 757, 911, 772]",MISC
870,NL,"[909, 757, 911, 772]",MISC
871,-,"[909, 757, 911, 772]",MISC
872,Project,"[169, 789, 240, 805]",MISC
873,#,"[241, 789, 260, 805]",MISC
874,2,"[241, 789, 260, 805]",MISC
875,-,"[262, 789, 263, 805]",MISC
876,NL,"[262, 789, 263, 805]",MISC
877,-,"[262, 789, 263, 805]",MISC
878,Name,"[169, 838, 227, 854]",MISC
879,:,"[228, 838, 242, 854]",MISC
880,Online,"[243, 838, 332, 854]",B-project_title
881,Reservation,"[332, 838, 494, 854]",I-project_title
882,-,"[495, 838, 497, 854]",MISC
883,NL,"[495, 838, 497, 854]",MISC
884,-,"[495, 838, 497, 854]",MISC
885,C,"[169, 854, 236, 870]",MISC
886,##lient,"[169, 854, 236, 870]",MISC
887,:,"[238, 854, 248, 870]",MISC
888,All,"[250, 854, 502, 870]",B-project_company_name
889,##in,"[250, 854, 502, 870]",I-project_company_name
890,##clusive,"[250, 854, 502, 870]",I-project_company_name
891,##out,"[250, 854, 502, 870]",I-project_company_name
892,##let,"[250, 854, 502, 870]",I-project_company_name
893,.,"[250, 854, 502, 870]",I-project_company_name
894,com,"[250, 854, 502, 870]",I-project_company_name
895,-,"[502, 854, 504, 870]",MISC
896,NL,"[502, 854, 504, 870]",MISC
897,-,"[502, 854, 504, 870]",MISC
898,Team,"[169, 871, 235, 887]",MISC
899,Si,"[235, 871, 301, 887]",MISC
900,##ze,"[235, 871, 301, 887]",MISC
901,:,"[302, 871, 317, 887]",MISC
902,5,"[318, 871, 334, 887]",MISC
903,-,"[335, 871, 337, 887]",MISC
904,NL,"[335, 871, 337, 887]",MISC
905,-,"[335, 871, 337, 887]",MISC
906,Du,"[169, 887, 275, 902]",MISC
907,##ration,"[169, 887, 275, 902]",MISC
908,:,"[276, 887, 287, 902]",MISC
909,Sep,"[289, 887, 328, 902]",MISC
910,2015,"[329, 887, 381, 902]",MISC
911,to,"[382, 887, 408, 902]",MISC
912,Aug,"[409, 887, 515, 902]",MISC
913,##20,"[409, 887, 515, 902]",MISC
914,##18,"[409, 887, 515, 902]",MISC
915,.,"[409, 887, 515, 902]",MISC
916,-,"[516, 887, 518, 902]",MISC
917,NL,"[516, 887, 518, 902]",MISC
918,-,"[516, 887, 518, 902]",MISC
919,Re,"[169, 936, 323, 951]",MISC
920,##sp,"[169, 936, 323, 951]",MISC
921,##ons,"[169, 936, 323, 951]",MISC
922,##ibi,"[169, 936, 323, 951]",MISC
923,##lities,"[169, 936, 323, 951]",MISC
924,:,"[169, 936, 323, 951]",MISC
925,-,"[323, 936, 325, 951]",MISC
926,NL,"[323, 936, 325, 951]",MISC
927,-,"[323, 936, 325, 951]",MISC
928,Ana,"[215, 968, 290, 984]",MISC
929,##ly,"[215, 968, 290, 984]",MISC
930,##ze,"[215, 968, 290, 984]",MISC
931,the,"[290, 968, 321, 984]",MISC
932,system,"[322, 968, 386, 984]",MISC
933,requirements,"[387, 968, 526, 984]",MISC
934,.,"[387, 968, 526, 984]",MISC
935,-,"[527, 968, 529, 984]",MISC
936,NL,"[527, 968, 529, 984]",MISC
937,-,"[527, 968, 529, 984]",MISC
938,Pre,"[215, 984, 319, 1000]",MISC
939,##par,"[215, 984, 319, 1000]",MISC
940,##ing,"[215, 984, 319, 1000]",MISC
941,Design,"[320, 984, 389, 1000]",MISC
942,documents,"[390, 984, 494, 1000]",MISC
943,from,"[494, 984, 541, 1000]",MISC
944,SR,"[541, 984, 575, 1000]",MISC
945,##D,"[541, 984, 575, 1000]",MISC
946,-,"[576, 984, 578, 1000]",MISC
947,NL,"[576, 984, 578, 1000]",MISC
948,-,"[576, 984, 578, 1000]",MISC
949,I,"[215, 104, 334, 120]",MISC
950,##mple,"[215, 104, 334, 120]",MISC
951,##mented,"[215, 104, 334, 120]",MISC
952,Action,"[334, 104, 398, 120]",MISC
953,Class,"[400, 104, 487, 120]",MISC
954,##es,"[400, 104, 487, 120]",MISC
955,.,"[400, 104, 487, 120]",MISC
956,-,"[487, 104, 489, 120]",MISC
957,NL,"[487, 104, 489, 120]",MISC
958,-,"[487, 104, 489, 120]",MISC
959,I,"[214, 121, 332, 137]",MISC
960,##mple,"[214, 121, 332, 137]",MISC
961,##mented,"[214, 121, 332, 137]",MISC
962,Business,"[332, 121, 417, 137]",MISC
963,logic,"[418, 121, 470, 137]",MISC
964,based,"[472, 121, 524, 137]",MISC
965,on,"[525, 121, 546, 137]",MISC
966,the,"[547, 121, 578, 137]",MISC
967,requirements,"[579, 121, 718, 137]",MISC
968,.,"[579, 121, 718, 137]",MISC
969,-,"[718, 121, 720, 137]",MISC
970,NL,"[718, 121, 720, 137]",MISC
971,-,"[718, 121, 720, 137]",MISC
972,I,"[214, 137, 328, 152]",MISC
973,##mple,"[214, 137, 328, 152]",MISC
974,##mented,"[214, 137, 328, 152]",MISC
975,Da,"[329, 137, 381, 152]",MISC
976,##o,"[329, 137, 381, 152]",MISC
977,’,"[329, 137, 381, 152]",MISC
978,s,"[329, 137, 381, 152]",MISC
979,and,"[381, 137, 412, 152]",MISC
980,their,"[413, 137, 465, 152]",MISC
981,implementation,"[465, 137, 621, 152]",MISC
982,##s,"[465, 137, 621, 152]",MISC
983,With,"[622, 137, 662, 152]",MISC
984,Hi,"[664, 137, 768, 152]",MISC
985,##ber,"[664, 137, 768, 152]",MISC
986,##nate,"[664, 137, 768, 152]",MISC
987,.,"[664, 137, 768, 152]",MISC
988,-,"[768, 137, 770, 152]",MISC
989,NL,"[768, 137, 770, 152]",MISC
990,-,"[768, 137, 770, 152]",MISC
991,I,"[215, 153, 336, 169]",MISC
992,##mple,"[215, 153, 336, 169]",MISC
993,##mented,"[215, 153, 336, 169]",MISC
994,Hi,"[337, 153, 435, 169]",MISC
995,##ber,"[337, 153, 435, 169]",MISC
996,##nate,"[337, 153, 435, 169]",MISC
997,Co,"[436, 153, 558, 169]",MISC
998,##mpo,"[436, 153, 558, 169]",MISC
999,##nent,"[436, 153, 558, 169]",MISC
1000,##s,"[436, 153, 558, 169]",MISC
1001,.,"[436, 153, 558, 169]",MISC
1002,-,"[558, 153, 560, 169]",MISC
1003,NL,"[558, 153, 560, 169]",MISC
1004,-,"[558, 153, 560, 169]",MISC
1005,Pre,"[215, 169, 301, 185]",MISC
1006,##par,"[215, 169, 301, 185]",MISC
1007,##ed,"[215, 169, 301, 185]",MISC
1008,the,"[303, 169, 335, 185]",MISC
1009,Unit,"[336, 169, 378, 185]",MISC
1010,Test,"[380, 169, 422, 185]",MISC
1011,plan,"[424, 169, 466, 185]",MISC
1012,and,"[468, 169, 500, 185]",MISC
1013,Results,"[500, 169, 576, 185]",MISC
1014,and,"[577, 169, 610, 185]",MISC
1015,System,"[610, 169, 676, 185]",MISC
1016,Test,"[676, 169, 719, 185]",MISC
1017,plan,"[720, 169, 763, 185]",MISC
1018,and,"[764, 169, 797, 185]",MISC
1019,Results,"[797, 169, 872, 185]",MISC
1020,documents,"[874, 169, 984, 185]",MISC
1021,.,"[874, 169, 984, 185]",MISC
1022,-,"[984, 169, 986, 185]",MISC
1023,NL,"[984, 169, 986, 185]",MISC
1024,-,"[984, 169, 986, 185]",MISC
1025,Des,"[169, 201, 281, 217]",MISC
1026,##cription,"[169, 201, 281, 217]",MISC
1027,:,"[169, 201, 281, 217]",MISC
1028,-,"[281, 201, 283, 217]",MISC
1029,NL,"[281, 201, 283, 217]",MISC
1030,-,"[281, 201, 283, 217]",MISC
1031,The,"[300, 218, 329, 234]",MISC
1032,Custom,"[331, 218, 412, 234]",MISC
1033,##er,"[331, 218, 412, 234]",MISC
1034,interact,"[412, 218, 503, 234]",MISC
1035,##s,"[412, 218, 503, 234]",MISC
1036,with,"[504, 218, 545, 234]",MISC
1037,the,"[545, 218, 574, 234]",MISC
1038,R,"[576, 218, 605, 234]",MISC
1039,##IA,"[576, 218, 605, 234]",MISC
1040,reservations,"[606, 218, 728, 234]",MISC
1041,system,"[729, 218, 789, 234]",MISC
1042,through,"[790, 218, 861, 234]",MISC
1043,one,"[862, 218, 890, 234]",MISC
1044,of,"[892, 218, 911, 234]",MISC
1045,several,"[913, 218, 984, 234]",MISC
1046,-,"[984, 218, 986, 234]",MISC
1047,NL,"[984, 218, 986, 234]",MISC
1048,-,"[984, 218, 986, 234]",MISC
1049,input,"[231, 234, 279, 250]",MISC
1050,forms,"[279, 234, 337, 250]",MISC
1051,",","[279, 234, 337, 250]",MISC
1052,or,"[338, 234, 357, 250]",MISC
1053,entry,"[357, 234, 405, 250]",MISC
1054,points,"[406, 234, 464, 250]",MISC
1055,into,"[464, 234, 503, 250]",MISC
1056,the,"[503, 234, 532, 250]",MISC
1057,reservations,"[533, 234, 648, 250]",MISC
1058,system,"[649, 234, 717, 250]",MISC
1059,.,"[649, 234, 717, 250]",MISC
1060,Our,"[717, 234, 746, 250]",MISC
1061,existing,"[747, 234, 824, 250]",MISC
1062,business,"[825, 234, 902, 250]",MISC
1063,process,"[902, 234, 970, 250]",MISC
1064,-,"[971, 234, 973, 250]",MISC
1065,NL,"[971, 234, 973, 250]",MISC
1066,-,"[971, 234, 973, 250]",MISC
1067,limits,"[231, 251, 285, 266]",MISC
1068,the,"[286, 251, 313, 266]",MISC
1069,Custom,"[314, 251, 396, 266]",MISC
1070,##ers,"[314, 251, 396, 266]",MISC
1071,ability,"[396, 251, 460, 266]",MISC
1072,to,"[461, 251, 478, 266]",MISC
1073,make,"[479, 251, 516, 266]",MISC
1074,changes,"[516, 251, 580, 266]",MISC
1075,to,"[581, 251, 598, 266]",MISC
1076,their,"[599, 251, 643, 266]",MISC
1077,criteria,"[645, 251, 718, 266]",MISC
1078,on,"[719, 251, 819, 266]",MISC
1079,-,"[719, 251, 819, 266]",MISC
1080,the,"[719, 251, 819, 266]",MISC
1081,-,"[719, 251, 819, 266]",MISC
1082,fly,"[719, 251, 819, 266]",MISC
1083,",","[719, 251, 819, 266]",MISC
1084,filter,"[820, 251, 874, 266]",MISC
1085,results,"[875, 251, 948, 266]",MISC
1086,",","[875, 251, 948, 266]",MISC
1087,and,"[949, 251, 976, 266]",MISC
1088,-,"[976, 251, 978, 266]",MISC
1089,NL,"[976, 251, 978, 266]",MISC
1090,-,"[976, 251, 978, 266]",MISC
1091,receive,"[231, 266, 298, 282]",MISC
1092,a,"[299, 266, 309, 282]",MISC
1093,more,"[309, 266, 348, 282]",MISC
1094,comprehensive,"[348, 266, 475, 282]",MISC
1095,result,"[475, 266, 533, 282]",MISC
1096,set,"[534, 266, 573, 282]",MISC
1097,.,"[534, 266, 573, 282]",MISC
1098,Regardless,"[573, 266, 669, 282]",MISC
1099,of,"[671, 266, 690, 282]",MISC
1100,feature,"[691, 266, 758, 282]",MISC
1101,limitations,"[759, 266, 875, 282]",MISC
1102,",","[759, 266, 875, 282]",MISC
1103,a,"[876, 266, 886, 282]",MISC
1104,fixed,"[886, 266, 934, 282]",MISC
1105,set,"[935, 266, 964, 282]",MISC
1106,of,"[965, 266, 984, 282]",MISC
1107,-,"[984, 266, 986, 282]",MISC
1108,NL,"[984, 266, 986, 282]",MISC
1109,-,"[984, 266, 986, 282]",MISC
1110,input,"[231, 283, 277, 299]",MISC
1111,criteria,"[279, 283, 354, 299]",MISC
1112,is,"[355, 283, 373, 299]",MISC
1113,required,"[375, 283, 450, 299]",MISC
1114,at,"[451, 283, 469, 299]",MISC
1115,any,"[470, 283, 497, 299]",MISC
1116,particular,"[499, 283, 594, 299]",MISC
1117,entry,"[595, 283, 641, 299]",MISC
1118,point,"[643, 283, 699, 299]",MISC
1119,.,"[643, 283, 699, 299]",MISC
1120,The,"[700, 283, 727, 299]",MISC
1121,mandatory,"[729, 283, 814, 299]",MISC
1122,parameters,"[815, 283, 919, 299]",MISC
1123,",","[815, 283, 919, 299]",MISC
1124,and,"[921, 283, 948, 299]",MISC
1125,their,"[950, 283, 996, 299]",MISC
1126,-,"[998, 283, 1000, 299]",MISC
1127,NL,"[998, 283, 1000, 299]",MISC
1128,-,"[998, 283, 1000, 299]",MISC
1129,criteria,"[231, 299, 319, 314]",MISC
1130,",","[231, 299, 319, 314]",MISC
1131,required,"[320, 299, 399, 314]",MISC
1132,performing,"[399, 299, 498, 314]",MISC
1133,a,"[499, 299, 508, 314]",MISC
1134,single,"[509, 299, 567, 314]",MISC
1135,instance,"[568, 299, 647, 314]",MISC
1136,of,"[648, 299, 667, 314]",MISC
1137,an,"[668, 299, 687, 314]",MISC
1138,Agent,"[687, 299, 736, 314]",MISC
1139,Gateway,"[737, 299, 806, 314]",MISC
1140,request,"[807, 299, 886, 314]",MISC
1141,",","[807, 299, 886, 314]",MISC
1142,and,"[886, 299, 915, 314]",MISC
1143,the,"[916, 299, 945, 314]",MISC
1144,-,"[946, 299, 947, 314]",MISC
1145,NL,"[946, 299, 947, 314]",MISC
1146,-,"[946, 299, 947, 314]",MISC
1147,desired,"[231, 316, 300, 331]",MISC
1148,expanded,"[301, 316, 380, 331]",MISC
1149,multi,"[381, 316, 510, 331]",MISC
1150,-,"[381, 316, 510, 331]",MISC
1151,request,"[381, 316, 510, 331]",MISC
1152,model,"[512, 316, 562, 331]",MISC
1153,parameter,"[562, 316, 651, 331]",MISC
1154,functionality,"[652, 316, 781, 331]",MISC
1155,An,"[783, 316, 802, 331]",MISC
1156,Agent,"[803, 316, 853, 331]",MISC
1157,Gateway,"[853, 316, 923, 331]",MISC
1158,request,"[923, 316, 993, 331]",MISC
1159,-,"[994, 316, 996, 331]",MISC
1160,NL,"[994, 316, 996, 331]",MISC
1161,-,"[994, 316, 996, 331]",MISC
1162,is,"[231, 331, 250, 347]",MISC
1163,expressed,"[252, 331, 346, 347]",MISC
1164,using,"[346, 331, 398, 347]",MISC
1165,XML,"[399, 331, 439, 347]",MISC
1166,.,"[399, 331, 439, 347]",MISC
1167,-,"[441, 331, 443, 347]",MISC
1168,NL,"[441, 331, 443, 347]",MISC
1169,-,"[441, 331, 443, 347]",MISC
1170,Environment,"[169, 364, 292, 379]",MISC
1171,:,"[169, 364, 292, 379]",MISC
1172,-,"[292, 364, 294, 379]",MISC
1173,NL,"[292, 364, 294, 379]",MISC
1174,-,"[292, 364, 294, 379]",MISC
1175,Java,"[204, 396, 254, 412]",MISC
1176,",","[204, 396, 254, 412]",MISC
1177,Hi,"[254, 396, 354, 412]",MISC
1178,##ber,"[254, 396, 354, 412]",MISC
1179,##nate,"[254, 396, 354, 412]",MISC
1180,",","[254, 396, 354, 412]",MISC
1181,Spring,"[354, 396, 454, 412]",MISC
1182,",","[354, 396, 454, 412]",MISC
1183,web,"[354, 396, 454, 412]",MISC
1184,services,"[454, 396, 543, 412]",MISC
1185,",","[454, 396, 543, 412]",MISC
1186,Web,"[545, 396, 624, 412]",MISC
1187,##log,"[545, 396, 624, 412]",MISC
1188,##ic,"[545, 396, 624, 412]",MISC
1189,Server,"[625, 396, 694, 412]",MISC
1190,",","[625, 396, 694, 412]",MISC
1191,Oracle,"[695, 396, 755, 412]",MISC
1192,Server,"[755, 396, 815, 412]",MISC
1193,Rest,"[815, 396, 854, 412]",MISC
1194,API,"[855, 396, 894, 412]",MISC
1195,.,"[855, 396, 894, 412]",MISC
1196,-,"[895, 396, 897, 412]",MISC
1197,NL,"[895, 396, 897, 412]",MISC
1198,-,"[895, 396, 897, 412]",MISC
1199,Project,"[169, 478, 240, 494]",MISC
1200,#,"[241, 478, 260, 494]",MISC
1201,3,"[241, 478, 260, 494]",MISC
1202,-,"[262, 478, 263, 494]",MISC
1203,NL,"[262, 478, 263, 494]",MISC
1204,-,"[262, 478, 263, 494]",MISC
1205,Name,"[204, 511, 262, 526]",MISC
1206,:,"[263, 511, 277, 526]",MISC
1207,R,"[278, 511, 484, 526]",B-project_title
1208,##MS,"[278, 511, 484, 526]",I-project_title
1209,(,"[278, 511, 484, 526]",I-project_title
1210,Rep,"[278, 511, 484, 526]",I-project_title
1211,##uta,"[278, 511, 484, 526]",I-project_title
1212,##tion,"[278, 511, 484, 526]",I-project_title
1213,Management,"[485, 511, 632, 526]",I-project_title
1214,and,"[634, 511, 678, 526]",I-project_title
1215,System,"[678, 511, 780, 526]",I-project_title
1216,),"[678, 511, 780, 526]",I-project_title
1217,-,"[782, 511, 784, 526]",MISC
1218,NL,"[782, 511, 784, 526]",MISC
1219,-,"[782, 511, 784, 526]",MISC
1220,Team,"[204, 526, 281, 543]",MISC
1221,Si,"[282, 526, 359, 543]",MISC
1222,##ze,"[282, 526, 359, 543]",MISC
1223,:,"[359, 526, 379, 543]",MISC
1224,4,"[379, 526, 398, 543]",MISC
1225,-,"[398, 526, 400, 543]",MISC
1226,NL,"[398, 526, 400, 543]",MISC
1227,-,"[398, 526, 400, 543]",MISC
1228,C,"[204, 543, 323, 559]",MISC
1229,##lient,"[204, 543, 323, 559]",MISC
1230,:,"[325, 543, 465, 559]",MISC
1231,ME,"[325, 543, 465, 559]",B-project_company_name
1232,##D,"[325, 543, 465, 559]",I-project_company_name
1233,##US,"[325, 543, 465, 559]",I-project_company_name
1234,##A,"[325, 543, 465, 559]",I-project_company_name
1235,-,"[466, 543, 468, 559]",MISC
1236,NL,"[466, 543, 468, 559]",MISC
1237,-,"[466, 543, 468, 559]",MISC
1238,Du,"[204, 559, 317, 576]",MISC
1239,##ration,"[204, 559, 317, 576]",MISC
1240,:,"[318, 559, 331, 576]",MISC
1241,Jan,"[332, 559, 374, 576]",MISC
1242,2019,"[374, 559, 430, 576]",MISC
1243,to,"[431, 559, 458, 576]",MISC
1244,Till,"[460, 559, 516, 576]",MISC
1245,Date,"[517, 559, 573, 576]",MISC
1246,-,"[574, 559, 576, 576]",MISC
1247,NL,"[574, 559, 576, 576]",MISC
1248,-,"[574, 559, 576, 576]",MISC
1249,Re,"[169, 576, 323, 591]",MISC
1250,##sp,"[169, 576, 323, 591]",MISC
1251,##ons,"[169, 576, 323, 591]",MISC
1252,##ibi,"[169, 576, 323, 591]",MISC
1253,##lities,"[169, 576, 323, 591]",MISC
1254,:,"[169, 576, 323, 591]",MISC
1255,-,"[323, 576, 325, 591]",MISC
1256,NL,"[323, 576, 325, 591]",MISC
1257,-,"[323, 576, 325, 591]",MISC
1258,Pre,"[215, 608, 317, 624]",MISC
1259,##par,"[215, 608, 317, 624]",MISC
1260,##ing,"[215, 608, 317, 624]",MISC
1261,Design,"[318, 608, 385, 624]",MISC
1262,documents,"[386, 608, 488, 624]",MISC
1263,from,"[488, 608, 533, 624]",MISC
1264,H,"[534, 608, 578, 624]",MISC
1265,##LD,"[534, 608, 578, 624]",MISC
1266,.,"[534, 608, 578, 624]",MISC
1267,-,"[579, 608, 581, 624]",MISC
1268,NL,"[579, 608, 581, 624]",MISC
1269,-,"[579, 608, 581, 624]",MISC
1270,I,"[215, 624, 334, 641]",MISC
1271,##mple,"[215, 624, 334, 641]",MISC
1272,##mented,"[215, 624, 334, 641]",MISC
1273,Service,"[335, 624, 410, 641]",MISC
1274,Class,"[411, 624, 498, 641]",MISC
1275,##es,"[411, 624, 498, 641]",MISC
1276,.,"[411, 624, 498, 641]",MISC
1277,-,"[499, 624, 500, 641]",MISC
1278,NL,"[499, 624, 500, 641]",MISC
1279,-,"[499, 624, 500, 641]",MISC
1280,I,"[214, 641, 332, 656]",MISC
1281,##mple,"[214, 641, 332, 656]",MISC
1282,##mented,"[214, 641, 332, 656]",MISC
1283,Business,"[332, 641, 417, 656]",MISC
1284,logic,"[418, 641, 470, 656]",MISC
1285,based,"[472, 641, 524, 656]",MISC
1286,on,"[525, 641, 546, 656]",MISC
1287,the,"[547, 641, 578, 656]",MISC
1288,requirements,"[579, 641, 718, 656]",MISC
1289,.,"[579, 641, 718, 656]",MISC
1290,-,"[718, 641, 720, 656]",MISC
1291,NL,"[718, 641, 720, 656]",MISC
1292,-,"[718, 641, 720, 656]",MISC
1293,I,"[214, 658, 330, 673]",MISC
1294,##mple,"[214, 658, 330, 673]",MISC
1295,##mented,"[214, 658, 330, 673]",MISC
1296,Da,"[331, 658, 383, 673]",MISC
1297,##o,"[331, 658, 383, 673]",MISC
1298,’,"[331, 658, 383, 673]",MISC
1299,s,"[331, 658, 383, 673]",MISC
1300,and,"[385, 658, 415, 673]",MISC
1301,their,"[416, 658, 468, 673]",MISC
1302,implementation,"[470, 658, 628, 673]",MISC
1303,##s,"[470, 658, 628, 673]",MISC
1304,With,"[629, 658, 672, 673]",MISC
1305,My,"[672, 658, 735, 673]",MISC
1306,##s,"[672, 658, 735, 673]",MISC
1307,##q,"[672, 658, 735, 673]",MISC
1308,##l,"[672, 658, 735, 673]",MISC
1309,.,"[672, 658, 735, 673]",MISC
1310,-,"[736, 658, 737, 673]",MISC
1311,NL,"[736, 658, 737, 673]",MISC
1312,-,"[736, 658, 737, 673]",MISC
1313,I,"[215, 673, 338, 689]",MISC
1314,##mple,"[215, 673, 338, 689]",MISC
1315,##mented,"[215, 673, 338, 689]",MISC
1316,the,"[340, 673, 373, 689]",MISC
1317,Map,"[374, 673, 464, 689]",MISC
1318,##ping,"[374, 673, 464, 689]",MISC
1319,##s,"[374, 673, 464, 689]",MISC
1320,(,"[465, 673, 576, 689]",MISC
1321,One,"[465, 673, 576, 689]",MISC
1322,##to,"[465, 673, 576, 689]",MISC
1323,##O,"[465, 673, 576, 689]",MISC
1324,##ne,"[465, 673, 576, 689]",MISC
1325,",","[465, 673, 576, 689]",MISC
1326,One,"[578, 673, 803, 689]",MISC
1327,##T,"[578, 673, 803, 689]",MISC
1328,##o,"[578, 673, 803, 689]",MISC
1329,##M,"[578, 673, 803, 689]",MISC
1330,##any,"[578, 673, 803, 689]",MISC
1331,",","[578, 673, 803, 689]",MISC
1332,Many,"[578, 673, 803, 689]",MISC
1333,##T,"[578, 673, 803, 689]",MISC
1334,##o,"[578, 673, 803, 689]",MISC
1335,##O,"[578, 673, 803, 689]",MISC
1336,##ne,"[578, 673, 803, 689]",MISC
1337,),"[578, 673, 803, 689]",MISC
1338,-,"[805, 673, 807, 689]",MISC
1339,NL,"[805, 673, 807, 689]",MISC
1340,-,"[805, 673, 807, 689]",MISC
1341,I,"[214, 690, 328, 706]",MISC
1342,##mple,"[214, 690, 328, 706]",MISC
1343,##mented,"[214, 690, 328, 706]",MISC
1344,sending,"[329, 690, 400, 706]",MISC
1345,the,"[401, 690, 432, 706]",MISC
1346,Not,"[433, 690, 556, 706]",MISC
1347,##ification,"[433, 690, 556, 706]",MISC
1348,to,"[557, 690, 577, 706]",MISC
1349,user,"[578, 690, 619, 706]",MISC
1350,-,"[620, 690, 622, 706]",MISC
1351,NL,"[620, 690, 622, 706]",MISC
1352,-,"[620, 690, 622, 706]",MISC
1353,Pre,"[215, 706, 301, 721]",MISC
1354,##par,"[215, 706, 301, 721]",MISC
1355,##ed,"[215, 706, 301, 721]",MISC
1356,the,"[303, 706, 336, 721]",MISC
1357,Unit,"[336, 706, 379, 721]",MISC
1358,Test,"[381, 706, 423, 721]",MISC
1359,plan,"[425, 706, 467, 721]",MISC
1360,and,"[469, 706, 502, 721]",MISC
1361,Results,"[502, 706, 579, 721]",MISC
1362,and,"[580, 706, 612, 721]",MISC
1363,System,"[613, 706, 678, 721]",MISC
1364,Test,"[679, 706, 722, 721]",MISC
1365,plan,"[723, 706, 766, 721]",MISC
1366,and,"[768, 706, 800, 721]",MISC
1367,Results,"[801, 706, 878, 721]",MISC
1368,-,"[878, 706, 880, 721]",MISC
1369,NL,"[878, 706, 880, 721]",MISC
1370,-,"[878, 706, 880, 721]",MISC
1371,Doc,"[238, 723, 341, 738]",MISC
1372,##ume,"[238, 723, 341, 738]",MISC
1373,##nts,"[238, 723, 341, 738]",MISC
1374,.,"[238, 723, 341, 738]",MISC
1375,-,"[341, 723, 342, 738]",MISC
1376,NL,"[341, 723, 342, 738]",MISC
1377,-,"[341, 723, 342, 738]",MISC
1378,Des,"[169, 771, 281, 786]",MISC
1379,##cription,"[169, 771, 281, 786]",MISC
1380,:,"[169, 771, 281, 786]",MISC
1381,-,"[281, 771, 283, 786]",MISC
1382,NL,"[281, 771, 283, 786]",MISC
1383,-,"[281, 771, 283, 786]",MISC
1384,The,"[204, 788, 235, 803]",MISC
1385,Main,"[235, 788, 275, 803]",MISC
1386,Concept,"[276, 788, 348, 803]",MISC
1387,of,"[349, 788, 368, 803]",MISC
1388,the,"[370, 788, 401, 803]",MISC
1389,Project,"[401, 788, 472, 803]",MISC
1390,is,"[474, 788, 493, 803]",MISC
1391,take,"[494, 788, 535, 803]",MISC
1392,feedback,"[536, 788, 619, 803]",MISC
1393,of,"[619, 788, 638, 803]",MISC
1394,the,"[640, 788, 671, 803]",MISC
1395,hospital,"[671, 788, 754, 803]",MISC
1396,and,"[754, 788, 785, 803]",MISC
1397,Give,"[785, 788, 826, 803]",MISC
1398,Rat,"[827, 788, 888, 803]",MISC
1399,##ing,"[827, 788, 888, 803]",MISC
1400,for,"[889, 788, 920, 803]",MISC
1401,the,"[920, 788, 951, 803]",MISC
1402,-,"[951, 788, 953, 803]",MISC
1403,NL,"[951, 788, 953, 803]",MISC
1404,-,"[951, 788, 953, 803]",MISC
1405,Service,"[204, 803, 271, 819]",MISC
1406,Pro,"[273, 803, 352, 819]",MISC
1407,##vide,"[273, 803, 352, 819]",MISC
1408,##d,"[273, 803, 352, 819]",MISC
1409,by,"[352, 803, 371, 819]",MISC
1410,the,"[372, 803, 401, 819]",MISC
1411,hospital,"[401, 803, 480, 819]",MISC
1412,and,"[480, 803, 509, 819]",MISC
1413,sending,"[510, 803, 577, 819]",MISC
1414,not,"[579, 803, 697, 819]",MISC
1415,##ification,"[579, 803, 697, 819]",MISC
1416,to,"[698, 803, 717, 819]",MISC
1417,user,"[718, 803, 756, 819]",MISC
1418,that,"[757, 803, 796, 819]",MISC
1419,feedback,"[797, 803, 876, 819]",MISC
1420,is,"[876, 803, 895, 819]",MISC
1421,pending,"[895, 803, 963, 819]",MISC
1422,.,"[965, 803, 974, 819]",MISC
1423,-,"[974, 803, 976, 819]",MISC
1424,NL,"[974, 803, 976, 819]",MISC
1425,-,"[974, 803, 976, 819]",MISC
1426,Pre,"[204, 820, 292, 836]",MISC
1427,##par,"[204, 820, 292, 836]",MISC
1428,##ing,"[204, 820, 292, 836]",MISC
1429,the,"[293, 820, 322, 836]",MISC
1430,questions,"[323, 820, 412, 836]",MISC
1431,for,"[412, 820, 441, 836]",MISC
1432,giving,"[442, 820, 500, 836]",MISC
1433,the,"[502, 820, 531, 836]",MISC
1434,feedback,"[532, 820, 611, 836]",MISC
1435,.,"[611, 820, 621, 836]",MISC
1436,Cal,"[621, 820, 729, 836]",MISC
1437,##cula,"[621, 820, 729, 836]",MISC
1438,##ting,"[621, 820, 729, 836]",MISC
1439,the,"[730, 820, 759, 836]",MISC
1440,percentage,"[760, 820, 858, 836]",MISC
1441,based,"[859, 820, 907, 836]",MISC
1442,-,"[909, 820, 911, 836]",MISC
1443,NL,"[909, 820, 911, 836]",MISC
1444,-,"[909, 820, 911, 836]",MISC
1445,on,"[204, 836, 223, 851]",MISC
1446,the,"[224, 836, 255, 851]",MISC
1447,rating,"[255, 836, 317, 851]",MISC
1448,given,"[317, 836, 367, 851]",MISC
1449,by,"[369, 836, 388, 851]",MISC
1450,the,"[390, 836, 420, 851]",MISC
1451,user,"[421, 836, 461, 851]",MISC
1452,-,"[462, 836, 464, 851]",MISC
1453,NL,"[462, 836, 464, 851]",MISC
1454,-,"[462, 836, 464, 851]",MISC
1455,Environment,"[169, 868, 292, 884]",MISC
1456,:,"[169, 868, 292, 884]",MISC
1457,-,"[292, 868, 294, 884]",MISC
1458,NL,"[292, 868, 294, 884]",MISC
1459,-,"[292, 868, 294, 884]",MISC
1460,Java,"[204, 901, 246, 916]",MISC
1461,8,"[248, 901, 257, 916]",MISC
1462,",","[258, 901, 268, 916]",MISC
1463,JP,"[269, 901, 312, 916]",MISC
1464,##A,"[269, 901, 312, 916]",MISC
1465,",","[269, 901, 312, 916]",MISC
1466,Spring,"[313, 901, 379, 916]",MISC
1467,B,"[379, 901, 433, 916]",MISC
1468,##O,"[379, 901, 433, 916]",MISC
1469,##OT,"[379, 901, 433, 916]",MISC
1470,",","[379, 901, 433, 916]",MISC
1471,Web,"[434, 901, 532, 916]",MISC
1472,##sp,"[434, 901, 532, 916]",MISC
1473,##here,"[434, 901, 532, 916]",MISC
1474,Server,"[532, 901, 607, 916]",MISC
1475,",","[532, 901, 607, 916]",MISC
1476,Ang,"[609, 901, 684, 916]",MISC
1477,##ular,"[609, 901, 684, 916]",MISC
1478,-,"[685, 901, 687, 916]",MISC
1479,NL,"[685, 901, 687, 916]",MISC
1480,-,"[685, 901, 687, 916]",MISC
