,token,box,label
0,C,"[448, 92, 609, 115]",MISC
1,##UR,"[448, 92, 609, 115]",MISC
2,##RI,"[448, 92, 609, 115]",MISC
3,##CU,"[448, 92, 609, 115]",MISC
4,##L,"[448, 92, 609, 115]",MISC
5,##UM,"[448, 92, 609, 115]",MISC
6,VI,"[609, 92, 689, 115]",MISC
7,##TA,"[609, 92, 689, 115]",MISC
8,##E,"[609, 92, 689, 115]",MISC
9,-,"[689, 92, 691, 115]",MISC
10,NL,"[689, 92, 691, 115]",MISC
11,-,"[689, 92, 691, 115]",MISC
12,S,"[137, 126, 262, 149]",B-name
13,##NE,"[137, 126, 262, 149]",I-name
14,##HA,"[137, 126, 262, 149]",I-name
15,.,"[137, 126, 262, 149]",I-name
16,S,"[137, 126, 262, 149]",I-name
17,.,"[137, 126, 262, 149]",I-name
18,M,"[137, 126, 262, 149]",I-name
19,-,"[262, 126, 264, 149]",MISC
20,NL,"[262, 126, 264, 149]",MISC
21,-,"[262, 126, 264, 149]",MISC
22,Mobile,"[137, 158, 220, 179]",MISC
23,:,"[137, 158, 220, 179]",MISC
24,+,"[220, 158, 255, 179]",B-phones_phone
25,91,"[220, 158, 255, 179]",I-phones_phone
26,–,"[256, 158, 386, 179]",I-phones_phone
27,96,"[256, 158, 386, 179]",I-phones_phone
28,##32,"[256, 158, 386, 179]",I-phones_phone
29,##9,"[256, 158, 386, 179]",I-phones_phone
30,##29,"[256, 158, 386, 179]",I-phones_phone
31,##27,"[256, 158, 386, 179]",I-phones_phone
32,##2,"[256, 158, 386, 179]",I-phones_phone
33,-,"[386, 158, 388, 179]",MISC
34,NL,"[386, 158, 388, 179]",MISC
35,-,"[386, 158, 388, 179]",MISC
36,Em,"[678, 158, 747, 179]",MISC
37,##ail,"[678, 158, 747, 179]",MISC
38,:,"[678, 158, 747, 179]",MISC
39,s,"[747, 158, 1000, 179]",B-emails_email
40,##ne,"[747, 158, 1000, 179]",I-emails_email
41,##ha,"[747, 158, 1000, 179]",I-emails_email
42,.,"[747, 158, 1000, 179]",I-emails_email
43,seven,"[747, 158, 1000, 179]",I-emails_email
44,##2,"[747, 158, 1000, 179]",I-emails_email
45,@,"[747, 158, 1000, 179]",I-emails_email
46,g,"[747, 158, 1000, 179]",I-emails_email
47,##mail,"[747, 158, 1000, 179]",I-emails_email
48,.,"[747, 158, 1000, 179]",I-emails_email
49,com,"[747, 158, 1000, 179]",I-emails_email
50,-,"[1000, 158, 1001, 179]",MISC
51,NL,"[1000, 158, 1001, 179]",MISC
52,-,"[1000, 158, 1001, 179]",MISC
53,W,"[137, 190, 197, 210]",B-work_experience_heading
54,##OR,"[137, 190, 197, 210]",I-work_experience_heading
55,##K,"[137, 190, 197, 210]",I-work_experience_heading
56,E,"[198, 190, 347, 210]",I-work_experience_heading
57,##X,"[198, 190, 347, 210]",I-work_experience_heading
58,##P,"[198, 190, 347, 210]",I-work_experience_heading
59,##ER,"[198, 190, 347, 210]",I-work_experience_heading
60,##IE,"[198, 190, 347, 210]",I-work_experience_heading
61,##NC,"[198, 190, 347, 210]",I-work_experience_heading
62,##E,"[198, 190, 347, 210]",I-work_experience_heading
63,-,"[348, 190, 350, 210]",MISC
64,NL,"[348, 190, 350, 210]",MISC
65,-,"[348, 190, 350, 210]",MISC
66,Currently,"[137, 222, 252, 244]",MISC
67,working,"[253, 222, 341, 244]",MISC
68,at,"[342, 222, 367, 244]",MISC
69,Di,"[368, 222, 445, 244]",MISC
70,##ks,"[368, 222, 445, 244]",MISC
71,##ha,"[368, 222, 445, 244]",MISC
72,Technologies,"[445, 222, 598, 244]",MISC
73,as,"[599, 222, 624, 244]",MISC
74,Associate,"[624, 222, 739, 244]",B-employer_role
75,Specialist,"[740, 222, 956, 244]",I-employer_role
76,-,"[740, 222, 956, 244]",I-employer_role
77,Talent,"[740, 222, 956, 244]",I-employer_role
78,-,"[957, 222, 959, 244]",MISC
79,NL,"[957, 222, 959, 244]",MISC
80,-,"[957, 222, 959, 244]",MISC
81,A,"[137, 248, 260, 271]",MISC
82,##c,"[137, 248, 260, 271]",MISC
83,##quisition,"[137, 248, 260, 271]",MISC
84,since,"[262, 248, 317, 271]",MISC
85,February,"[318, 248, 408, 271]",MISC
86,2018,"[408, 248, 452, 271]",MISC
87,-,"[454, 248, 455, 271]",MISC
88,NL,"[454, 248, 455, 271]",MISC
89,-,"[454, 248, 455, 271]",MISC
90,Working,"[184, 289, 266, 310]",MISC
91,as,"[268, 289, 291, 310]",MISC
92,IT,"[292, 289, 315, 310]",MISC
93,Re,"[316, 289, 435, 310]",MISC
94,##c,"[316, 289, 435, 310]",MISC
95,##ruit,"[316, 289, 435, 310]",MISC
96,##er,"[316, 289, 435, 310]",MISC
97,.,"[316, 289, 435, 310]",MISC
98,-,"[436, 289, 438, 310]",MISC
99,NL,"[436, 289, 438, 310]",MISC
100,-,"[436, 289, 438, 310]",MISC
101,In,"[183, 309, 269, 329]",MISC
102,##volved,"[183, 309, 269, 329]",MISC
103,in,"[270, 309, 291, 329]",MISC
104,working,"[292, 309, 367, 329]",MISC
105,for,"[368, 309, 401, 329]",MISC
106,both,"[401, 309, 443, 329]",MISC
107,internal,"[445, 309, 531, 329]",MISC
108,requirements,"[532, 309, 662, 329]",MISC
109,as,"[663, 309, 684, 329]",MISC
110,well,"[685, 309, 727, 329]",MISC
111,as,"[728, 309, 749, 329]",MISC
112,client,"[750, 309, 815, 329]",MISC
113,requirements,"[816, 309, 957, 329]",MISC
114,.,"[816, 309, 957, 329]",MISC
115,-,"[957, 309, 959, 329]",MISC
116,NL,"[957, 309, 959, 329]",MISC
117,-,"[957, 309, 959, 329]",MISC
118,Short,"[183, 329, 313, 349]",MISC
119,##list,"[183, 329, 313, 349]",MISC
120,##ing,"[183, 329, 313, 349]",MISC
121,candidates,"[314, 329, 421, 349]",MISC
122,from,"[423, 329, 465, 349]",MISC
123,Na,"[466, 329, 531, 349]",MISC
124,##uk,"[466, 329, 531, 349]",MISC
125,##ri,"[466, 329, 531, 349]",MISC
126,based,"[532, 329, 585, 349]",MISC
127,on,"[586, 329, 607, 349]",MISC
128,the,"[608, 329, 640, 349]",MISC
129,job,"[641, 329, 673, 349]",MISC
130,description,"[673, 329, 804, 349]",MISC
131,.,"[673, 329, 804, 349]",MISC
132,-,"[804, 329, 806, 349]",MISC
133,NL,"[804, 329, 806, 349]",MISC
134,-,"[804, 329, 806, 349]",MISC
135,Calling,"[183, 347, 260, 369]",MISC
136,the,"[261, 347, 294, 369]",MISC
137,candidates,"[295, 347, 418, 369]",MISC
138,",","[295, 347, 418, 369]",MISC
139,speaking,"[418, 347, 506, 369]",MISC
140,to,"[508, 347, 529, 369]",MISC
141,them,"[530, 347, 574, 369]",MISC
142,regarding,"[575, 347, 674, 369]",MISC
143,the,"[676, 347, 708, 369]",MISC
144,job,"[709, 347, 742, 369]",MISC
145,and,"[743, 347, 775, 369]",MISC
146,processing,"[776, 347, 887, 369]",MISC
147,them,"[888, 347, 932, 369]",MISC
148,if,"[933, 347, 954, 369]",MISC
149,-,"[955, 347, 957, 369]",MISC
150,NL,"[955, 347, 957, 369]",MISC
151,-,"[955, 347, 957, 369]",MISC
152,interested,"[206, 365, 300, 386]",MISC
153,.,"[206, 365, 300, 386]",MISC
154,-,"[300, 365, 302, 386]",MISC
155,NL,"[300, 365, 302, 386]",MISC
156,-,"[300, 365, 302, 386]",MISC
157,Sc,"[182, 386, 288, 406]",MISC
158,##hed,"[182, 386, 288, 406]",MISC
159,##ulin,"[182, 386, 288, 406]",MISC
160,##g,"[182, 386, 288, 406]",MISC
161,interviews,"[288, 386, 393, 406]",MISC
162,and,"[393, 386, 424, 406]",MISC
163,sending,"[425, 386, 498, 406]",MISC
164,it,"[499, 386, 520, 406]",MISC
165,to,"[520, 386, 541, 406]",MISC
166,clients,"[541, 386, 613, 406]",MISC
167,if,"[614, 386, 636, 406]",MISC
168,shortlisted,"[636, 386, 762, 406]",MISC
169,.,"[636, 386, 762, 406]",MISC
170,-,"[762, 386, 764, 406]",MISC
171,NL,"[762, 386, 764, 406]",MISC
172,-,"[762, 386, 764, 406]",MISC
173,Hi,"[183, 404, 246, 425]",MISC
174,##ring,"[183, 404, 246, 425]",MISC
175,the,"[246, 404, 277, 425]",MISC
176,candidate,"[278, 404, 372, 425]",MISC
177,if,"[374, 404, 395, 425]",MISC
178,shortlisted,"[395, 404, 512, 425]",MISC
179,by,"[512, 404, 533, 425]",MISC
180,the,"[533, 404, 564, 425]",MISC
181,client,"[565, 404, 638, 425]",MISC
182,.,"[565, 404, 638, 425]",MISC
183,-,"[639, 404, 641, 425]",MISC
184,NL,"[639, 404, 641, 425]",MISC
185,-,"[639, 404, 641, 425]",MISC
186,Work,"[184, 424, 255, 445]",MISC
187,##ed,"[184, 424, 255, 445]",MISC
188,on,"[255, 424, 278, 445]",MISC
189,technologies,"[278, 424, 420, 445]",MISC
190,such,"[420, 424, 466, 445]",MISC
191,as,"[468, 424, 491, 445]",MISC
192,Java,"[491, 424, 549, 445]",MISC
193,",","[491, 424, 549, 445]",MISC
194,U,"[550, 424, 585, 445]",MISC
195,##I,"[550, 424, 585, 445]",MISC
196,",","[550, 424, 585, 445]",MISC
197,P,"[586, 424, 632, 445]",MISC
198,##HP,"[586, 424, 632, 445]",MISC
199,",","[586, 424, 632, 445]",MISC
200,Testing,"[633, 424, 716, 445]",MISC
201,and,"[716, 424, 751, 445]",MISC
202,Android,"[752, 424, 845, 445]",MISC
203,.,"[752, 424, 845, 445]",MISC
204,-,"[846, 424, 848, 445]",MISC
205,NL,"[846, 424, 848, 445]",MISC
206,-,"[846, 424, 848, 445]",MISC
207,Hindus,"[137, 460, 247, 482]",B-employer_company_name
208,##tan,"[137, 460, 247, 482]",I-employer_company_name
209,Coca,"[248, 460, 357, 482]",I-employer_company_name
210,-,"[248, 460, 357, 482]",I-employer_company_name
211,Cola,"[248, 460, 357, 482]",I-employer_company_name
212,Be,"[358, 460, 467, 482]",I-employer_company_name
213,##ver,"[358, 460, 467, 482]",I-employer_company_name
214,##ages,"[358, 460, 467, 482]",I-employer_company_name
215,P,"[468, 460, 516, 482]",I-employer_company_name
216,##v,"[468, 460, 516, 482]",I-employer_company_name
217,##t,"[468, 460, 516, 482]",I-employer_company_name
218,.,"[468, 460, 516, 482]",I-employer_company_name
219,Ltd,"[517, 460, 553, 482]",I-employer_company_name
220,(,"[554, 460, 688, 482]",MISC
221,Bangalore,"[554, 460, 688, 482]",MISC
222,),"[554, 460, 688, 482]",MISC
223,August,"[688, 460, 761, 482]",MISC
224,2016,"[762, 460, 809, 482]",MISC
225,to,"[811, 460, 833, 482]",MISC
226,August,"[835, 460, 908, 482]",MISC
227,2017,"[908, 460, 956, 482]",MISC
228,-,"[957, 460, 959, 482]",MISC
229,NL,"[957, 460, 959, 482]",MISC
230,-,"[957, 460, 959, 482]",MISC
231,(,"[137, 486, 206, 509]",MISC
232,Under,"[137, 486, 206, 509]",MISC
233,Talent,"[206, 486, 275, 509]",MISC
234,Pro,"[275, 486, 310, 509]",MISC
235,Pay,"[310, 486, 402, 509]",MISC
236,##roll,"[310, 486, 402, 509]",MISC
237,),"[310, 486, 402, 509]",MISC
238,-,"[402, 486, 404, 509]",MISC
239,NL,"[402, 486, 404, 509]",MISC
240,-,"[402, 486, 404, 509]",MISC
241,Work,"[184, 529, 255, 548]",MISC
242,##ed,"[184, 529, 255, 548]",MISC
243,at,"[255, 529, 278, 548]",MISC
244,Hindus,"[279, 529, 384, 548]",MISC
245,##tan,"[279, 529, 384, 548]",MISC
246,Coca,"[386, 529, 492, 548]",MISC
247,-,"[386, 529, 492, 548]",MISC
248,Cola,"[386, 529, 492, 548]",MISC
249,Be,"[494, 529, 599, 548]",MISC
250,##ver,"[494, 529, 599, 548]",MISC
251,##ages,"[494, 529, 599, 548]",MISC
252,P,"[601, 529, 647, 548]",MISC
253,##v,"[601, 529, 647, 548]",MISC
254,##t,"[601, 529, 647, 548]",MISC
255,.,"[601, 529, 647, 548]",MISC
256,Ltd,"[648, 529, 694, 548]",MISC
257,.,"[648, 529, 694, 548]",MISC
258,through,"[696, 529, 778, 548]",MISC
259,Talent,"[779, 529, 850, 548]",MISC
260,Pro,"[851, 529, 885, 548]",MISC
261,as,"[887, 529, 910, 548]",MISC
262,H,"[911, 529, 934, 548]",MISC
263,##R,"[911, 529, 934, 548]",MISC
264,-,"[934, 529, 936, 548]",MISC
265,NL,"[934, 529, 936, 548]",MISC
266,-,"[934, 529, 936, 548]",MISC
267,Executive,"[206, 546, 298, 567]",MISC
268,(,"[298, 546, 379, 567]",MISC
269,Hand,"[298, 546, 379, 567]",MISC
270,##led,"[298, 546, 379, 567]",MISC
271,recruitment,"[380, 546, 512, 567]",MISC
272,),"[380, 546, 512, 567]",MISC
273,.,"[380, 546, 512, 567]",MISC
274,-,"[513, 546, 515, 567]",MISC
275,NL,"[513, 546, 515, 567]",MISC
276,-,"[513, 546, 515, 567]",MISC
277,End,"[183, 566, 216, 585]",MISC
278,to,"[216, 566, 237, 585]",MISC
279,end,"[238, 566, 271, 585]",MISC
280,recruitment,"[272, 566, 404, 585]",MISC
281,:,"[272, 566, 404, 585]",MISC
282,So,"[404, 566, 504, 585]",MISC
283,##ur,"[404, 566, 504, 585]",MISC
284,##cing,"[404, 566, 504, 585]",MISC
285,",","[404, 566, 504, 585]",MISC
286,Screen,"[504, 566, 613, 585]",MISC
287,##ing,"[504, 566, 613, 585]",MISC
288,",","[504, 566, 613, 585]",MISC
289,Co,"[615, 566, 758, 585]",MISC
290,-,"[615, 566, 758, 585]",MISC
291,or,"[615, 566, 758, 585]",MISC
292,##dina,"[615, 566, 758, 585]",MISC
293,##ting,"[615, 566, 758, 585]",MISC
294,interviews,"[759, 566, 868, 585]",MISC
295,and,"[869, 566, 902, 585]",MISC
296,on,"[903, 566, 924, 585]",MISC
297,-,"[925, 566, 927, 585]",MISC
298,NL,"[925, 566, 927, 585]",MISC
299,-,"[925, 566, 927, 585]",MISC
300,boarding,"[206, 583, 285, 604]",MISC
301,candidates,"[286, 583, 395, 604]",MISC
302,.,"[286, 583, 395, 604]",MISC
303,-,"[396, 583, 398, 604]",MISC
304,NL,"[396, 583, 398, 604]",MISC
305,-,"[396, 583, 398, 604]",MISC
306,Meeting,"[183, 603, 259, 624]",MISC
307,hiring,"[259, 603, 325, 624]",MISC
308,managers,"[325, 603, 411, 624]",MISC
309,to,"[413, 603, 434, 624]",MISC
310,understand,"[435, 603, 544, 624]",MISC
311,skills,"[544, 603, 609, 624]",MISC
312,required,"[610, 603, 707, 624]",MISC
313,.,"[610, 603, 707, 624]",MISC
314,-,"[708, 603, 710, 624]",MISC
315,NL,"[708, 603, 710, 624]",MISC
316,-,"[708, 603, 710, 624]",MISC
317,Under,"[183, 623, 288, 644]",MISC
318,##sto,"[183, 623, 288, 644]",MISC
319,##od,"[183, 623, 288, 644]",MISC
320,the,"[290, 623, 320, 644]",MISC
321,job,"[322, 623, 352, 644]",MISC
322,requirements,"[354, 623, 482, 644]",MISC
323,and,"[482, 623, 513, 644]",MISC
324,identified,"[514, 623, 620, 644]",MISC
325,right,"[621, 623, 673, 644]",MISC
326,candidates,"[675, 623, 780, 644]",MISC
327,with,"[782, 623, 824, 644]",MISC
328,required,"[825, 623, 909, 644]",MISC
329,skills,"[910, 623, 974, 644]",MISC
330,-,"[975, 623, 977, 644]",MISC
331,NL,"[975, 623, 977, 644]",MISC
332,-,"[975, 623, 977, 644]",MISC
333,set,"[206, 640, 239, 661]",MISC
334,and,"[240, 640, 273, 661]",MISC
335,experience,"[274, 640, 385, 661]",MISC
336,and,"[387, 640, 420, 661]",MISC
337,made,"[421, 640, 465, 661]",MISC
338,sure,"[466, 640, 510, 661]",MISC
339,that,"[511, 640, 556, 661]",MISC
340,they,"[557, 640, 601, 661]",MISC
341,should,"[602, 640, 669, 661]",MISC
342,match,"[670, 640, 725, 661]",MISC
343,with,"[726, 640, 770, 661]",MISC
344,the,"[771, 640, 804, 661]",MISC
345,requirement,"[805, 640, 928, 661]",MISC
346,as,"[930, 640, 951, 661]",MISC
347,per,"[952, 640, 985, 661]",MISC
348,-,"[986, 640, 988, 661]",MISC
349,NL,"[986, 640, 988, 661]",MISC
350,-,"[986, 640, 988, 661]",MISC
351,the,"[206, 658, 235, 679]",MISC
352,job,"[236, 658, 274, 679]",MISC
353,.,"[236, 658, 274, 679]",MISC
354,-,"[275, 658, 277, 679]",MISC
355,NL,"[275, 658, 277, 679]",MISC
356,-,"[275, 658, 277, 679]",MISC
357,Co,"[183, 678, 304, 699]",MISC
358,##ord,"[183, 678, 304, 699]",MISC
359,##inated,"[183, 678, 304, 699]",MISC
360,with,"[305, 678, 349, 699]",MISC
361,various,"[349, 678, 426, 699]",MISC
362,man,"[427, 678, 515, 699]",MISC
363,##power,"[427, 678, 515, 699]",MISC
364,consultant,"[516, 678, 636, 699]",MISC
365,##s,"[516, 678, 636, 699]",MISC
366,to,"[638, 678, 659, 699]",MISC
367,pro,"[660, 678, 736, 699]",MISC
368,##cure,"[660, 678, 736, 699]",MISC
369,resources,"[737, 678, 846, 699]",MISC
370,.,"[737, 678, 846, 699]",MISC
371,-,"[848, 678, 850, 699]",MISC
372,NL,"[848, 678, 850, 699]",MISC
373,-,"[848, 678, 850, 699]",MISC
374,Short,"[183, 698, 300, 718]",MISC
375,##listed,"[183, 698, 300, 718]",MISC
376,candidates,"[301, 698, 408, 718]",MISC
377,received,"[408, 698, 493, 718]",MISC
378,from,"[494, 698, 537, 718]",MISC
379,consultant,"[537, 698, 654, 718]",MISC
380,##s,"[537, 698, 654, 718]",MISC
381,and,"[656, 698, 686, 718]",MISC
382,also,"[688, 698, 730, 718]",MISC
383,sourced,"[731, 698, 806, 718]",MISC
384,through,"[806, 698, 881, 718]",MISC
385,portal,"[881, 698, 945, 718]",MISC
386,-,"[946, 698, 948, 718]",MISC
387,NL,"[946, 698, 948, 718]",MISC
388,-,"[946, 698, 948, 718]",MISC
389,(,"[206, 715, 293, 736]",MISC
390,Na,"[206, 715, 293, 736]",MISC
391,##uk,"[206, 715, 293, 736]",MISC
392,##ri,"[206, 715, 293, 736]",MISC
393,),"[206, 715, 293, 736]",MISC
394,and,"[293, 715, 323, 736]",MISC
395,sent,"[325, 715, 367, 736]",MISC
396,them,"[368, 715, 410, 736]",MISC
397,to,"[411, 715, 432, 736]",MISC
398,the,"[433, 715, 464, 736]",MISC
399,respective,"[465, 715, 573, 736]",MISC
400,hiring,"[573, 715, 636, 736]",MISC
401,managers,"[638, 715, 734, 736]",MISC
402,.,"[638, 715, 734, 736]",MISC
403,-,"[735, 715, 737, 736]",MISC
404,NL,"[735, 715, 737, 736]",MISC
405,-,"[735, 715, 737, 736]",MISC
406,Co,"[183, 735, 304, 756]",MISC
407,##ord,"[183, 735, 304, 756]",MISC
408,##inated,"[183, 735, 304, 756]",MISC
409,during,"[304, 735, 369, 756]",MISC
410,interviews,"[370, 735, 480, 756]",MISC
411,and,"[481, 735, 513, 756]",MISC
412,promptly,"[514, 735, 602, 756]",MISC
413,informed,"[602, 735, 690, 756]",MISC
414,the,"[690, 735, 723, 756]",MISC
415,rejected,"[723, 735, 811, 756]",MISC
416,candidates,"[811, 735, 920, 756]",MISC
417,about,"[921, 735, 975, 756]",MISC
418,-,"[977, 735, 978, 756]",MISC
419,NL,"[977, 735, 978, 756]",MISC
420,-,"[977, 735, 978, 756]",MISC
421,the,"[206, 753, 235, 775]",MISC
422,reasons,"[236, 753, 305, 775]",MISC
423,for,"[306, 753, 334, 775]",MISC
424,the,"[336, 753, 364, 775]",MISC
425,rejection,"[365, 753, 475, 775]",MISC
426,##s,"[365, 753, 475, 775]",MISC
427,.,"[365, 753, 475, 775]",MISC
428,-,"[475, 753, 477, 775]",MISC
429,NL,"[475, 753, 477, 775]",MISC
430,-,"[475, 753, 477, 775]",MISC
431,Co,"[183, 773, 317, 793]",MISC
432,-,"[183, 773, 317, 793]",MISC
433,or,"[183, 773, 317, 793]",MISC
434,##dina,"[183, 773, 317, 793]",MISC
435,##ted,"[183, 773, 317, 793]",MISC
436,during,"[317, 773, 384, 793]",MISC
437,the,"[384, 773, 417, 793]",MISC
438,on,"[418, 773, 439, 793]",MISC
439,boarding,"[440, 773, 528, 793]",MISC
440,processes,"[530, 773, 641, 793]",MISC
441,.,"[530, 773, 641, 793]",MISC
442,-,"[641, 773, 643, 793]",MISC
443,NL,"[641, 773, 643, 793]",MISC
444,-,"[641, 773, 643, 793]",MISC
445,Pre,"[183, 793, 283, 813]",MISC
446,##par,"[183, 793, 283, 813]",MISC
447,##ing,"[183, 793, 283, 813]",MISC
448,reports,"[283, 793, 359, 813]",MISC
449,on,"[360, 793, 381, 813]",MISC
450,the,"[382, 793, 415, 813]",MISC
451,number,"[416, 793, 481, 813]",MISC
452,of,"[482, 793, 503, 813]",MISC
453,closure,"[504, 793, 604, 813]",MISC
454,##s,"[504, 793, 604, 813]",MISC
455,",","[504, 793, 604, 813]",MISC
456,internal,"[604, 793, 692, 813]",MISC
457,movements,"[692, 793, 802, 813]",MISC
458,",","[692, 793, 802, 813]",MISC
459,and,"[803, 793, 836, 813]",MISC
460,offer,"[836, 793, 890, 813]",MISC
461,declined,"[892, 793, 980, 813]",MISC
462,-,"[980, 793, 982, 813]",MISC
463,NL,"[980, 793, 982, 813]",MISC
464,-,"[980, 793, 982, 813]",MISC
465,particular,"[206, 810, 321, 832]",MISC
466,##s,"[206, 810, 321, 832]",MISC
467,to,"[323, 810, 344, 832]",MISC
468,ensure,"[344, 810, 408, 832]",MISC
469,the,"[408, 810, 439, 832]",MISC
470,flow,"[440, 810, 482, 832]",MISC
471,of,"[482, 810, 503, 832]",MISC
472,work,"[503, 810, 546, 832]",MISC
473,to,"[546, 810, 567, 832]",MISC
474,reach,"[567, 810, 619, 832]",MISC
475,the,"[620, 810, 651, 832]",MISC
476,as,"[652, 810, 715, 832]",MISC
477,##pire,"[652, 810, 715, 832]",MISC
478,rates,"[716, 810, 779, 832]",MISC
479,.,"[716, 810, 779, 832]",MISC
480,-,"[779, 810, 781, 832]",MISC
481,NL,"[779, 810, 781, 832]",MISC
482,-,"[779, 810, 781, 832]",MISC
483,Send,"[184, 830, 264, 851]",MISC
484,##ing,"[184, 830, 264, 851]",MISC
485,weekly,"[266, 830, 335, 851]",MISC
486,recruitment,"[336, 830, 464, 851]",MISC
487,status,"[465, 830, 534, 851]",MISC
488,to,"[535, 830, 558, 851]",MISC
489,the,"[559, 830, 593, 851]",MISC
490,Z,"[594, 830, 651, 851]",MISC
491,##onal,"[594, 830, 651, 851]",MISC
492,H,"[652, 830, 675, 851]",MISC
493,##R,"[652, 830, 675, 851]",MISC
494,Manager,"[676, 830, 768, 851]",MISC
495,.,"[676, 830, 768, 851]",MISC
496,-,"[770, 830, 772, 851]",MISC
497,NL,"[770, 830, 772, 851]",MISC
498,-,"[770, 830, 772, 851]",MISC
499,-,"[143, 850, 145, 869]",MISC
500,NL,"[143, 850, 145, 869]",MISC
501,-,"[143, 850, 145, 869]",MISC
502,H,"[206, 880, 229, 903]",B-employer_role
503,##R,"[206, 880, 229, 903]",I-employer_role
504,Inter,"[231, 880, 304, 903]",I-employer_role
505,##n,"[231, 880, 304, 903]",I-employer_role
506,at,"[304, 880, 327, 903]",MISC
507,Southern,"[328, 880, 424, 903]",B-employer_company_name
508,Electric,"[426, 880, 521, 903]",I-employer_company_name
509,Company,"[523, 880, 607, 903]",I-employer_company_name
510,(,"[608, 880, 740, 903]",MISC
511,Bangalore,"[608, 880, 740, 903]",MISC
512,),"[608, 880, 740, 903]",MISC
513,August,"[742, 880, 815, 903]",MISC
514,2017,"[815, 880, 863, 903]",MISC
515,to,"[864, 880, 887, 903]",MISC
516,-,"[888, 880, 890, 903]",MISC
517,NL,"[888, 880, 890, 903]",MISC
518,-,"[888, 880, 890, 903]",MISC
519,September,"[206, 898, 310, 920]",MISC
520,2017,"[311, 898, 369, 920]",MISC
521,.,"[311, 898, 369, 920]",MISC
522,-,"[369, 898, 371, 920]",MISC
523,NL,"[369, 898, 371, 920]",MISC
524,-,"[369, 898, 371, 920]",MISC
525,H,"[206, 929, 229, 951]",B-employer_role
526,##R,"[206, 929, 229, 951]",I-employer_role
527,Inter,"[230, 929, 301, 951]",I-employer_role
528,##n,"[230, 929, 301, 951]",I-employer_role
529,at,"[302, 929, 325, 951]",MISC
530,S,"[325, 929, 419, 951]",B-employer_company_name
531,##pra,"[325, 929, 419, 951]",I-employer_company_name
532,##ying,"[325, 929, 419, 951]",I-employer_company_name
533,Systems,"[420, 929, 503, 951]",I-employer_company_name
534,(,"[504, 929, 586, 951]",I-employer_company_name
535,India,"[504, 929, 586, 951]",I-employer_company_name
536,),"[504, 929, 586, 951]",I-employer_company_name
537,P,"[587, 929, 633, 951]",I-employer_company_name
538,##v,"[587, 929, 633, 951]",I-employer_company_name
539,##t,"[587, 929, 633, 951]",I-employer_company_name
540,.,"[587, 929, 633, 951]",I-employer_company_name
541,Ltd,"[634, 929, 680, 951]",I-employer_company_name
542,.,"[634, 929, 680, 951]",MISC
543,Bangalore,"[682, 929, 787, 951]",MISC
544,September,"[789, 929, 894, 951]",MISC
545,-,"[896, 929, 898, 951]",MISC
546,NL,"[896, 929, 898, 951]",MISC
547,-,"[896, 929, 898, 951]",MISC
548,2017,"[206, 947, 254, 969]",MISC
549,to,"[256, 947, 279, 969]",MISC
550,November,"[281, 947, 379, 969]",MISC
551,2017,"[380, 947, 441, 969]",MISC
552,.,"[380, 947, 441, 969]",MISC
553,-,"[442, 947, 444, 969]",MISC
554,NL,"[442, 947, 444, 969]",MISC
555,-,"[442, 947, 444, 969]",MISC
556,St,"[184, 981, 291, 1000]",MISC
557,##at,"[184, 981, 291, 1000]",MISC
558,##uto,"[184, 981, 291, 1000]",MISC
559,##ry,"[184, 981, 291, 1000]",MISC
560,returns,"[291, 981, 374, 1000]",MISC
561,–,"[375, 981, 386, 1000]",MISC
562,P,"[387, 981, 421, 1000]",MISC
563,##F,"[387, 981, 421, 1000]",MISC
564,",","[387, 981, 421, 1000]",MISC
565,E,"[423, 981, 457, 1000]",MISC
566,##SI,"[423, 981, 457, 1000]",MISC
567,and,"[459, 981, 493, 1000]",MISC
568,PT,"[494, 981, 529, 1000]",MISC
569,-,"[530, 981, 532, 1000]",MISC
570,NL,"[530, 981, 532, 1000]",MISC
571,-,"[530, 981, 532, 1000]",MISC
572,Bonus,"[184, 93, 241, 115]",MISC
573,Cal,"[242, 93, 379, 115]",MISC
574,##cula,"[242, 93, 379, 115]",MISC
575,##tion,"[242, 93, 379, 115]",MISC
576,-,"[381, 93, 383, 115]",MISC
577,NL,"[381, 93, 383, 115]",MISC
578,-,"[381, 93, 383, 115]",MISC
579,Attendance,"[184, 113, 298, 133]",MISC
580,",","[299, 113, 311, 133]",MISC
581,P,"[311, 113, 437, 133]",MISC
582,##un,"[311, 113, 437, 133]",MISC
583,##ct,"[311, 113, 437, 133]",MISC
584,##ual,"[311, 113, 437, 133]",MISC
585,##ity,"[311, 113, 437, 133]",MISC
586,and,"[438, 113, 473, 133]",MISC
587,O,"[473, 113, 496, 133]",MISC
588,##T,"[473, 113, 496, 133]",MISC
589,Maintenance,"[496, 113, 634, 133]",MISC
590,-,"[636, 113, 637, 133]",MISC
591,NL,"[636, 113, 637, 133]",MISC
592,-,"[636, 113, 637, 133]",MISC
593,Lu,"[184, 132, 328, 153]",MISC
594,##nch,"[184, 132, 328, 153]",MISC
595,/,"[184, 132, 328, 153]",MISC
596,S,"[184, 132, 328, 153]",MISC
597,##nac,"[184, 132, 328, 153]",MISC
598,##ks,"[184, 132, 328, 153]",MISC
599,Co,"[328, 132, 399, 153]",MISC
600,##upon,"[328, 132, 399, 153]",MISC
601,Maintenance,"[400, 132, 543, 153]",MISC
602,-,"[544, 132, 545, 153]",MISC
603,NL,"[544, 132, 545, 153]",MISC
604,-,"[544, 132, 545, 153]",MISC
605,MBA,"[159, 183, 203, 205]",MISC
606,PR,"[203, 183, 320, 205]",MISC
607,##O,"[203, 183, 320, 205]",MISC
608,##J,"[203, 183, 320, 205]",MISC
609,##EC,"[203, 183, 320, 205]",MISC
610,##TS,"[203, 183, 320, 205]",MISC
611,-,"[321, 183, 323, 205]",MISC
612,NL,"[321, 183, 323, 205]",MISC
613,-,"[321, 183, 323, 205]",MISC
614,Organization,"[159, 214, 293, 236]",MISC
615,Study,"[293, 214, 360, 236]",MISC
616,:,"[293, 214, 360, 236]",MISC
617,-,"[360, 214, 362, 236]",MISC
618,NL,"[360, 214, 362, 236]",MISC
619,-,"[360, 214, 362, 236]",MISC
620,Organization,"[159, 244, 291, 265]",MISC
621,study,"[292, 244, 348, 265]",MISC
622,for,"[348, 244, 380, 265]",MISC
623,10,"[381, 244, 402, 265]",MISC
624,days,"[403, 244, 447, 265]",MISC
625,at,"[448, 244, 469, 265]",MISC
626,S,"[470, 244, 558, 265]",B-employer_company_name
627,##pra,"[470, 244, 558, 265]",I-employer_company_name
628,##ying,"[470, 244, 558, 265]",I-employer_company_name
629,Systems,"[559, 244, 636, 265]",I-employer_company_name
630,(,"[637, 244, 714, 265]",I-employer_company_name
631,India,"[637, 244, 714, 265]",I-employer_company_name
632,),"[637, 244, 714, 265]",I-employer_company_name
633,P,"[715, 244, 759, 265]",I-employer_company_name
634,##v,"[715, 244, 759, 265]",I-employer_company_name
635,##t,"[715, 244, 759, 265]",I-employer_company_name
636,.,"[715, 244, 759, 265]",I-employer_company_name
637,Ltd,"[760, 244, 804, 265]",I-employer_company_name
638,.,"[760, 244, 804, 265]",MISC
639,Follow,"[804, 244, 892, 265]",MISC
640,##ed,"[804, 244, 892, 265]",MISC
641,by,"[893, 244, 914, 265]",MISC
642,a,"[916, 244, 925, 265]",MISC
643,-,"[927, 244, 929, 265]",MISC
644,NL,"[927, 244, 929, 265]",MISC
645,-,"[927, 244, 929, 265]",MISC
646,submission,"[159, 263, 264, 284]",MISC
647,of,"[264, 263, 286, 284]",MISC
648,a,"[286, 263, 295, 284]",MISC
649,report,"[296, 263, 359, 284]",MISC
650,to,"[360, 263, 381, 284]",MISC
651,the,"[381, 263, 412, 284]",MISC
652,college,"[413, 263, 497, 284]",MISC
653,.,"[413, 263, 497, 284]",MISC
654,-,"[498, 263, 500, 284]",MISC
655,NL,"[498, 263, 500, 284]",MISC
656,-,"[498, 263, 500, 284]",MISC
657,Summer,"[159, 294, 227, 317]",MISC
658,Inter,"[228, 294, 343, 317]",MISC
659,##ns,"[228, 294, 343, 317]",MISC
660,##hip,"[228, 294, 343, 317]",MISC
661,Project,"[344, 294, 436, 317]",MISC
662,:,"[344, 294, 436, 317]",MISC
663,-,"[436, 294, 438, 317]",MISC
664,NL,"[436, 294, 438, 317]",MISC
665,-,"[436, 294, 438, 317]",MISC
666,Company,"[159, 326, 245, 347]",MISC
667,:,"[159, 326, 245, 347]",MISC
668,B,"[245, 326, 310, 347]",B-project_title
669,##hara,"[245, 326, 310, 347]",I-project_title
670,##t,"[245, 326, 310, 347]",I-project_title
671,Electronics,"[310, 326, 429, 347]",I-project_title
672,Limited,"[430, 326, 516, 347]",I-project_title
673,",","[430, 326, 516, 347]",I-project_title
674,Bangalore,"[517, 326, 614, 347]",I-project_title
675,-,"[614, 326, 616, 347]",MISC
676,NL,"[614, 326, 616, 347]",MISC
677,-,"[614, 326, 616, 347]",MISC
678,Ten,"[159, 358, 237, 379]",MISC
679,##ure,"[159, 358, 237, 379]",MISC
680,:,"[159, 358, 237, 379]",MISC
681,6th,"[237, 358, 270, 379]",MISC
682,July,"[271, 358, 315, 379]",MISC
683,to,"[316, 358, 337, 379]",MISC
684,20th,"[339, 358, 383, 379]",MISC
685,August,"[384, 358, 451, 379]",MISC
686,(,"[451, 358, 484, 379]",MISC
687,45,"[451, 358, 484, 379]",MISC
688,days,"[485, 358, 541, 379]",MISC
689,),"[485, 358, 541, 379]",MISC
690,-,"[542, 358, 544, 379]",MISC
691,NL,"[542, 358, 544, 379]",MISC
692,-,"[542, 358, 544, 379]",MISC
693,Project,"[159, 388, 237, 410]",MISC
694,title,"[237, 388, 304, 410]",MISC
695,:,"[237, 388, 304, 410]",MISC
696,A,"[305, 388, 315, 410]",MISC
697,Study,"[316, 388, 372, 410]",MISC
698,on,"[373, 388, 394, 410]",MISC
699,"""","[395, 388, 495, 410]",MISC
700,Em,"[395, 388, 495, 410]",MISC
701,##p,"[395, 388, 495, 410]",MISC
702,##loy,"[395, 388, 495, 410]",MISC
703,##ee,"[395, 388, 495, 410]",MISC
704,Sa,"[497, 388, 631, 410]",MISC
705,##tisfaction,"[497, 388, 631, 410]",MISC
706,Level,"[632, 388, 699, 410]",MISC
707,##s,"[632, 388, 699, 410]",MISC
708,On,"[700, 388, 721, 410]",MISC
709,The,"[722, 388, 755, 410]",MISC
710,Welfare,"[756, 388, 835, 410]",MISC
711,Me,"[835, 388, 925, 410]",MISC
712,##asures,"[835, 388, 925, 410]",MISC
713,At,"[925, 388, 946, 410]",MISC
714,-,"[948, 388, 950, 410]",MISC
715,NL,"[948, 388, 950, 410]",MISC
716,-,"[948, 388, 950, 410]",MISC
717,B,"[159, 407, 220, 428]",MISC
718,##hara,"[159, 407, 220, 428]",MISC
719,##t,"[159, 407, 220, 428]",MISC
720,Electronics,"[220, 407, 331, 428]",MISC
721,Limited,"[333, 407, 414, 428]",MISC
722,"""","[333, 407, 414, 428]",MISC
723,-,"[415, 407, 417, 428]",MISC
724,NL,"[415, 407, 417, 428]",MISC
725,-,"[415, 407, 417, 428]",MISC
726,E,"[153, 440, 281, 460]",B-education_heading
727,##D,"[153, 440, 281, 460]",I-education_heading
728,##UC,"[153, 440, 281, 460]",I-education_heading
729,##AT,"[153, 440, 281, 460]",I-education_heading
730,##ION,"[153, 440, 281, 460]",I-education_heading
731,-,"[281, 440, 283, 460]",MISC
732,NL,"[281, 440, 283, 460]",MISC
733,-,"[281, 440, 283, 460]",MISC
734,Examination,"[172, 469, 379, 490]",MISC
735,-,"[381, 469, 398, 490]",MISC
736,University,"[400, 469, 589, 490]",MISC
737,-,"[589, 469, 607, 490]",MISC
738,Institute,"[608, 469, 779, 490]",MISC
739,-,"[779, 469, 796, 490]",MISC
740,Year,"[798, 469, 873, 490]",MISC
741,-,"[874, 469, 891, 490]",MISC
742,Marks,"[893, 469, 987, 490]",MISC
743,-,"[988, 469, 990, 490]",MISC
744,NL,"[988, 469, 990, 490]",MISC
745,-,"[988, 469, 990, 490]",MISC
746,M,"[159, 492, 170, 534]",B-education_degree
747,B,"[172, 492, 183, 534]",I-education_degree
748,A,"[185, 492, 196, 534]",I-education_degree
749,(,"[198, 492, 236, 534]",MISC
750,H,"[198, 492, 236, 534]",B-education_course
751,##R,"[198, 492, 236, 534]",I-education_course
752,and,"[237, 492, 275, 534]",I-education_course
753,Marketing,"[276, 492, 406, 534]",I-education_course
754,),"[276, 492, 406, 534]",MISC
755,-,"[407, 492, 419, 534]",MISC
756,Jain,"[420, 492, 472, 534]",MISC
757,University,"[472, 492, 603, 534]",MISC
758,-,"[603, 492, 615, 534]",MISC
759,C,"[616, 492, 655, 534]",B-education_institute
760,##MS,"[616, 492, 655, 534]",I-education_institute
761,Business,"[656, 492, 759, 534]",I-education_institute
762,School,"[760, 492, 837, 534]",I-education_institute
763,-,"[839, 492, 850, 534]",MISC
764,2016,"[852, 492, 904, 534]",MISC
765,-,"[904, 492, 916, 534]",MISC
766,76,"[917, 492, 994, 534]",MISC
767,.,"[917, 492, 994, 534]",MISC
768,41,"[917, 492, 994, 534]",MISC
769,%,"[917, 492, 994, 534]",MISC
770,-,"[996, 492, 998, 534]",MISC
771,NL,"[996, 492, 998, 534]",MISC
772,-,"[996, 492, 998, 534]",MISC
773,G,"[178, 558, 266, 599]",MISC
774,##rad,"[178, 558, 266, 599]",MISC
775,##uation,"[178, 558, 266, 599]",MISC
776,BC,"[267, 558, 291, 599]",B-education_degree
777,##A,"[267, 558, 291, 599]",I-education_degree
778,-,"[293, 558, 301, 599]",MISC
779,Bangalore,"[302, 558, 381, 599]",MISC
780,Ma,"[382, 558, 453, 599]",MISC
781,##hara,"[382, 558, 453, 599]",MISC
782,##ni,"[382, 558, 453, 599]",MISC
783,Lakshmi,"[453, 558, 515, 599]",MISC
784,Am,"[516, 558, 577, 599]",MISC
785,##mann,"[516, 558, 577, 599]",MISC
786,##i,"[516, 558, 577, 599]",MISC
787,University,"[578, 558, 666, 599]",MISC
788,College,"[667, 558, 728, 599]",MISC
789,For,"[729, 558, 754, 599]",MISC
790,Women,"[756, 558, 807, 599]",MISC
791,",","[756, 558, 807, 599]",MISC
792,Bangalore,"[809, 558, 887, 599]",MISC
793,-,"[889, 558, 897, 599]",MISC
794,2013,"[898, 558, 932, 599]",MISC
795,-,"[933, 558, 941, 599]",MISC
796,70,"[942, 558, 994, 599]",MISC
797,.,"[942, 558, 994, 599]",MISC
798,38,"[942, 558, 994, 599]",MISC
799,%,"[942, 558, 994, 599]",MISC
800,-,"[996, 558, 998, 599]",MISC
801,NL,"[996, 558, 998, 599]",MISC
802,-,"[996, 558, 998, 599]",MISC
803,E,"[153, 633, 237, 653]",B-others_heading
804,##XT,"[153, 633, 237, 653]",I-others_heading
805,##RA,"[153, 633, 237, 653]",I-others_heading
806,-,"[153, 633, 237, 653]",I-others_heading
807,C,"[238, 633, 393, 653]",I-others_heading
808,##UR,"[238, 633, 393, 653]",I-others_heading
809,##RI,"[238, 633, 393, 653]",I-others_heading
810,##CU,"[238, 633, 393, 653]",I-others_heading
811,##LA,"[238, 633, 393, 653]",I-others_heading
812,##RS,"[238, 633, 393, 653]",I-others_heading
813,-,"[394, 633, 396, 653]",MISC
814,NL,"[394, 633, 396, 653]",MISC
815,-,"[394, 633, 396, 653]",MISC
816,Music,"[183, 664, 237, 685]",MISC
817,(,"[238, 664, 356, 685]",MISC
818,Hindus,"[238, 664, 356, 685]",MISC
819,##tani,"[238, 664, 356, 685]",MISC
820,Classical,"[358, 664, 477, 685]",MISC
821,),"[358, 664, 477, 685]",MISC
822,.,"[358, 664, 477, 685]",MISC
823,-,"[478, 664, 480, 685]",MISC
824,NL,"[478, 664, 480, 685]",MISC
825,-,"[478, 664, 480, 685]",MISC
826,Part,"[184, 686, 234, 707]",MISC
827,of,"[234, 686, 259, 707]",MISC
828,volunteer,"[259, 686, 409, 707]",MISC
829,##ing,"[259, 686, 409, 707]",MISC
830,team,"[409, 686, 458, 707]",MISC
831,at,"[458, 686, 483, 707]",MISC
832,NH,"[483, 686, 569, 707]",MISC
833,##RD,"[483, 686, 569, 707]",MISC
834,-,"[483, 686, 569, 707]",MISC
835,H,"[483, 686, 569, 707]",MISC
836,##R,"[483, 686, 569, 707]",MISC
837,Show,"[570, 686, 670, 707]",MISC
838,##case,"[570, 686, 670, 707]",MISC
839,-,"[670, 686, 672, 707]",MISC
840,NL,"[670, 686, 672, 707]",MISC
841,-,"[670, 686, 672, 707]",MISC
842,Volunteer,"[183, 708, 304, 728]",MISC
843,##ed,"[183, 708, 304, 728]",MISC
844,for,"[305, 708, 338, 728]",MISC
845,one,"[339, 708, 371, 728]",MISC
846,of,"[372, 708, 393, 728]",MISC
847,the,"[394, 708, 427, 728]",MISC
848,vertical,"[428, 708, 527, 728]",MISC
849,##s,"[428, 708, 527, 728]",MISC
850,for,"[528, 708, 561, 728]",MISC
851,Pa,"[561, 708, 649, 728]",MISC
852,##rich,"[561, 708, 649, 728]",MISC
853,##ay,"[561, 708, 649, 728]",MISC
854,Fest,"[650, 708, 694, 728]",MISC
855,-,"[695, 708, 697, 728]",MISC
856,NL,"[695, 708, 697, 728]",MISC
857,-,"[695, 708, 697, 728]",MISC
858,Volunteer,"[183, 731, 302, 751]",MISC
859,##ed,"[183, 731, 302, 751]",MISC
860,for,"[302, 731, 333, 751]",MISC
861,International,"[334, 731, 474, 751]",MISC
862,Conference,"[475, 731, 582, 751]",MISC
863,on,"[583, 731, 604, 751]",MISC
864,"""","[605, 731, 745, 751]",MISC
865,Re,"[605, 731, 745, 751]",MISC
866,-,"[605, 731, 745, 751]",MISC
867,script,"[605, 731, 745, 751]",MISC
868,##ing,"[605, 731, 745, 751]",MISC
869,India,"[746, 731, 821, 751]",MISC
870,',"[746, 731, 821, 751]",MISC
871,s,"[746, 731, 821, 751]",MISC
872,Growth,"[822, 731, 885, 751]",MISC
873,Story,"[887, 731, 950, 751]",MISC
874,"""","[887, 731, 950, 751]",MISC
875,-,"[952, 731, 954, 751]",MISC
876,NL,"[952, 731, 954, 751]",MISC
877,-,"[952, 731, 954, 751]",MISC
878,Volunteer,"[184, 752, 314, 773]",MISC
879,##ed,"[184, 752, 314, 773]",MISC
880,for,"[315, 752, 350, 773]",MISC
881,Job,"[351, 752, 386, 773]",MISC
882,Fair,"[387, 752, 433, 773]",MISC
883,held,"[435, 752, 481, 773]",MISC
884,at,"[483, 752, 506, 773]",MISC
885,C,"[507, 752, 541, 773]",B-education_institute
886,##MS,"[507, 752, 541, 773]",I-education_institute
887,Business,"[543, 752, 637, 773]",I-education_institute
888,School,"[638, 752, 709, 773]",I-education_institute
889,-,"[710, 752, 712, 773]",MISC
890,NL,"[710, 752, 712, 773]",MISC
891,-,"[710, 752, 712, 773]",MISC
892,Present,"[183, 775, 281, 796]",MISC
893,##ed,"[183, 775, 281, 796]",MISC
894,a,"[282, 775, 291, 796]",MISC
895,paper,"[293, 775, 346, 796]",MISC
896,on,"[348, 775, 369, 796]",MISC
897,Intel,"[370, 775, 500, 796]",MISC
898,##lect,"[370, 775, 500, 796]",MISC
899,##ual,"[370, 775, 500, 796]",MISC
900,Property,"[501, 775, 588, 796]",MISC
901,Rights,"[589, 775, 666, 796]",MISC
902,:,"[589, 775, 666, 796]",MISC
903,Patent,"[666, 775, 752, 796]",MISC
904,##s,"[666, 775, 752, 796]",MISC
905,",","[666, 775, 752, 796]",MISC
906,Copyright,"[754, 775, 863, 796]",MISC
907,##s,"[754, 775, 863, 796]",MISC
908,and,"[864, 775, 896, 796]",MISC
909,Trade,"[897, 775, 950, 796]",MISC
910,-,"[952, 775, 954, 796]",MISC
911,NL,"[952, 775, 954, 796]",MISC
912,-,"[952, 775, 954, 796]",MISC
913,Secrets,"[206, 794, 287, 816]",MISC
914,organized,"[287, 794, 388, 816]",MISC
915,by,"[390, 794, 413, 816]",MISC
916,C,"[413, 794, 448, 816]",B-education_institute
917,##MS,"[413, 794, 448, 816]",I-education_institute
918,Business,"[448, 794, 540, 816]",I-education_institute
919,School,"[540, 794, 609, 816]",I-education_institute
920,-,"[609, 794, 611, 816]",MISC
921,NL,"[609, 794, 611, 816]",MISC
922,-,"[609, 794, 611, 816]",MISC
923,CE,"[153, 846, 337, 867]",B-others_heading
924,##RT,"[153, 846, 337, 867]",I-others_heading
925,##IF,"[153, 846, 337, 867]",I-others_heading
926,##IC,"[153, 846, 337, 867]",I-others_heading
927,##AT,"[153, 846, 337, 867]",I-others_heading
928,##ION,"[153, 846, 337, 867]",I-others_heading
929,##S,"[153, 846, 337, 867]",I-others_heading
930,-,"[337, 846, 339, 867]",MISC
931,NL,"[337, 846, 339, 867]",MISC
932,-,"[337, 846, 339, 867]",MISC
933,Ce,"[185, 878, 347, 898]",MISC
934,##rt,"[185, 878, 347, 898]",MISC
935,##ification,"[185, 878, 347, 898]",MISC
936,in,"[349, 878, 374, 898]",MISC
937,SA,"[374, 878, 411, 898]",MISC
938,##P,"[374, 878, 411, 898]",MISC
939,–,"[412, 878, 462, 898]",MISC
940,HC,"[412, 878, 462, 898]",MISC
941,##M,"[412, 878, 462, 898]",MISC
942,-,"[463, 878, 465, 898]",MISC
943,NL,"[463, 878, 465, 898]",MISC
944,-,"[463, 878, 465, 898]",MISC
945,P,"[153, 920, 264, 940]",B-personal_details_heading
946,##ER,"[153, 920, 264, 940]",I-personal_details_heading
947,##SO,"[153, 920, 264, 940]",I-personal_details_heading
948,##NA,"[153, 920, 264, 940]",I-personal_details_heading
949,##L,"[153, 920, 264, 940]",I-personal_details_heading
950,DE,"[265, 920, 363, 940]",I-personal_details_heading
951,##TA,"[265, 920, 363, 940]",I-personal_details_heading
952,##IL,"[265, 920, 363, 940]",I-personal_details_heading
953,##S,"[265, 920, 363, 940]",I-personal_details_heading
954,-,"[363, 920, 365, 940]",MISC
955,NL,"[363, 920, 365, 940]",MISC
956,-,"[363, 920, 365, 940]",MISC
957,Date,"[137, 949, 195, 972]",MISC
958,of,"[196, 949, 225, 972]",MISC
959,Birth,"[225, 949, 298, 972]",MISC
960,:,"[299, 949, 312, 972]",MISC
961,07,"[313, 949, 342, 972]",MISC
962,February,"[343, 949, 460, 972]",MISC
963,1992,"[460, 949, 517, 972]",MISC
964,-,"[519, 949, 521, 972]",MISC
965,NL,"[519, 949, 521, 972]",MISC
966,-,"[519, 949, 521, 972]",MISC
967,Languages,"[137, 970, 250, 992]",MISC
968,Known,"[251, 970, 312, 992]",MISC
969,:,"[314, 970, 325, 992]",MISC
970,Kannada,"[326, 970, 426, 992]",MISC
971,",","[326, 970, 426, 992]",MISC
972,Hindi,"[427, 970, 489, 992]",MISC
973,and,"[490, 970, 527, 992]",MISC
974,English,"[528, 970, 616, 992]",MISC
975,-,"[616, 970, 618, 992]",MISC
976,NL,"[616, 970, 618, 992]",MISC
977,-,"[616, 970, 618, 992]",MISC
