,token,box,label
0,P,"[368, 82, 604, 118]",B-name
1,.,"[368, 82, 604, 118]",I-name
2,V,"[368, 82, 604, 118]",I-name
3,.,"[368, 82, 604, 118]",I-name
4,S,"[368, 82, 604, 118]",I-name
5,.,"[368, 82, 604, 118]",I-name
6,S,"[368, 82, 604, 118]",I-name
7,##we,"[368, 82, 604, 118]",I-name
8,##tha,"[368, 82, 604, 118]",I-name
9,Go,"[604, 82, 683, 118]",MISC
10,##ud,"[604, 82, 683, 118]",MISC
11,-,"[683, 82, 685, 118]",MISC
12,NL,"[683, 82, 685, 118]",MISC
13,-,"[683, 82, 685, 118]",MISC
14,1,"[313, 124, 395, 144]",MISC
15,-,"[313, 124, 395, 144]",MISC
16,75,"[313, 124, 395, 144]",MISC
17,/,"[313, 124, 395, 144]",MISC
18,8,"[313, 124, 395, 144]",MISC
19,/,"[313, 124, 395, 144]",MISC
20,4,"[313, 124, 395, 144]",MISC
21,Bo,"[396, 124, 489, 144]",MISC
22,##du,"[396, 124, 489, 144]",MISC
23,##ppa,"[396, 124, 489, 144]",MISC
24,##l,"[396, 124, 489, 144]",MISC
25,",","[396, 124, 489, 144]",MISC
26,Hyderabad,"[489, 124, 593, 144]",MISC
27,",","[489, 124, 593, 144]",MISC
28,Telangana,"[593, 124, 686, 144]",MISC
29,5000,"[687, 124, 748, 144]",MISC
30,##9,"[687, 124, 748, 144]",MISC
31,##2,"[687, 124, 748, 144]",MISC
32,-,"[749, 124, 751, 144]",MISC
33,NL,"[749, 124, 751, 144]",MISC
34,-,"[749, 124, 751, 144]",MISC
35,s,"[261, 154, 491, 179]",B-emails_email
36,##we,"[261, 154, 491, 179]",I-emails_email
37,##tha,"[261, 154, 491, 179]",I-emails_email
38,##pu,"[261, 154, 491, 179]",I-emails_email
39,##li,"[261, 154, 491, 179]",I-emails_email
40,##9,"[261, 154, 491, 179]",I-emails_email
41,##6,"[261, 154, 491, 179]",I-emails_email
42,@,"[261, 154, 491, 179]",I-emails_email
43,g,"[261, 154, 491, 179]",I-emails_email
44,##mail,"[261, 154, 491, 179]",I-emails_email
45,##com,"[261, 154, 491, 179]",I-emails_email
46,",","[492, 154, 503, 179]",MISC
47,+,"[503, 154, 800, 179]",B-phones_phone
48,91,"[503, 154, 800, 179]",I-phones_phone
49,##8,"[503, 154, 800, 179]",I-phones_phone
50,##37,"[503, 154, 800, 179]",I-phones_phone
51,##46,"[503, 154, 800, 179]",I-phones_phone
52,##90,"[503, 154, 800, 179]",I-phones_phone
53,##8,"[503, 154, 800, 179]",I-phones_phone
54,##5,"[503, 154, 800, 179]",I-phones_phone
55,##7,"[503, 154, 800, 179]",I-phones_phone
56,",","[503, 154, 800, 179]",MISC
57,+,"[503, 154, 800, 179]",B-phones_phone
58,91,"[503, 154, 800, 179]",I-phones_phone
59,##8,"[503, 154, 800, 179]",I-phones_phone
60,##500,"[503, 154, 800, 179]",I-phones_phone
61,##01,"[503, 154, 800, 179]",I-phones_phone
62,##8,"[503, 154, 800, 179]",I-phones_phone
63,##9,"[503, 154, 800, 179]",I-phones_phone
64,##46,"[503, 154, 800, 179]",I-phones_phone
65,-,"[801, 154, 803, 179]",MISC
66,NL,"[801, 154, 803, 179]",MISC
67,-,"[801, 154, 803, 179]",MISC
68,O,"[64, 186, 196, 210]",B-summary_heading
69,##B,"[64, 186, 196, 210]",I-summary_heading
70,##J,"[64, 186, 196, 210]",I-summary_heading
71,##EC,"[64, 186, 196, 210]",I-summary_heading
72,##TI,"[64, 186, 196, 210]",I-summary_heading
73,##VE,"[64, 186, 196, 210]",I-summary_heading
74,-,"[196, 186, 198, 210]",MISC
75,NL,"[196, 186, 198, 210]",MISC
76,-,"[196, 186, 198, 210]",MISC
77,To,"[64, 222, 85, 238]",MISC
78,build,"[87, 222, 142, 238]",MISC
79,upon,"[144, 222, 188, 238]",MISC
80,and,"[189, 222, 223, 238]",MISC
81,enhance,"[224, 222, 302, 238]",MISC
82,my,"[304, 222, 325, 238]",MISC
83,professional,"[326, 222, 462, 238]",MISC
84,skills,"[463, 222, 531, 238]",MISC
85,in,"[532, 222, 553, 238]",MISC
86,a,"[555, 222, 565, 238]",MISC
87,reputed,"[566, 222, 645, 238]",MISC
88,and,"[646, 222, 680, 238]",MISC
89,dynamic,"[680, 222, 759, 238]",MISC
90,organization,"[760, 222, 896, 238]",MISC
91,that,"[897, 222, 942, 238]",MISC
92,gives,"[942, 222, 998, 238]",MISC
93,-,"[1000, 222, 1001, 238]",MISC
94,NL,"[1000, 222, 1001, 238]",MISC
95,-,"[1000, 222, 1001, 238]",MISC
96,me,"[64, 241, 85, 257]",MISC
97,the,"[87, 241, 121, 257]",MISC
98,opportunity,"[121, 241, 246, 257]",MISC
99,to,"[247, 241, 268, 257]",MISC
100,evolve,"[269, 241, 337, 257]",MISC
101,in,"[338, 241, 359, 257]",MISC
102,a,"[361, 241, 372, 257]",MISC
103,professional,"[372, 241, 508, 257]",MISC
104,manner,"[509, 241, 577, 257]",MISC
105,and,"[578, 241, 612, 257]",MISC
106,contribute,"[612, 241, 725, 257]",MISC
107,to,"[726, 241, 748, 257]",MISC
108,the,"[749, 241, 783, 257]",MISC
109,goals,"[783, 241, 839, 257]",MISC
110,of,"[841, 241, 862, 257]",MISC
111,company,"[863, 241, 955, 257]",MISC
112,.,"[863, 241, 955, 257]",MISC
113,-,"[955, 241, 957, 257]",MISC
114,NL,"[955, 241, 957, 257]",MISC
115,-,"[955, 241, 957, 257]",MISC
116,K,"[64, 288, 110, 312]",B-skills_heading
117,##E,"[64, 288, 110, 312]",I-skills_heading
118,##Y,"[64, 288, 110, 312]",I-skills_heading
119,SK,"[111, 288, 204, 312]",I-skills_heading
120,##IL,"[111, 288, 204, 312]",I-skills_heading
121,##LS,"[111, 288, 204, 312]",I-skills_heading
122,-,"[205, 288, 207, 312]",MISC
123,NL,"[205, 288, 207, 312]",MISC
124,-,"[205, 288, 207, 312]",MISC
125,Application,"[64, 325, 187, 342]",MISC
126,Software,"[188, 325, 278, 342]",MISC
127,:,"[279, 325, 345, 342]",MISC
128,SP,"[279, 325, 345, 342]",MISC
129,##SS,"[279, 325, 345, 342]",MISC
130,",","[279, 325, 345, 342]",MISC
131,Microsoft,"[346, 325, 447, 342]",MISC
132,office,"[448, 325, 514, 342]",MISC
133,Pack,"[516, 325, 605, 342]",MISC
134,##age,"[516, 325, 605, 342]",MISC
135,",","[516, 325, 605, 342]",MISC
136,email,"[606, 325, 662, 342]",MISC
137,hunter,"[663, 325, 741, 342]",MISC
138,",","[663, 325, 741, 342]",MISC
139,Advance,"[742, 325, 820, 342]",MISC
140,Ex,"[821, 325, 887, 342]",MISC
141,##cel,"[821, 325, 887, 342]",MISC
142,.,"[821, 325, 887, 342]",MISC
143,-,"[889, 325, 890, 342]",MISC
144,NL,"[889, 325, 890, 342]",MISC
145,-,"[889, 325, 890, 342]",MISC
146,Operating,"[64, 351, 175, 369]",MISC
147,System,"[176, 351, 249, 369]",MISC
148,:,"[250, 351, 261, 369]",MISC
149,Windows,"[262, 351, 348, 369]",MISC
150,7,"[349, 351, 435, 369]",MISC
151,",","[349, 351, 435, 369]",MISC
152,8,"[349, 351, 435, 369]",MISC
153,",","[349, 351, 435, 369]",MISC
154,10,"[349, 351, 435, 369]",B-education_degree
155,.,"[349, 351, 435, 369]",MISC
156,-,"[436, 351, 438, 369]",MISC
157,NL,"[436, 351, 438, 369]",MISC
158,-,"[436, 351, 438, 369]",MISC
159,Technical,"[64, 379, 177, 396]",MISC
160,Software,"[178, 379, 278, 396]",MISC
161,:,"[279, 379, 291, 396]",MISC
162,AU,"[292, 379, 342, 396]",MISC
163,##TO,"[292, 379, 342, 396]",MISC
164,CA,"[342, 379, 380, 396]",MISC
165,##D,"[342, 379, 380, 396]",MISC
166,",","[380, 379, 393, 396]",MISC
167,Solid,"[393, 379, 455, 396]",MISC
168,Works,"[456, 379, 519, 396]",MISC
169,",","[519, 379, 532, 396]",MISC
170,Pro,"[532, 379, 607, 396]",MISC
171,-,"[532, 379, 607, 396]",MISC
172,e,"[532, 379, 607, 396]",MISC
173,.,"[532, 379, 607, 396]",MISC
174,-,"[608, 379, 610, 396]",MISC
175,NL,"[608, 379, 610, 396]",MISC
176,-,"[608, 379, 610, 396]",MISC
177,AC,"[64, 427, 194, 447]",MISC
178,##AD,"[64, 427, 194, 447]",MISC
179,##EM,"[64, 427, 194, 447]",MISC
180,##IC,"[64, 427, 194, 447]",MISC
181,PR,"[195, 427, 472, 447]",MISC
182,##O,"[195, 427, 472, 447]",MISC
183,##J,"[195, 427, 472, 447]",MISC
184,##EC,"[195, 427, 472, 447]",MISC
185,##TS,"[195, 427, 472, 447]",MISC
186,",","[195, 427, 472, 447]",MISC
187,T,"[195, 427, 472, 447]",MISC
188,##RA,"[195, 427, 472, 447]",MISC
189,##IN,"[195, 427, 472, 447]",MISC
190,##ING,"[195, 427, 472, 447]",MISC
191,AN,"[472, 427, 521, 447]",MISC
192,##G,"[472, 427, 521, 447]",MISC
193,IN,"[521, 427, 684, 447]",MISC
194,##TE,"[521, 427, 684, 447]",MISC
195,##R,"[521, 427, 684, 447]",MISC
196,##NS,"[521, 427, 684, 447]",MISC
197,##H,"[521, 427, 684, 447]",MISC
198,##IP,"[521, 427, 684, 447]",MISC
199,-,"[685, 427, 686, 447]",MISC
200,NL,"[685, 427, 686, 447]",MISC
201,-,"[685, 427, 686, 447]",MISC
202,IN,"[64, 463, 139, 478]",B-project_title
203,##DI,"[64, 463, 139, 478]",I-project_title
204,##AN,"[64, 463, 139, 478]",I-project_title
205,RA,"[140, 463, 240, 478]",I-project_title
206,##IL,"[140, 463, 240, 478]",I-project_title
207,##WA,"[140, 463, 240, 478]",I-project_title
208,##Y,"[140, 463, 240, 478]",I-project_title
209,##S,"[140, 463, 240, 478]",I-project_title
210,(,"[241, 463, 253, 478]",MISC
211,Technical,"[253, 463, 366, 478]",MISC
212,Project,"[367, 463, 455, 478]",MISC
213,),"[456, 463, 468, 478]",MISC
214,-,"[468, 463, 470, 478]",MISC
215,NL,"[468, 463, 470, 478]",MISC
216,-,"[468, 463, 470, 478]",MISC
217,The,"[64, 488, 91, 511]",MISC
218,objective,"[92, 488, 176, 511]",MISC
219,of,"[177, 488, 195, 511]",MISC
220,the,"[196, 488, 223, 511]",MISC
221,project,"[224, 488, 288, 511]",MISC
222,is,"[290, 488, 308, 511]",MISC
223,to,"[309, 488, 327, 511]",MISC
224,increase,"[328, 488, 403, 511]",MISC
225,the,"[403, 488, 430, 511]",MISC
226,efficiency,"[431, 488, 524, 511]",MISC
227,of,"[525, 488, 543, 511]",MISC
228,engine,"[544, 488, 600, 511]",MISC
229,and,"[601, 488, 627, 511]",MISC
230,how,"[629, 488, 656, 511]",MISC
231,to,"[657, 488, 675, 511]",MISC
232,use,"[676, 488, 703, 511]",MISC
233,efficient,"[704, 488, 788, 511]",MISC
234,cool,"[789, 488, 853, 511]",MISC
235,##ant,"[789, 488, 853, 511]",MISC
236,.,"[855, 488, 864, 511]",MISC
237,And,"[864, 488, 891, 511]",MISC
238,there,"[892, 488, 939, 511]",MISC
239,by,"[940, 488, 957, 511]",MISC
240,-,"[958, 488, 960, 511]",MISC
241,NL,"[958, 488, 960, 511]",MISC
242,-,"[958, 488, 960, 511]",MISC
243,understanding,"[64, 512, 187, 534]",MISC
244,the,"[189, 512, 217, 534]",MISC
245,working,"[217, 512, 283, 534]",MISC
246,process,"[284, 512, 351, 534]",MISC
247,of,"[351, 512, 369, 534]",MISC
248,Rail,"[371, 512, 408, 534]",MISC
249,engine,"[409, 512, 466, 534]",MISC
250,in,"[466, 512, 484, 534]",MISC
251,work,"[486, 512, 523, 534]",MISC
252,shop,"[524, 512, 562, 534]",MISC
253,at,"[562, 512, 580, 534]",MISC
254,Se,"[582, 512, 705, 534]",MISC
255,##cu,"[582, 512, 705, 534]",MISC
256,##nder,"[582, 512, 705, 534]",MISC
257,##abad,"[582, 512, 705, 534]",MISC
258,.,"[582, 512, 705, 534]",MISC
259,-,"[706, 512, 708, 534]",MISC
260,NL,"[706, 512, 708, 534]",MISC
261,-,"[706, 512, 708, 534]",MISC
262,BA,"[64, 548, 127, 563]",B-project_title
263,##J,"[64, 548, 127, 563]",I-project_title
264,##A,"[64, 548, 127, 563]",I-project_title
265,##J,"[64, 548, 127, 563]",I-project_title
266,F,"[128, 548, 215, 563]",I-project_title
267,##IN,"[128, 548, 215, 563]",I-project_title
268,##SE,"[128, 548, 215, 563]",I-project_title
269,##R,"[128, 548, 215, 563]",I-project_title
270,##V,"[128, 548, 215, 563]",I-project_title
271,Ltd,"[217, 548, 255, 563]",I-project_title
272,-,"[255, 548, 257, 563]",MISC
273,NL,"[255, 548, 257, 563]",MISC
274,-,"[255, 548, 257, 563]",MISC
275,Inter,"[64, 573, 157, 595]",MISC
276,##ns,"[64, 573, 157, 595]",MISC
277,##hip,"[64, 573, 157, 595]",MISC
278,in,"[158, 573, 176, 595]",MISC
279,pure,"[177, 573, 214, 595]",MISC
280,sales,"[214, 573, 261, 595]",MISC
281,marketing,"[261, 573, 345, 595]",MISC
282,profile,"[346, 573, 410, 595]",MISC
283,to,"[412, 573, 430, 595]",MISC
284,pitch,"[431, 573, 477, 595]",MISC
285,customers,"[478, 573, 562, 595]",MISC
286,on,"[562, 573, 580, 595]",MISC
287,the,"[581, 573, 608, 595]",MISC
288,shop,"[609, 573, 647, 595]",MISC
289,floor,"[647, 573, 694, 595]",MISC
290,and,"[694, 573, 721, 595]",MISC
291,convert,"[722, 573, 787, 595]",MISC
292,them,"[788, 573, 826, 595]",MISC
293,into,"[826, 573, 863, 595]",MISC
294,Baja,"[863, 573, 910, 595]",MISC
295,##j,"[863, 573, 910, 595]",MISC
296,Fin,"[910, 573, 975, 595]",MISC
297,##ser,"[910, 573, 975, 595]",MISC
298,##v,"[910, 573, 975, 595]",MISC
299,-,"[976, 573, 978, 595]",MISC
300,NL,"[976, 573, 978, 595]",MISC
301,-,"[976, 573, 978, 595]",MISC
302,consumers,"[64, 595, 153, 619]",MISC
303,.,"[155, 595, 164, 619]",MISC
304,As,"[165, 595, 184, 619]",MISC
305,the,"[185, 595, 213, 619]",MISC
306,products,"[215, 595, 296, 619]",MISC
307,are,"[296, 595, 324, 619]",MISC
308,consumer,"[326, 595, 406, 619]",MISC
309,Du,"[406, 595, 476, 619]",MISC
310,##rable,"[406, 595, 476, 619]",MISC
311,there,"[477, 595, 527, 619]",MISC
312,are,"[527, 595, 556, 619]",MISC
313,many,"[558, 595, 597, 619]",MISC
314,schemes,"[598, 595, 668, 619]",MISC
315,and,"[668, 595, 697, 619]",MISC
316,features,"[699, 595, 779, 619]",MISC
317,of,"[779, 595, 799, 619]",MISC
318,the,"[799, 595, 828, 619]",MISC
319,product,"[830, 595, 899, 619]",MISC
320,to,"[900, 595, 920, 619]",MISC
321,be,"[920, 595, 940, 619]",MISC
322,-,"[940, 595, 942, 619]",MISC
323,NL,"[940, 595, 942, 619]",MISC
324,-,"[940, 595, 942, 619]",MISC
325,explained,"[64, 619, 144, 643]",MISC
326,to,"[146, 619, 164, 643]",MISC
327,the,"[164, 619, 191, 643]",MISC
328,customers,"[191, 619, 281, 643]",MISC
329,.,"[191, 619, 281, 643]",MISC
330,-,"[282, 619, 284, 643]",MISC
331,NL,"[282, 619, 284, 643]",MISC
332,-,"[282, 619, 284, 643]",MISC
333,H,"[64, 655, 196, 670]",B-project_title
334,##IN,"[64, 655, 196, 670]",I-project_title
335,##D,"[64, 655, 196, 670]",I-project_title
336,##US,"[64, 655, 196, 670]",I-project_title
337,##TA,"[64, 655, 196, 670]",I-project_title
338,##N,"[64, 655, 196, 670]",I-project_title
339,P,"[196, 655, 329, 670]",I-project_title
340,##ET,"[196, 655, 329, 670]",I-project_title
341,##RO,"[196, 655, 329, 670]",I-project_title
342,##LE,"[196, 655, 329, 670]",I-project_title
343,##UM,"[196, 655, 329, 670]",I-project_title
344,CO,"[329, 655, 490, 670]",I-project_title
345,##RP,"[329, 655, 490, 670]",I-project_title
346,##OR,"[329, 655, 490, 670]",I-project_title
347,##AT,"[329, 655, 490, 670]",I-project_title
348,##ION,"[329, 655, 490, 670]",I-project_title
349,Ltd,"[491, 655, 548, 670]",I-project_title
350,.,"[491, 655, 548, 670]",MISC
351,(,"[550, 655, 564, 670]",MISC
352,HP,"[565, 655, 622, 670]",MISC
353,##CL,"[565, 655, 622, 670]",MISC
354,),"[623, 655, 638, 670]",MISC
355,-,"[638, 655, 640, 670]",MISC
356,NL,"[638, 655, 640, 670]",MISC
357,-,"[638, 655, 640, 670]",MISC
358,Pre,"[64, 680, 141, 703]",MISC
359,##par,"[64, 680, 141, 703]",MISC
360,##ed,"[64, 680, 141, 703]",MISC
361,a,"[142, 680, 151, 703]",MISC
362,project,"[152, 680, 220, 703]",MISC
363,report,"[220, 680, 277, 703]",MISC
364,on,"[278, 680, 296, 703]",MISC
365,“,"[298, 680, 307, 703]",MISC
366,Services,"[308, 680, 424, 703]",MISC
367,##cape,"[308, 680, 424, 703]",MISC
368,in,"[425, 680, 443, 703]",MISC
369,Re,"[444, 680, 501, 703]",MISC
370,##tail,"[444, 680, 501, 703]",MISC
371,Out,"[503, 680, 560, 703]",MISC
372,##let,"[503, 680, 560, 703]",MISC
373,–,"[561, 680, 570, 703]",MISC
374,Effect,"[571, 680, 628, 703]",MISC
375,on,"[630, 680, 647, 703]",MISC
376,Custom,"[649, 680, 726, 703]",MISC
377,##er,"[649, 680, 726, 703]",MISC
378,Sa,"[727, 680, 843, 703]",MISC
379,##tisfaction,"[727, 680, 843, 703]",MISC
380,and,"[844, 680, 873, 703]",MISC
381,Pre,"[873, 680, 970, 703]",MISC
382,##ference,"[873, 680, 970, 703]",MISC
383,-,"[971, 680, 973, 703]",MISC
384,NL,"[971, 680, 973, 703]",MISC
385,-,"[971, 680, 973, 703]",MISC
386,“,"[64, 703, 127, 726]",MISC
387,.,"[64, 703, 127, 726]",MISC
388,After,"[64, 703, 127, 726]",MISC
389,research,"[127, 703, 198, 726]",MISC
390,",","[198, 703, 261, 726]",MISC
391,survey,"[198, 703, 261, 726]",MISC
392,and,"[261, 703, 288, 726]",MISC
393,analysis,"[288, 703, 360, 726]",MISC
394,in,"[360, 703, 378, 726]",MISC
395,Re,"[378, 703, 431, 726]",MISC
396,##tail,"[378, 703, 431, 726]",MISC
397,outlets,"[431, 703, 503, 726]",MISC
398,",","[431, 703, 503, 726]",MISC
399,collect,"[503, 703, 566, 726]",MISC
400,information,"[566, 703, 664, 726]",MISC
401,and,"[664, 703, 691, 726]",MISC
402,define,"[691, 703, 745, 726]",MISC
403,Services,"[745, 703, 852, 726]",MISC
404,##cape,"[745, 703, 852, 726]",MISC
405,and,"[853, 703, 879, 726]",MISC
406,its,"[879, 703, 906, 726]",MISC
407,dependence,"[906, 703, 996, 726]",MISC
408,-,"[996, 703, 998, 726]",MISC
409,NL,"[996, 703, 998, 726]",MISC
410,-,"[996, 703, 998, 726]",MISC
411,on,"[64, 726, 80, 749]",MISC
412,customer,"[81, 726, 149, 749]",MISC
413,satisfaction,"[151, 726, 264, 749]",MISC
414,.,"[151, 726, 264, 749]",MISC
415,-,"[264, 726, 266, 749]",MISC
416,NL,"[264, 726, 266, 749]",MISC
417,-,"[264, 726, 266, 749]",MISC
418,E,"[64, 759, 212, 779]",B-education_heading
419,##D,"[64, 759, 212, 779]",I-education_heading
420,##UC,"[64, 759, 212, 779]",I-education_heading
421,##AT,"[64, 759, 212, 779]",I-education_heading
422,##ION,"[64, 759, 212, 779]",I-education_heading
423,-,"[212, 759, 214, 779]",MISC
424,NL,"[212, 759, 214, 779]",MISC
425,-,"[212, 759, 214, 779]",MISC
426,B,"[64, 796, 148, 810]",B-education_institute
427,##hara,"[64, 796, 148, 810]",I-education_institute
428,##ti,"[64, 796, 148, 810]",I-education_institute
429,V,"[150, 796, 271, 810]",I-education_institute
430,##idy,"[150, 796, 271, 810]",I-education_institute
431,##ap,"[150, 796, 271, 810]",I-education_institute
432,##ee,"[150, 796, 271, 810]",I-education_institute
433,##th,"[150, 796, 271, 810]",I-education_institute
434,Dee,"[272, 796, 345, 810]",I-education_institute
435,##med,"[272, 796, 345, 810]",I-education_institute
436,University,"[345, 796, 467, 810]",I-education_institute
437,",","[468, 796, 479, 810]",I-education_institute
438,Pune,"[480, 796, 528, 810]",I-education_institute
439,-,"[529, 796, 531, 810]",MISC
440,NL,"[529, 796, 531, 810]",MISC
441,-,"[529, 796, 531, 810]",MISC
442,P,"[64, 823, 150, 837]",MISC
443,##urs,"[64, 823, 150, 837]",MISC
444,##uing,"[64, 823, 150, 837]",MISC
445,MBA,"[150, 823, 182, 837]",B-education_degree
446,(,"[182, 823, 193, 837]",MISC
447,9,"[193, 823, 203, 837]",MISC
448,s,"[203, 823, 257, 837]",MISC
449,##c,"[203, 823, 257, 837]",MISC
450,##g,"[203, 823, 257, 837]",MISC
451,##pa,"[203, 823, 257, 837]",MISC
452,till,"[257, 823, 300, 837]",MISC
453,se,"[300, 823, 332, 837]",MISC
454,##m,"[300, 823, 332, 837]",MISC
455,),"[332, 823, 343, 837]",MISC
456,-,"[343, 823, 345, 837]",MISC
457,NL,"[343, 823, 345, 837]",MISC
458,-,"[343, 823, 345, 837]",MISC
459,Since,"[849, 823, 898, 837]",MISC
460,August,"[899, 823, 958, 837]",MISC
461,2018,"[958, 823, 997, 837]",MISC
462,-,"[998, 823, 1000, 837]",MISC
463,NL,"[998, 823, 1000, 837]",MISC
464,-,"[998, 823, 1000, 837]",MISC
465,J,"[64, 850, 100, 865]",B-education_institute
466,##NT,"[64, 850, 100, 865]",I-education_institute
467,University,"[100, 850, 218, 865]",I-education_institute
468,",","[220, 850, 230, 865]",I-education_institute
469,Hyderabad,"[232, 850, 339, 865]",I-education_institute
470,-,"[339, 850, 341, 865]",MISC
471,NL,"[339, 850, 341, 865]",MISC
472,-,"[339, 850, 341, 865]",MISC
473,B,"[64, 878, 132, 891]",B-education_degree
474,.,"[64, 878, 132, 891]",I-education_degree
475,Tech,"[64, 878, 132, 891]",I-education_degree
476,(,"[133, 878, 144, 891]",MISC
477,Me,"[144, 878, 189, 891]",B-education_course
478,##ch,"[144, 878, 189, 891]",I-education_course
479,),"[190, 878, 201, 891]",MISC
480,–,"[202, 878, 212, 891]",MISC
481,69,"[213, 878, 270, 891]",MISC
482,.,"[213, 878, 270, 891]",MISC
483,05,"[213, 878, 270, 891]",MISC
484,%,"[271, 878, 281, 891]",MISC
485,-,"[282, 878, 284, 891]",MISC
486,NL,"[282, 878, 284, 891]",MISC
487,-,"[282, 878, 284, 891]",MISC
488,April,"[908, 878, 953, 891]",MISC
489,2017,"[954, 878, 990, 891]",MISC
490,-,"[991, 878, 992, 891]",MISC
491,NL,"[991, 878, 992, 891]",MISC
492,-,"[991, 878, 992, 891]",MISC
493,Narayan,"[64, 905, 159, 920]",B-education_institute
494,##a,"[64, 905, 159, 920]",I-education_institute
495,Jr,"[159, 905, 193, 920]",I-education_institute
496,.,"[159, 905, 193, 920]",I-education_institute
497,College,"[195, 905, 277, 920]",I-education_institute
498,",","[278, 905, 289, 920]",I-education_institute
499,Hyderabad,"[290, 905, 395, 920]",I-education_institute
500,-,"[397, 905, 398, 920]",MISC
501,NL,"[397, 905, 398, 920]",MISC
502,-,"[397, 905, 398, 920]",MISC
503,12,"[64, 934, 87, 947]",B-education_degree
504,th,"[88, 934, 112, 947]",MISC
505,–,"[113, 934, 124, 947]",MISC
506,80,"[125, 934, 149, 947]",MISC
507,%,"[150, 934, 161, 947]",MISC
508,-,"[162, 934, 164, 947]",MISC
509,NL,"[162, 934, 164, 947]",MISC
510,-,"[162, 934, 164, 947]",MISC
511,April,"[899, 934, 944, 947]",MISC
512,2013,"[945, 934, 981, 947]",MISC
513,-,"[982, 934, 983, 947]",MISC
514,NL,"[982, 934, 983, 947]",MISC
515,-,"[982, 934, 983, 947]",MISC
516,Narayan,"[64, 960, 155, 973]",B-education_institute
517,##a,"[64, 960, 155, 973]",I-education_institute
518,Concept,"[155, 960, 234, 973]",I-education_institute
519,School,"[235, 960, 303, 973]",I-education_institute
520,",","[304, 960, 315, 973]",I-education_institute
521,Hyderabad,"[315, 960, 417, 973]",I-education_institute
522,-,"[418, 960, 420, 973]",MISC
523,NL,"[418, 960, 420, 973]",MISC
524,-,"[418, 960, 420, 973]",MISC
525,10,"[64, 986, 85, 999]",B-education_degree
526,th,"[86, 986, 108, 999]",MISC
527,–,"[109, 986, 120, 999]",MISC
528,83,"[120, 986, 165, 999]",MISC
529,.,"[120, 986, 165, 999]",MISC
530,3,"[120, 986, 165, 999]",MISC
531,%,"[165, 986, 176, 999]",MISC
532,-,"[177, 986, 178, 999]",MISC
533,NL,"[177, 986, 178, 999]",MISC
534,-,"[177, 986, 178, 999]",MISC
535,April,"[890, 986, 935, 999]",MISC
536,2011,"[936, 986, 972, 999]",MISC
537,-,"[973, 986, 974, 999]",MISC
538,NL,"[973, 986, 974, 999]",MISC
539,-,"[973, 986, 974, 999]",MISC
540,AC,"[64, 75, 262, 95]",B-others_heading
541,##H,"[64, 75, 262, 95]",I-others_heading
542,##IE,"[64, 75, 262, 95]",I-others_heading
543,##VE,"[64, 75, 262, 95]",I-others_heading
544,##ME,"[64, 75, 262, 95]",I-others_heading
545,##NT,"[64, 75, 262, 95]",I-others_heading
546,##S,"[64, 75, 262, 95]",I-others_heading
547,-,"[262, 75, 264, 95]",MISC
548,NL,"[262, 75, 264, 95]",MISC
549,-,"[262, 75, 264, 95]",MISC
550,T,"[64, 114, 118, 129]",MISC
551,##hr,"[64, 114, 118, 129]",MISC
552,##ow,"[64, 114, 118, 129]",MISC
553,ball,"[118, 114, 161, 129]",MISC
554,player,"[162, 114, 226, 129]",MISC
555,-,"[227, 114, 228, 129]",MISC
556,NL,"[227, 114, 228, 129]",MISC
557,-,"[227, 114, 228, 129]",MISC
558,E,"[64, 141, 118, 156]",MISC
559,##ssa,"[64, 141, 118, 156]",MISC
560,##y,"[64, 141, 118, 156]",MISC
561,writing,"[119, 141, 196, 156]",MISC
562,winner,"[196, 141, 261, 156]",MISC
563,at,"[262, 141, 284, 156]",MISC
564,campus,"[284, 141, 349, 156]",MISC
565,level,"[350, 141, 404, 156]",MISC
566,-,"[406, 141, 407, 156]",MISC
567,NL,"[406, 141, 407, 156]",MISC
568,-,"[406, 141, 407, 156]",MISC
569,Organ,"[64, 170, 168, 185]",MISC
570,##izing,"[64, 170, 168, 185]",MISC
571,events,"[169, 170, 232, 185]",MISC
572,in,"[232, 170, 252, 185]",MISC
573,college,"[253, 170, 327, 185]",MISC
574,-,"[327, 170, 329, 185]",MISC
575,NL,"[327, 170, 329, 185]",MISC
576,-,"[327, 170, 329, 185]",MISC
577,N,"[64, 197, 93, 212]",MISC
578,##SS,"[64, 197, 93, 212]",MISC
579,activities,"[93, 197, 188, 212]",MISC
580,-,"[189, 197, 191, 212]",MISC
581,NL,"[189, 197, 191, 212]",MISC
582,-,"[189, 197, 191, 212]",MISC
583,E,"[64, 254, 139, 272]",B-others_heading
584,##XT,"[64, 254, 139, 272]",I-others_heading
585,##RA,"[64, 254, 139, 272]",I-others_heading
586,C,"[140, 254, 292, 272]",I-others_heading
587,##UR,"[140, 254, 292, 272]",I-others_heading
588,##RI,"[140, 254, 292, 272]",I-others_heading
589,##CU,"[140, 254, 292, 272]",I-others_heading
590,##LA,"[140, 254, 292, 272]",I-others_heading
591,##R,"[140, 254, 292, 272]",I-others_heading
592,ACT,"[293, 254, 445, 272]",I-others_heading
593,##I,"[293, 254, 445, 272]",I-others_heading
594,##VI,"[293, 254, 445, 272]",I-others_heading
595,##TI,"[293, 254, 445, 272]",I-others_heading
596,##ES,"[293, 254, 445, 272]",I-others_heading
597,-,"[445, 254, 447, 272]",MISC
598,NL,"[445, 254, 447, 272]",MISC
599,-,"[445, 254, 447, 272]",MISC
600,Blood,"[64, 288, 118, 303]",MISC
601,camps,"[118, 288, 172, 303]",MISC
602,and,"[172, 288, 204, 303]",MISC
603,College,"[204, 288, 279, 303]",MISC
604,Festival,"[280, 288, 387, 303]",MISC
605,##s,"[280, 288, 387, 303]",MISC
606,.,"[280, 288, 387, 303]",MISC
607,-,"[388, 288, 389, 303]",MISC
608,NL,"[388, 288, 389, 303]",MISC
609,-,"[388, 288, 389, 303]",MISC
610,Active,"[64, 317, 127, 332]",MISC
611,participation,"[128, 317, 266, 332]",MISC
612,in,"[266, 317, 286, 332]",MISC
613,Tree,"[288, 317, 329, 332]",MISC
614,Plantation,"[330, 317, 436, 332]",MISC
615,programmes,"[437, 317, 553, 332]",MISC
616,.,"[437, 317, 553, 332]",MISC
617,-,"[554, 317, 556, 332]",MISC
618,NL,"[554, 317, 556, 332]",MISC
619,-,"[554, 317, 556, 332]",MISC
620,Working,"[64, 345, 144, 360]",MISC
621,as,"[145, 345, 166, 360]",MISC
622,committee,"[168, 345, 272, 360]",MISC
623,member,"[272, 345, 340, 360]",MISC
624,in,"[342, 345, 363, 360]",MISC
625,College,"[365, 345, 446, 360]",MISC
626,events,"[446, 345, 527, 360]",MISC
627,.,"[446, 345, 527, 360]",MISC
628,-,"[527, 345, 529, 360]",MISC
629,NL,"[527, 345, 529, 360]",MISC
630,-,"[527, 345, 529, 360]",MISC
631,DE,"[64, 457, 220, 472]",B-others_heading
632,##CL,"[64, 457, 220, 472]",I-others_heading
633,##AR,"[64, 457, 220, 472]",I-others_heading
634,##AT,"[64, 457, 220, 472]",I-others_heading
635,##ION,"[64, 457, 220, 472]",I-others_heading
636,-,"[220, 457, 221, 472]",MISC
637,NL,"[220, 457, 221, 472]",MISC
638,-,"[220, 457, 221, 472]",MISC
639,I,"[64, 486, 73, 501]",MISC
640,here,"[74, 486, 116, 501]",MISC
641,by,"[117, 486, 136, 501]",MISC
642,declare,"[138, 486, 211, 501]",MISC
643,that,"[212, 486, 253, 501]",MISC
644,the,"[254, 486, 285, 501]",MISC
645,particular,"[286, 486, 402, 501]",MISC
646,##s,"[286, 486, 402, 501]",MISC
647,furnished,"[402, 486, 497, 501]",MISC
648,above,"[498, 486, 549, 501]",MISC
649,are,"[550, 486, 581, 501]",MISC
650,correct,"[582, 486, 666, 501]",MISC
651,.,"[582, 486, 666, 501]",MISC
652,-,"[667, 486, 669, 501]",MISC
653,NL,"[667, 486, 669, 501]",MISC
654,-,"[667, 486, 669, 501]",MISC
655,Place,"[64, 514, 123, 529]",MISC
656,–,"[123, 514, 134, 529]",MISC
657,Pune,"[135, 514, 181, 529]",MISC
658,-,"[182, 514, 184, 529]",MISC
659,NL,"[182, 514, 184, 529]",MISC
660,-,"[182, 514, 184, 529]",MISC
661,D,"[64, 542, 125, 557]",MISC
662,##AT,"[64, 542, 125, 557]",MISC
663,##E,"[64, 542, 125, 557]",MISC
664,:,"[64, 542, 125, 557]",MISC
665,-,"[125, 542, 127, 557]",MISC
666,NL,"[125, 542, 127, 557]",MISC
667,-,"[125, 542, 127, 557]",MISC
668,S,"[64, 655, 187, 670]",MISC
669,##IG,"[64, 655, 187, 670]",MISC
670,##NA,"[64, 655, 187, 670]",MISC
671,##TU,"[64, 655, 187, 670]",MISC
672,##RE,"[64, 655, 187, 670]",MISC
673,-,"[187, 655, 189, 670]",MISC
674,NL,"[187, 655, 189, 670]",MISC
675,-,"[187, 655, 189, 670]",MISC
