,token,box,label
0,AN,"[61, 66, 346, 93]",B-name
1,##UR,"[61, 66, 346, 93]",I-name
2,##AG,"[61, 66, 346, 93]",I-name
3,D,"[346, 66, 582, 93]",I-name
4,##U,"[346, 66, 582, 93]",I-name
5,##BE,"[346, 66, 582, 93]",I-name
6,##Y,"[346, 66, 582, 93]",I-name
7,-,"[582, 66, 584, 93]",MISC
8,NL,"[582, 66, 584, 93]",MISC
9,-,"[582, 66, 584, 93]",MISC
10,PR,"[61, 127, 276, 155]",B-summary_heading
11,##O,"[61, 127, 276, 155]",I-summary_heading
12,##F,"[61, 127, 276, 155]",I-summary_heading
13,##ES,"[61, 127, 276, 155]",I-summary_heading
14,##SI,"[61, 127, 276, 155]",I-summary_heading
15,##ON,"[61, 127, 276, 155]",I-summary_heading
16,##AL,"[61, 127, 276, 155]",I-summary_heading
17,S,"[278, 127, 403, 155]",I-summary_heading
18,##UM,"[278, 127, 403, 155]",I-summary_heading
19,##MA,"[278, 127, 403, 155]",I-summary_heading
20,##R,"[278, 127, 403, 155]",I-summary_heading
21,##Y,"[278, 127, 403, 155]",I-summary_heading
22,-,"[404, 127, 406, 155]",MISC
23,NL,"[404, 127, 406, 155]",MISC
24,-,"[404, 127, 406, 155]",MISC
25,Strong,"[61, 165, 122, 185]",MISC
26,&,"[122, 165, 131, 185]",MISC
27,Experience,"[132, 165, 241, 185]",MISC
28,##d,"[132, 165, 241, 185]",MISC
29,Financial,"[242, 165, 331, 185]",MISC
30,Report,"[332, 165, 422, 185]",MISC
31,##ing,"[332, 165, 422, 185]",MISC
32,professional,"[423, 165, 543, 185]",MISC
33,with,"[543, 165, 583, 185]",MISC
34,a,"[583, 165, 592, 185]",MISC
35,-,"[593, 165, 595, 185]",MISC
36,NL,"[593, 165, 595, 185]",MISC
37,-,"[593, 165, 595, 185]",MISC
38,demonstrated,"[61, 182, 187, 202]",MISC
39,history,"[188, 182, 261, 202]",MISC
40,of,"[262, 182, 282, 202]",MISC
41,working,"[284, 182, 356, 202]",MISC
42,in,"[358, 182, 378, 202]",MISC
43,the,"[379, 182, 410, 202]",MISC
44,Food,"[411, 182, 452, 202]",MISC
45,E,"[453, 182, 559, 202]",MISC
46,-,"[453, 182, 559, 202]",MISC
47,commerce,"[453, 182, 559, 202]",MISC
48,-,"[559, 182, 561, 202]",MISC
49,NL,"[559, 182, 561, 202]",MISC
50,-,"[559, 182, 561, 202]",MISC
51,industry,"[61, 200, 149, 220]",MISC
52,.,"[61, 200, 149, 220]",MISC
53,Ski,"[151, 200, 220, 220]",MISC
54,##lled,"[151, 200, 220, 220]",MISC
55,in,"[220, 200, 238, 220]",MISC
56,S,"[240, 200, 278, 220]",MISC
57,##QL,"[240, 200, 278, 220]",MISC
58,",","[240, 200, 278, 220]",MISC
59,Microsoft,"[279, 200, 367, 220]",MISC
60,Ex,"[369, 200, 427, 220]",MISC
61,##cel,"[369, 200, 427, 220]",MISC
62,",","[369, 200, 427, 220]",MISC
63,Microsoft,"[428, 200, 515, 220]",MISC
64,Word,"[517, 200, 555, 220]",MISC
65,and,"[557, 200, 586, 220]",MISC
66,Data,"[586, 200, 625, 220]",MISC
67,-,"[626, 200, 628, 220]",MISC
68,NL,"[626, 200, 628, 220]",MISC
69,-,"[626, 200, 628, 220]",MISC
70,Analysis,"[61, 217, 142, 237]",MISC
71,.,"[61, 217, 142, 237]",MISC
72,-,"[142, 217, 143, 237]",MISC
73,NL,"[142, 217, 143, 237]",MISC
74,-,"[142, 217, 143, 237]",MISC
75,W,"[61, 270, 134, 291]",B-work_experience_heading
76,##OR,"[61, 270, 134, 291]",I-work_experience_heading
77,##K,"[61, 270, 134, 291]",I-work_experience_heading
78,H,"[135, 270, 262, 291]",I-work_experience_heading
79,##IS,"[135, 270, 262, 291]",I-work_experience_heading
80,##TO,"[135, 270, 262, 291]",I-work_experience_heading
81,##R,"[135, 270, 262, 291]",I-work_experience_heading
82,##Y,"[135, 270, 262, 291]",I-work_experience_heading
83,-,"[264, 270, 265, 291]",MISC
84,NL,"[264, 270, 265, 291]",MISC
85,-,"[264, 270, 265, 291]",MISC
86,Financial,"[61, 301, 147, 321]",B-employer_role
87,Ana,"[148, 301, 224, 321]",I-employer_role
88,##ly,"[148, 301, 224, 321]",I-employer_role
89,##st,"[148, 301, 224, 321]",I-employer_role
90,",","[148, 301, 224, 321]",MISC
91,11,"[225, 301, 290, 321]",MISC
92,/,"[225, 301, 290, 321]",MISC
93,2019,"[225, 301, 290, 321]",MISC
94,to,"[292, 301, 310, 321]",MISC
95,Current,"[311, 301, 377, 321]",MISC
96,-,"[378, 301, 380, 321]",MISC
97,NL,"[378, 301, 380, 321]",MISC
98,-,"[378, 301, 380, 321]",MISC
99,Lim,"[61, 318, 154, 338]",B-employer_company_name
100,##ero,"[61, 318, 154, 338]",I-employer_company_name
101,##ad,"[61, 318, 154, 338]",I-employer_company_name
102,",","[61, 318, 154, 338]",MISC
103,Guru,"[156, 318, 240, 338]",MISC
104,##gram,"[156, 318, 240, 338]",MISC
105,-,"[240, 318, 242, 338]",MISC
106,NL,"[240, 318, 242, 338]",MISC
107,-,"[240, 318, 242, 338]",MISC
108,•,"[61, 340, 72, 362]",MISC
109,Pre,"[72, 340, 160, 362]",MISC
110,##par,"[72, 340, 160, 362]",MISC
111,##es,"[72, 340, 160, 362]",MISC
112,daily,"[160, 340, 214, 362]",MISC
113,and,"[214, 340, 247, 362]",MISC
114,monthly,"[247, 340, 324, 362]",MISC
115,level,"[324, 340, 378, 362]",MISC
116,Prof,"[378, 340, 444, 362]",MISC
117,##it,"[378, 340, 444, 362]",MISC
118,and,"[444, 340, 477, 362]",MISC
119,Loss,"[477, 340, 520, 362]",MISC
120,statement,"[520, 340, 619, 362]",MISC
121,-,"[619, 340, 621, 362]",MISC
122,NL,"[619, 340, 621, 362]",MISC
123,-,"[619, 340, 621, 362]",MISC
124,for,"[76, 357, 107, 380]",MISC
125,the,"[108, 357, 139, 380]",MISC
126,top,"[140, 357, 171, 380]",MISC
127,man,"[173, 357, 278, 380]",MISC
128,##gement,"[173, 357, 278, 380]",MISC
129,.,"[173, 357, 278, 380]",MISC
130,-,"[280, 357, 282, 380]",MISC
131,NL,"[280, 357, 282, 380]",MISC
132,-,"[280, 357, 282, 380]",MISC
133,•,"[61, 381, 71, 401]",MISC
134,Daily,"[72, 381, 123, 401]",MISC
135,data,"[123, 381, 163, 401]",MISC
136,tracking,"[164, 381, 244, 401]",MISC
137,of,"[245, 381, 265, 401]",MISC
138,all,"[266, 381, 295, 401]",MISC
139,Inc,"[297, 381, 419, 401]",MISC
140,##ome,"[297, 381, 419, 401]",MISC
141,##s,"[297, 381, 419, 401]",MISC
142,/,"[297, 381, 419, 401]",MISC
143,cost,"[297, 381, 419, 401]",MISC
144,and,"[419, 381, 448, 401]",MISC
145,all,"[450, 381, 479, 401]",MISC
146,other,"[481, 381, 532, 401]",MISC
147,top,"[532, 381, 561, 401]",MISC
148,-,"[562, 381, 564, 401]",MISC
149,NL,"[562, 381, 564, 401]",MISC
150,-,"[562, 381, 564, 401]",MISC
151,business,"[76, 398, 154, 418]",MISC
152,metric,"[154, 398, 233, 418]",MISC
153,##es,"[154, 398, 233, 418]",MISC
154,-,"[233, 398, 234, 418]",MISC
155,NL,"[233, 398, 234, 418]",MISC
156,-,"[233, 398, 234, 418]",MISC
157,•,"[61, 420, 71, 440]",MISC
158,Pre,"[72, 420, 165, 440]",MISC
159,##par,"[72, 420, 165, 440]",MISC
160,##ing,"[72, 420, 165, 440]",MISC
161,the,"[165, 420, 196, 440]",MISC
162,monthly,"[196, 420, 267, 440]",MISC
163,budget,"[269, 420, 340, 440]",MISC
164,##s,"[269, 420, 340, 440]",MISC
165,and,"[342, 420, 373, 440]",MISC
166,allocation,"[373, 420, 477, 440]",MISC
167,of,"[477, 420, 497, 440]",MISC
168,costs,"[498, 420, 549, 440]",MISC
169,-,"[550, 420, 551, 440]",MISC
170,NL,"[550, 420, 551, 440]",MISC
171,-,"[550, 420, 551, 440]",MISC
172,Senior,"[61, 460, 122, 480]",B-employer_role
173,Data,"[123, 460, 163, 480]",I-employer_role
174,Ana,"[163, 460, 243, 480]",I-employer_role
175,##ly,"[163, 460, 243, 480]",I-employer_role
176,##st,"[163, 460, 243, 480]",I-employer_role
177,",","[163, 460, 243, 480]",MISC
178,11,"[245, 460, 316, 480]",MISC
179,/,"[245, 460, 316, 480]",MISC
180,2016,"[245, 460, 316, 480]",MISC
181,to,"[316, 460, 336, 480]",MISC
182,10,"[336, 460, 407, 480]",MISC
183,/,"[336, 460, 407, 480]",MISC
184,2019,"[336, 460, 407, 480]",MISC
185,-,"[408, 460, 409, 480]",MISC
186,NL,"[408, 460, 409, 480]",MISC
187,-,"[408, 460, 409, 480]",MISC
188,Z,"[61, 477, 136, 497]",B-employer_company_name
189,##oma,"[61, 477, 136, 497]",I-employer_company_name
190,##to,"[61, 477, 136, 497]",I-employer_company_name
191,",","[61, 477, 136, 497]",MISC
192,Guru,"[137, 477, 233, 497]",MISC
193,##gram,"[137, 477, 233, 497]",MISC
194,",","[137, 477, 233, 497]",MISC
195,Haryana,"[234, 477, 308, 497]",MISC
196,-,"[309, 477, 311, 497]",MISC
197,NL,"[309, 477, 311, 497]",MISC
198,-,"[309, 477, 311, 497]",MISC
199,•,"[61, 495, 71, 515]",MISC
200,Direct,"[72, 495, 152, 515]",MISC
201,##ly,"[72, 495, 152, 515]",MISC
202,In,"[152, 495, 232, 515]",MISC
203,##volved,"[152, 495, 232, 515]",MISC
204,in,"[233, 495, 253, 515]",MISC
205,Pre,"[253, 495, 342, 515]",MISC
206,##par,"[253, 495, 342, 515]",MISC
207,##ing,"[253, 495, 342, 515]",MISC
208,the,"[344, 495, 373, 515]",MISC
209,P,"[374, 495, 403, 515]",MISC
210,&,"[374, 495, 403, 515]",MISC
211,L,"[374, 495, 403, 515]",MISC
212,for,"[404, 495, 433, 515]",MISC
213,the,"[435, 495, 464, 515]",MISC
214,entire,"[465, 495, 525, 515]",MISC
215,platform,"[525, 495, 606, 515]",MISC
216,-,"[606, 495, 608, 515]",MISC
217,NL,"[606, 495, 608, 515]",MISC
218,-,"[606, 495, 608, 515]",MISC
219,•,"[61, 512, 72, 532]",MISC
220,Revenue,"[73, 512, 149, 532]",MISC
221,analysis,"[150, 512, 238, 532]",MISC
222,and,"[239, 512, 272, 532]",MISC
223,Take,"[272, 512, 316, 532]",MISC
224,rate,"[316, 512, 360, 532]",MISC
225,analysis,"[361, 512, 448, 532]",MISC
226,on,"[449, 512, 471, 532]",MISC
227,monthly,"[472, 512, 548, 532]",MISC
228,and,"[549, 512, 582, 532]",MISC
229,-,"[582, 512, 584, 532]",MISC
230,NL,"[582, 512, 584, 532]",MISC
231,-,"[582, 512, 584, 532]",MISC
232,weekly,"[61, 530, 120, 550]",MISC
233,level,"[120, 530, 167, 550]",MISC
234,-,"[169, 530, 171, 550]",MISC
235,NL,"[169, 530, 171, 550]",MISC
236,-,"[169, 530, 171, 550]",MISC
237,•,"[61, 547, 71, 567]",MISC
238,Co,"[72, 547, 114, 567]",MISC
239,##st,"[72, 547, 114, 567]",MISC
240,per,"[115, 547, 146, 567]",MISC
241,order,"[147, 547, 200, 567]",MISC
242,analysis,"[200, 547, 295, 567]",MISC
243,",","[200, 547, 295, 567]",MISC
244,Logistics,"[296, 547, 391, 567]",MISC
245,cost,"[392, 547, 445, 567]",MISC
246,",","[392, 547, 445, 567]",MISC
247,Pro,"[445, 547, 498, 567]",MISC
248,##mo,"[445, 547, 498, 567]",MISC
249,burn,"[499, 547, 541, 567]",MISC
250,and,"[541, 547, 572, 567]",MISC
251,-,"[573, 547, 575, 567]",MISC
252,NL,"[573, 547, 575, 567]",MISC
253,-,"[573, 547, 575, 567]",MISC
254,Credits,"[61, 565, 129, 585]",MISC
255,analysis,"[130, 565, 206, 585]",MISC
256,with,"[207, 565, 246, 585]",MISC
257,their,"[246, 565, 294, 585]",MISC
258,trend,"[295, 565, 342, 585]",MISC
259,-,"[344, 565, 346, 585]",MISC
260,NL,"[344, 565, 346, 585]",MISC
261,-,"[344, 565, 346, 585]",MISC
262,•,"[61, 582, 71, 602]",MISC
263,Hold,"[72, 582, 123, 602]",MISC
264,##s,"[72, 582, 123, 602]",MISC
265,the,"[124, 582, 154, 602]",MISC
266,complete,"[155, 582, 237, 602]",MISC
267,responsibility,"[237, 582, 381, 602]",MISC
268,of,"[382, 582, 402, 602]",MISC
269,Pay,"[403, 582, 485, 602]",MISC
270,##ments,"[403, 582, 485, 602]",MISC
271,to,"[486, 582, 506, 602]",MISC
272,Partner,"[506, 582, 577, 602]",MISC
273,-,"[579, 582, 581, 602]",MISC
274,NL,"[579, 582, 581, 602]",MISC
275,-,"[579, 582, 581, 602]",MISC
276,Restaurant,"[61, 600, 173, 620]",MISC
277,##s,"[61, 600, 173, 620]",MISC
278,in,"[173, 600, 193, 620]",MISC
279,India,"[193, 600, 253, 620]",MISC
280,",","[193, 600, 253, 620]",MISC
281,UAE,"[254, 600, 294, 620]",MISC
282,",","[254, 600, 294, 620]",MISC
283,Beirut,"[295, 600, 355, 620]",MISC
284,and,"[356, 600, 385, 620]",MISC
285,Qatar,"[386, 600, 435, 620]",MISC
286,-,"[437, 600, 438, 620]",MISC
287,NL,"[437, 600, 438, 620]",MISC
288,-,"[437, 600, 438, 620]",MISC
289,•,"[61, 617, 72, 637]",MISC
290,En,"[73, 617, 140, 637]",MISC
291,##sure,"[73, 617, 140, 637]",MISC
292,the,"[142, 617, 174, 637]",MISC
293,in,"[176, 617, 243, 637]",MISC
294,##flow,"[176, 617, 243, 637]",MISC
295,of,"[245, 617, 267, 637]",MISC
296,funds,"[268, 617, 324, 637]",MISC
297,from,"[325, 617, 371, 637]",MISC
298,Pay,"[371, 617, 462, 637]",MISC
299,##ments,"[371, 617, 462, 637]",MISC
300,Gateway,"[463, 617, 554, 637]",MISC
301,##s,"[463, 617, 554, 637]",MISC
302,and,"[554, 617, 587, 637]",MISC
303,to,"[589, 617, 610, 637]",MISC
304,-,"[612, 617, 613, 637]",MISC
305,NL,"[612, 617, 613, 637]",MISC
306,-,"[612, 617, 613, 637]",MISC
307,check,"[61, 635, 114, 655]",MISC
308,and,"[115, 635, 146, 655]",MISC
309,fund,"[147, 635, 189, 655]",MISC
310,the,"[190, 635, 221, 655]",MISC
311,balance,"[222, 635, 297, 655]",MISC
312,amount,"[298, 635, 361, 655]",MISC
313,for,"[362, 635, 393, 655]",MISC
314,out,"[394, 635, 469, 655]",MISC
315,##flow,"[394, 635, 469, 655]",MISC
316,-,"[469, 635, 471, 655]",MISC
317,NL,"[469, 635, 471, 655]",MISC
318,-,"[469, 635, 471, 655]",MISC
319,•,"[61, 652, 71, 672]",MISC
320,Part,"[71, 652, 110, 672]",MISC
321,of,"[111, 652, 129, 672]",MISC
322,legal,"[130, 652, 180, 672]",MISC
323,and,"[180, 652, 209, 672]",MISC
324,compliance,"[209, 652, 307, 672]",MISC
325,Projects,"[308, 652, 386, 672]",MISC
326,like,"[386, 652, 425, 672]",MISC
327,preparing,"[426, 652, 513, 672]",MISC
328,all,"[514, 652, 543, 672]",MISC
329,the,"[544, 652, 573, 672]",MISC
330,-,"[573, 652, 575, 672]",MISC
331,NL,"[573, 652, 575, 672]",MISC
332,-,"[573, 652, 575, 672]",MISC
333,reports,"[61, 670, 136, 690]",MISC
334,related,"[137, 670, 212, 690]",MISC
335,to,"[213, 670, 233, 690]",MISC
336,F,"[235, 670, 287, 690]",MISC
337,##SS,"[235, 670, 287, 690]",MISC
338,##A,"[235, 670, 287, 690]",MISC
339,##I,"[235, 670, 287, 690]",MISC
340,Numbers,"[289, 670, 363, 690]",MISC
341,and,"[365, 670, 396, 690]",MISC
342,G,"[397, 670, 428, 690]",MISC
343,##ST,"[397, 670, 428, 690]",MISC
344,Numbers,"[430, 670, 515, 690]",MISC
345,",","[430, 670, 515, 690]",MISC
346,legal,"[516, 670, 569, 690]",MISC
347,Course,"[570, 670, 634, 690]",MISC
348,-,"[635, 670, 637, 690]",MISC
349,NL,"[635, 670, 637, 690]",MISC
350,-,"[635, 670, 637, 690]",MISC
351,of,"[61, 687, 80, 707]",MISC
352,action,"[81, 687, 146, 707]",MISC
353,",","[81, 687, 146, 707]",MISC
354,business,"[148, 687, 224, 707]",MISC
355,coverage,"[225, 687, 310, 707]",MISC
356,.,"[225, 687, 310, 707]",MISC
357,-,"[311, 687, 313, 707]",MISC
358,NL,"[311, 687, 313, 707]",MISC
359,-,"[311, 687, 313, 707]",MISC
360,•,"[61, 705, 71, 725]",MISC
361,Direct,"[72, 705, 152, 725]",MISC
362,##ly,"[72, 705, 152, 725]",MISC
363,involved,"[153, 705, 233, 725]",MISC
364,in,"[234, 705, 254, 725]",MISC
365,Internal,"[255, 705, 346, 725]",MISC
366,",","[255, 705, 346, 725]",MISC
367,External,"[346, 705, 426, 725]",MISC
368,and,"[428, 705, 457, 725]",MISC
369,Bank,"[458, 705, 498, 725]",MISC
370,audit,"[499, 705, 559, 725]",MISC
371,##s,"[499, 705, 559, 725]",MISC
372,with,"[560, 705, 600, 725]",MISC
373,-,"[601, 705, 602, 725]",MISC
374,NL,"[601, 705, 602, 725]",MISC
375,-,"[601, 705, 602, 725]",MISC
376,their,"[61, 722, 103, 742]",MISC
377,reconciliation,"[104, 722, 222, 742]",MISC
378,-,"[224, 722, 225, 742]",MISC
379,NL,"[224, 722, 225, 742]",MISC
380,-,"[224, 722, 225, 742]",MISC
381,•,"[61, 740, 71, 760]",MISC
382,Working,"[72, 740, 143, 760]",MISC
383,actively,"[144, 740, 226, 760]",MISC
384,with,"[226, 740, 266, 760]",MISC
385,Tech,"[267, 740, 307, 760]",MISC
386,team,"[308, 740, 348, 760]",MISC
387,for,"[349, 740, 378, 760]",MISC
388,Bill,"[380, 740, 451, 760]",MISC
389,##ing,"[380, 740, 451, 760]",MISC
390,server,"[452, 740, 512, 760]",MISC
391,integration,"[513, 740, 626, 760]",MISC
392,-,"[626, 740, 628, 760]",MISC
393,NL,"[626, 740, 628, 760]",MISC
394,-,"[626, 740, 628, 760]",MISC
395,with,"[61, 757, 103, 777]",MISC
396,tied,"[104, 757, 146, 777]",MISC
397,up,"[146, 757, 166, 777]",MISC
398,bank,"[167, 757, 209, 777]",MISC
399,–,"[209, 757, 219, 777]",MISC
400,Finding,"[220, 757, 293, 777]",MISC
401,and,"[294, 757, 325, 777]",MISC
402,correct,"[326, 757, 431, 777]",MISC
403,##ing,"[326, 757, 431, 777]",MISC
404,the,"[431, 757, 462, 777]",MISC
405,bugs,"[463, 757, 505, 777]",MISC
406,and,"[505, 757, 536, 777]",MISC
407,proper,"[537, 757, 599, 777]",MISC
408,-,"[601, 757, 602, 777]",MISC
409,NL,"[601, 757, 602, 777]",MISC
410,-,"[601, 757, 602, 777]",MISC
411,allocation,"[61, 775, 163, 795]",MISC
412,of,"[165, 775, 185, 795]",MISC
413,amount,"[186, 775, 248, 795]",MISC
414,got,"[248, 775, 279, 795]",MISC
415,affected,"[279, 775, 361, 795]",MISC
416,due,"[362, 775, 393, 795]",MISC
417,to,"[393, 775, 413, 795]",MISC
418,bugs,"[413, 775, 454, 795]",MISC
419,-,"[455, 775, 457, 795]",MISC
420,NL,"[455, 775, 457, 795]",MISC
421,-,"[455, 775, 457, 795]",MISC
422,•,"[61, 792, 71, 812]",MISC
423,Pre,"[72, 792, 165, 812]",MISC
424,##par,"[72, 792, 165, 812]",MISC
425,##ing,"[72, 792, 165, 812]",MISC
426,Rate,"[165, 792, 205, 812]",MISC
427,cards,"[206, 792, 257, 812]",MISC
428,&,"[258, 792, 267, 812]",MISC
429,Special,"[268, 792, 339, 812]",MISC
430,Inc,"[340, 792, 442, 812]",MISC
431,##ent,"[340, 792, 442, 812]",MISC
432,##ives,"[340, 792, 442, 812]",MISC
433,of,"[443, 792, 463, 812]",MISC
434,Riders,"[464, 792, 526, 812]",MISC
435,of,"[526, 792, 546, 812]",MISC
436,various,"[547, 792, 618, 812]",MISC
437,-,"[619, 792, 621, 812]",MISC
438,NL,"[619, 792, 621, 812]",MISC
439,-,"[619, 792, 621, 812]",MISC
440,cities,"[61, 810, 107, 830]",MISC
441,-,"[107, 810, 109, 830]",MISC
442,NL,"[107, 810, 109, 830]",MISC
443,-,"[107, 810, 109, 830]",MISC
444,•,"[61, 827, 72, 847]",MISC
445,Re,"[72, 827, 193, 847]",MISC
446,##sponsible,"[72, 827, 193, 847]",MISC
447,for,"[193, 827, 226, 847]",MISC
448,the,"[226, 827, 259, 847]",MISC
449,Pay,"[259, 827, 335, 847]",MISC
450,##ment,"[259, 827, 335, 847]",MISC
451,In,"[336, 827, 434, 847]",MISC
452,##vo,"[336, 827, 434, 847]",MISC
453,##ices,"[336, 827, 434, 847]",MISC
454,",","[336, 827, 434, 847]",MISC
455,U,"[434, 827, 467, 847]",MISC
456,##TR,"[434, 827, 467, 847]",MISC
457,Numbers,"[467, 827, 555, 847]",MISC
458,",","[467, 827, 555, 847]",MISC
459,G,"[555, 827, 588, 847]",MISC
460,##ST,"[555, 827, 588, 847]",MISC
461,-,"[588, 827, 590, 847]",MISC
462,NL,"[588, 827, 590, 847]",MISC
463,-,"[588, 827, 590, 847]",MISC
464,related,"[61, 845, 125, 865]",MISC
465,issue,"[126, 845, 172, 865]",MISC
466,-,"[173, 845, 174, 865]",MISC
467,NL,"[173, 845, 174, 865]",MISC
468,-,"[173, 845, 174, 865]",MISC
469,•,"[61, 862, 71, 881]",MISC
470,Strong,"[72, 862, 134, 881]",MISC
471,hands,"[134, 862, 185, 881]",MISC
472,on,"[187, 862, 207, 881]",MISC
473,Fr,"[207, 862, 258, 881]",MISC
474,##aud,"[207, 862, 258, 881]",MISC
475,checks,"[259, 862, 321, 881]",MISC
476,and,"[322, 862, 353, 881]",MISC
477,its,"[353, 862, 384, 881]",MISC
478,identification,"[385, 862, 530, 881]",MISC
479,at,"[530, 862, 551, 881]",MISC
480,various,"[551, 862, 624, 881]",MISC
481,-,"[624, 862, 626, 881]",MISC
482,NL,"[624, 862, 626, 881]",MISC
483,-,"[624, 862, 626, 881]",MISC
484,levels,"[61, 880, 120, 898]",MISC
485,like,"[120, 880, 158, 898]",MISC
486,-,"[159, 880, 168, 898]",MISC
487,Use,"[169, 880, 207, 898]",MISC
488,##r,"[169, 880, 207, 898]",MISC
489,level,"[208, 880, 266, 898]",MISC
490,",","[208, 880, 266, 898]",MISC
491,Restaurant,"[266, 880, 363, 898]",MISC
492,level,"[364, 880, 422, 898]",MISC
493,",","[364, 880, 422, 898]",MISC
494,Rider,"[422, 880, 470, 898]",MISC
495,level,"[471, 880, 529, 898]",MISC
496,.,"[471, 880, 529, 898]",MISC
497,-,"[530, 880, 531, 898]",MISC
498,NL,"[530, 880, 531, 898]",MISC
499,-,"[530, 880, 531, 898]",MISC
500,E,"[61, 925, 211, 952]",B-education_heading
501,##D,"[61, 925, 211, 952]",I-education_heading
502,##UC,"[61, 925, 211, 952]",I-education_heading
503,##AT,"[61, 925, 211, 952]",I-education_heading
504,##ION,"[61, 925, 211, 952]",I-education_heading
505,-,"[211, 925, 213, 952]",MISC
506,NL,"[211, 925, 213, 952]",MISC
507,-,"[211, 925, 213, 952]",MISC
508,B,"[61, 963, 112, 982]",B-education_degree
509,.,"[61, 963, 112, 982]",I-education_degree
510,Co,"[61, 963, 112, 982]",I-education_degree
511,##m,"[61, 963, 112, 982]",I-education_degree
512,(,"[114, 963, 187, 982]",MISC
513,Hon,"[114, 963, 187, 982]",MISC
514,##s,"[114, 963, 187, 982]",MISC
515,),"[114, 963, 187, 982]",MISC
516,",","[114, 963, 187, 982]",MISC
517,Accounting,"[188, 963, 292, 982]",B-education_course
518,And,"[293, 963, 324, 982]",I-education_course
519,Finance,"[325, 963, 409, 982]",I-education_course
520,",","[325, 963, 409, 982]",MISC
521,2016,"[409, 963, 451, 982]",MISC
522,-,"[451, 963, 453, 982]",MISC
523,NL,"[451, 963, 453, 982]",MISC
524,-,"[451, 963, 453, 982]",MISC
525,R,"[61, 981, 102, 1000]",B-education_institute
526,##D,"[61, 981, 102, 1000]",I-education_institute
527,##V,"[61, 981, 102, 1000]",I-education_institute
528,##V,"[61, 981, 102, 1000]",I-education_institute
529,University,"[102, 981, 202, 1000]",I-education_institute
530,-,"[203, 981, 212, 1000]",MISC
531,J,"[213, 981, 294, 1000]",MISC
532,##aba,"[213, 981, 294, 1000]",MISC
533,##l,"[213, 981, 294, 1000]",MISC
534,##pur,"[213, 981, 294, 1000]",MISC
535,-,"[295, 981, 296, 1000]",MISC
536,NL,"[295, 981, 296, 1000]",MISC
537,-,"[295, 981, 296, 1000]",MISC
538,Ad,"[710, 48, 775, 68]",MISC
539,##dress,"[710, 48, 775, 68]",MISC
540,:,"[776, 48, 786, 68]",MISC
541,C,"[786, 48, 833, 68]",MISC
542,-,"[786, 48, 833, 68]",MISC
543,29,"[786, 48, 833, 68]",MISC
544,",","[786, 48, 833, 68]",MISC
545,Ken,"[834, 48, 908, 68]",MISC
546,##dr,"[834, 48, 908, 68]",MISC
547,##iya,"[834, 48, 908, 68]",MISC
548,V,"[910, 48, 966, 68]",MISC
549,##ih,"[910, 48, 966, 68]",MISC
550,##ar,"[910, 48, 966, 68]",MISC
551,",","[910, 48, 966, 68]",MISC
552,-,"[967, 48, 969, 68]",MISC
553,NL,"[967, 48, 969, 68]",MISC
554,-,"[967, 48, 969, 68]",MISC
555,Guru,"[710, 66, 805, 86]",MISC
556,##gram,"[710, 66, 805, 86]",MISC
557,",","[710, 66, 805, 86]",MISC
558,Haryana,"[805, 66, 878, 86]",MISC
559,122,"[879, 66, 941, 86]",MISC
560,##00,"[879, 66, 941, 86]",MISC
561,##2,"[879, 66, 941, 86]",MISC
562,-,"[943, 66, 945, 86]",MISC
563,NL,"[943, 66, 945, 86]",MISC
564,-,"[943, 66, 945, 86]",MISC
565,Phone,"[710, 90, 768, 110]",MISC
566,:,"[769, 90, 779, 110]",MISC
567,82,"[769, 90, 779, 110]",B-phones_phone
568,##8,"[769, 90, 779, 110]",I-phones_phone
569,78,"[780, 90, 815, 110]",I-phones_phone
570,##4,"[780, 90, 815, 110]",I-phones_phone
571,41,"[815, 90, 850, 110]",I-phones_phone
572,##9,"[815, 90, 850, 110]",I-phones_phone
573,##8,"[815, 90, 850, 110]",I-phones_phone
574,-,"[897, 90, 899, 110]",MISC
575,NL,"[897, 90, 899, 110]",MISC
576,-,"[897, 90, 899, 110]",MISC
577,Em,"[710, 113, 761, 133]",MISC
578,##ail,"[710, 113, 761, 133]",MISC
579,:,"[761, 113, 770, 133]",MISC
580,an,"[771, 113, 995, 133]",B-emails_email
581,##nu,"[771, 113, 995, 133]",I-emails_email
582,.,"[771, 113, 995, 133]",I-emails_email
583,dub,"[771, 113, 995, 133]",I-emails_email
584,##ey,"[771, 113, 995, 133]",I-emails_email
585,##9,"[771, 113, 995, 133]",I-emails_email
586,##5,"[771, 113, 995, 133]",I-emails_email
587,@,"[771, 113, 995, 133]",I-emails_email
588,g,"[771, 113, 995, 133]",I-emails_email
589,##mail,"[771, 113, 995, 133]",I-emails_email
590,.,"[771, 113, 995, 133]",I-emails_email
591,com,"[771, 113, 995, 133]",I-emails_email
592,-,"[996, 113, 998, 133]",MISC
593,NL,"[996, 113, 998, 133]",MISC
594,-,"[996, 113, 998, 133]",MISC
595,SK,"[710, 182, 799, 207]",B-skills_heading
596,##IL,"[710, 182, 799, 207]",I-skills_heading
597,##LS,"[710, 182, 799, 207]",I-skills_heading
598,-,"[799, 182, 801, 207]",MISC
599,NL,"[799, 182, 801, 207]",MISC
600,-,"[799, 182, 801, 207]",MISC
601,•,"[710, 217, 719, 237]",MISC
602,Financial,"[720, 217, 805, 237]",MISC
603,Report,"[806, 217, 892, 237]",MISC
604,##ing,"[806, 217, 892, 237]",MISC
605,&,"[893, 217, 902, 237]",MISC
606,Analysis,"[902, 217, 979, 237]",MISC
607,-,"[979, 217, 981, 237]",MISC
608,NL,"[979, 217, 981, 237]",MISC
609,-,"[979, 217, 981, 237]",MISC
610,•,"[710, 235, 719, 255]",MISC
611,Pre,"[720, 235, 813, 255]",MISC
612,##par,"[720, 235, 813, 255]",MISC
613,##ing,"[720, 235, 813, 255]",MISC
614,the,"[813, 235, 844, 255]",MISC
615,P,"[844, 235, 875, 255]",MISC
616,&,"[844, 235, 875, 255]",MISC
617,L,"[844, 235, 875, 255]",MISC
618,statement,"[875, 235, 968, 255]",MISC
619,of,"[968, 235, 988, 255]",MISC
620,-,"[989, 235, 990, 255]",MISC
621,NL,"[989, 235, 990, 255]",MISC
622,-,"[989, 235, 990, 255]",MISC
623,Platform,"[724, 252, 799, 272]",MISC
624,-,"[799, 252, 801, 272]",MISC
625,NL,"[799, 252, 801, 272]",MISC
626,-,"[799, 252, 801, 272]",MISC
627,•,"[710, 270, 717, 290]",MISC
628,Co,"[719, 270, 753, 290]",MISC
629,##st,"[719, 270, 753, 290]",MISC
630,allocation,"[755, 270, 844, 290]",MISC
631,logic,"[844, 270, 897, 290]",MISC
632,##s,"[844, 270, 897, 290]",MISC
633,-,"[897, 270, 899, 290]",MISC
634,NL,"[897, 270, 899, 290]",MISC
635,-,"[897, 270, 899, 290]",MISC
636,•,"[710, 287, 719, 307]",MISC
637,Making,"[720, 287, 884, 307]",MISC
638,/,"[720, 287, 884, 307]",MISC
639,Main,"[720, 287, 884, 307]",MISC
640,##tain,"[720, 287, 884, 307]",MISC
641,##g,"[720, 287, 884, 307]",MISC
642,dash,"[886, 287, 988, 307]",MISC
643,##boards,"[886, 287, 988, 307]",MISC
644,&,"[989, 287, 998, 307]",MISC
645,-,"[1000, 287, 1001, 307]",MISC
646,NL,"[1000, 287, 1001, 307]",MISC
647,-,"[1000, 287, 1001, 307]",MISC
648,spreads,"[724, 301, 845, 325]",MISC
649,##hee,"[724, 301, 845, 325]",MISC
650,##ts,"[724, 301, 845, 325]",MISC
651,views,"[846, 301, 895, 325]",MISC
652,to,"[896, 301, 916, 325]",MISC
653,keep,"[916, 301, 956, 325]",MISC
654,the,"[956, 301, 986, 325]",MISC
655,-,"[987, 301, 989, 325]",MISC
656,NL,"[987, 301, 989, 325]",MISC
657,-,"[987, 301, 989, 325]",MISC
658,daily,"[724, 318, 774, 342]",MISC
659,view,"[774, 318, 812, 342]",MISC
660,on,"[814, 318, 832, 342]",MISC
661,-,"[834, 318, 836, 342]",MISC
662,NL,"[834, 318, 836, 342]",MISC
663,-,"[834, 318, 836, 342]",MISC
664,•,"[710, 340, 719, 360]",MISC
665,Knowledge,"[720, 340, 815, 360]",MISC
666,of,"[815, 340, 835, 360]",MISC
667,A,"[836, 340, 951, 360]",MISC
668,##cco,"[836, 340, 951, 360]",MISC
669,##unta,"[836, 340, 951, 360]",MISC
670,##ncy,"[836, 340, 951, 360]",MISC
671,-,"[952, 340, 954, 360]",MISC
672,NL,"[952, 340, 954, 360]",MISC
673,-,"[952, 340, 954, 360]",MISC
674,•,"[710, 357, 719, 377]",MISC
675,ER,"[721, 357, 751, 377]",MISC
676,##P,"[721, 357, 751, 377]",MISC
677,Tall,"[752, 357, 805, 377]",MISC
678,##y,"[752, 357, 805, 377]",MISC
679,9,"[806, 357, 836, 377]",MISC
680,.,"[806, 357, 836, 377]",MISC
681,0,"[806, 357, 836, 377]",MISC
682,-,"[837, 357, 839, 377]",MISC
683,NL,"[837, 357, 839, 377]",MISC
684,-,"[837, 357, 839, 377]",MISC
685,•,"[710, 375, 721, 395]",MISC
686,MS,"[722, 375, 746, 395]",MISC
687,Ex,"[747, 375, 807, 395]",MISC
688,##cel,"[747, 375, 807, 395]",MISC
689,and,"[808, 375, 844, 395]",MISC
690,MS,"[844, 375, 868, 395]",MISC
691,Word,"[869, 375, 916, 395]",MISC
692,-,"[918, 375, 919, 395]",MISC
693,NL,"[918, 375, 919, 395]",MISC
694,-,"[918, 375, 919, 395]",MISC
695,•,"[710, 392, 721, 412]",MISC
696,S,"[722, 392, 759, 412]",MISC
697,##QL,"[722, 392, 759, 412]",MISC
698,-,"[759, 392, 761, 412]",MISC
699,NL,"[759, 392, 761, 412]",MISC
700,-,"[759, 392, 761, 412]",MISC
701,•,"[710, 410, 721, 430]",MISC
702,Pre,"[721, 410, 786, 430]",MISC
703,##sto,"[721, 410, 786, 430]",MISC
704,&,"[786, 410, 797, 430]",MISC
705,R,"[797, 410, 808, 430]",MISC
706,language,"[808, 410, 896, 430]",MISC
707,-,"[896, 410, 897, 430]",MISC
708,NL,"[896, 410, 897, 430]",MISC
709,-,"[896, 410, 897, 430]",MISC
710,•,"[61, 36, 72, 56]",MISC
711,Graduate,"[73, 36, 175, 56]",MISC
712,##d,"[73, 36, 175, 56]",MISC
713,with,"[175, 36, 219, 56]",MISC
714,69,"[220, 36, 253, 56]",MISC
715,%,"[220, 36, 253, 56]",MISC
716,-,"[255, 36, 256, 56]",MISC
717,NL,"[255, 36, 256, 56]",MISC
718,-,"[255, 36, 256, 56]",MISC
719,•,"[61, 53, 71, 73]",MISC
720,Major,"[72, 53, 147, 73]",MISC
721,##ed,"[72, 53, 147, 73]",MISC
722,in,"[147, 53, 167, 73]",MISC
723,A,"[169, 53, 254, 73]",MISC
724,##cco,"[169, 53, 254, 73]",MISC
725,##unts,"[169, 53, 254, 73]",MISC
726,and,"[255, 53, 286, 73]",MISC
727,Finance,"[287, 53, 362, 73]",MISC
728,-,"[362, 53, 364, 73]",MISC
729,NL,"[362, 53, 364, 73]",MISC
730,-,"[362, 53, 364, 73]",MISC
731,High,"[61, 90, 103, 110]",B-education_degree
732,School,"[104, 90, 166, 110]",I-education_degree
733,Diploma,"[167, 90, 251, 110]",I-education_degree
734,",","[167, 90, 251, 110]",MISC
735,2013,"[252, 90, 294, 110]",MISC
736,-,"[295, 90, 296, 110]",MISC
737,NL,"[295, 90, 296, 110]",MISC
738,-,"[295, 90, 296, 110]",MISC
739,G,"[61, 107, 102, 127]",B-education_institute
740,##GI,"[61, 107, 102, 127]",I-education_institute
741,##S,"[61, 107, 102, 127]",I-education_institute
742,-,"[102, 107, 111, 127]",MISC
743,J,"[112, 107, 192, 127]",MISC
744,##aba,"[112, 107, 192, 127]",MISC
745,##l,"[112, 107, 192, 127]",MISC
746,##pur,"[112, 107, 192, 127]",MISC
747,-,"[193, 107, 194, 127]",MISC
748,NL,"[193, 107, 194, 127]",MISC
749,-,"[193, 107, 194, 127]",MISC
750,•,"[61, 131, 72, 151]",MISC
751,Pass,"[72, 131, 138, 151]",MISC
752,##es,"[72, 131, 138, 151]",MISC
753,with,"[139, 131, 182, 151]",MISC
754,77,"[183, 131, 227, 151]",MISC
755,.,"[183, 131, 227, 151]",MISC
756,2,"[183, 131, 227, 151]",MISC
757,%,"[227, 131, 238, 151]",MISC
758,-,"[238, 131, 240, 151]",MISC
759,NL,"[238, 131, 240, 151]",MISC
760,-,"[238, 131, 240, 151]",MISC
761,•,"[61, 148, 72, 168]",MISC
762,Major,"[73, 148, 151, 168]",MISC
763,##ed,"[73, 148, 151, 168]",MISC
764,in,"[151, 148, 173, 168]",MISC
765,Commerce,"[174, 148, 263, 168]",MISC
766,-,"[264, 148, 265, 168]",MISC
767,NL,"[264, 148, 265, 168]",MISC
768,-,"[264, 148, 265, 168]",MISC
769,Senior,"[61, 185, 122, 205]",B-education_degree
770,Secondary,"[123, 185, 214, 205]",I-education_degree
771,School,"[215, 185, 286, 205]",I-education_degree
772,",","[215, 185, 286, 205]",MISC
773,2011,"[286, 185, 327, 205]",MISC
774,-,"[327, 185, 329, 205]",MISC
775,NL,"[327, 185, 329, 205]",MISC
776,-,"[327, 185, 329, 205]",MISC
777,G,"[61, 202, 102, 222]",B-education_institute
778,##GI,"[61, 202, 102, 222]",I-education_institute
779,##S,"[61, 202, 102, 222]",I-education_institute
780,-,"[102, 202, 111, 222]",MISC
781,J,"[112, 202, 192, 222]",MISC
782,##aba,"[112, 202, 192, 222]",MISC
783,##l,"[112, 202, 192, 222]",MISC
784,##pur,"[112, 202, 192, 222]",MISC
785,-,"[193, 202, 194, 222]",MISC
786,NL,"[193, 202, 194, 222]",MISC
787,-,"[193, 202, 194, 222]",MISC
788,•,"[61, 226, 72, 246]",MISC
789,6,"[73, 226, 108, 246]",MISC
790,.,"[73, 226, 108, 246]",MISC
791,8,"[73, 226, 108, 246]",MISC
792,C,"[110, 226, 157, 246]",MISC
793,##GP,"[110, 226, 157, 246]",MISC
794,##A,"[110, 226, 157, 246]",MISC
795,-,"[158, 226, 160, 246]",MISC
796,NL,"[158, 226, 160, 246]",MISC
797,-,"[158, 226, 160, 246]",MISC
798,IN,"[61, 271, 205, 300]",B-skills_heading
799,##TE,"[61, 271, 205, 300]",I-skills_heading
800,##RE,"[61, 271, 205, 300]",I-skills_heading
801,##ST,"[61, 271, 205, 300]",I-skills_heading
802,##S,"[61, 271, 205, 300]",I-skills_heading
803,-,"[205, 271, 207, 300]",MISC
804,NL,"[205, 271, 207, 300]",MISC
805,-,"[205, 271, 207, 300]",MISC
806,•,"[61, 310, 71, 330]",MISC
807,Travel,"[72, 310, 174, 330]",MISC
808,##ling,"[72, 310, 174, 330]",MISC
809,•,"[174, 310, 183, 330]",MISC
810,Listen,"[184, 310, 275, 330]",MISC
811,##ing,"[184, 310, 275, 330]",MISC
812,to,"[276, 310, 296, 330]",MISC
813,music,"[296, 310, 347, 330]",MISC
814,&,"[347, 310, 356, 330]",MISC
815,watching,"[357, 310, 438, 330]",MISC
816,movies,"[439, 310, 510, 330]",MISC
817,.,"[439, 310, 510, 330]",MISC
818,•,"[511, 310, 520, 330]",MISC
819,S,"[521, 310, 601, 330]",MISC
820,##pen,"[521, 310, 601, 330]",MISC
821,##ding,"[521, 310, 601, 330]",MISC
822,-,"[602, 310, 604, 330]",MISC
823,NL,"[602, 310, 604, 330]",MISC
824,-,"[602, 310, 604, 330]",MISC
825,times,"[61, 327, 112, 347]",MISC
826,with,"[113, 327, 153, 347]",MISC
827,friends,"[154, 327, 225, 347]",MISC
828,•,"[226, 327, 235, 347]",MISC
829,Watching,"[236, 327, 318, 347]",MISC
830,TV,"[318, 327, 338, 347]",MISC
831,series,"[339, 327, 399, 347]",MISC
832,-,"[400, 327, 402, 347]",MISC
833,NL,"[400, 327, 402, 347]",MISC
834,-,"[400, 327, 402, 347]",MISC
