,token,box,label
0,Man,"[148, 100, 229, 119]",B-name
1,##o,"[148, 100, 229, 119]",I-name
2,##j,"[148, 100, 229, 119]",I-name
3,Sen,"[230, 100, 278, 119]",I-name
4,-,"[279, 100, 281, 119]",MISC
5,NL,"[279, 100, 281, 119]",MISC
6,-,"[279, 100, 281, 119]",MISC
7,:,"[600, 100, 672, 119]",MISC
8,m,"[673, 100, 993, 119]",B-emails_email
9,##sman,"[673, 100, 993, 119]",I-emails_email
10,##o,"[673, 100, 993, 119]",I-emails_email
11,##j,"[673, 100, 993, 119]",I-emails_email
12,##sen,"[673, 100, 993, 119]",I-emails_email
13,##9,"[673, 100, 993, 119]",I-emails_email
14,##1,"[673, 100, 993, 119]",I-emails_email
15,@,"[673, 100, 993, 119]",I-emails_email
16,g,"[673, 100, 993, 119]",I-emails_email
17,##mail,"[673, 100, 993, 119]",I-emails_email
18,.,"[673, 100, 993, 119]",I-emails_email
19,com,"[673, 100, 993, 119]",I-emails_email
20,-,"[994, 100, 996, 119]",MISC
21,NL,"[994, 100, 996, 119]",MISC
22,-,"[994, 100, 996, 119]",MISC
23,:,"[600, 122, 670, 141]",MISC
24,+,"[671, 122, 869, 141]",MISC
25,91,"[671, 122, 869, 141]",MISC
26,-,"[671, 122, 869, 141]",MISC
27,93,"[671, 122, 869, 141]",B-phones_phone
28,##40,"[671, 122, 869, 141]",I-phones_phone
29,##30,"[671, 122, 869, 141]",I-phones_phone
30,##16,"[671, 122, 869, 141]",I-phones_phone
31,##6,"[671, 122, 869, 141]",I-phones_phone
32,##2,"[671, 122, 869, 141]",I-phones_phone
33,-,"[870, 122, 872, 141]",MISC
34,NL,"[870, 122, 872, 141]",MISC
35,-,"[870, 122, 872, 141]",MISC
36,O,"[133, 182, 246, 200]",B-summary_heading
37,##bject,"[133, 182, 246, 200]",I-summary_heading
38,##ive,"[133, 182, 246, 200]",I-summary_heading
39,:,"[133, 182, 246, 200]",I-summary_heading
40,-,"[246, 182, 248, 200]",MISC
41,NL,"[246, 182, 248, 200]",MISC
42,-,"[246, 182, 248, 200]",MISC
43,See,"[159, 211, 246, 229]",MISC
44,##king,"[159, 211, 246, 229]",MISC
45,a,"[247, 211, 259, 229]",MISC
46,challenging,"[260, 211, 399, 229]",MISC
47,career,"[400, 211, 475, 229]",MISC
48,in,"[476, 211, 500, 229]",MISC
49,the,"[501, 211, 538, 229]",MISC
50,area,"[539, 211, 589, 229]",MISC
51,of,"[590, 211, 614, 229]",MISC
52,software,"[615, 211, 715, 229]",MISC
53,development,"[716, 211, 855, 229]",MISC
54,where,"[856, 211, 919, 229]",MISC
55,I,"[919, 211, 930, 229]",MISC
56,can,"[932, 211, 969, 229]",MISC
57,-,"[970, 211, 972, 229]",MISC
58,NL,"[970, 211, 972, 229]",MISC
59,-,"[970, 211, 972, 229]",MISC
60,create,"[159, 229, 231, 247]",MISC
61,value,"[231, 229, 290, 247]",MISC
62,for,"[291, 229, 327, 247]",MISC
63,my,"[328, 229, 352, 247]",MISC
64,company,"[352, 229, 435, 247]",MISC
65,by,"[436, 229, 460, 247]",MISC
66,utilizing,"[460, 229, 568, 247]",MISC
67,technical,"[569, 229, 676, 247]",MISC
68,pro,"[678, 229, 833, 247]",MISC
69,##fic,"[678, 229, 833, 247]",MISC
70,##ien,"[678, 229, 833, 247]",MISC
71,##cies,"[678, 229, 833, 247]",MISC
72,and,"[834, 229, 870, 247]",MISC
73,growing,"[871, 229, 954, 247]",MISC
74,-,"[955, 229, 957, 247]",MISC
75,NL,"[955, 229, 957, 247]",MISC
76,-,"[955, 229, 957, 247]",MISC
77,along,"[159, 247, 222, 264]",MISC
78,with,"[222, 247, 272, 264]",MISC
79,company,"[272, 247, 372, 264]",MISC
80,.,"[272, 247, 372, 264]",MISC
81,-,"[374, 247, 375, 264]",MISC
82,NL,"[374, 247, 375, 264]",MISC
83,-,"[374, 247, 375, 264]",MISC
84,Experience,"[133, 283, 270, 301]",B-summary_heading
85,Su,"[271, 283, 380, 301]",I-summary_heading
86,##mma,"[271, 283, 380, 301]",I-summary_heading
87,##ry,"[271, 283, 380, 301]",I-summary_heading
88,:,"[271, 283, 380, 301]",I-summary_heading
89,-,"[381, 283, 383, 301]",MISC
90,NL,"[381, 283, 383, 301]",MISC
91,-,"[381, 283, 383, 301]",MISC
92,More,"[205, 329, 257, 343]",MISC
93,than,"[257, 329, 309, 343]",MISC
94,four,"[310, 329, 362, 343]",MISC
95,years,"[362, 329, 427, 343]",MISC
96,of,"[427, 329, 453, 343]",MISC
97,professional,"[453, 329, 609, 343]",MISC
98,experience,"[610, 329, 740, 343]",MISC
99,as,"[741, 329, 767, 343]",MISC
100,a,"[767, 329, 780, 343]",MISC
101,Java,"[780, 329, 897, 343]",MISC
102,/,"[780, 329, 897, 343]",MISC
103,J,"[780, 329, 897, 343]",MISC
104,##2,"[780, 329, 897, 343]",MISC
105,##EE,"[780, 329, 897, 343]",MISC
106,-,"[898, 329, 899, 343]",MISC
107,NL,"[898, 329, 899, 343]",MISC
108,-,"[898, 329, 899, 343]",MISC
109,developer,"[225, 346, 335, 363]",MISC
110,have,"[336, 346, 384, 363]",MISC
111,in,"[385, 346, 483, 363]",MISC
112,-,"[385, 346, 483, 363]",MISC
113,depth,"[385, 346, 483, 363]",MISC
114,knowledge,"[483, 346, 592, 363]",MISC
115,and,"[594, 346, 629, 363]",MISC
116,exposure,"[630, 346, 729, 363]",MISC
117,to,"[729, 346, 753, 363]",MISC
118,different,"[753, 346, 862, 363]",MISC
119,types,"[864, 346, 925, 363]",MISC
120,of,"[925, 346, 949, 363]",MISC
121,-,"[950, 346, 951, 363]",MISC
122,NL,"[950, 346, 951, 363]",MISC
123,-,"[950, 346, 951, 363]",MISC
124,applications,"[225, 365, 362, 383]",MISC
125,and,"[364, 365, 397, 383]",MISC
126,architecture,"[399, 365, 549, 383]",MISC
127,##s,"[399, 365, 549, 383]",MISC
128,which,"[549, 365, 606, 383]",MISC
129,include,"[607, 365, 687, 383]",MISC
130,web,"[688, 365, 791, 383]",MISC
131,-,"[688, 365, 791, 383]",MISC
132,based,"[688, 365, 791, 383]",MISC
133,client,"[792, 365, 942, 383]",MISC
134,-,"[792, 365, 942, 383]",MISC
135,server,"[792, 365, 942, 383]",MISC
136,-,"[942, 365, 944, 383]",MISC
137,NL,"[942, 365, 944, 383]",MISC
138,-,"[942, 365, 944, 383]",MISC
139,application,"[225, 386, 350, 404]",MISC
140,development,"[350, 386, 474, 404]",MISC
141,projects,"[474, 386, 574, 404]",MISC
142,.,"[474, 386, 574, 404]",MISC
143,-,"[575, 386, 577, 404]",MISC
144,NL,"[575, 386, 577, 404]",MISC
145,-,"[575, 386, 577, 404]",MISC
146,Having,"[205, 410, 283, 425]",MISC
147,Experience,"[283, 410, 413, 425]",MISC
148,to,"[414, 410, 439, 425]",MISC
149,developing,"[440, 410, 569, 425]",MISC
150,micro,"[570, 410, 635, 425]",MISC
151,services,"[635, 410, 739, 425]",MISC
152,using,"[739, 410, 804, 425]",MISC
153,spring,"[804, 410, 882, 425]",MISC
154,boot,"[883, 410, 947, 425]",MISC
155,.,"[883, 410, 947, 425]",MISC
156,-,"[948, 410, 950, 425]",MISC
157,NL,"[948, 410, 950, 425]",MISC
158,-,"[948, 410, 950, 425]",MISC
159,Good,"[205, 431, 257, 446]",MISC
160,knowledge,"[259, 431, 379, 446]",MISC
161,in,"[380, 431, 406, 446]",MISC
162,working,"[407, 431, 499, 446]",MISC
163,with,"[500, 431, 552, 446]",MISC
164,Collections,"[554, 431, 700, 446]",MISC
165,-,"[701, 431, 703, 446]",MISC
166,NL,"[701, 431, 703, 446]",MISC
167,-,"[701, 431, 703, 446]",MISC
168,API,"[225, 447, 264, 465]",MISC
169,and,"[265, 447, 304, 465]",MISC
170,O,"[304, 447, 356, 465]",MISC
171,##OP,"[304, 447, 356, 465]",MISC
172,##S,"[304, 447, 356, 465]",MISC
173,technologies,"[357, 447, 527, 465]",MISC
174,.,"[357, 447, 527, 465]",MISC
175,-,"[527, 447, 529, 465]",MISC
176,NL,"[527, 447, 529, 465]",MISC
177,-,"[527, 447, 529, 465]",MISC
178,Ex,"[205, 472, 350, 486]",MISC
179,##tensive,"[205, 472, 350, 486]",MISC
180,##ly,"[205, 472, 350, 486]",MISC
181,used,"[351, 472, 403, 486]",MISC
182,J,"[405, 472, 456, 486]",MISC
183,##2,"[405, 472, 456, 486]",MISC
184,##EE,"[405, 472, 456, 486]",MISC
185,Design,"[458, 472, 537, 486]",MISC
186,Pat,"[537, 472, 656, 486]",MISC
187,##tern,"[537, 472, 656, 486]",MISC
188,##s,"[537, 472, 656, 486]",MISC
189,.,"[537, 472, 656, 486]",MISC
190,-,"[657, 472, 659, 486]",MISC
191,NL,"[657, 472, 659, 486]",MISC
192,-,"[657, 472, 659, 486]",MISC
193,Experience,"[204, 493, 325, 507]",MISC
194,in,"[325, 493, 349, 507]",MISC
195,development,"[349, 493, 480, 507]",MISC
196,of,"[481, 493, 505, 507]",MISC
197,object,"[505, 493, 685, 507]",MISC
198,-,"[505, 493, 685, 507]",MISC
199,oriented,"[505, 493, 685, 507]",MISC
200,business,"[686, 493, 782, 507]",MISC
201,applications,"[782, 493, 926, 507]",MISC
202,using,"[926, 493, 986, 507]",MISC
203,-,"[987, 493, 988, 507]",MISC
204,NL,"[987, 493, 988, 507]",MISC
205,-,"[987, 493, 988, 507]",MISC
206,Java,"[225, 510, 290, 528]",MISC
207,",","[225, 510, 290, 528]",MISC
208,J,"[291, 510, 356, 528]",MISC
209,##D,"[291, 510, 356, 528]",MISC
210,##BC,"[291, 510, 356, 528]",MISC
211,",","[291, 510, 356, 528]",MISC
212,Ser,"[357, 510, 460, 528]",MISC
213,##v,"[357, 510, 460, 528]",MISC
214,##let,"[357, 510, 460, 528]",MISC
215,",","[357, 510, 460, 528]",MISC
216,J,"[462, 510, 514, 528]",MISC
217,##SP,"[462, 510, 514, 528]",MISC
218,",","[462, 510, 514, 528]",MISC
219,spring,"[514, 510, 592, 528]",MISC
220,and,"[593, 510, 632, 528]",MISC
221,Hi,"[632, 510, 762, 528]",MISC
222,##ber,"[632, 510, 762, 528]",MISC
223,##nate,"[632, 510, 762, 528]",MISC
224,",","[632, 510, 762, 528]",MISC
225,spring,"[764, 510, 841, 528]",MISC
226,boot,"[842, 510, 907, 528]",MISC
227,",","[842, 510, 907, 528]",MISC
228,JP,"[908, 510, 960, 528]",MISC
229,##A,"[908, 510, 960, 528]",MISC
230,",","[908, 510, 960, 528]",MISC
231,-,"[961, 510, 962, 528]",MISC
232,NL,"[961, 510, 962, 528]",MISC
233,-,"[961, 510, 962, 528]",MISC
234,J,"[225, 531, 281, 549]",MISC
235,##MS,"[225, 531, 281, 549]",MISC
236,",","[225, 531, 281, 549]",MISC
237,Apache,"[282, 531, 365, 549]",MISC
238,Came,"[367, 531, 450, 549]",MISC
239,##l,"[367, 531, 450, 549]",MISC
240,",","[367, 531, 450, 549]",MISC
241,Ra,"[451, 531, 522, 549]",MISC
242,##dis,"[451, 531, 522, 549]",MISC
243,C,"[522, 531, 605, 549]",MISC
244,##ache,"[522, 531, 605, 549]",MISC
245,",","[522, 531, 605, 549]",MISC
246,Trans,"[607, 531, 760, 549]",MISC
247,##action,"[607, 531, 760, 549]",MISC
248,Management,"[762, 531, 916, 549]",MISC
249,",","[762, 531, 916, 549]",MISC
250,Java,"[917, 531, 973, 549]",MISC
251,-,"[974, 531, 975, 549]",MISC
252,NL,"[974, 531, 975, 549]",MISC
253,-,"[974, 531, 975, 549]",MISC
254,Mail,"[225, 552, 283, 570]",MISC
255,.,"[225, 552, 283, 570]",MISC
256,-,"[283, 552, 285, 570]",MISC
257,NL,"[283, 552, 285, 570]",MISC
258,-,"[283, 552, 285, 570]",MISC
259,Having,"[206, 575, 287, 589]",MISC
260,Experience,"[288, 575, 425, 589]",MISC
261,in,"[426, 575, 452, 589]",MISC
262,Rest,"[453, 575, 548, 589]",MISC
263,##ful,"[453, 575, 548, 589]",MISC
264,and,"[549, 575, 590, 589]",MISC
265,soap,"[591, 575, 644, 589]",MISC
266,Web,"[646, 575, 686, 589]",MISC
267,Services,"[687, 575, 809, 589]",MISC
268,.,"[687, 575, 809, 589]",MISC
269,-,"[811, 575, 812, 589]",MISC
270,NL,"[811, 575, 812, 589]",MISC
271,-,"[811, 575, 812, 589]",MISC
272,Having,"[206, 596, 287, 610]",MISC
273,Experience,"[289, 596, 426, 610]",MISC
274,in,"[426, 596, 452, 610]",MISC
275,J,"[454, 596, 495, 610]",MISC
276,##MS,"[454, 596, 495, 610]",MISC
277,(,"[495, 596, 577, 610]",MISC
278,t,"[495, 596, 577, 610]",MISC
279,##ib,"[495, 596, 577, 610]",MISC
280,##co,"[495, 596, 577, 610]",MISC
281,em,"[578, 596, 619, 610]",MISC
282,##s,"[578, 596, 619, 610]",MISC
283,que,"[619, 596, 701, 610]",MISC
284,##ue,"[619, 596, 701, 610]",MISC
285,",","[619, 596, 701, 610]",MISC
286,topic,"[702, 596, 771, 610]",MISC
287,and,"[771, 596, 812, 610]",MISC
288,bridges,"[812, 596, 937, 610]",MISC
289,),"[812, 596, 937, 610]",MISC
290,.,"[812, 596, 937, 610]",MISC
291,-,"[937, 596, 938, 610]",MISC
292,NL,"[937, 596, 938, 610]",MISC
293,-,"[937, 596, 938, 610]",MISC
294,Experience,"[205, 617, 331, 631]",MISC
295,in,"[332, 617, 356, 631]",MISC
296,Oracle,"[357, 617, 433, 631]",MISC
297,databases,"[434, 617, 560, 631]",MISC
298,.,"[434, 617, 560, 631]",MISC
299,Experience,"[561, 617, 687, 631]",MISC
300,in,"[688, 617, 712, 631]",MISC
301,developing,"[714, 617, 840, 631]",MISC
302,S,"[841, 617, 878, 631]",MISC
303,##QL,"[841, 617, 878, 631]",MISC
304,que,"[879, 617, 968, 631]",MISC
305,##ries,"[879, 617, 968, 631]",MISC
306,-,"[968, 617, 970, 631]",MISC
307,NL,"[968, 617, 970, 631]",MISC
308,-,"[968, 617, 970, 631]",MISC
309,and,"[225, 634, 261, 652]",MISC
310,calling,"[261, 634, 343, 652]",MISC
311,Store,"[344, 634, 414, 652]",MISC
312,##d,"[344, 634, 414, 652]",MISC
313,Pro,"[415, 634, 545, 652]",MISC
314,##ced,"[415, 634, 545, 652]",MISC
315,##ures,"[415, 634, 545, 652]",MISC
316,.,"[415, 634, 545, 652]",MISC
317,-,"[546, 634, 548, 652]",MISC
318,NL,"[546, 634, 548, 652]",MISC
319,-,"[546, 634, 548, 652]",MISC
320,Experience,"[205, 657, 331, 673]",MISC
321,in,"[331, 657, 355, 673]",MISC
322,version,"[356, 657, 443, 673]",MISC
323,control,"[445, 657, 532, 673]",MISC
324,tools,"[533, 657, 596, 673]",MISC
325,like,"[596, 657, 646, 673]",MISC
326,G,"[647, 657, 697, 673]",MISC
327,##IT,"[647, 657, 697, 673]",MISC
328,",","[647, 657, 697, 673]",MISC
329,SV,"[697, 657, 747, 673]",MISC
330,##N,"[697, 657, 747, 673]",MISC
331,.,"[697, 657, 747, 673]",MISC
332,-,"[748, 657, 750, 673]",MISC
333,NL,"[748, 657, 750, 673]",MISC
334,-,"[748, 657, 750, 673]",MISC
335,Ex,"[205, 678, 316, 692]",MISC
336,##pert,"[205, 678, 316, 692]",MISC
337,##ise,"[205, 678, 316, 692]",MISC
338,in,"[316, 678, 340, 692]",MISC
339,various,"[341, 678, 426, 692]",MISC
340,framework,"[428, 678, 552, 692]",MISC
341,##s,"[428, 678, 552, 692]",MISC
342,and,"[552, 678, 589, 692]",MISC
343,quality,"[590, 678, 675, 692]",MISC
344,control,"[676, 678, 762, 692]",MISC
345,tools,"[763, 678, 825, 692]",MISC
346,for,"[826, 678, 863, 692]",MISC
347,Unit,"[863, 678, 911, 692]",MISC
348,-,"[912, 678, 914, 692]",MISC
349,NL,"[912, 678, 914, 692]",MISC
350,-,"[912, 678, 914, 692]",MISC
351,Test,"[225, 695, 277, 713]",MISC
352,and,"[279, 695, 318, 713]",MISC
353,Integration,"[319, 695, 466, 713]",MISC
354,Test,"[467, 695, 533, 713]",MISC
355,",","[467, 695, 533, 713]",MISC
356,for,"[534, 695, 573, 713]",MISC
357,example,"[574, 695, 667, 713]",MISC
358,Mo,"[668, 695, 773, 713]",MISC
359,##cki,"[668, 695, 773, 713]",MISC
360,##to,"[668, 695, 773, 713]",MISC
361,",","[668, 695, 773, 713]",MISC
362,J,"[775, 695, 855, 713]",MISC
363,##UN,"[775, 695, 855, 713]",MISC
364,##IT,"[775, 695, 855, 713]",MISC
365,",","[775, 695, 855, 713]",MISC
366,S,"[856, 695, 907, 713]",MISC
367,##OA,"[856, 695, 907, 713]",MISC
368,##P,"[856, 695, 907, 713]",MISC
369,U,"[909, 695, 948, 713]",MISC
370,##I,"[909, 695, 948, 713]",MISC
371,",","[909, 695, 948, 713]",MISC
372,-,"[950, 695, 951, 713]",MISC
373,NL,"[950, 695, 951, 713]",MISC
374,-,"[950, 695, 951, 713]",MISC
375,Son,"[225, 716, 361, 734]",MISC
376,##ar,"[225, 716, 361, 734]",MISC
377,##Q,"[225, 716, 361, 734]",MISC
378,##ube,"[225, 716, 361, 734]",MISC
379,",","[225, 716, 361, 734]",MISC
380,post,"[362, 716, 456, 734]",MISC
381,##man,"[362, 716, 456, 734]",MISC
382,and,"[457, 716, 551, 734]",MISC
383,##fish,"[457, 716, 551, 734]",MISC
384,eye,"[552, 716, 606, 734]",MISC
385,.,"[552, 716, 606, 734]",MISC
386,-,"[607, 716, 609, 734]",MISC
387,NL,"[607, 716, 609, 734]",MISC
388,-,"[607, 716, 609, 734]",MISC
389,Understanding,"[206, 741, 380, 755]",MISC
390,of,"[381, 741, 407, 755]",MISC
391,Software,"[408, 741, 515, 755]",MISC
392,Development,"[516, 741, 664, 755]",MISC
393,Life,"[664, 741, 718, 755]",MISC
394,Cycle,"[718, 741, 785, 755]",MISC
395,SD,"[785, 741, 852, 755]",MISC
396,##LC,"[785, 741, 852, 755]",MISC
397,.,"[785, 741, 852, 755]",MISC
398,F,"[853, 741, 960, 755]",MISC
399,##ami,"[853, 741, 960, 755]",MISC
400,##lia,"[853, 741, 960, 755]",MISC
401,##r,"[853, 741, 960, 755]",MISC
402,-,"[961, 741, 962, 755]",MISC
403,NL,"[961, 741, 962, 755]",MISC
404,-,"[961, 741, 962, 755]",MISC
405,with,"[225, 757, 279, 776]",MISC
406,A,"[279, 757, 346, 776]",MISC
407,##gi,"[279, 757, 346, 776]",MISC
408,##le,"[279, 757, 346, 776]",MISC
409,Development,"[346, 757, 508, 776]",MISC
410,",","[346, 757, 508, 776]",MISC
411,Test,"[508, 757, 654, 776]",MISC
412,-,"[508, 757, 654, 776]",MISC
413,Drive,"[508, 757, 654, 776]",MISC
414,##n,"[508, 757, 654, 776]",MISC
415,Development,"[656, 757, 802, 776]",MISC
416,and,"[804, 757, 843, 776]",MISC
417,Daily,"[844, 757, 911, 776]",MISC
418,Sc,"[911, 757, 991, 776]",MISC
419,##rum,"[911, 757, 991, 776]",MISC
420,.,"[911, 757, 991, 776]",MISC
421,-,"[992, 757, 994, 776]",MISC
422,NL,"[992, 757, 994, 776]",MISC
423,-,"[992, 757, 994, 776]",MISC
424,Experience,"[133, 834, 251, 852]",B-work_experience_heading
425,Profile,"[252, 834, 347, 852]",I-work_experience_heading
426,:,"[252, 834, 347, 852]",I-work_experience_heading
427,-,"[348, 834, 350, 852]",MISC
428,NL,"[348, 834, 350, 852]",MISC
429,-,"[348, 834, 350, 852]",MISC
430,Working,"[180, 867, 274, 881]",MISC
431,as,"[275, 867, 301, 881]",MISC
432,Programme,"[302, 867, 438, 881]",B-employer_role
433,##r,"[302, 867, 438, 881]",I-employer_role
434,Ana,"[439, 867, 533, 881]",I-employer_role
435,##ly,"[439, 867, 533, 881]",I-employer_role
436,##st,"[439, 867, 533, 881]",I-employer_role
437,in,"[534, 867, 560, 881]",MISC
438,Co,"[561, 867, 684, 881]",MISC
439,##gni,"[561, 867, 684, 881]",MISC
440,##zan,"[561, 867, 684, 881]",MISC
441,##t,"[561, 867, 684, 881]",MISC
442,Soft,"[684, 867, 819, 881]",MISC
443,##vision,"[684, 867, 819, 881]",MISC
444,Mysore,"[820, 867, 902, 881]",MISC
445,from,"[902, 867, 956, 881]",MISC
446,Apr,"[957, 867, 997, 881]",MISC
447,-,"[998, 867, 1000, 881]",MISC
448,NL,"[998, 867, 1000, 881]",MISC
449,-,"[998, 867, 1000, 881]",MISC
450,2018,"[200, 884, 244, 902]",MISC
451,to,"[245, 884, 267, 902]",MISC
452,till,"[268, 884, 312, 902]",MISC
453,date,"[313, 884, 369, 902]",MISC
454,.,"[313, 884, 369, 902]",MISC
455,-,"[370, 884, 372, 902]",MISC
456,NL,"[370, 884, 372, 902]",MISC
457,-,"[370, 884, 372, 902]",MISC
458,Work,"[181, 909, 272, 923]",MISC
459,##ed,"[181, 909, 272, 923]",MISC
460,as,"[272, 909, 302, 923]",MISC
461,Associate,"[303, 909, 438, 923]",B-employer_role
462,Consul,"[439, 909, 589, 923]",I-employer_role
463,##tant,"[439, 909, 589, 923]",I-employer_role
464,in,"[590, 909, 620, 923]",MISC
465,V,"[621, 909, 726, 923]",B-employer_company_name
466,##irt,"[621, 909, 726, 923]",I-employer_company_name
467,##usa,"[621, 909, 726, 923]",I-employer_company_name
468,Consul,"[727, 909, 877, 923]",I-employer_company_name
469,##ting,"[727, 909, 877, 923]",I-employer_company_name
470,Services,"[878, 909, 999, 923]",I-employer_company_name
471,-,"[1000, 909, 1001, 923]",MISC
472,NL,"[1000, 909, 1001, 923]",MISC
473,-,"[1000, 909, 1001, 923]",MISC
474,Bangalore,"[200, 926, 320, 944]",MISC
475,from,"[320, 926, 372, 944]",MISC
476,Nov,"[373, 926, 412, 944]",MISC
477,2016,"[414, 926, 465, 944]",MISC
478,to,"[467, 926, 493, 944]",MISC
479,Apr,"[494, 926, 614, 944]",MISC
480,-,"[494, 926, 614, 944]",MISC
481,2018,"[494, 926, 614, 944]",MISC
482,.,"[494, 926, 614, 944]",MISC
483,-,"[614, 926, 616, 944]",MISC
484,NL,"[614, 926, 616, 944]",MISC
485,-,"[614, 926, 616, 944]",MISC
486,Work,"[181, 949, 270, 963]",MISC
487,##ed,"[181, 949, 270, 963]",MISC
488,as,"[272, 949, 302, 963]",MISC
489,Software,"[302, 949, 423, 963]",B-employer_role
490,Engineer,"[423, 949, 544, 963]",I-employer_role
491,in,"[544, 949, 574, 963]",MISC
492,HC,"[574, 949, 619, 963]",B-employer_company_name
493,##L,"[574, 949, 619, 963]",I-employer_company_name
494,T,"[620, 949, 799, 963]",I-employer_company_name
495,##EC,"[620, 949, 799, 963]",I-employer_company_name
496,##H,"[620, 949, 799, 963]",I-employer_company_name
497,##N,"[620, 949, 799, 963]",I-employer_company_name
498,##OL,"[620, 949, 799, 963]",I-employer_company_name
499,##O,"[620, 949, 799, 963]",I-employer_company_name
500,##GI,"[620, 949, 799, 963]",I-employer_company_name
501,##ES,"[620, 949, 799, 963]",I-employer_company_name
502,Ltd,"[801, 949, 860, 963]",I-employer_company_name
503,",","[801, 949, 860, 963]",I-employer_company_name
504,Bangalore,"[862, 949, 997, 963]",MISC
505,-,"[998, 949, 1000, 963]",MISC
506,NL,"[998, 949, 1000, 963]",MISC
507,-,"[998, 949, 1000, 963]",MISC
508,from,"[200, 966, 253, 984]",MISC
509,June,"[254, 966, 307, 984]",MISC
510,2015,"[308, 966, 362, 984]",MISC
511,to,"[362, 966, 388, 984]",MISC
512,Nov,"[389, 966, 428, 984]",MISC
513,2016,"[430, 966, 497, 984]",MISC
514,.,"[430, 966, 497, 984]",MISC
515,-,"[498, 966, 500, 984]",MISC
516,NL,"[498, 966, 500, 984]",MISC
517,-,"[498, 966, 500, 984]",MISC
518,Work,"[181, 100, 268, 118]",MISC
519,##ed,"[181, 100, 268, 118]",MISC
520,as,"[268, 100, 296, 118]",MISC
521,Trans,"[297, 100, 457, 118]",B-employer_role
522,##action,"[297, 100, 457, 118]",I-employer_role
523,Process,"[458, 100, 588, 118]",I-employer_role
524,##or,"[458, 100, 588, 118]",I-employer_role
525,in,"[589, 100, 617, 118]",MISC
526,X,"[618, 100, 691, 118]",B-employer_company_name
527,##ero,"[618, 100, 691, 118]",I-employer_company_name
528,##x,"[618, 100, 691, 118]",I-employer_company_name
529,Business,"[691, 100, 808, 118]",I-employer_company_name
530,Services,"[808, 100, 925, 118]",I-employer_company_name
531,India,"[925, 100, 997, 118]",I-employer_company_name
532,-,"[998, 100, 1000, 118]",I-employer_company_name
533,NL,"[998, 100, 1000, 118]",I-employer_company_name
534,-,"[998, 100, 1000, 118]",I-employer_company_name
535,P,"[200, 119, 305, 137]",I-employer_company_name
536,##v,"[200, 119, 305, 137]",I-employer_company_name
537,##t,"[200, 119, 305, 137]",I-employer_company_name
538,.,"[200, 119, 305, 137]",I-employer_company_name
539,l,"[200, 119, 305, 137]",I-employer_company_name
540,##t,"[200, 119, 305, 137]",I-employer_company_name
541,##d,"[200, 119, 305, 137]",I-employer_company_name
542,",","[200, 119, 305, 137]",MISC
543,Indo,"[305, 119, 383, 137]",MISC
544,##re,"[305, 119, 383, 137]",MISC
545,from,"[385, 119, 437, 137]",MISC
546,Oct,"[438, 119, 476, 137]",MISC
547,2013,"[477, 119, 529, 137]",MISC
548,to,"[530, 119, 556, 137]",MISC
549,May,"[557, 119, 596, 137]",MISC
550,2015,"[596, 119, 661, 137]",MISC
551,.,"[596, 119, 661, 137]",MISC
552,-,"[662, 119, 664, 137]",MISC
553,NL,"[662, 119, 664, 137]",MISC
554,-,"[662, 119, 664, 137]",MISC
555,Academic,"[133, 201, 233, 219]",B-education_heading
556,Profile,"[233, 201, 333, 219]",I-education_heading
557,:,"[233, 201, 333, 219]",I-education_heading
558,-,"[333, 201, 335, 219]",MISC
559,NL,"[333, 201, 335, 219]",MISC
560,-,"[333, 201, 335, 219]",MISC
561,Bachelor,"[181, 255, 295, 269]",MISC
562,in,"[297, 255, 324, 269]",MISC
563,Computer,"[326, 255, 440, 269]",MISC
564,Application,"[441, 255, 601, 269]",MISC
565,(,"[601, 255, 673, 269]",MISC
566,BC,"[601, 255, 673, 269]",B-education_degree
567,##A,"[601, 255, 673, 269]",I-education_degree
568,),"[601, 255, 673, 269]",MISC
569,in,"[673, 255, 701, 269]",MISC
570,2011,"[702, 255, 760, 269]",MISC
571,from,"[760, 255, 818, 269]",MISC
572,MC,"[818, 255, 890, 269]",B-education_institute
573,##RP,"[818, 255, 890, 269]",I-education_institute
574,##V,"[818, 255, 890, 269]",I-education_institute
575,B,"[891, 255, 991, 269]",I-education_institute
576,##hop,"[891, 255, 991, 269]",I-education_institute
577,##al,"[891, 255, 991, 269]",I-education_institute
578,.,"[891, 255, 991, 269]",MISC
579,-,"[992, 255, 994, 269]",MISC
580,NL,"[992, 255, 994, 269]",MISC
581,-,"[992, 255, 994, 269]",MISC
582,Technical,"[133, 311, 238, 329]",MISC
583,Profile,"[239, 311, 331, 329]",MISC
584,:,"[239, 311, 331, 329]",MISC
585,-,"[333, 311, 335, 329]",MISC
586,NL,"[333, 311, 335, 329]",MISC
587,-,"[333, 311, 335, 329]",MISC
588,SK,"[216, 342, 327, 360]",MISC
589,##IL,"[216, 342, 327, 360]",MISC
590,##L,"[216, 342, 327, 360]",MISC
591,-,"[328, 342, 351, 360]",MISC
592,E,"[351, 342, 597, 360]",MISC
593,##X,"[351, 342, 597, 360]",MISC
594,##P,"[351, 342, 597, 360]",MISC
595,##ER,"[351, 342, 597, 360]",MISC
596,##IE,"[351, 342, 597, 360]",MISC
597,##NC,"[351, 342, 597, 360]",MISC
598,##ED,"[351, 342, 597, 360]",MISC
599,-,"[597, 342, 620, 360]",MISC
600,A,"[620, 342, 822, 360]",MISC
601,##WA,"[620, 342, 822, 360]",MISC
602,##RE,"[620, 342, 822, 360]",MISC
603,##NE,"[620, 342, 822, 360]",MISC
604,##SS,"[620, 342, 822, 360]",MISC
605,-,"[822, 342, 824, 360]",MISC
606,NL,"[822, 342, 824, 360]",MISC
607,-,"[822, 342, 824, 360]",MISC
608,Languages,"[159, 381, 388, 399]",MISC
609,-,"[390, 381, 414, 399]",MISC
610,J,"[416, 381, 517, 399]",MISC
611,##AV,"[416, 381, 517, 399]",MISC
612,##A,"[416, 381, 517, 399]",MISC
613,8,"[518, 381, 594, 399]",MISC
614,.,"[518, 381, 594, 399]",MISC
615,0,"[518, 381, 594, 399]",MISC
616,-,"[595, 381, 619, 399]",MISC
617,C,"[621, 381, 671, 399]",MISC
618,",","[621, 381, 671, 399]",MISC
619,C,"[672, 381, 748, 399]",MISC
620,+,"[672, 381, 748, 399]",MISC
621,+,"[672, 381, 748, 399]",MISC
622,-,"[750, 381, 751, 399]",MISC
623,NL,"[750, 381, 751, 399]",MISC
624,-,"[750, 381, 751, 399]",MISC
625,Operating,"[151, 415, 203, 506]",MISC
626,Systems,"[205, 415, 246, 506]",MISC
627,Web,"[246, 415, 263, 506]",MISC
628,Technologies,"[264, 415, 335, 506]",MISC
629,Database,"[335, 415, 382, 506]",MISC
630,Software,"[383, 415, 442, 506]",MISC
631,’,"[383, 415, 442, 506]",MISC
632,s,"[383, 415, 442, 506]",MISC
633,-,"[442, 415, 448, 506]",MISC
634,Windows,"[448, 415, 489, 506]",MISC
635,H,"[490, 415, 519, 506]",MISC
636,##t,"[490, 415, 519, 506]",MISC
637,##m,"[490, 415, 519, 506]",MISC
638,##l,"[490, 415, 519, 506]",MISC
639,",","[490, 415, 519, 506]",MISC
640,Java,"[520, 415, 579, 506]",MISC
641,##Script,"[520, 415, 579, 506]",MISC
642,Oracle,"[579, 415, 614, 506]",MISC
643,11,"[615, 415, 655, 506]",MISC
644,##g,"[615, 415, 655, 506]",MISC
645,/,"[615, 415, 655, 506]",MISC
646,10,"[615, 415, 655, 506]",MISC
647,##g,"[615, 415, 655, 506]",MISC
648,-,"[656, 415, 662, 506]",MISC
649,Linux,"[662, 415, 697, 506]",MISC
650,",","[662, 415, 697, 506]",MISC
651,Unix,"[698, 415, 720, 506]",MISC
652,Ajax,"[721, 415, 751, 506]",MISC
653,",","[721, 415, 751, 506]",MISC
654,CS,"[751, 415, 768, 506]",MISC
655,##S,"[751, 415, 768, 506]",MISC
656,",","[769, 415, 775, 506]",MISC
657,XML,"[775, 415, 792, 506]",MISC
658,My,"[793, 415, 822, 506]",MISC
659,##S,"[793, 415, 822, 506]",MISC
660,##QL,"[793, 415, 822, 506]",MISC
661,5,"[822, 415, 839, 506]",MISC
662,.,"[822, 415, 839, 506]",MISC
663,0,"[822, 415, 839, 506]",MISC
664,-,"[840, 415, 842, 506]",MISC
665,NL,"[840, 415, 842, 506]",MISC
666,-,"[840, 415, 842, 506]",MISC
667,J,"[151, 525, 172, 579]",MISC
668,##SE,"[151, 525, 172, 579]",MISC
669,Technologies,"[172, 525, 253, 579]",MISC
670,J,"[255, 525, 275, 579]",MISC
671,##EE,"[255, 525, 275, 579]",MISC
672,Technologies,"[275, 525, 357, 579]",MISC
673,Server,"[358, 525, 406, 579]",MISC
674,##s,"[358, 525, 406, 579]",MISC
675,-,"[406, 525, 412, 579]",MISC
676,J,"[413, 525, 446, 579]",MISC
677,##ND,"[413, 525, 446, 579]",MISC
678,##I,"[413, 525, 446, 579]",MISC
679,",","[413, 525, 446, 579]",MISC
680,J,"[448, 525, 473, 579]",MISC
681,##D,"[448, 525, 473, 579]",MISC
682,##BC,"[448, 525, 473, 579]",MISC
683,Ser,"[475, 525, 529, 579]",MISC
684,##v,"[475, 525, 529, 579]",MISC
685,##let,"[475, 525, 529, 579]",MISC
686,",","[475, 525, 529, 579]",MISC
687,J,"[530, 525, 551, 579]",MISC
688,##SP,"[530, 525, 551, 579]",MISC
689,Web,"[551, 525, 605, 579]",MISC
690,##L,"[551, 525, 605, 579]",MISC
691,##og,"[551, 525, 605, 579]",MISC
692,##ic,"[551, 525, 605, 579]",MISC
693,",","[606, 525, 660, 579]",MISC
694,Tom,"[606, 525, 660, 579]",MISC
695,##cat,"[606, 525, 660, 579]",MISC
696,",","[606, 525, 660, 579]",MISC
697,boss,"[661, 525, 687, 579]",MISC
698,-,"[689, 525, 694, 579]",MISC
699,R,"[695, 525, 716, 579]",MISC
700,##MI,"[695, 525, 716, 579]",MISC
701,E,"[716, 525, 736, 579]",MISC
702,##J,"[716, 525, 736, 579]",MISC
703,##B,"[716, 525, 736, 579]",MISC
704,",","[737, 525, 763, 579]",MISC
705,J,"[737, 525, 763, 579]",MISC
706,##MS,"[737, 525, 763, 579]",MISC
707,-,"[764, 525, 766, 579]",MISC
708,NL,"[764, 525, 766, 579]",MISC
709,-,"[764, 525, 766, 579]",MISC
710,Framework,"[151, 636, 318, 655]",MISC
711,##s,"[151, 636, 318, 655]",MISC
712,-,"[318, 636, 335, 655]",MISC
713,Spring,"[335, 636, 451, 655]",MISC
714,",","[335, 636, 451, 655]",MISC
715,Spring,"[451, 636, 551, 655]",MISC
716,boot,"[551, 636, 618, 655]",MISC
717,-,"[618, 636, 635, 655]",MISC
718,St,"[635, 636, 735, 655]",MISC
719,##ru,"[635, 636, 735, 655]",MISC
720,##ts,"[635, 636, 735, 655]",MISC
721,-,"[735, 636, 737, 655]",MISC
722,NL,"[735, 636, 737, 655]",MISC
723,-,"[735, 636, 737, 655]",MISC
724,Lo,"[151, 742, 307, 760]",MISC
725,##gging,"[151, 742, 307, 760]",MISC
726,Too,"[308, 742, 397, 760]",MISC
727,##l,"[308, 742, 397, 760]",MISC
728,-,"[398, 742, 420, 760]",MISC
729,Lo,"[420, 742, 532, 760]",MISC
730,##g,"[420, 742, 532, 760]",MISC
731,##4,"[420, 742, 532, 760]",MISC
732,##J,"[420, 742, 532, 760]",MISC
733,-,"[533, 742, 555, 760]",MISC
734,As,"[555, 742, 779, 760]",MISC
735,##ser,"[555, 742, 779, 760]",MISC
736,##tions,"[555, 742, 779, 760]",MISC
737,-,"[779, 742, 781, 760]",MISC
738,NL,"[779, 742, 781, 760]",MISC
739,-,"[779, 742, 781, 760]",MISC
740,B,"[151, 776, 285, 794]",MISC
741,##uild,"[151, 776, 285, 794]",MISC
742,Too,"[285, 776, 391, 794]",MISC
743,##l,"[285, 776, 391, 794]",MISC
744,-,"[392, 776, 418, 794]",MISC
745,Ma,"[419, 776, 552, 794]",MISC
746,##ven,"[419, 776, 552, 794]",MISC
747,-,"[553, 776, 579, 794]",MISC
748,G,"[580, 776, 739, 794]",MISC
749,##rad,"[580, 776, 739, 794]",MISC
750,##le,"[580, 776, 739, 794]",MISC
751,-,"[740, 776, 742, 794]",MISC
752,NL,"[740, 776, 742, 794]",MISC
753,-,"[740, 776, 742, 794]",MISC
754,Project,"[133, 830, 211, 848]",MISC
755,Profile,"[212, 830, 303, 848]",MISC
756,:,"[212, 830, 303, 848]",MISC
757,-,"[303, 830, 305, 848]",MISC
758,NL,"[303, 830, 305, 848]",MISC
759,-,"[303, 830, 305, 848]",MISC
760,Project,"[133, 877, 242, 894]",MISC
761,#,"[133, 877, 242, 894]",MISC
762,1,"[133, 877, 242, 894]",MISC
763,:,"[133, 877, 242, 894]",MISC
764,-,"[242, 877, 244, 894]",MISC
765,NL,"[242, 877, 244, 894]",MISC
766,-,"[242, 877, 244, 894]",MISC
767,Project,"[133, 912, 237, 930]",MISC
768,Name,"[238, 912, 298, 930]",MISC
769,:,"[299, 912, 313, 930]",MISC
770,EP,"[314, 912, 358, 930]",B-project_title
771,##S,"[314, 912, 358, 930]",I-project_title
772,-,"[359, 912, 361, 930]",MISC
773,NL,"[359, 912, 361, 930]",MISC
774,-,"[359, 912, 361, 930]",MISC
775,C,"[133, 931, 238, 949]",MISC
776,##lient,"[133, 931, 238, 949]",MISC
777,:,"[238, 931, 255, 949]",MISC
778,Macy,"[256, 931, 343, 949]",MISC
779,##s,"[256, 931, 343, 949]",MISC
780,-,"[344, 931, 346, 949]",MISC
781,NL,"[344, 931, 346, 949]",MISC
782,-,"[344, 931, 346, 949]",MISC
783,Team,"[133, 951, 205, 969]",MISC
784,Si,"[206, 951, 279, 969]",MISC
785,##ze,"[206, 951, 279, 969]",MISC
786,:,"[280, 951, 297, 969]",MISC
787,8,"[299, 951, 315, 969]",MISC
788,Members,"[317, 951, 445, 969]",MISC
789,-,"[446, 951, 448, 969]",MISC
790,NL,"[446, 951, 448, 969]",MISC
791,-,"[446, 951, 448, 969]",MISC
792,Technologies,"[133, 100, 283, 116]",MISC
793,:,"[284, 100, 295, 116]",MISC
794,Java,"[297, 100, 360, 116]",MISC
795,",","[297, 100, 360, 116]",MISC
796,spring,"[360, 100, 447, 116]",MISC
797,",","[360, 100, 447, 116]",MISC
798,hi,"[448, 100, 574, 116]",MISC
799,##ber,"[448, 100, 574, 116]",MISC
800,##nate,"[448, 100, 574, 116]",MISC
801,",","[448, 100, 574, 116]",MISC
802,spring,"[574, 100, 648, 116]",MISC
803,boot,"[650, 100, 713, 116]",MISC
804,",","[650, 100, 713, 116]",MISC
805,Rest,"[713, 100, 800, 116]",MISC
806,##ful,"[713, 100, 800, 116]",MISC
807,and,"[801, 100, 838, 116]",MISC
808,soap,"[839, 100, 889, 116]",MISC
809,web,"[889, 100, 926, 116]",MISC
810,-,"[927, 100, 929, 116]",MISC
811,NL,"[927, 100, 929, 116]",MISC
812,-,"[927, 100, 929, 116]",MISC
813,Services,"[133, 116, 233, 134]",MISC
814,",","[133, 116, 233, 134]",MISC
815,j,"[233, 116, 277, 134]",MISC
816,##d,"[233, 116, 277, 134]",MISC
817,##b,"[233, 116, 277, 134]",MISC
818,##c,"[233, 116, 277, 134]",MISC
819,-,"[277, 116, 279, 134]",MISC
820,NL,"[277, 116, 279, 134]",MISC
821,-,"[277, 116, 279, 134]",MISC
822,Too,"[133, 136, 190, 154]",MISC
823,##ls,"[133, 136, 190, 154]",MISC
824,&,"[192, 136, 203, 154]",MISC
825,server,"[203, 136, 274, 154]",MISC
826,:,"[274, 136, 285, 154]",MISC
827,Too,"[286, 136, 343, 154]",MISC
828,##ls,"[286, 136, 343, 154]",MISC
829,(,"[344, 136, 450, 154]",MISC
830,Eclipse,"[344, 136, 450, 154]",MISC
831,",","[344, 136, 450, 154]",MISC
832,g,"[450, 136, 531, 154]",MISC
833,##it,"[450, 136, 531, 154]",MISC
834,##la,"[450, 136, 531, 154]",MISC
835,##b,"[450, 136, 531, 154]",MISC
836,",","[450, 136, 531, 154]",MISC
837,ma,"[532, 136, 603, 154]",MISC
838,##ven,"[532, 136, 603, 154]",MISC
839,",","[532, 136, 603, 154]",MISC
840,Ji,"[603, 136, 660, 154]",MISC
841,##ra,"[603, 136, 660, 154]",MISC
842,",","[603, 136, 660, 154]",MISC
843,J,"[661, 136, 732, 154]",MISC
844,##U,"[661, 136, 732, 154]",MISC
845,##ni,"[661, 136, 732, 154]",MISC
846,##t,"[661, 136, 732, 154]",MISC
847,",","[661, 136, 732, 154]",MISC
848,Lo,"[732, 136, 813, 154]",MISC
849,##g,"[732, 136, 813, 154]",MISC
850,##4,"[732, 136, 813, 154]",MISC
851,##j,"[732, 136, 813, 154]",MISC
852,),"[732, 136, 813, 154]",MISC
853,",","[732, 136, 813, 154]",MISC
854,server,"[814, 136, 955, 154]",MISC
855,-,"[814, 136, 955, 154]",MISC
856,J,"[814, 136, 955, 154]",MISC
857,##bos,"[814, 136, 955, 154]",MISC
858,##s,"[814, 136, 955, 154]",MISC
859,-,"[955, 136, 957, 154]",MISC
860,NL,"[955, 136, 957, 154]",MISC
861,-,"[955, 136, 957, 154]",MISC
862,Database,"[133, 155, 274, 173]",MISC
863,:,"[274, 155, 290, 173]",MISC
864,Oracle,"[291, 155, 413, 173]",MISC
865,.,"[291, 155, 413, 173]",MISC
866,-,"[414, 155, 416, 173]",MISC
867,NL,"[414, 155, 416, 173]",MISC
868,-,"[414, 155, 416, 173]",MISC
869,Project,"[133, 269, 216, 287]",MISC
870,Des,"[217, 269, 359, 287]",MISC
871,##cription,"[217, 269, 359, 287]",MISC
872,:,"[217, 269, 359, 287]",MISC
873,-,"[361, 269, 362, 287]",MISC
874,NL,"[361, 269, 362, 287]",MISC
875,-,"[361, 269, 362, 287]",MISC
876,Basic,"[133, 310, 238, 328]",MISC
877,##ally,"[133, 310, 238, 328]",MISC
878,this,"[239, 310, 286, 328]",MISC
879,project,"[287, 310, 368, 328]",MISC
880,is,"[369, 310, 392, 328]",MISC
881,built,"[393, 310, 450, 328]",MISC
882,to,"[452, 310, 474, 328]",MISC
883,replace,"[476, 310, 557, 328]",MISC
884,the,"[559, 310, 594, 328]",MISC
885,legacy,"[594, 310, 664, 328]",MISC
886,Main,"[665, 310, 771, 328]",MISC
887,##frame,"[665, 310, 771, 328]",MISC
888,business,"[771, 310, 912, 328]",MISC
889,##flow,"[771, 310, 912, 328]",MISC
890,into,"[913, 310, 960, 328]",MISC
891,-,"[961, 310, 962, 328]",MISC
892,NL,"[961, 310, 962, 328]",MISC
893,-,"[961, 310, 962, 328]",MISC
894,SC,"[133, 328, 244, 346]",MISC
895,##MC,"[133, 328, 244, 346]",MISC
896,##red,"[133, 328, 244, 346]",MISC
897,##it,"[133, 328, 244, 346]",MISC
898,application,"[245, 328, 382, 346]",MISC
899,using,"[383, 328, 444, 346]",MISC
900,Java,"[445, 328, 493, 346]",MISC
901,&,"[495, 328, 506, 346]",MISC
902,Web,"[507, 328, 544, 346]",MISC
903,services,"[545, 328, 656, 346]",MISC
904,.,"[545, 328, 656, 346]",MISC
905,This,"[657, 328, 705, 346]",MISC
906,new,"[707, 328, 744, 346]",MISC
907,business,"[745, 328, 843, 346]",MISC
908,logic,"[845, 328, 906, 346]",MISC
909,is,"[907, 328, 931, 346]",MISC
910,to,"[932, 328, 956, 346]",MISC
911,-,"[957, 328, 959, 346]",MISC
912,NL,"[957, 328, 959, 346]",MISC
913,-,"[957, 328, 959, 346]",MISC
914,provide,"[133, 346, 218, 364]",MISC
915,stable,"[219, 346, 291, 364]",MISC
916,and,"[292, 346, 328, 364]",MISC
917,efficient,"[329, 346, 438, 364]",MISC
918,way,"[440, 346, 475, 364]",MISC
919,for,"[477, 346, 512, 364]",MISC
920,the,"[513, 346, 549, 364]",MISC
921,clients,"[550, 346, 635, 364]",MISC
922,which,"[636, 346, 697, 364]",MISC
923,deployed,"[697, 346, 796, 364]",MISC
924,over,"[796, 346, 844, 364]",MISC
925,many,"[845, 346, 893, 364]",MISC
926,stores,"[894, 346, 966, 364]",MISC
927,to,"[968, 346, 992, 364]",MISC
928,-,"[992, 346, 994, 364]",MISC
929,NL,"[992, 346, 994, 364]",MISC
930,-,"[992, 346, 994, 364]",MISC
931,remove,"[133, 364, 205, 382]",MISC
932,depend,"[207, 364, 329, 382]",MISC
933,##ency,"[207, 364, 329, 382]",MISC
934,over,"[330, 364, 378, 382]",MISC
935,main,"[379, 364, 489, 382]",MISC
936,##frame,"[379, 364, 489, 382]",MISC
937,application,"[490, 364, 637, 382]",MISC
938,.,"[490, 364, 637, 382]",MISC
939,-,"[638, 364, 640, 382]",MISC
940,NL,"[638, 364, 640, 382]",MISC
941,-,"[638, 364, 640, 382]",MISC
942,As,"[133, 401, 157, 418]",MISC
943,a,"[158, 401, 169, 418]",MISC
944,part,"[171, 401, 221, 418]",MISC
945,of,"[221, 401, 245, 418]",MISC
946,the,"[247, 401, 284, 418]",MISC
947,development,"[284, 401, 434, 418]",MISC
948,",","[284, 401, 434, 418]",MISC
949,we,"[436, 401, 460, 418]",MISC
950,are,"[461, 401, 498, 418]",MISC
951,developing,"[499, 401, 625, 418]",MISC
952,a,"[626, 401, 637, 418]",MISC
953,complete,"[638, 401, 738, 418]",MISC
954,new,"[739, 401, 776, 418]",MISC
955,application,"[777, 401, 916, 418]",MISC
956,called,"[916, 401, 990, 418]",MISC
957,-,"[992, 401, 994, 418]",MISC
958,NL,"[992, 401, 994, 418]",MISC
959,-,"[992, 401, 994, 418]",MISC
960,SC,"[133, 418, 248, 436]",MISC
961,##MC,"[133, 418, 248, 436]",MISC
962,##red,"[133, 418, 248, 436]",MISC
963,##it,"[133, 418, 248, 436]",MISC
964,which,"[250, 418, 314, 436]",MISC
965,takes,"[314, 418, 379, 436]",MISC
966,S,"[379, 418, 431, 436]",MISC
967,##OA,"[379, 418, 431, 436]",MISC
968,##P,"[379, 418, 431, 436]",MISC
969,request,"[431, 418, 522, 436]",MISC
970,from,"[522, 418, 574, 436]",MISC
971,EP,"[574, 418, 612, 436]",B-project_title
972,##S,"[574, 418, 612, 436]",I-project_title
973,(,"[612, 418, 755, 436]",MISC
974,Enterprise,"[612, 418, 755, 436]",MISC
975,Pay,"[755, 418, 846, 436]",MISC
976,##ment,"[755, 418, 846, 436]",MISC
977,Service,"[846, 418, 950, 436]",MISC
978,),"[846, 418, 950, 436]",MISC
979,and,"[950, 418, 988, 436]",MISC
980,-,"[988, 418, 990, 436]",MISC
981,NL,"[988, 418, 990, 436]",MISC
982,-,"[988, 418, 990, 436]",MISC
983,processes,"[133, 436, 240, 454]",MISC
984,the,"[242, 436, 277, 454]",MISC
985,request,"[278, 436, 362, 454]",MISC
986,based,"[363, 436, 422, 454]",MISC
987,on,"[424, 436, 448, 454]",MISC
988,some,"[448, 436, 496, 454]",MISC
989,business,"[496, 436, 593, 454]",MISC
990,logic,"[593, 436, 665, 454]",MISC
991,.,"[593, 436, 665, 454]",MISC
992,This,"[666, 436, 714, 454]",MISC
993,will,"[714, 436, 763, 454]",MISC
994,interact,"[763, 436, 859, 454]",MISC
995,with,"[860, 436, 908, 454]",MISC
996,Van,"[908, 436, 981, 454]",MISC
997,##ti,"[908, 436, 981, 454]",MISC
998,##v,"[908, 436, 981, 454]",MISC
999,-,"[981, 436, 983, 454]",MISC
1000,NL,"[981, 436, 983, 454]",MISC
1001,-,"[981, 436, 983, 454]",MISC
1002,server,"[133, 454, 209, 472]",MISC
1003,to,"[209, 454, 233, 472]",MISC
1004,get,"[235, 454, 272, 472]",MISC
1005,the,"[273, 454, 310, 472]",MISC
1006,required,"[311, 454, 411, 472]",MISC
1007,response,"[412, 454, 512, 472]",MISC
1008,and,"[514, 454, 551, 472]",MISC
1009,provides,"[552, 454, 652, 472]",MISC
1010,back,"[654, 454, 704, 472]",MISC
1011,the,"[705, 454, 742, 472]",MISC
1012,response,"[743, 454, 843, 472]",MISC
1013,based,"[845, 454, 908, 472]",MISC
1014,on,"[908, 454, 932, 472]",MISC
1015,the,"[934, 454, 971, 472]",MISC
1016,-,"[972, 454, 974, 472]",MISC
1017,NL,"[972, 454, 974, 472]",MISC
1018,-,"[972, 454, 974, 472]",MISC
1019,different,"[133, 472, 233, 490]",MISC
1020,Author,"[234, 472, 378, 490]",MISC
1021,##ization,"[234, 472, 378, 490]",MISC
1022,types,"[379, 472, 435, 490]",MISC
1023,to,"[435, 472, 457, 490]",MISC
1024,the,"[457, 472, 491, 490]",MISC
1025,client,"[491, 472, 569, 490]",MISC
1026,.,"[491, 472, 569, 490]",MISC
1027,Also,"[569, 472, 625, 490]",MISC
1028,",","[569, 472, 625, 490]",MISC
1029,this,"[625, 472, 670, 490]",MISC
1030,application,"[670, 472, 792, 490]",MISC
1031,incorporates,"[793, 472, 926, 490]",MISC
1032,-,"[927, 472, 929, 490]",MISC
1033,NL,"[927, 472, 929, 490]",MISC
1034,-,"[927, 472, 929, 490]",MISC
1035,En,"[133, 490, 388, 507]",MISC
1036,##c,"[133, 490, 388, 507]",MISC
1037,##ry,"[133, 490, 388, 507]",MISC
1038,##ption,"[133, 490, 388, 507]",MISC
1039,/,"[133, 490, 388, 507]",MISC
1040,Dec,"[133, 490, 388, 507]",MISC
1041,##ry,"[133, 490, 388, 507]",MISC
1042,##ption,"[133, 490, 388, 507]",MISC
1043,of,"[390, 490, 414, 507]",MISC
1044,A,"[414, 490, 499, 507]",MISC
1045,##cco,"[414, 490, 499, 507]",MISC
1046,##unt,"[414, 490, 499, 507]",MISC
1047,Number,"[500, 490, 572, 507]",MISC
1048,using,"[573, 490, 634, 507]",MISC
1049,E,"[634, 490, 670, 507]",MISC
1050,##ES,"[634, 490, 670, 507]",MISC
1051,service,"[671, 490, 756, 507]",MISC
1052,for,"[757, 490, 792, 507]",MISC
1053,the,"[793, 490, 829, 507]",MISC
1054,security,"[830, 490, 939, 507]",MISC
1055,.,"[830, 490, 939, 507]",MISC
1056,-,"[940, 490, 942, 507]",MISC
1057,NL,"[940, 490, 942, 507]",MISC
1058,-,"[940, 490, 942, 507]",MISC
1059,Re,"[133, 527, 322, 545]",MISC
1060,##sp,"[133, 527, 322, 545]",MISC
1061,##ons,"[133, 527, 322, 545]",MISC
1062,##ibi,"[133, 527, 322, 545]",MISC
1063,##lities,"[133, 527, 322, 545]",MISC
1064,:,"[133, 527, 322, 545]",MISC
1065,-,"[322, 527, 324, 545]",MISC
1066,NL,"[322, 527, 324, 545]",MISC
1067,-,"[322, 527, 324, 545]",MISC
1068,Ana,"[180, 571, 306, 586]",MISC
1069,##ly,"[180, 571, 306, 586]",MISC
1070,##zing,"[180, 571, 306, 586]",MISC
1071,the,"[307, 571, 348, 586]",MISC
1072,design,"[349, 571, 433, 586]",MISC
1073,document,"[434, 571, 545, 586]",MISC
1074,and,"[547, 571, 587, 586]",MISC
1075,G,"[589, 571, 672, 586]",MISC
1076,##ather,"[589, 571, 672, 586]",MISC
1077,requirements,"[674, 571, 842, 586]",MISC
1078,and,"[843, 571, 883, 586]",MISC
1079,identify,"[885, 571, 996, 586]",MISC
1080,-,"[998, 571, 1000, 586]",MISC
1081,NL,"[998, 571, 1000, 586]",MISC
1082,-,"[998, 571, 1000, 586]",MISC
1083,requirement,"[200, 588, 335, 606]",MISC
1084,gap,"[335, 588, 370, 606]",MISC
1085,-,"[372, 588, 374, 606]",MISC
1086,NL,"[372, 588, 374, 606]",MISC
1087,-,"[372, 588, 374, 606]",MISC
1088,Hand,"[178, 613, 251, 627]",MISC
1089,##le,"[178, 613, 251, 627]",MISC
1090,client,"[252, 613, 324, 627]",MISC
1091,communication,"[325, 613, 483, 627]",MISC
1092,regarding,"[484, 613, 594, 627]",MISC
1093,requirements,"[595, 613, 752, 627]",MISC
1094,",","[595, 613, 752, 627]",MISC
1095,design,"[754, 613, 839, 627]",MISC
1096,",","[754, 613, 839, 627]",MISC
1097,etc,"[839, 613, 888, 627]",MISC
1098,.,"[839, 613, 888, 627]",MISC
1099,-,"[888, 613, 890, 627]",MISC
1100,NL,"[888, 613, 890, 627]",MISC
1101,-,"[888, 613, 890, 627]",MISC
1102,In,"[178, 631, 275, 645]",MISC
1103,##volved,"[178, 631, 275, 645]",MISC
1104,in,"[275, 631, 299, 645]",MISC
1105,task,"[299, 631, 347, 645]",MISC
1106,planning,"[348, 631, 444, 645]",MISC
1107,and,"[444, 631, 480, 645]",MISC
1108,technical,"[481, 631, 588, 645]",MISC
1109,discussions,"[590, 631, 734, 645]",MISC
1110,.,"[590, 631, 734, 645]",MISC
1111,-,"[735, 631, 737, 645]",MISC
1112,NL,"[735, 631, 737, 645]",MISC
1113,-,"[735, 631, 737, 645]",MISC
1114,Review,"[181, 648, 270, 663]",MISC
1115,the,"[272, 648, 316, 663]",MISC
1116,developed,"[317, 648, 453, 663]",MISC
1117,code,"[453, 648, 513, 663]",MISC
1118,and,"[514, 648, 558, 663]",MISC
1119,make,"[559, 648, 618, 663]",MISC
1120,sure,"[620, 648, 679, 663]",MISC
1121,it,"[680, 648, 710, 663]",MISC
1122,ad,"[710, 648, 816, 663]",MISC
1123,##here,"[710, 648, 816, 663]",MISC
1124,##s,"[710, 648, 816, 663]",MISC
1125,to,"[816, 648, 846, 663]",MISC
1126,the,"[846, 648, 891, 663]",MISC
1127,design,"[892, 648, 997, 663]",MISC
1128,",","[892, 648, 997, 663]",MISC
1129,-,"[998, 648, 1000, 663]",MISC
1130,NL,"[998, 648, 1000, 663]",MISC
1131,-,"[998, 648, 1000, 663]",MISC
1132,standards,"[200, 663, 303, 680]",MISC
1133,and,"[304, 663, 338, 680]",MISC
1134,guidelines,"[339, 663, 454, 680]",MISC
1135,of,"[456, 663, 478, 680]",MISC
1136,the,"[479, 663, 513, 680]",MISC
1137,client,"[514, 663, 596, 680]",MISC
1138,.,"[514, 663, 596, 680]",MISC
1139,-,"[596, 663, 598, 680]",MISC
1140,NL,"[596, 663, 598, 680]",MISC
1141,-,"[596, 663, 598, 680]",MISC
1142,De,"[179, 684, 255, 698]",MISC
1143,##p,"[179, 684, 255, 698]",MISC
1144,##loy,"[179, 684, 255, 698]",MISC
1145,minor,"[255, 684, 394, 698]",MISC
1146,/,"[255, 684, 394, 698]",MISC
1147,major,"[255, 684, 394, 698]",MISC
1148,releases,"[394, 684, 494, 698]",MISC
1149,-,"[496, 684, 498, 698]",MISC
1150,NL,"[496, 684, 498, 698]",MISC
1151,-,"[496, 684, 498, 698]",MISC
1152,In,"[179, 702, 277, 716]",MISC
1153,##volved,"[179, 702, 277, 716]",MISC
1154,in,"[278, 702, 302, 716]",MISC
1155,code,"[303, 702, 351, 716]",MISC
1156,enhance,"[353, 702, 501, 716]",MISC
1157,##ment,"[353, 702, 501, 716]",MISC
1158,",","[353, 702, 501, 716]",MISC
1159,De,"[502, 702, 664, 716]",MISC
1160,##fect,"[502, 702, 664, 716]",MISC
1161,##fi,"[502, 702, 664, 716]",MISC
1162,##xing,"[502, 702, 664, 716]",MISC
1163,.,"[502, 702, 664, 716]",MISC
1164,-,"[664, 702, 666, 716]",MISC
1165,NL,"[664, 702, 666, 716]",MISC
1166,-,"[664, 702, 666, 716]",MISC
1167,Support,"[179, 720, 268, 734]",MISC
1168,the,"[268, 720, 305, 734]",MISC
1169,on,"[307, 720, 383, 734]",MISC
1170,##site,"[307, 720, 383, 734]",MISC
1171,team,"[383, 720, 433, 734]",MISC
1172,on,"[434, 720, 458, 734]",MISC
1173,technical,"[460, 720, 575, 734]",MISC
1174,issues,"[575, 720, 651, 734]",MISC
1175,-,"[651, 720, 653, 734]",MISC
1176,NL,"[651, 720, 653, 734]",MISC
1177,-,"[651, 720, 653, 734]",MISC
1178,Pro,"[179, 737, 270, 752]",MISC
1179,##vide,"[179, 737, 270, 752]",MISC
1180,guidance,"[270, 737, 374, 752]",MISC
1181,and,"[374, 737, 413, 752]",MISC
1182,support,"[413, 737, 504, 752]",MISC
1183,to,"[504, 737, 530, 752]",MISC
1184,the,"[530, 737, 569, 752]",MISC
1185,client,"[569, 737, 673, 752]",MISC
1186,’,"[569, 737, 673, 752]",MISC
1187,s,"[569, 737, 673, 752]",MISC
1188,internal,"[673, 737, 777, 752]",MISC
1189,teams,"[777, 737, 842, 752]",MISC
1190,such,"[842, 737, 894, 752]",MISC
1191,as,"[894, 737, 920, 752]",MISC
1192,the,"[920, 737, 959, 752]",MISC
1193,U,"[959, 737, 998, 752]",MISC
1194,##AT,"[959, 737, 998, 752]",MISC
1195,-,"[998, 737, 1000, 752]",MISC
1196,NL,"[998, 737, 1000, 752]",MISC
1197,-,"[998, 737, 1000, 752]",MISC
1198,team,"[200, 752, 257, 769]",MISC
1199,",","[200, 752, 257, 769]",MISC
1200,business,"[257, 752, 350, 769]",MISC
1201,analysts,"[350, 752, 454, 769]",MISC
1202,",","[350, 752, 454, 769]",MISC
1203,and,"[455, 752, 488, 769]",MISC
1204,stakeholders,"[489, 752, 639, 769]",MISC
1205,.,"[489, 752, 639, 769]",MISC
1206,-,"[640, 752, 642, 769]",MISC
1207,NL,"[640, 752, 642, 769]",MISC
1208,-,"[640, 752, 642, 769]",MISC
1209,Project,"[133, 788, 242, 805]",MISC
1210,#,"[133, 788, 242, 805]",MISC
1211,2,"[133, 788, 242, 805]",MISC
1212,:,"[133, 788, 242, 805]",MISC
1213,-,"[242, 788, 244, 805]",MISC
1214,NL,"[242, 788, 244, 805]",MISC
1215,-,"[242, 788, 244, 805]",MISC
1216,Project,"[133, 824, 244, 842]",MISC
1217,Name,"[245, 824, 308, 842]",MISC
1218,:,"[309, 824, 323, 842]",MISC
1219,N,"[325, 824, 387, 842]",B-project_title
1220,##MD,"[325, 824, 387, 842]",I-project_title
1221,##B,"[325, 824, 387, 842]",I-project_title
1222,-,"[388, 824, 390, 842]",MISC
1223,NL,"[388, 824, 390, 842]",MISC
1224,-,"[388, 824, 390, 842]",MISC
1225,C,"[133, 844, 235, 860]",MISC
1226,##lient,"[133, 844, 235, 860]",MISC
1227,:,"[236, 844, 253, 860]",MISC
1228,British,"[253, 844, 374, 860]",MISC
1229,Telecom,"[374, 844, 494, 860]",MISC
1230,-,"[494, 844, 496, 860]",MISC
1231,NL,"[494, 844, 496, 860]",MISC
1232,-,"[494, 844, 496, 860]",MISC
1233,Team,"[133, 862, 203, 880]",MISC
1234,Si,"[203, 862, 274, 880]",MISC
1235,##ze,"[203, 862, 274, 880]",MISC
1236,:,"[274, 862, 291, 880]",MISC
1237,8,"[292, 862, 308, 880]",MISC
1238,Members,"[309, 862, 432, 880]",MISC
1239,-,"[433, 862, 435, 880]",MISC
1240,NL,"[433, 862, 435, 880]",MISC
1241,-,"[433, 862, 435, 880]",MISC
1242,Technologies,"[133, 881, 274, 899]",MISC
1243,:,"[275, 881, 286, 899]",MISC
1244,Java,"[287, 881, 344, 899]",MISC
1245,",","[287, 881, 344, 899]",MISC
1246,spring,"[346, 881, 427, 899]",MISC
1247,",","[346, 881, 427, 899]",MISC
1248,hi,"[428, 881, 545, 899]",MISC
1249,##ber,"[428, 881, 545, 899]",MISC
1250,##nate,"[428, 881, 545, 899]",MISC
1251,",","[428, 881, 545, 899]",MISC
1252,spring,"[547, 881, 617, 899]",MISC
1253,boot,"[618, 881, 675, 899]",MISC
1254,",","[618, 881, 675, 899]",MISC
1255,Rest,"[677, 881, 758, 899]",MISC
1256,##ful,"[677, 881, 758, 899]",MISC
1257,web,"[759, 881, 795, 899]",MISC
1258,Services,"[795, 881, 900, 899]",MISC
1259,",","[795, 881, 900, 899]",MISC
1260,Ser,"[901, 881, 996, 899]",MISC
1261,##v,"[901, 881, 996, 899]",MISC
1262,##let,"[901, 881, 996, 899]",MISC
1263,",","[901, 881, 996, 899]",MISC
1264,-,"[996, 881, 998, 899]",MISC
1265,NL,"[996, 881, 998, 899]",MISC
1266,-,"[996, 881, 998, 899]",MISC
1267,J,"[133, 899, 179, 917]",MISC
1268,##SP,"[133, 899, 179, 917]",MISC
1269,",","[133, 899, 179, 917]",MISC
1270,j,"[179, 899, 225, 917]",MISC
1271,##d,"[179, 899, 225, 917]",MISC
1272,##b,"[179, 899, 225, 917]",MISC
1273,##c,"[179, 899, 225, 917]",MISC
1274,-,"[225, 899, 227, 917]",MISC
1275,NL,"[225, 899, 227, 917]",MISC
1276,-,"[225, 899, 227, 917]",MISC
1277,Too,"[333, 919, 388, 937]",MISC
1278,##ls,"[333, 919, 388, 937]",MISC
1279,&,"[390, 919, 401, 937]",MISC
1280,server,"[402, 919, 481, 937]",MISC
1281,:,"[402, 919, 481, 937]",MISC
1282,Too,"[482, 919, 537, 937]",MISC
1283,##ls,"[482, 919, 537, 937]",MISC
1284,(,"[539, 919, 641, 937]",MISC
1285,Eclipse,"[539, 919, 641, 937]",MISC
1286,",","[539, 919, 641, 937]",MISC
1287,g,"[642, 919, 722, 937]",MISC
1288,##it,"[642, 919, 722, 937]",MISC
1289,##la,"[642, 919, 722, 937]",MISC
1290,##b,"[642, 919, 722, 937]",MISC
1291,",","[642, 919, 722, 937]",MISC
1292,g,"[722, 919, 802, 937]",MISC
1293,##rad,"[722, 919, 802, 937]",MISC
1294,##le,"[722, 919, 802, 937]",MISC
1295,",","[722, 919, 802, 937]",MISC
1296,J,"[802, 919, 871, 937]",MISC
1297,##U,"[802, 919, 871, 937]",MISC
1298,##ni,"[802, 919, 871, 937]",MISC
1299,##t,"[802, 919, 871, 937]",MISC
1300,",","[802, 919, 871, 937]",MISC
1301,Lo,"[871, 919, 951, 937]",MISC
1302,##g,"[871, 919, 951, 937]",MISC
1303,##4,"[871, 919, 951, 937]",MISC
1304,##j,"[871, 919, 951, 937]",MISC
1305,),"[871, 919, 951, 937]",MISC
1306,",","[871, 919, 951, 937]",MISC
1307,-,"[951, 919, 953, 937]",MISC
1308,NL,"[951, 919, 953, 937]",MISC
1309,-,"[951, 919, 953, 937]",MISC
1310,server,"[133, 937, 253, 954]",MISC
1311,-,"[133, 937, 253, 954]",MISC
1312,Web,"[133, 937, 253, 954]",MISC
1313,Logic,"[254, 937, 313, 954]",MISC
1314,-,"[314, 937, 316, 954]",MISC
1315,NL,"[314, 937, 316, 954]",MISC
1316,-,"[314, 937, 316, 954]",MISC
1317,Database,"[133, 955, 268, 973]",MISC
1318,:,"[269, 955, 286, 973]",MISC
1319,Oracle,"[286, 955, 388, 973]",MISC
1320,-,"[388, 955, 390, 973]",MISC
1321,NL,"[388, 955, 390, 973]",MISC
1322,-,"[388, 955, 390, 973]",MISC
1323,Project,"[133, 100, 216, 118]",MISC
1324,Des,"[217, 100, 359, 118]",MISC
1325,##cription,"[217, 100, 359, 118]",MISC
1326,:,"[217, 100, 359, 118]",MISC
1327,-,"[361, 100, 362, 118]",MISC
1328,NL,"[361, 100, 362, 118]",MISC
1329,-,"[361, 100, 362, 118]",MISC
1330,N,"[133, 140, 183, 158]",B-project_title
1331,##MD,"[133, 140, 183, 158]",I-project_title
1332,##B,"[133, 140, 183, 158]",I-project_title
1333,is,"[183, 140, 207, 158]",MISC
1334,an,"[208, 140, 232, 158]",MISC
1335,OR,"[233, 140, 307, 158]",MISC
1336,##AC,"[233, 140, 307, 158]",MISC
1337,##LE,"[233, 140, 307, 158]",MISC
1338,database,"[309, 140, 409, 158]",MISC
1339,holding,"[409, 140, 496, 158]",MISC
1340,data,"[497, 140, 547, 158]",MISC
1341,for,"[548, 140, 585, 158]",MISC
1342,customer,"[585, 140, 685, 158]",MISC
1343,devices,"[686, 140, 786, 158]",MISC
1344,",","[686, 140, 786, 158]",MISC
1345,sites,"[786, 140, 861, 158]",MISC
1346,",","[786, 140, 861, 158]",MISC
1347,circuits,"[862, 140, 962, 158]",MISC
1348,-,"[962, 140, 964, 158]",MISC
1349,NL,"[962, 140, 964, 158]",MISC
1350,-,"[962, 140, 964, 158]",MISC
1351,and,"[133, 158, 168, 176]",MISC
1352,the,"[170, 158, 205, 176]",MISC
1353,network,"[207, 158, 305, 176]",MISC
1354,.,"[207, 158, 305, 176]",MISC
1355,The,"[306, 158, 341, 176]",MISC
1356,database,"[343, 158, 441, 176]",MISC
1357,holds,"[441, 158, 502, 176]",MISC
1358,device,"[503, 158, 575, 176]",MISC
1359,related,"[577, 158, 662, 176]",MISC
1360,information,"[663, 158, 798, 176]",MISC
1361,and,"[799, 158, 834, 176]",MISC
1362,provides,"[836, 158, 934, 176]",MISC
1363,-,"[935, 158, 937, 176]",MISC
1364,NL,"[935, 158, 937, 176]",MISC
1365,-,"[935, 158, 937, 176]",MISC
1366,customers,"[133, 176, 238, 193]",MISC
1367,with,"[239, 176, 285, 193]",MISC
1368,the,"[286, 176, 321, 193]",MISC
1369,status,"[321, 176, 391, 193]",MISC
1370,of,"[392, 176, 414, 193]",MISC
1371,devices,"[415, 176, 508, 193]",MISC
1372,",","[415, 176, 508, 193]",MISC
1373,network,"[509, 176, 602, 193]",MISC
1374,",","[509, 176, 602, 193]",MISC
1375,sites,"[603, 176, 661, 193]",MISC
1376,and,"[662, 176, 697, 193]",MISC
1377,circuits,"[697, 176, 803, 193]",MISC
1378,.,"[697, 176, 803, 193]",MISC
1379,-,"[803, 176, 805, 193]",MISC
1380,NL,"[803, 176, 805, 193]",MISC
1381,-,"[803, 176, 805, 193]",MISC
1382,The,"[133, 212, 170, 230]",MISC
1383,N,"[170, 212, 220, 230]",B-project_title
1384,##MD,"[170, 212, 220, 230]",I-project_title
1385,##B,"[170, 212, 220, 230]",I-project_title
1386,Oracle,"[220, 212, 295, 230]",MISC
1387,database,"[296, 212, 396, 230]",MISC
1388,is,"[396, 212, 420, 230]",MISC
1389,identified,"[421, 212, 545, 230]",MISC
1390,as,"[546, 212, 570, 230]",MISC
1391,the,"[571, 212, 608, 230]",MISC
1392,master,"[609, 212, 683, 230]",MISC
1393,source,"[684, 212, 758, 230]",MISC
1394,of,"[759, 212, 783, 230]",MISC
1395,data,"[784, 212, 834, 230]",MISC
1396,for,"[834, 212, 871, 230]",MISC
1397,actively,"[872, 212, 972, 230]",MISC
1398,-,"[972, 212, 974, 230]",MISC
1399,NL,"[972, 212, 974, 230]",MISC
1400,-,"[972, 212, 974, 230]",MISC
1401,managed,"[133, 230, 225, 248]",MISC
1402,network,"[227, 230, 320, 248]",MISC
1403,devices,"[321, 230, 428, 248]",MISC
1404,.,"[321, 230, 428, 248]",MISC
1405,These,"[429, 230, 495, 248]",MISC
1406,devices,"[496, 230, 588, 248]",MISC
1407,are,"[590, 230, 629, 248]",MISC
1408,loaded,"[630, 230, 710, 248]",MISC
1409,into,"[711, 230, 765, 248]",MISC
1410,N,"[765, 230, 818, 248]",B-project_title
1411,##MD,"[765, 230, 818, 248]",I-project_title
1412,##B,"[765, 230, 818, 248]",I-project_title
1413,from,"[818, 230, 872, 248]",MISC
1414,B,"[872, 230, 911, 248]",MISC
1415,##F,"[872, 230, 911, 248]",MISC
1416,##G,"[872, 230, 911, 248]",MISC
1417,-,"[912, 230, 914, 248]",MISC
1418,NL,"[912, 230, 914, 248]",MISC
1419,-,"[912, 230, 914, 248]",MISC
1420,database,"[133, 248, 237, 267]",MISC
1421,using,"[238, 248, 302, 267]",MISC
1422,bulk,"[303, 248, 355, 267]",MISC
1423,load,"[356, 248, 407, 267]",MISC
1424,process,"[408, 248, 499, 267]",MISC
1425,(,"[500, 248, 578, 267]",MISC
1426,DC,"[500, 248, 578, 267]",MISC
1427,##MO,"[500, 248, 578, 267]",MISC
1428,),"[500, 248, 578, 267]",MISC
1429,or,"[578, 248, 604, 267]",MISC
1430,by,"[605, 248, 630, 267]",MISC
1431,using,"[631, 248, 696, 267]",MISC
1432,N,"[696, 248, 735, 267]",MISC
1433,##MS,"[696, 248, 735, 267]",MISC
1434,Lo,"[736, 248, 813, 267]",MISC
1435,##ader,"[736, 248, 813, 267]",MISC
1436,web,"[814, 248, 853, 267]",MISC
1437,application,"[854, 248, 996, 267]",MISC
1438,-,"[998, 248, 1000, 267]",MISC
1439,NL,"[998, 248, 1000, 267]",MISC
1440,-,"[998, 248, 1000, 267]",MISC
1441,for,"[133, 267, 168, 285]",MISC
1442,a,"[170, 267, 181, 285]",MISC
1443,single,"[182, 267, 254, 285]",MISC
1444,CP,"[256, 267, 291, 285]",MISC
1445,##E,"[256, 267, 291, 285]",MISC
1446,route,"[293, 267, 378, 285]",MISC
1447,##r,"[293, 267, 378, 285]",MISC
1448,.,"[293, 267, 378, 285]",MISC
1449,The,"[379, 267, 414, 285]",MISC
1450,Data,"[416, 267, 464, 285]",MISC
1451,Lo,"[465, 267, 537, 285]",MISC
1452,##ader,"[465, 267, 537, 285]",MISC
1453,application,"[539, 267, 674, 285]",MISC
1454,will,"[674, 267, 722, 285]",MISC
1455,get,"[723, 267, 758, 285]",MISC
1456,this,"[760, 267, 808, 285]",MISC
1457,information,"[809, 267, 945, 285]",MISC
1458,from,"[945, 267, 993, 285]",MISC
1459,-,"[994, 267, 996, 285]",MISC
1460,NL,"[994, 267, 996, 285]",MISC
1461,-,"[994, 267, 996, 285]",MISC
1462,N,"[133, 285, 183, 301]",B-project_title
1463,##MD,"[133, 285, 183, 301]",I-project_title
1464,##B,"[133, 285, 183, 301]",I-project_title
1465,for,"[185, 285, 222, 301]",MISC
1466,particular,"[223, 285, 351, 301]",MISC
1467,network,"[353, 285, 442, 301]",MISC
1468,realm,"[443, 285, 519, 301]",MISC
1469,##s,"[443, 285, 519, 301]",MISC
1470,via,"[521, 285, 558, 301]",MISC
1471,enhanced,"[560, 285, 662, 301]",MISC
1472,M,"[663, 285, 700, 301]",MISC
1473,##L,"[663, 285, 700, 301]",MISC
1474,##I,"[663, 285, 700, 301]",MISC
1475,capability,"[702, 285, 830, 301]",MISC
1476,exposed,"[831, 285, 920, 301]",MISC
1477,by,"[922, 285, 946, 301]",MISC
1478,AD,"[948, 285, 985, 301]",MISC
1479,##L,"[948, 285, 985, 301]",MISC
1480,-,"[987, 285, 988, 301]",MISC
1481,NL,"[987, 285, 988, 301]",MISC
1482,-,"[987, 285, 988, 301]",MISC
1483,platform,"[133, 301, 238, 319]",MISC
1484,",","[133, 301, 238, 319]",MISC
1485,and,"[239, 301, 274, 319]",MISC
1486,provide,"[274, 301, 355, 319]",MISC
1487,this,"[356, 301, 402, 319]",MISC
1488,data,"[403, 301, 449, 319]",MISC
1489,via,"[450, 301, 485, 319]",MISC
1490,API,"[485, 301, 532, 319]",MISC
1491,##s,"[485, 301, 532, 319]",MISC
1492,to,"[532, 301, 555, 319]",MISC
1493,the,"[556, 301, 591, 319]",MISC
1494,intelligent,"[591, 301, 719, 319]",MISC
1495,worker,"[721, 301, 791, 319]",MISC
1496,servers,"[791, 301, 873, 319]",MISC
1497,installed,"[873, 301, 979, 319]",MISC
1498,-,"[979, 301, 981, 319]",MISC
1499,NL,"[979, 301, 981, 319]",MISC
1500,-,"[979, 301, 981, 319]",MISC
1501,on,"[133, 319, 157, 337]",MISC
1502,Linux,"[158, 319, 219, 337]",MISC
1503,OS,"[219, 319, 256, 337]",MISC
1504,.,"[219, 319, 256, 337]",MISC
1505,Additionally,"[256, 319, 416, 337]",MISC
1506,",","[256, 319, 416, 337]",MISC
1507,Data,"[417, 319, 465, 337]",MISC
1508,Lo,"[466, 319, 540, 337]",MISC
1509,##ader,"[466, 319, 540, 337]",MISC
1510,automated,"[541, 319, 652, 337]",MISC
1511,interface,"[652, 319, 763, 337]",MISC
1512,will,"[763, 319, 811, 337]",MISC
1513,also,"[812, 319, 860, 337]",MISC
1514,get,"[862, 319, 899, 337]",MISC
1515,data,"[899, 319, 947, 337]",MISC
1516,from,"[948, 319, 996, 337]",MISC
1517,-,"[998, 319, 1000, 337]",MISC
1518,NL,"[998, 319, 1000, 337]",MISC
1519,-,"[998, 319, 1000, 337]",MISC
1520,M,"[133, 337, 170, 356]",MISC
1521,##L,"[133, 337, 170, 356]",MISC
1522,##I,"[133, 337, 170, 356]",MISC
1523,for,"[171, 337, 208, 356]",MISC
1524,new,"[208, 337, 245, 356]",MISC
1525,customer,"[246, 337, 346, 356]",MISC
1526,devices,"[347, 337, 434, 356]",MISC
1527,added,"[435, 337, 496, 356]",MISC
1528,(,"[498, 337, 611, 356]",MISC
1529,create,"[498, 337, 611, 356]",MISC
1530,),"[498, 337, 611, 356]",MISC
1531,",","[498, 337, 611, 356]",MISC
1532,deleted,"[611, 337, 698, 356]",MISC
1533,(,"[699, 337, 799, 356]",MISC
1534,ceased,"[699, 337, 799, 356]",MISC
1535,),"[699, 337, 799, 356]",MISC
1536,and,"[800, 337, 837, 356]",MISC
1537,updated,"[837, 337, 924, 356]",MISC
1538,in,"[925, 337, 950, 356]",MISC
1539,the,"[951, 337, 988, 356]",MISC
1540,-,"[988, 337, 990, 356]",MISC
1541,NL,"[988, 337, 990, 356]",MISC
1542,-,"[988, 337, 990, 356]",MISC
1543,networks,"[133, 356, 250, 374]",MISC
1544,",","[133, 356, 250, 374]",MISC
1545,from,"[250, 356, 302, 374]",MISC
1546,the,"[302, 356, 341, 374]",MISC
1547,N,"[341, 356, 393, 374]",B-project_title
1548,##MD,"[341, 356, 393, 374]",I-project_title
1549,##B,"[341, 356, 393, 374]",I-project_title
1550,database,"[393, 356, 510, 374]",MISC
1551,.,"[393, 356, 510, 374]",MISC
1552,-,"[511, 356, 512, 374]",MISC
1553,NL,"[511, 356, 512, 374]",MISC
1554,-,"[511, 356, 512, 374]",MISC
1555,Re,"[133, 393, 322, 411]",MISC
1556,##sp,"[133, 393, 322, 411]",MISC
1557,##ons,"[133, 393, 322, 411]",MISC
1558,##ibi,"[133, 393, 322, 411]",MISC
1559,##lities,"[133, 393, 322, 411]",MISC
1560,:,"[133, 393, 322, 411]",MISC
1561,-,"[322, 393, 324, 411]",MISC
1562,NL,"[322, 393, 324, 411]",MISC
1563,-,"[322, 393, 324, 411]",MISC
1564,Ana,"[180, 438, 306, 452]",MISC
1565,##ly,"[180, 438, 306, 452]",MISC
1566,##zing,"[180, 438, 306, 452]",MISC
1567,the,"[307, 438, 348, 452]",MISC
1568,design,"[349, 438, 433, 452]",MISC
1569,document,"[434, 438, 545, 452]",MISC
1570,and,"[547, 438, 587, 452]",MISC
1571,G,"[589, 438, 672, 452]",MISC
1572,##ather,"[589, 438, 672, 452]",MISC
1573,requirements,"[674, 438, 842, 452]",MISC
1574,and,"[843, 438, 883, 452]",MISC
1575,identify,"[885, 438, 996, 452]",MISC
1576,-,"[998, 438, 1000, 452]",MISC
1577,NL,"[998, 438, 1000, 452]",MISC
1578,-,"[998, 438, 1000, 452]",MISC
1579,requirement,"[200, 454, 335, 471]",MISC
1580,gap,"[335, 454, 370, 471]",MISC
1581,-,"[372, 454, 374, 471]",MISC
1582,NL,"[372, 454, 374, 471]",MISC
1583,-,"[372, 454, 374, 471]",MISC
1584,Hand,"[178, 478, 251, 492]",MISC
1585,##le,"[178, 478, 251, 492]",MISC
1586,client,"[252, 478, 324, 492]",MISC
1587,communication,"[325, 478, 483, 492]",MISC
1588,regarding,"[484, 478, 594, 492]",MISC
1589,requirements,"[595, 478, 752, 492]",MISC
1590,",","[595, 478, 752, 492]",MISC
1591,design,"[754, 478, 839, 492]",MISC
1592,",","[754, 478, 839, 492]",MISC
1593,etc,"[839, 478, 888, 492]",MISC
1594,.,"[839, 478, 888, 492]",MISC
1595,-,"[888, 478, 890, 492]",MISC
1596,NL,"[888, 478, 890, 492]",MISC
1597,-,"[888, 478, 890, 492]",MISC
1598,Designed,"[180, 496, 289, 510]",MISC
1599,and,"[291, 496, 332, 510]",MISC
1600,processed,"[332, 496, 457, 510]",MISC
1601,J,"[457, 496, 511, 510]",MISC
1602,##SO,"[457, 496, 511, 510]",MISC
1603,##N,"[457, 496, 511, 510]",MISC
1604,requests,"[513, 496, 622, 510]",MISC
1605,according,"[623, 496, 748, 510]",MISC
1606,to,"[748, 496, 774, 510]",MISC
1607,different,"[776, 496, 900, 510]",MISC
1608,types,"[901, 496, 969, 510]",MISC
1609,of,"[970, 496, 996, 510]",MISC
1610,-,"[998, 496, 1000, 510]",MISC
1611,NL,"[998, 496, 1000, 510]",MISC
1612,-,"[998, 496, 1000, 510]",MISC
1613,modules,"[200, 513, 288, 531]",MISC
1614,actions,"[290, 513, 379, 531]",MISC
1615,request,"[380, 513, 469, 531]",MISC
1616,data,"[470, 513, 520, 531]",MISC
1617,and,"[521, 513, 558, 531]",MISC
1618,responses,"[560, 513, 675, 531]",MISC
1619,accordingly,"[676, 513, 817, 531]",MISC
1620,to,"[817, 513, 841, 531]",MISC
1621,send,"[843, 513, 893, 531]",MISC
1622,it,"[895, 513, 919, 531]",MISC
1623,back,"[920, 513, 970, 531]",MISC
1624,to,"[972, 513, 996, 531]",MISC
1625,-,"[998, 513, 999, 531]",MISC
1626,NL,"[998, 513, 999, 531]",MISC
1627,-,"[998, 513, 999, 531]",MISC
1628,front,"[200, 534, 257, 552]",MISC
1629,end,"[258, 534, 294, 552]",MISC
1630,after,"[294, 534, 351, 552]",MISC
1631,the,"[352, 534, 388, 552]",MISC
1632,logic,"[388, 534, 445, 552]",MISC
1633,processing,"[447, 534, 563, 552]",MISC
1634,-,"[564, 534, 566, 552]",MISC
1635,NL,"[564, 534, 566, 552]",MISC
1636,-,"[564, 534, 566, 552]",MISC
1637,Inter,"[179, 557, 311, 571]",MISC
1638,##act,"[179, 557, 311, 571]",MISC
1639,##ed,"[179, 557, 311, 571]",MISC
1640,with,"[311, 557, 363, 571]",MISC
1641,Business,"[364, 557, 470, 571]",MISC
1642,Ana,"[470, 557, 575, 571]",MISC
1643,##ly,"[470, 557, 575, 571]",MISC
1644,##sts,"[470, 557, 575, 571]",MISC
1645,to,"[575, 557, 601, 571]",MISC
1646,come,"[602, 557, 654, 571]",MISC
1647,up,"[654, 557, 680, 571]",MISC
1648,with,"[681, 557, 733, 571]",MISC
1649,better,"[734, 557, 811, 571]",MISC
1650,implementation,"[813, 557, 996, 571]",MISC
1651,-,"[998, 557, 1000, 571]",MISC
1652,NL,"[998, 557, 1000, 571]",MISC
1653,-,"[998, 557, 1000, 571]",MISC
1654,designs,"[200, 574, 277, 592]",MISC
1655,for,"[279, 574, 312, 592]",MISC
1656,the,"[313, 574, 346, 592]",MISC
1657,Application,"[347, 574, 482, 592]",MISC
1658,.,"[347, 574, 482, 592]",MISC
1659,-,"[483, 574, 485, 592]",MISC
1660,NL,"[483, 574, 485, 592]",MISC
1661,-,"[483, 574, 485, 592]",MISC
1662,Work,"[179, 598, 255, 613]",MISC
1663,##ed,"[179, 598, 255, 613]",MISC
1664,with,"[256, 598, 306, 613]",MISC
1665,Test,"[307, 598, 396, 613]",MISC
1666,##ers,"[307, 598, 396, 613]",MISC
1667,in,"[396, 598, 420, 613]",MISC
1668,re,"[422, 598, 537, 613]",MISC
1669,##sol,"[422, 598, 537, 613]",MISC
1670,##ving,"[422, 598, 537, 613]",MISC
1671,various,"[537, 598, 626, 613]",MISC
1672,defects,"[627, 598, 716, 613]",MISC
1673,in,"[716, 598, 740, 613]",MISC
1674,the,"[742, 598, 779, 613]",MISC
1675,application,"[780, 598, 919, 613]",MISC
1676,and,"[921, 598, 958, 613]",MISC
1677,was,"[959, 598, 996, 613]",MISC
1678,-,"[998, 598, 1000, 613]",MISC
1679,NL,"[998, 598, 1000, 613]",MISC
1680,-,"[998, 598, 1000, 613]",MISC
1681,an,"[200, 616, 224, 632]",MISC
1682,integral,"[224, 616, 320, 632]",MISC
1683,part,"[321, 616, 370, 632]",MISC
1684,of,"[370, 616, 394, 632]",MISC
1685,the,"[395, 616, 430, 632]",MISC
1686,team,"[431, 616, 490, 632]",MISC
1687,.,"[431, 616, 490, 632]",MISC
1688,-,"[492, 616, 494, 632]",MISC
1689,NL,"[492, 616, 494, 632]",MISC
1690,-,"[492, 616, 494, 632]",MISC
1691,Pre,"[180, 639, 287, 653]",MISC
1692,##par,"[180, 639, 287, 653]",MISC
1693,##ed,"[180, 639, 287, 653]",MISC
1694,technical,"[289, 639, 411, 653]",MISC
1695,reports,"[412, 639, 506, 653]",MISC
1696,documentation,"[507, 639, 683, 653]",MISC
1697,manual,"[684, 639, 779, 653]",MISC
1698,##s,"[684, 639, 779, 653]",MISC
1699,during,"[780, 639, 861, 653]",MISC
1700,the,"[861, 639, 902, 653]",MISC
1701,program,"[902, 639, 997, 653]",MISC
1702,-,"[998, 639, 1000, 653]",MISC
1703,NL,"[998, 639, 1000, 653]",MISC
1704,-,"[998, 639, 1000, 653]",MISC
1705,development,"[200, 656, 338, 674]",MISC
1706,.,"[200, 656, 338, 674]",MISC
1707,-,"[338, 656, 340, 674]",MISC
1708,NL,"[338, 656, 340, 674]",MISC
1709,-,"[338, 656, 340, 674]",MISC
1710,Pro,"[179, 680, 270, 694]",MISC
1711,##vide,"[179, 680, 270, 694]",MISC
1712,guidance,"[270, 680, 374, 694]",MISC
1713,and,"[374, 680, 413, 694]",MISC
1714,support,"[413, 680, 504, 694]",MISC
1715,to,"[504, 680, 530, 694]",MISC
1716,the,"[530, 680, 569, 694]",MISC
1717,client,"[569, 680, 673, 694]",MISC
1718,’,"[569, 680, 673, 694]",MISC
1719,s,"[569, 680, 673, 694]",MISC
1720,internal,"[673, 680, 777, 694]",MISC
1721,teams,"[777, 680, 842, 694]",MISC
1722,such,"[842, 680, 894, 694]",MISC
1723,as,"[894, 680, 920, 694]",MISC
1724,the,"[920, 680, 959, 694]",MISC
1725,U,"[959, 680, 998, 694]",MISC
1726,##AT,"[959, 680, 998, 694]",MISC
1727,-,"[998, 680, 1000, 694]",MISC
1728,NL,"[998, 680, 1000, 694]",MISC
1729,-,"[998, 680, 1000, 694]",MISC
1730,team,"[200, 696, 257, 714]",MISC
1731,",","[200, 696, 257, 714]",MISC
1732,business,"[257, 696, 350, 714]",MISC
1733,analysts,"[350, 696, 454, 714]",MISC
1734,",","[350, 696, 454, 714]",MISC
1735,and,"[455, 696, 488, 714]",MISC
1736,stakeholders,"[489, 696, 639, 714]",MISC
1737,.,"[489, 696, 639, 714]",MISC
1738,-,"[640, 696, 642, 714]",MISC
1739,NL,"[640, 696, 642, 714]",MISC
1740,-,"[640, 696, 642, 714]",MISC
1741,Project,"[133, 737, 242, 753]",MISC
1742,#,"[133, 737, 242, 753]",MISC
1743,3,"[133, 737, 242, 753]",MISC
1744,:,"[133, 737, 242, 753]",MISC
1745,-,"[242, 737, 244, 753]",MISC
1746,NL,"[242, 737, 244, 753]",MISC
1747,-,"[242, 737, 244, 753]",MISC
1748,Project,"[133, 771, 229, 789]",MISC
1749,Name,"[230, 771, 283, 789]",MISC
1750,:,"[285, 771, 298, 789]",MISC
1751,Re,"[299, 771, 380, 789]",B-project_title
1752,##tail,"[299, 771, 380, 789]",I-project_title
1753,Medical,"[382, 771, 478, 789]",I-project_title
1754,Store,"[479, 771, 547, 789]",I-project_title
1755,-,"[548, 771, 550, 789]",MISC
1756,NL,"[548, 771, 550, 789]",MISC
1757,-,"[548, 771, 550, 789]",MISC
1758,C,"[133, 791, 233, 809]",MISC
1759,##lient,"[133, 791, 233, 809]",MISC
1760,:,"[233, 791, 250, 809]",MISC
1761,Global,"[250, 791, 350, 809]",MISC
1762,Health,"[351, 791, 451, 809]",MISC
1763,line,"[451, 791, 518, 809]",MISC
1764,-,"[518, 791, 520, 809]",MISC
1765,NL,"[518, 791, 520, 809]",MISC
1766,-,"[518, 791, 520, 809]",MISC
1767,Team,"[133, 810, 203, 828]",MISC
1768,Si,"[203, 810, 274, 828]",MISC
1769,##ze,"[203, 810, 274, 828]",MISC
1770,:,"[274, 810, 291, 828]",MISC
1771,8,"[292, 810, 308, 828]",MISC
1772,Members,"[309, 810, 432, 828]",MISC
1773,-,"[433, 810, 435, 828]",MISC
1774,NL,"[433, 810, 435, 828]",MISC
1775,-,"[433, 810, 435, 828]",MISC
1776,Technologies,"[133, 830, 277, 848]",MISC
1777,:,"[278, 830, 289, 848]",MISC
1778,Java,"[290, 830, 349, 848]",MISC
1779,",","[290, 830, 349, 848]",MISC
1780,spring,"[350, 830, 434, 848]",MISC
1781,",","[350, 830, 434, 848]",MISC
1782,hi,"[435, 830, 555, 848]",MISC
1783,##ber,"[435, 830, 555, 848]",MISC
1784,##nate,"[435, 830, 555, 848]",MISC
1785,",","[435, 830, 555, 848]",MISC
1786,R,"[556, 830, 615, 848]",MISC
1787,##ES,"[556, 830, 615, 848]",MISC
1788,##T,"[556, 830, 615, 848]",MISC
1789,",","[556, 830, 615, 848]",MISC
1790,Ser,"[616, 830, 713, 848]",MISC
1791,##v,"[616, 830, 713, 848]",MISC
1792,##let,"[616, 830, 713, 848]",MISC
1793,",","[616, 830, 713, 848]",MISC
1794,J,"[713, 830, 748, 848]",MISC
1795,##SP,"[713, 830, 748, 848]",MISC
1796,-,"[750, 830, 751, 848]",MISC
1797,NL,"[750, 830, 751, 848]",MISC
1798,-,"[750, 830, 751, 848]",MISC
1799,Too,"[333, 849, 390, 866]",MISC
1800,##ls,"[333, 849, 390, 866]",MISC
1801,&,"[392, 849, 403, 866]",MISC
1802,server,"[403, 849, 485, 866]",MISC
1803,:,"[403, 849, 485, 866]",MISC
1804,Too,"[486, 849, 543, 866]",MISC
1805,##ls,"[486, 849, 543, 866]",MISC
1806,(,"[545, 849, 661, 866]",MISC
1807,Eclipse,"[545, 849, 661, 866]",MISC
1808,",","[545, 849, 661, 866]",MISC
1809,",","[545, 849, 661, 866]",MISC
1810,Ma,"[662, 849, 733, 866]",MISC
1811,##ven,"[662, 849, 733, 866]",MISC
1812,",","[662, 849, 733, 866]",MISC
1813,J,"[733, 849, 803, 866]",MISC
1814,##U,"[733, 849, 803, 866]",MISC
1815,##ni,"[733, 849, 803, 866]",MISC
1816,##t,"[733, 849, 803, 866]",MISC
1817,",","[733, 849, 803, 866]",MISC
1818,Lo,"[803, 849, 885, 866]",MISC
1819,##g,"[803, 849, 885, 866]",MISC
1820,##4,"[803, 849, 885, 866]",MISC
1821,##j,"[803, 849, 885, 866]",MISC
1822,),"[803, 849, 885, 866]",MISC
1823,",","[803, 849, 885, 866]",MISC
1824,server,"[886, 849, 967, 866]",MISC
1825,-,"[886, 849, 967, 866]",MISC
1826,-,"[968, 849, 970, 866]",MISC
1827,NL,"[968, 849, 970, 866]",MISC
1828,-,"[968, 849, 970, 866]",MISC
1829,Web,"[133, 866, 174, 884]",MISC
1830,Logic,"[174, 866, 240, 884]",MISC
1831,-,"[242, 866, 244, 884]",MISC
1832,NL,"[242, 866, 244, 884]",MISC
1833,-,"[242, 866, 244, 884]",MISC
1834,Database,"[133, 885, 268, 904]",MISC
1835,:,"[269, 885, 286, 904]",MISC
1836,Oracle,"[286, 885, 388, 904]",MISC
1837,-,"[388, 885, 390, 904]",MISC
1838,NL,"[388, 885, 390, 904]",MISC
1839,-,"[388, 885, 390, 904]",MISC
1840,Project,"[133, 923, 216, 941]",MISC
1841,Des,"[217, 923, 359, 941]",MISC
1842,##cription,"[217, 923, 359, 941]",MISC
1843,:,"[217, 923, 359, 941]",MISC
1844,-,"[361, 923, 362, 941]",MISC
1845,NL,"[361, 923, 362, 941]",MISC
1846,-,"[361, 923, 362, 941]",MISC
1847,This,"[216, 963, 264, 981]",MISC
1848,project,"[264, 963, 348, 981]",MISC
1849,is,"[349, 963, 373, 981]",MISC
1850,used,"[373, 963, 421, 981]",MISC
1851,mainly,"[421, 963, 493, 981]",MISC
1852,for,"[493, 963, 529, 981]",MISC
1853,medical,"[530, 963, 613, 981]",MISC
1854,stores,"[614, 963, 686, 981]",MISC
1855,to,"[686, 963, 710, 981]",MISC
1856,maintain,"[710, 963, 807, 981]",MISC
1857,the,"[807, 963, 842, 981]",MISC
1858,details,"[843, 963, 926, 981]",MISC
1859,of,"[927, 963, 951, 981]",MISC
1860,-,"[951, 963, 953, 981]",MISC
1861,NL,"[951, 963, 953, 981]",MISC
1862,-,"[951, 963, 953, 981]",MISC
1863,medical,"[133, 981, 220, 1000]",MISC
1864,store,"[221, 981, 282, 1000]",MISC
1865,such,"[284, 981, 334, 1000]",MISC
1866,as,"[334, 981, 358, 1000]",MISC
1867,stock,"[359, 981, 420, 1000]",MISC
1868,and,"[422, 981, 459, 1000]",MISC
1869,account,"[460, 981, 560, 1000]",MISC
1870,.,"[460, 981, 560, 1000]",MISC
1871,This,"[560, 981, 610, 1000]",MISC
1872,software,"[610, 981, 710, 1000]",MISC
1873,is,"[711, 981, 735, 1000]",MISC
1874,so,"[736, 981, 760, 1000]",MISC
1875,designed,"[761, 981, 861, 1000]",MISC
1876,as,"[862, 981, 886, 1000]",MISC
1877,to,"[887, 981, 911, 1000]",MISC
1878,ease,"[912, 981, 962, 1000]",MISC
1879,-,"[962, 981, 964, 1000]",MISC
1880,NL,"[962, 981, 964, 1000]",MISC
1881,-,"[962, 981, 964, 1000]",MISC
1882,the,"[133, 100, 168, 116]",MISC
1883,work,"[169, 100, 217, 116]",MISC
1884,load,"[218, 100, 277, 116]",MISC
1885,.,"[218, 100, 277, 116]",MISC
1886,The,"[278, 100, 313, 116]",MISC
1887,main,"[315, 100, 363, 116]",MISC
1888,feature,"[363, 100, 446, 116]",MISC
1889,includes,"[448, 100, 544, 116]",MISC
1890,inventory,"[545, 100, 652, 116]",MISC
1891,and,"[654, 100, 689, 116]",MISC
1892,stock,"[690, 100, 749, 116]",MISC
1893,control,"[751, 100, 847, 116]",MISC
1894,",","[751, 100, 847, 116]",MISC
1895,accounting,"[848, 100, 979, 116]",MISC
1896,",","[848, 100, 979, 116]",MISC
1897,-,"[981, 100, 983, 116]",MISC
1898,NL,"[981, 100, 983, 116]",MISC
1899,-,"[981, 100, 983, 116]",MISC
1900,customer,"[133, 116, 233, 134]",MISC
1901,management,"[234, 116, 373, 134]",MISC
1902,.,"[234, 116, 373, 134]",MISC
1903,In,"[373, 116, 397, 134]",MISC
1904,this,"[398, 116, 448, 134]",MISC
1905,software,"[449, 116, 549, 134]",MISC
1906,we,"[550, 116, 574, 134]",MISC
1907,can,"[576, 116, 613, 134]",MISC
1908,maintain,"[614, 116, 714, 134]",MISC
1909,the,"[715, 116, 752, 134]",MISC
1910,data,"[753, 116, 803, 134]",MISC
1911,of,"[803, 116, 827, 134]",MISC
1912,medicines,"[829, 116, 954, 134]",MISC
1913,",","[829, 116, 954, 134]",MISC
1914,-,"[955, 116, 957, 134]",MISC
1915,NL,"[955, 116, 957, 134]",MISC
1916,-,"[955, 116, 957, 134]",MISC
1917,customers,"[133, 134, 251, 152]",MISC
1918,and,"[252, 134, 291, 152]",MISC
1919,bill,"[292, 134, 410, 152]",MISC
1920,##ings,"[292, 134, 410, 152]",MISC
1921,.,"[292, 134, 410, 152]",MISC
1922,We,"[411, 134, 436, 152]",MISC
1923,can,"[437, 134, 476, 152]",MISC
1924,add,"[477, 134, 516, 152]",MISC
1925,the,"[516, 134, 555, 152]",MISC
1926,new,"[556, 134, 595, 152]",MISC
1927,customers,"[596, 134, 714, 152]",MISC
1928,or,"[715, 134, 741, 152]",MISC
1929,we,"[741, 134, 767, 152]",MISC
1930,can,"[768, 134, 806, 152]",MISC
1931,get,"[807, 134, 846, 152]",MISC
1932,old,"[847, 134, 886, 152]",MISC
1933,-,"[887, 134, 888, 152]",MISC
1934,NL,"[887, 134, 888, 152]",MISC
1935,-,"[887, 134, 888, 152]",MISC
1936,customers,"[133, 152, 246, 171]",MISC
1937,details,"[247, 152, 336, 171]",MISC
1938,by,"[337, 152, 361, 171]",MISC
1939,using,"[362, 152, 425, 171]",MISC
1940,mobile,"[426, 152, 502, 171]",MISC
1941,number,"[502, 152, 591, 171]",MISC
1942,.,"[502, 152, 591, 171]",MISC
1943,We,"[591, 152, 615, 171]",MISC
1944,can,"[617, 152, 654, 171]",MISC
1945,search,"[655, 152, 731, 171]",MISC
1946,for,"[731, 152, 768, 171]",MISC
1947,medicines,"[770, 152, 896, 171]",MISC
1948,",","[770, 152, 896, 171]",MISC
1949,add,"[897, 152, 934, 171]",MISC
1950,to,"[935, 152, 959, 171]",MISC
1951,-,"[961, 152, 962, 171]",MISC
1952,NL,"[961, 152, 962, 171]",MISC
1953,-,"[961, 152, 962, 171]",MISC
1954,the,"[133, 171, 168, 189]",MISC
1955,bill,"[168, 171, 214, 189]",MISC
1956,and,"[215, 171, 250, 189]",MISC
1957,print,"[250, 171, 308, 189]",MISC
1958,the,"[309, 171, 344, 189]",MISC
1959,bill,"[344, 171, 391, 189]",MISC
1960,and,"[391, 171, 426, 189]",MISC
1961,customer,"[426, 171, 519, 189]",MISC
1962,details,"[520, 171, 613, 189]",MISC
1963,.,"[520, 171, 613, 189]",MISC
1964,-,"[614, 171, 616, 189]",MISC
1965,NL,"[614, 171, 616, 189]",MISC
1966,-,"[614, 171, 616, 189]",MISC
1967,Re,"[133, 208, 322, 226]",MISC
1968,##sp,"[133, 208, 322, 226]",MISC
1969,##ons,"[133, 208, 322, 226]",MISC
1970,##ibi,"[133, 208, 322, 226]",MISC
1971,##lities,"[133, 208, 322, 226]",MISC
1972,:,"[133, 208, 322, 226]",MISC
1973,-,"[322, 208, 324, 226]",MISC
1974,NL,"[322, 208, 324, 226]",MISC
1975,-,"[322, 208, 324, 226]",MISC
1976,In,"[180, 287, 289, 301]",MISC
1977,##volved,"[180, 287, 289, 301]",MISC
1978,in,"[291, 287, 317, 301]",MISC
1979,Full,"[319, 287, 372, 301]",MISC
1980,Cycle,"[374, 287, 443, 301]",MISC
1981,of,"[443, 287, 469, 301]",MISC
1982,Software,"[471, 287, 580, 301]",MISC
1983,Development,"[582, 287, 734, 301]",MISC
1984,from,"[734, 287, 788, 301]",MISC
1985,Analysis,"[790, 287, 899, 301]",MISC
1986,through,"[901, 287, 997, 301]",MISC
1987,-,"[998, 287, 1000, 301]",MISC
1988,NL,"[998, 287, 1000, 301]",MISC
1989,-,"[998, 287, 1000, 301]",MISC
1990,Design,"[200, 301, 272, 319]",MISC
1991,Development,"[272, 301, 403, 319]",MISC
1992,Integration,"[404, 301, 536, 319]",MISC
1993,and,"[537, 301, 572, 319]",MISC
1994,testing,"[573, 301, 657, 319]",MISC
1995,phases,"[658, 301, 741, 319]",MISC
1996,.,"[658, 301, 741, 319]",MISC
1997,-,"[742, 301, 744, 319]",MISC
1998,NL,"[742, 301, 744, 319]",MISC
1999,-,"[742, 301, 744, 319]",MISC
2000,In,"[181, 322, 300, 337]",MISC
2001,##volved,"[181, 322, 300, 337]",MISC
2002,in,"[300, 322, 330, 337]",MISC
2003,the,"[330, 322, 374, 337]",MISC
2004,configuration,"[375, 322, 567, 337]",MISC
2005,of,"[568, 322, 598, 337]",MISC
2006,Spring,"[598, 322, 687, 337]",MISC
2007,MV,"[687, 322, 731, 337]",MISC
2008,##C,"[687, 322, 731, 337]",MISC
2009,File,"[732, 322, 791, 337]",MISC
2010,Down,"[791, 322, 910, 337]",MISC
2011,##load,"[791, 322, 910, 337]",MISC
2012,and,"[910, 322, 955, 337]",MISC
2013,OR,"[955, 322, 999, 337]",MISC
2014,##M,"[955, 322, 999, 337]",MISC
2015,-,"[1000, 322, 1001, 337]",MISC
2016,NL,"[1000, 322, 1001, 337]",MISC
2017,-,"[1000, 322, 1001, 337]",MISC
2018,Framework,"[200, 337, 322, 354]",MISC
2019,##s,"[200, 337, 322, 354]",MISC
2020,Hi,"[323, 337, 445, 354]",MISC
2021,##ber,"[323, 337, 445, 354]",MISC
2022,##nate,"[323, 337, 445, 354]",MISC
2023,.,"[323, 337, 445, 354]",MISC
2024,-,"[446, 337, 448, 354]",MISC
2025,NL,"[446, 337, 448, 354]",MISC
2026,-,"[446, 337, 448, 354]",MISC
2027,Designed,"[179, 358, 283, 372]",MISC
2028,and,"[284, 358, 323, 372]",MISC
2029,implemented,"[323, 358, 466, 372]",MISC
2030,Trans,"[467, 358, 609, 372]",MISC
2031,##action,"[467, 358, 609, 372]",MISC
2032,Management,"[610, 358, 740, 372]",MISC
2033,using,"[741, 358, 806, 372]",MISC
2034,Spring,"[806, 358, 897, 372]",MISC
2035,.,"[806, 358, 897, 372]",MISC
2036,-,"[898, 358, 900, 372]",MISC
2037,NL,"[898, 358, 900, 372]",MISC
2038,-,"[898, 358, 900, 372]",MISC
2039,Used,"[179, 376, 229, 390]",MISC
2040,Hi,"[231, 376, 345, 390]",MISC
2041,##ber,"[231, 376, 345, 390]",MISC
2042,##nate,"[231, 376, 345, 390]",MISC
2043,for,"[346, 376, 383, 390]",MISC
2044,mapping,"[385, 376, 474, 390]",MISC
2045,business,"[475, 376, 577, 390]",MISC
2046,objects,"[578, 376, 667, 390]",MISC
2047,to,"[668, 376, 692, 390]",MISC
2048,the,"[694, 376, 731, 390]",MISC
2049,Oracle,"[732, 376, 808, 390]",MISC
2050,database,"[810, 376, 911, 390]",MISC
2051,-,"[912, 376, 914, 390]",MISC
2052,NL,"[912, 376, 914, 390]",MISC
2053,-,"[912, 376, 914, 390]",MISC
2054,Dev,"[180, 394, 306, 408]",MISC
2055,##elo,"[180, 394, 306, 408]",MISC
2056,##ped,"[180, 394, 306, 408]",MISC
2057,-,"[307, 394, 309, 408]",MISC
2058,NL,"[307, 394, 309, 408]",MISC
2059,-,"[307, 394, 309, 408]",MISC
2060,client,"[366, 394, 424, 408]",MISC
2061,-,"[424, 394, 425, 408]",MISC
2062,NL,"[424, 394, 425, 408]",MISC
2063,-,"[424, 394, 425, 408]",MISC
2064,request,"[483, 394, 561, 408]",MISC
2065,-,"[561, 394, 562, 408]",MISC
2066,NL,"[561, 394, 562, 408]",MISC
2067,-,"[561, 394, 562, 408]",MISC
2068,valid,"[618, 394, 731, 408]",MISC
2069,##ations,"[618, 394, 731, 408]",MISC
2070,-,"[731, 394, 733, 408]",MISC
2071,NL,"[731, 394, 733, 408]",MISC
2072,-,"[731, 394, 733, 408]",MISC
2073,and,"[790, 394, 827, 408]",MISC
2074,-,"[827, 394, 829, 408]",MISC
2075,NL,"[827, 394, 829, 408]",MISC
2076,-,"[827, 394, 829, 408]",MISC
2077,processing,"[887, 394, 998, 408]",MISC
2078,-,"[998, 394, 1000, 408]",MISC
2079,NL,"[998, 394, 1000, 408]",MISC
2080,-,"[998, 394, 1000, 408]",MISC
2081,using,"[200, 408, 262, 426]",MISC
2082,Java,"[263, 408, 389, 426]",MISC
2083,##Script,"[263, 408, 389, 426]",MISC
2084,and,"[390, 408, 427, 426]",MISC
2085,H,"[428, 408, 491, 426]",MISC
2086,##TM,"[428, 408, 491, 426]",MISC
2087,##L,"[428, 408, 491, 426]",MISC
2088,.,"[428, 408, 491, 426]",MISC
2089,-,"[492, 408, 494, 426]",MISC
2090,NL,"[492, 408, 494, 426]",MISC
2091,-,"[492, 408, 494, 426]",MISC
2092,Review,"[181, 429, 270, 443]",MISC
2093,the,"[272, 429, 316, 443]",MISC
2094,developed,"[317, 429, 453, 443]",MISC
2095,code,"[453, 429, 513, 443]",MISC
2096,and,"[514, 429, 558, 443]",MISC
2097,make,"[559, 429, 618, 443]",MISC
2098,sure,"[620, 429, 679, 443]",MISC
2099,it,"[680, 429, 710, 443]",MISC
2100,ad,"[710, 429, 816, 443]",MISC
2101,##here,"[710, 429, 816, 443]",MISC
2102,##s,"[710, 429, 816, 443]",MISC
2103,to,"[816, 429, 846, 443]",MISC
2104,the,"[846, 429, 891, 443]",MISC
2105,design,"[892, 429, 997, 443]",MISC
2106,",","[892, 429, 997, 443]",MISC
2107,-,"[998, 429, 1000, 443]",MISC
2108,NL,"[998, 429, 1000, 443]",MISC
2109,-,"[998, 429, 1000, 443]",MISC
2110,standards,"[200, 443, 303, 461]",MISC
2111,and,"[304, 443, 338, 461]",MISC
2112,guidelines,"[339, 443, 454, 461]",MISC
2113,of,"[456, 443, 478, 461]",MISC
2114,the,"[479, 443, 513, 461]",MISC
2115,client,"[514, 443, 596, 461]",MISC
2116,.,"[514, 443, 596, 461]",MISC
2117,-,"[596, 443, 598, 461]",MISC
2118,NL,"[596, 443, 598, 461]",MISC
2119,-,"[596, 443, 598, 461]",MISC
2120,De,"[179, 465, 255, 479]",MISC
2121,##p,"[179, 465, 255, 479]",MISC
2122,##loy,"[179, 465, 255, 479]",MISC
2123,minor,"[255, 465, 394, 479]",MISC
2124,/,"[255, 465, 394, 479]",MISC
2125,major,"[255, 465, 394, 479]",MISC
2126,releases,"[394, 465, 494, 479]",MISC
2127,-,"[496, 465, 498, 479]",MISC
2128,NL,"[496, 465, 498, 479]",MISC
2129,-,"[496, 465, 498, 479]",MISC
2130,In,"[179, 484, 277, 497]",MISC
2131,##volved,"[179, 484, 277, 497]",MISC
2132,in,"[278, 484, 302, 497]",MISC
2133,code,"[303, 484, 351, 497]",MISC
2134,enhance,"[353, 484, 501, 497]",MISC
2135,##ment,"[353, 484, 501, 497]",MISC
2136,",","[353, 484, 501, 497]",MISC
2137,De,"[502, 484, 664, 497]",MISC
2138,##fect,"[502, 484, 664, 497]",MISC
2139,##fi,"[502, 484, 664, 497]",MISC
2140,##xing,"[502, 484, 664, 497]",MISC
2141,.,"[502, 484, 664, 497]",MISC
2142,-,"[664, 484, 666, 497]",MISC
2143,NL,"[664, 484, 666, 497]",MISC
2144,-,"[664, 484, 666, 497]",MISC
2145,Personal,"[133, 560, 227, 578]",B-personal_details_heading
2146,Profile,"[227, 560, 322, 578]",I-personal_details_heading
2147,:,"[227, 560, 322, 578]",I-personal_details_heading
2148,-,"[322, 560, 324, 578]",MISC
2149,NL,"[322, 560, 324, 578]",MISC
2150,-,"[322, 560, 324, 578]",MISC
2151,Name,"[133, 591, 292, 609]",MISC
2152,:,"[294, 591, 332, 609]",MISC
2153,Man,"[334, 591, 534, 609]",B-name
2154,##o,"[334, 591, 534, 609]",I-name
2155,##j,"[334, 591, 534, 609]",I-name
2156,Sen,"[535, 591, 655, 609]",I-name
2157,-,"[655, 591, 657, 609]",MISC
2158,NL,"[655, 591, 657, 609]",MISC
2159,-,"[655, 591, 657, 609]",MISC
2160,Gender,"[133, 627, 312, 643]",MISC
2161,:,"[314, 627, 343, 643]",MISC
2162,Male,"[344, 627, 464, 643]",MISC
2163,-,"[464, 627, 466, 643]",MISC
2164,NL,"[464, 627, 466, 643]",MISC
2165,-,"[464, 627, 466, 643]",MISC
2166,Date,"[133, 662, 222, 680]",MISC
2167,of,"[222, 662, 266, 680]",MISC
2168,Birth,"[266, 662, 377, 680]",MISC
2169,:,"[377, 662, 400, 680]",MISC
2170,15th,"[400, 662, 488, 680]",MISC
2171,May,"[488, 662, 577, 680]",MISC
2172,",","[488, 662, 577, 680]",MISC
2173,1991,"[577, 662, 666, 680]",MISC
2174,-,"[666, 662, 668, 680]",MISC
2175,NL,"[666, 662, 668, 680]",MISC
2176,-,"[666, 662, 668, 680]",MISC
2177,Languages,"[133, 698, 303, 716]",MISC
2178,Known,"[304, 698, 399, 716]",MISC
2179,:,"[400, 698, 418, 716]",MISC
2180,English,"[419, 698, 570, 716]",MISC
2181,",","[419, 698, 570, 716]",MISC
2182,Hindi,"[571, 698, 665, 716]",MISC
2183,-,"[666, 698, 668, 716]",MISC
2184,NL,"[666, 698, 668, 716]",MISC
2185,-,"[666, 698, 668, 716]",MISC
2186,Permanent,"[133, 734, 274, 752]",MISC
2187,Ad,"[274, 734, 383, 752]",MISC
2188,##dress,"[274, 734, 383, 752]",MISC
2189,:,"[384, 734, 399, 752]",MISC
2190,ward,"[399, 734, 461, 752]",MISC
2191,no,"[462, 734, 492, 752]",MISC
2192,17,"[494, 734, 523, 752]",MISC
2193,D,"[525, 734, 649, 752]",MISC
2194,##han,"[525, 734, 649, 752]",MISC
2195,##pur,"[525, 734, 649, 752]",MISC
2196,##i,"[525, 734, 649, 752]",MISC
2197,di,"[650, 734, 712, 752]",MISC
2198,##st,"[650, 734, 712, 752]",MISC
2199,s,"[713, 734, 822, 752]",MISC
2200,##ha,"[713, 734, 822, 752]",MISC
2201,##h,"[713, 734, 822, 752]",MISC
2202,##do,"[713, 734, 822, 752]",MISC
2203,##l,"[713, 734, 822, 752]",MISC
2204,(,"[823, 734, 901, 752]",MISC
2205,M,"[823, 734, 901, 752]",MISC
2206,.,"[823, 734, 901, 752]",MISC
2207,P,"[823, 734, 901, 752]",MISC
2208,),"[823, 734, 901, 752]",MISC
2209,-,"[901, 734, 903, 752]",MISC
2210,NL,"[901, 734, 903, 752]",MISC
2211,-,"[901, 734, 903, 752]",MISC
2212,pin,"[538, 752, 657, 770]",MISC
2213,-,"[538, 752, 657, 770]",MISC
2214,48,"[538, 752, 657, 770]",MISC
2215,##41,"[538, 752, 657, 770]",MISC
2216,##14,"[538, 752, 657, 770]",MISC
2217,-,"[657, 752, 659, 770]",MISC
2218,NL,"[657, 752, 659, 770]",MISC
2219,-,"[657, 752, 659, 770]",MISC
