,token,box,label
0,Mad,"[89, 87, 254, 103]",B-name
1,##hus,"[89, 87, 254, 103]",I-name
2,##uda,"[89, 87, 254, 103]",I-name
3,##na,"[89, 87, 254, 103]",I-name
4,A,"[256, 87, 270, 103]",I-name
5,C,"[271, 87, 286, 103]",I-name
6,-,"[286, 87, 288, 103]",MISC
7,NL,"[286, 87, 288, 103]",MISC
8,-,"[286, 87, 288, 103]",MISC
9,Mobile,"[89, 103, 180, 120]",MISC
10,:,"[89, 103, 180, 120]",MISC
11,97,"[181, 103, 313, 120]",B-phones_phone
12,##40,"[181, 103, 313, 120]",I-phones_phone
13,##12,"[181, 103, 313, 120]",I-phones_phone
14,##27,"[181, 103, 313, 120]",I-phones_phone
15,##00,"[181, 103, 313, 120]",I-phones_phone
16,-,"[313, 103, 315, 120]",MISC
17,NL,"[313, 103, 315, 120]",MISC
18,-,"[313, 103, 315, 120]",MISC
19,Em,"[89, 120, 167, 137]",MISC
20,##ail,"[89, 120, 167, 137]",MISC
21,:,"[89, 120, 167, 137]",MISC
22,mad,"[168, 120, 483, 137]",B-emails_email
23,##hus,"[168, 120, 483, 137]",I-emails_email
24,##uda,"[168, 120, 483, 137]",I-emails_email
25,##na,"[168, 120, 483, 137]",I-emails_email
26,.,"[168, 120, 483, 137]",I-emails_email
27,a,"[168, 120, 483, 137]",I-emails_email
28,##c,"[168, 120, 483, 137]",I-emails_email
29,@,"[168, 120, 483, 137]",I-emails_email
30,g,"[168, 120, 483, 137]",I-emails_email
31,##mail,"[168, 120, 483, 137]",I-emails_email
32,.,"[168, 120, 483, 137]",I-emails_email
33,com,"[168, 120, 483, 137]",I-emails_email
34,-,"[484, 120, 486, 137]",MISC
35,NL,"[484, 120, 486, 137]",MISC
36,-,"[484, 120, 486, 137]",MISC
37,Over,"[89, 171, 135, 187]",MISC
38,all,"[137, 171, 172, 187]",MISC
39,8,"[173, 171, 183, 187]",MISC
40,years,"[185, 171, 243, 187]",MISC
41,of,"[244, 171, 268, 187]",MISC
42,IT,"[268, 171, 292, 187]",MISC
43,experience,"[292, 171, 422, 187]",MISC
44,.,"[292, 171, 422, 187]",MISC
45,Work,"[424, 171, 471, 187]",MISC
46,experience,"[472, 171, 592, 187]",MISC
47,in,"[592, 171, 615, 187]",MISC
48,multiple,"[616, 171, 710, 187]",MISC
49,domains,"[712, 171, 796, 187]",MISC
50,like,"[796, 171, 842, 187]",MISC
51,Finance,"[844, 171, 938, 187]",MISC
52,",","[844, 171, 938, 187]",MISC
53,Cable,"[940, 171, 998, 187]",MISC
54,-,"[999, 171, 1001, 187]",MISC
55,NL,"[999, 171, 1001, 187]",MISC
56,-,"[999, 171, 1001, 187]",MISC
57,te,"[89, 187, 196, 205]",MISC
58,##le,"[89, 187, 196, 205]",MISC
59,##phony,"[89, 187, 196, 205]",MISC
60,&,"[196, 187, 207, 205]",MISC
61,broadband,"[208, 187, 315, 205]",MISC
62,and,"[316, 187, 352, 205]",MISC
63,manufacturing,"[352, 187, 626, 205]",MISC
64,/,"[352, 187, 626, 205]",MISC
65,marketing,"[352, 187, 626, 205]",MISC
66,industries,"[627, 187, 757, 205]",MISC
67,.,"[627, 187, 757, 205]",MISC
68,Ex,"[758, 187, 865, 205]",MISC
69,##tensive,"[758, 187, 865, 205]",MISC
70,knowledge,"[866, 187, 973, 205]",MISC
71,of,"[974, 187, 997, 205]",MISC
72,-,"[998, 187, 1000, 205]",MISC
73,NL,"[998, 187, 1000, 205]",MISC
74,-,"[998, 187, 1000, 205]",MISC
75,SD,"[89, 205, 135, 222]",MISC
76,##LC,"[89, 205, 135, 222]",MISC
77,processes,"[136, 205, 253, 222]",MISC
78,",","[136, 205, 253, 222]",MISC
79,software,"[254, 205, 347, 222]",MISC
80,development,"[348, 205, 477, 222]",MISC
81,method,"[478, 205, 642, 222]",MISC
82,##ologies,"[478, 205, 642, 222]",MISC
83,",","[478, 205, 642, 222]",MISC
84,C,"[644, 205, 797, 222]",MISC
85,##lient,"[644, 205, 797, 222]",MISC
86,/,"[644, 205, 797, 222]",MISC
87,Server,"[644, 205, 797, 222]",MISC
88,and,"[797, 205, 831, 222]",MISC
89,O,"[832, 205, 902, 222]",MISC
90,##bject,"[832, 205, 902, 222]",MISC
91,Orient,"[903, 205, 996, 222]",MISC
92,##ed,"[903, 205, 996, 222]",MISC
93,-,"[998, 205, 1000, 222]",MISC
94,NL,"[998, 205, 1000, 222]",MISC
95,-,"[998, 205, 1000, 222]",MISC
96,Programming,"[89, 222, 222, 239]",MISC
97,techniques,"[224, 222, 345, 239]",MISC
98,(,"[347, 222, 420, 239]",MISC
99,O,"[347, 222, 420, 239]",MISC
100,##OP,"[347, 222, 420, 239]",MISC
101,),"[347, 222, 420, 239]",MISC
102,.,"[347, 222, 420, 239]",MISC
103,Ski,"[420, 222, 506, 239]",MISC
104,##lled,"[420, 222, 506, 239]",MISC
105,in,"[506, 222, 529, 239]",MISC
106,.,"[531, 222, 579, 239]",MISC
107,Net,"[531, 222, 579, 239]",MISC
108,framework,"[580, 222, 701, 239]",MISC
109,",","[580, 222, 701, 239]",MISC
110,C,"[703, 222, 739, 239]",MISC
111,#,"[703, 222, 739, 239]",MISC
112,",","[703, 222, 739, 239]",MISC
113,AS,"[740, 222, 838, 239]",MISC
114,##P,"[740, 222, 838, 239]",MISC
115,.,"[740, 222, 838, 239]",MISC
116,NE,"[740, 222, 838, 239]",MISC
117,##T,"[740, 222, 838, 239]",MISC
118,",","[740, 222, 838, 239]",MISC
119,AD,"[838, 222, 936, 239]",MISC
120,##O,"[838, 222, 936, 239]",MISC
121,.,"[838, 222, 936, 239]",MISC
122,NE,"[838, 222, 936, 239]",MISC
123,##T,"[838, 222, 936, 239]",MISC
124,",","[838, 222, 936, 239]",MISC
125,L,"[936, 222, 997, 239]",MISC
126,##IN,"[936, 222, 997, 239]",MISC
127,##Q,"[936, 222, 997, 239]",MISC
128,",","[936, 222, 997, 239]",MISC
129,-,"[998, 222, 1000, 239]",MISC
130,NL,"[998, 222, 1000, 239]",MISC
131,-,"[998, 222, 1000, 239]",MISC
132,WC,"[89, 239, 137, 256]",MISC
133,##F,"[89, 239, 137, 256]",MISC
134,",","[89, 239, 137, 256]",MISC
135,V,"[137, 239, 185, 256]",MISC
136,##B,"[137, 239, 185, 256]",MISC
137,##6,"[137, 239, 185, 256]",MISC
138,",","[137, 239, 185, 256]",MISC
139,AD,"[186, 239, 234, 256]",MISC
140,##O,"[186, 239, 234, 256]",MISC
141,",","[186, 239, 234, 256]",MISC
142,S,"[234, 239, 366, 256]",MISC
143,##QL,"[234, 239, 366, 256]",MISC
144,-,"[234, 239, 366, 256]",MISC
145,Server,"[234, 239, 366, 256]",MISC
146,",","[234, 239, 366, 256]",MISC
147,Oracle,"[368, 239, 452, 256]",MISC
148,",","[368, 239, 452, 256]",MISC
149,MS,"[453, 239, 574, 256]",MISC
150,-,"[453, 239, 574, 256]",MISC
151,Access,"[453, 239, 574, 256]",MISC
152,.,"[453, 239, 574, 256]",MISC
153,Strong,"[574, 239, 646, 256]",MISC
154,mathematical,"[647, 239, 792, 256]",MISC
155,background,"[793, 239, 914, 256]",MISC
156,coupled,"[914, 239, 998, 256]",MISC
157,-,"[1000, 239, 1001, 256]",MISC
158,NL,"[1000, 239, 1001, 256]",MISC
159,-,"[1000, 239, 1001, 256]",MISC
160,with,"[89, 256, 131, 272]",MISC
161,excellent,"[132, 256, 228, 272]",MISC
162,problem,"[230, 256, 305, 272]",MISC
163,solving,"[306, 256, 381, 272]",MISC
164,/,"[382, 256, 479, 272]",MISC
165,decision,"[382, 256, 479, 272]",MISC
166,making,"[480, 256, 544, 272]",MISC
167,skills,"[545, 256, 620, 272]",MISC
168,.,"[545, 256, 620, 272]",MISC
169,-,"[622, 256, 623, 272]",MISC
170,NL,"[622, 256, 623, 272]",MISC
171,-,"[622, 256, 623, 272]",MISC
172,Technical,"[409, 306, 524, 324]",MISC
173,Ski,"[525, 306, 587, 324]",MISC
174,##ll,"[525, 306, 587, 324]",MISC
175,Su,"[589, 306, 678, 324]",MISC
176,##mma,"[589, 306, 678, 324]",MISC
177,##ry,"[589, 306, 678, 324]",MISC
178,-,"[679, 306, 680, 324]",MISC
179,NL,"[679, 306, 680, 324]",MISC
180,-,"[679, 306, 680, 324]",MISC
181,Operating,"[137, 326, 287, 341]",MISC
182,Systems,"[287, 326, 403, 341]",MISC
183,:,"[404, 326, 420, 341]",MISC
184,Windows,"[420, 326, 536, 341]",MISC
185,X,"[537, 326, 702, 341]",MISC
186,##P,"[537, 326, 702, 341]",MISC
187,/,"[537, 326, 702, 341]",MISC
188,Windows,"[537, 326, 702, 341]",MISC
189,7,"[703, 326, 719, 341]",MISC
190,-,"[720, 326, 721, 341]",MISC
191,NL,"[720, 326, 721, 341]",MISC
192,-,"[720, 326, 721, 341]",MISC
193,Technologies,"[135, 343, 445, 357]",MISC
194,/,"[135, 343, 445, 357]",MISC
195,Languages,"[135, 343, 445, 357]",MISC
196,:,"[447, 343, 459, 357]",MISC
197,Framework,"[461, 343, 587, 357]",MISC
198,3,"[588, 343, 629, 357]",MISC
199,.,"[588, 343, 629, 357]",MISC
200,5,"[588, 343, 629, 357]",MISC
201,and,"[631, 343, 672, 357]",MISC
202,4,"[673, 343, 729, 357]",MISC
203,.,"[673, 343, 729, 357]",MISC
204,0,"[673, 343, 729, 357]",MISC
205,",","[673, 343, 729, 357]",MISC
206,C,"[730, 343, 771, 357]",MISC
207,#,"[730, 343, 771, 357]",MISC
208,",","[730, 343, 771, 357]",MISC
209,AD,"[773, 343, 885, 357]",MISC
210,##O,"[773, 343, 885, 357]",MISC
211,.,"[773, 343, 885, 357]",MISC
212,NE,"[773, 343, 885, 357]",MISC
213,##T,"[773, 343, 885, 357]",MISC
214,",","[773, 343, 885, 357]",MISC
215,V,"[886, 343, 941, 357]",MISC
216,##B,"[886, 343, 941, 357]",MISC
217,##6,"[886, 343, 941, 357]",MISC
218,",","[886, 343, 941, 357]",MISC
219,AD,"[943, 343, 998, 357]",MISC
220,##O,"[943, 343, 998, 357]",MISC
221,",","[943, 343, 998, 357]",MISC
222,-,"[999, 343, 1001, 357]",MISC
223,NL,"[999, 343, 1001, 357]",MISC
224,-,"[999, 343, 1001, 357]",MISC
225,XML,"[153, 357, 208, 374]",MISC
226,",","[153, 357, 208, 374]",MISC
227,WC,"[209, 357, 250, 374]",MISC
228,##F,"[209, 357, 250, 374]",MISC
229,-,"[251, 357, 253, 374]",MISC
230,NL,"[251, 357, 253, 374]",MISC
231,-,"[251, 357, 253, 374]",MISC
232,Web,"[135, 378, 178, 391]",MISC
233,Technologies,"[179, 378, 354, 391]",MISC
234,:,"[354, 378, 368, 391]",MISC
235,AS,"[369, 378, 484, 391]",MISC
236,##P,"[369, 378, 484, 391]",MISC
237,.,"[369, 378, 484, 391]",MISC
238,NE,"[369, 378, 484, 391]",MISC
239,##T,"[369, 378, 484, 391]",MISC
240,",","[369, 378, 484, 391]",MISC
241,Java,"[485, 378, 644, 391]",MISC
242,##Script,"[485, 378, 644, 391]",MISC
243,",","[485, 378, 644, 391]",MISC
244,H,"[646, 378, 717, 391]",MISC
245,##TM,"[646, 378, 717, 391]",MISC
246,##L,"[646, 378, 717, 391]",MISC
247,",","[646, 378, 717, 391]",MISC
248,CS,"[718, 378, 775, 391]",MISC
249,##S,"[718, 378, 775, 391]",MISC
250,",","[718, 378, 775, 391]",MISC
251,J,"[777, 378, 878, 391]",MISC
252,##quer,"[777, 378, 878, 391]",MISC
253,##y,"[777, 378, 878, 391]",MISC
254,",","[777, 378, 878, 391]",MISC
255,AJ,"[879, 378, 936, 391]",MISC
256,##A,"[879, 378, 936, 391]",MISC
257,##X,"[879, 378, 936, 391]",MISC
258,-,"[937, 378, 939, 391]",MISC
259,NL,"[937, 378, 939, 391]",MISC
260,-,"[937, 378, 939, 391]",MISC
261,Database,"[139, 395, 283, 408]",MISC
262,:,"[284, 395, 301, 408]",MISC
263,S,"[302, 395, 499, 408]",MISC
264,##QL,"[302, 395, 499, 408]",MISC
265,-,"[302, 395, 499, 408]",MISC
266,Server,"[302, 395, 499, 408]",MISC
267,",","[302, 395, 499, 408]",MISC
268,Oracle,"[501, 395, 608, 408]",MISC
269,-,"[609, 395, 611, 408]",MISC
270,NL,"[609, 395, 611, 408]",MISC
271,-,"[609, 395, 611, 408]",MISC
272,Application,"[135, 411, 292, 425]",MISC
273,Server,"[293, 411, 378, 425]",MISC
274,:,"[379, 411, 393, 425]",MISC
275,Team,"[393, 411, 450, 425]",MISC
276,Foundation,"[450, 411, 593, 425]",MISC
277,Server,"[593, 411, 693, 425]",MISC
278,",","[593, 411, 693, 425]",MISC
279,Visual,"[694, 411, 779, 425]",MISC
280,Source,"[780, 411, 865, 425]",MISC
281,Safe,"[866, 411, 923, 425]",MISC
282,-,"[923, 411, 925, 425]",MISC
283,NL,"[923, 411, 925, 425]",MISC
284,-,"[923, 411, 925, 425]",MISC
285,Experience,"[483, 477, 606, 494]",B-work_experience_heading
286,-,"[606, 477, 607, 494]",MISC
287,NL,"[606, 477, 607, 494]",MISC
288,-,"[606, 477, 607, 494]",MISC
289,IT,"[89, 496, 114, 513]",B-employer_company_name
290,C,"[115, 496, 166, 513]",I-employer_company_name
291,##ube,"[115, 496, 166, 513]",I-employer_company_name
292,Technologies,"[166, 496, 321, 513]",I-employer_company_name
293,LL,"[322, 496, 386, 513]",I-employer_company_name
294,##P,"[322, 496, 386, 513]",I-employer_company_name
295,.,"[322, 496, 386, 513]",MISC
296,",","[322, 496, 386, 513]",MISC
297,Bangalore,"[386, 496, 515, 513]",MISC
298,",","[386, 496, 515, 513]",MISC
299,Karnataka,"[516, 496, 632, 513]",MISC
300,-,"[632, 496, 634, 513]",MISC
301,NL,"[632, 496, 634, 513]",MISC
302,-,"[632, 496, 634, 513]",MISC
303,[,"[746, 496, 819, 513]",MISC
304,From,"[746, 496, 819, 513]",MISC
305,Aug,"[821, 496, 865, 513]",MISC
306,2013,"[865, 496, 924, 513]",MISC
307,to,"[925, 496, 954, 513]",MISC
308,Feb,"[955, 496, 999, 513]",MISC
309,-,"[1000, 496, 1001, 513]",MISC
310,NL,"[1000, 496, 1001, 513]",MISC
311,-,"[1000, 496, 1001, 513]",MISC
312,2014,"[937, 513, 1000, 529]",MISC
313,],"[937, 513, 1000, 529]",MISC
314,-,"[1000, 513, 1001, 529]",MISC
315,NL,"[1000, 513, 1001, 529]",MISC
316,-,"[1000, 513, 1001, 529]",MISC
317,#,"[89, 547, 103, 564]",MISC
318,1,"[104, 547, 118, 564]",MISC
319,Product,"[119, 547, 226, 564]",MISC
320,Name,"[227, 547, 288, 564]",MISC
321,:,"[289, 547, 303, 564]",MISC
322,P,"[304, 547, 349, 564]",MISC
323,##2,"[304, 547, 349, 564]",MISC
324,##P,"[304, 547, 349, 564]",MISC
325,(,"[351, 547, 566, 564]",MISC
326,P,"[351, 547, 566, 564]",MISC
327,##eer,"[351, 547, 566, 564]",MISC
328,-,"[351, 547, 566, 564]",MISC
329,to,"[351, 547, 566, 564]",MISC
330,-,"[351, 547, 566, 564]",MISC
331,P,"[351, 547, 566, 564]",MISC
332,##eer,"[351, 547, 566, 564]",MISC
333,),"[351, 547, 566, 564]",MISC
334,-,"[566, 547, 568, 564]",MISC
335,NL,"[566, 547, 568, 564]",MISC
336,-,"[566, 547, 568, 564]",MISC
337,C,"[153, 564, 260, 582]",MISC
338,##lient,"[153, 564, 260, 582]",MISC
339,:,"[260, 564, 278, 582]",MISC
340,IT,"[278, 564, 314, 582]",MISC
341,Atlantis,"[314, 564, 457, 582]",MISC
342,-,"[458, 564, 459, 582]",MISC
343,NL,"[458, 564, 459, 582]",MISC
344,-,"[458, 564, 459, 582]",MISC
345,Domain,"[153, 582, 272, 599]",MISC
346,:,"[274, 582, 293, 599]",MISC
347,Finance,"[294, 582, 434, 599]",MISC
348,-,"[434, 582, 436, 599]",MISC
349,NL,"[434, 582, 436, 599]",MISC
350,-,"[434, 582, 436, 599]",MISC
351,Role,"[153, 599, 212, 615]",MISC
352,:,"[212, 599, 226, 615]",MISC
353,Sr,"[227, 599, 269, 615]",B-employer_role
354,.,"[227, 599, 269, 615]",I-employer_role
355,Software,"[271, 599, 389, 615]",I-employer_role
356,Engineer,"[389, 599, 507, 615]",I-employer_role
357,-,"[508, 599, 509, 615]",MISC
358,NL,"[508, 599, 509, 615]",MISC
359,-,"[508, 599, 509, 615]",MISC
360,P,"[89, 632, 122, 649]",MISC
361,##2,"[89, 632, 122, 649]",MISC
362,##p,"[89, 632, 122, 649]",MISC
363,is,"[124, 632, 147, 649]",MISC
364,a,"[147, 632, 263, 649]",MISC
365,##fin,"[147, 632, 263, 649]",MISC
366,##an,"[147, 632, 263, 649]",MISC
367,##cial,"[147, 632, 263, 649]",MISC
368,P,"[264, 632, 403, 649]",MISC
369,##eer,"[264, 632, 403, 649]",MISC
370,-,"[264, 632, 403, 649]",MISC
371,to,"[264, 632, 403, 649]",MISC
372,-,"[264, 632, 403, 649]",MISC
373,P,"[264, 632, 403, 649]",MISC
374,##eer,"[264, 632, 403, 649]",MISC
375,application,"[404, 632, 532, 649]",MISC
376,which,"[532, 632, 589, 649]",MISC
377,involves,"[591, 632, 683, 649]",MISC
378,business,"[684, 632, 777, 649]",MISC
379,between,"[778, 632, 858, 649]",MISC
380,borrow,"[859, 632, 963, 649]",MISC
381,##ers,"[859, 632, 963, 649]",MISC
382,and,"[964, 632, 998, 649]",MISC
383,-,"[1000, 632, 1001, 649]",MISC
384,NL,"[1000, 632, 1001, 649]",MISC
385,-,"[1000, 632, 1001, 649]",MISC
386,lend,"[89, 649, 192, 666]",MISC
387,##ers,"[89, 649, 192, 666]",MISC
388,.,"[89, 649, 192, 666]",MISC
389,The,"[193, 649, 230, 666]",MISC
390,application,"[231, 649, 374, 666]",MISC
391,works,"[374, 649, 439, 666]",MISC
392,for,"[439, 649, 477, 666]",MISC
393,two,"[478, 649, 516, 666]",MISC
394,types,"[517, 649, 581, 666]",MISC
395,of,"[582, 649, 607, 666]",MISC
396,users,"[608, 649, 672, 666]",MISC
397,-,"[673, 649, 686, 666]",MISC
398,Bo,"[686, 649, 802, 666]",MISC
399,##rrow,"[686, 649, 802, 666]",MISC
400,##ers,"[686, 649, 802, 666]",MISC
401,(,"[803, 649, 855, 666]",MISC
402,who,"[803, 649, 855, 666]",MISC
403,are,"[855, 649, 892, 666]",MISC
404,in,"[894, 649, 919, 666]",MISC
405,need,"[920, 649, 971, 666]",MISC
406,of,"[972, 649, 997, 666]",MISC
407,-,"[998, 649, 1000, 666]",MISC
408,NL,"[998, 649, 1000, 666]",MISC
409,-,"[998, 649, 1000, 666]",MISC
410,money,"[89, 666, 163, 683]",MISC
411,),"[89, 666, 163, 683]",MISC
412,and,"[164, 666, 202, 683]",MISC
413,Len,"[202, 666, 290, 683]",MISC
414,##ders,"[202, 666, 290, 683]",MISC
415,(,"[291, 666, 341, 683]",MISC
416,who,"[291, 666, 341, 683]",MISC
417,are,"[341, 666, 379, 683]",MISC
418,ready,"[379, 666, 441, 683]",MISC
419,to,"[442, 666, 467, 683]",MISC
420,lend,"[467, 666, 517, 683]",MISC
421,money,"[518, 666, 605, 683]",MISC
422,),"[518, 666, 605, 683]",MISC
423,.,"[518, 666, 605, 683]",MISC
424,Len,"[606, 666, 681, 683]",MISC
425,##der,"[606, 666, 681, 683]",MISC
426,can,"[682, 666, 719, 683]",MISC
427,invest,"[720, 666, 795, 683]",MISC
428,the,"[796, 666, 833, 683]",MISC
429,money,"[834, 666, 896, 683]",MISC
430,in,"[897, 666, 922, 683]",MISC
431,P,"[922, 666, 972, 683]",MISC
432,##2,"[922, 666, 972, 683]",MISC
433,##P,"[922, 666, 972, 683]",MISC
434,.,"[922, 666, 972, 683]",MISC
435,If,"[972, 666, 997, 683]",MISC
436,-,"[998, 666, 1000, 683]",MISC
437,NL,"[998, 666, 1000, 683]",MISC
438,-,"[998, 666, 1000, 683]",MISC
439,anyone,"[89, 683, 160, 699]",MISC
440,is,"[160, 683, 184, 699]",MISC
441,register,"[184, 683, 314, 699]",MISC
442,##ing,"[184, 683, 314, 699]",MISC
443,as,"[316, 683, 339, 699]",MISC
444,borrow,"[340, 683, 447, 699]",MISC
445,##er,"[340, 683, 447, 699]",MISC
446,",","[340, 683, 447, 699]",MISC
447,they,"[447, 683, 494, 699]",MISC
448,has,"[495, 683, 531, 699]",MISC
449,to,"[531, 683, 554, 699]",MISC
450,enter,"[555, 683, 614, 699]",MISC
451,many,"[615, 683, 661, 699]",MISC
452,details,"[663, 683, 745, 699]",MISC
453,like,"[747, 683, 793, 699]",MISC
454,Name,"[794, 683, 853, 699]",MISC
455,",","[794, 683, 853, 699]",MISC
456,age,"[854, 683, 901, 699]",MISC
457,",","[854, 683, 901, 699]",MISC
458,sex,"[902, 683, 948, 699]",MISC
459,",","[902, 683, 948, 699]",MISC
460,SS,"[950, 683, 996, 699]",MISC
461,##N,"[950, 683, 996, 699]",MISC
462,",","[950, 683, 996, 699]",MISC
463,-,"[998, 683, 999, 699]",MISC
464,NL,"[998, 683, 999, 699]",MISC
465,-,"[998, 683, 999, 699]",MISC
466,employment,"[89, 699, 213, 716]",MISC
467,details,"[215, 699, 302, 716]",MISC
468,etc,"[303, 699, 366, 716]",MISC
469,.,"[303, 699, 366, 716]",MISC
470,",","[303, 699, 366, 716]",MISC
471,into,"[366, 699, 416, 716]",MISC
472,P,"[417, 699, 454, 716]",MISC
473,##2,"[417, 699, 454, 716]",MISC
474,##P,"[417, 699, 454, 716]",MISC
475,system,"[455, 699, 542, 716]",MISC
476,.,"[455, 699, 542, 716]",MISC
477,P,"[543, 699, 581, 716]",MISC
478,##2,"[543, 699, 581, 716]",MISC
479,##P,"[543, 699, 581, 716]",MISC
480,team,"[581, 699, 631, 716]",MISC
481,will,"[632, 699, 681, 716]",MISC
482,verify,"[682, 699, 757, 716]",MISC
483,them,"[758, 699, 808, 716]",MISC
484,and,"[808, 699, 846, 716]",MISC
485,give,"[846, 699, 896, 716]",MISC
486,a,"[897, 699, 909, 716]",MISC
487,grade,"[909, 699, 972, 716]",MISC
488,to,"[972, 699, 997, 716]",MISC
489,-,"[998, 699, 1000, 716]",MISC
490,NL,"[998, 699, 1000, 716]",MISC
491,-,"[998, 699, 1000, 716]",MISC
492,them,"[89, 716, 135, 734]",MISC
493,(,"[136, 716, 264, 734]",MISC
494,borrow,"[136, 716, 264, 734]",MISC
495,##ers,"[136, 716, 264, 734]",MISC
496,),"[136, 716, 264, 734]",MISC
497,from,"[266, 716, 312, 734]",MISC
498,Data,"[313, 716, 359, 734]",MISC
499,Credit,"[360, 716, 430, 734]",MISC
500,API,"[431, 716, 477, 734]",MISC
501,.,"[431, 716, 477, 734]",MISC
502,Once,"[478, 716, 525, 734]",MISC
503,borrow,"[525, 716, 618, 734]",MISC
504,##er,"[525, 716, 618, 734]",MISC
505,is,"[620, 716, 643, 734]",MISC
506,verified,"[644, 716, 749, 734]",MISC
507,",","[644, 716, 749, 734]",MISC
508,lend,"[750, 716, 819, 734]",MISC
509,##er,"[750, 716, 819, 734]",MISC
510,can,"[821, 716, 854, 734]",MISC
511,see,"[856, 716, 890, 734]",MISC
512,the,"[891, 716, 925, 734]",MISC
513,list,"[927, 716, 973, 734]",MISC
514,of,"[974, 716, 997, 734]",MISC
515,-,"[998, 716, 1000, 734]",MISC
516,NL,"[998, 716, 1000, 734]",MISC
517,-,"[998, 716, 1000, 734]",MISC
518,borrow,"[89, 734, 194, 751]",MISC
519,##ers,"[89, 734, 194, 751]",MISC
520,and,"[195, 734, 229, 751]",MISC
521,their,"[230, 734, 289, 751]",MISC
522,list,"[289, 734, 336, 751]",MISC
523,of,"[337, 734, 360, 751]",MISC
524,details,"[360, 734, 453, 751]",MISC
525,.,"[360, 734, 453, 751]",MISC
526,If,"[455, 734, 478, 751]",MISC
527,the,"[478, 734, 512, 751]",MISC
528,lend,"[514, 734, 583, 751]",MISC
529,##er,"[514, 734, 583, 751]",MISC
530,is,"[584, 734, 608, 751]",MISC
531,interested,"[608, 734, 726, 751]",MISC
532,in,"[726, 734, 749, 751]",MISC
533,any,"[750, 734, 784, 751]",MISC
534,borrow,"[785, 734, 890, 751]",MISC
535,##er,"[785, 734, 890, 751]",MISC
536,",","[785, 734, 890, 751]",MISC
537,he,"[891, 734, 915, 751]",MISC
538,can,"[915, 734, 949, 751]",MISC
539,lend,"[950, 734, 997, 751]",MISC
540,-,"[998, 734, 1000, 751]",MISC
541,NL,"[998, 734, 1000, 751]",MISC
542,-,"[998, 734, 1000, 751]",MISC
543,money,"[89, 751, 151, 768]",MISC
544,to,"[153, 751, 178, 768]",MISC
545,them,"[178, 751, 228, 768]",MISC
546,and,"[229, 751, 267, 768]",MISC
547,can,"[268, 751, 305, 768]",MISC
548,expect,"[306, 751, 383, 768]",MISC
549,the,"[383, 751, 421, 768]",MISC
550,repay,"[421, 751, 548, 768]",MISC
551,##ments,"[421, 751, 548, 768]",MISC
552,monthly,"[549, 751, 651, 768]",MISC
553,.,"[549, 751, 651, 768]",MISC
554,-,"[652, 751, 654, 768]",MISC
555,NL,"[652, 751, 654, 768]",MISC
556,-,"[652, 751, 654, 768]",MISC
557,Technologies,"[89, 784, 238, 801]",MISC
558,used,"[240, 784, 302, 801]",MISC
559,:,"[240, 784, 302, 801]",MISC
560,-,"[303, 784, 304, 801]",MISC
561,NL,"[303, 784, 304, 801]",MISC
562,-,"[303, 784, 304, 801]",MISC
563,Framework,"[134, 808, 255, 818]",MISC
564,4,"[256, 808, 309, 818]",MISC
565,.,"[256, 808, 309, 818]",MISC
566,0,"[256, 808, 309, 818]",MISC
567,",","[256, 808, 309, 818]",MISC
568,C,"[310, 808, 349, 818]",MISC
569,#,"[310, 808, 349, 818]",MISC
570,",","[310, 808, 349, 818]",MISC
571,AD,"[351, 808, 445, 818]",MISC
572,##O,"[351, 808, 445, 818]",MISC
573,.,"[351, 808, 445, 818]",MISC
574,NE,"[351, 808, 445, 818]",MISC
575,##T,"[351, 808, 445, 818]",MISC
576,-,"[445, 808, 447, 818]",MISC
577,NL,"[445, 808, 447, 818]",MISC
578,-,"[445, 808, 447, 818]",MISC
579,AS,"[133, 825, 231, 835]",MISC
580,##P,"[133, 825, 231, 835]",MISC
581,.,"[133, 825, 231, 835]",MISC
582,NE,"[133, 825, 231, 835]",MISC
583,##T,"[133, 825, 231, 835]",MISC
584,",","[133, 825, 231, 835]",MISC
585,H,"[231, 825, 292, 835]",MISC
586,##TM,"[231, 825, 292, 835]",MISC
587,##L,"[231, 825, 292, 835]",MISC
588,",","[231, 825, 292, 835]",MISC
589,CS,"[293, 825, 341, 835]",MISC
590,##S,"[293, 825, 341, 835]",MISC
591,",","[293, 825, 341, 835]",MISC
592,Java,"[342, 825, 463, 835]",MISC
593,##Script,"[342, 825, 463, 835]",MISC
594,-,"[465, 825, 467, 835]",MISC
595,NL,"[465, 825, 467, 835]",MISC
596,-,"[465, 825, 467, 835]",MISC
597,S,"[135, 842, 176, 853]",MISC
598,##QL,"[135, 842, 176, 853]",MISC
599,server,"[176, 842, 258, 853]",MISC
600,-,"[260, 842, 262, 853]",MISC
601,NL,"[260, 842, 262, 853]",MISC
602,-,"[260, 842, 262, 853]",MISC
603,Role,"[89, 869, 147, 886]",MISC
604,##s,"[89, 869, 147, 886]",MISC
605,and,"[148, 869, 184, 886]",MISC
606,Re,"[184, 869, 385, 886]",MISC
607,##sp,"[184, 869, 385, 886]",MISC
608,##ons,"[184, 869, 385, 886]",MISC
609,##ibi,"[184, 869, 385, 886]",MISC
610,##lities,"[184, 869, 385, 886]",MISC
611,:,"[184, 869, 385, 886]",MISC
612,-,"[386, 869, 388, 886]",MISC
613,NL,"[386, 869, 388, 886]",MISC
614,-,"[386, 869, 388, 886]",MISC
615,In,"[133, 890, 227, 903]",MISC
616,##volved,"[133, 890, 227, 903]",MISC
617,in,"[228, 890, 251, 903]",MISC
618,SD,"[251, 890, 298, 903]",MISC
619,##LC,"[251, 890, 298, 903]",MISC
620,process,"[299, 890, 381, 903]",MISC
621,-,"[382, 890, 393, 903]",MISC
622,Re,"[394, 890, 524, 903]",MISC
623,##quire,"[394, 890, 524, 903]",MISC
624,##ment,"[394, 890, 524, 903]",MISC
625,gathering,"[524, 890, 642, 903]",MISC
626,",","[524, 890, 642, 903]",MISC
627,design,"[643, 890, 713, 903]",MISC
628,discussions,"[714, 890, 855, 903]",MISC
629,",","[714, 890, 855, 903]",MISC
630,development,"[857, 890, 998, 903]",MISC
631,",","[857, 890, 998, 903]",MISC
632,-,"[1000, 890, 1001, 903]",MISC
633,NL,"[1000, 890, 1001, 903]",MISC
634,-,"[1000, 890, 1001, 903]",MISC
635,unit,"[153, 903, 197, 920]",MISC
636,testing,"[198, 903, 277, 920]",MISC
637,and,"[278, 903, 312, 920]",MISC
638,Q,"[313, 903, 334, 920]",MISC
639,##A,"[313, 903, 334, 920]",MISC
640,discussions,"[336, 903, 460, 920]",MISC
641,-,"[461, 903, 463, 920]",MISC
642,NL,"[461, 903, 463, 920]",MISC
643,-,"[461, 903, 463, 920]",MISC
644,Work,"[132, 923, 202, 937]",MISC
645,##ed,"[132, 923, 202, 937]",MISC
646,for,"[202, 923, 236, 937]",MISC
647,different,"[237, 923, 340, 937]",MISC
648,modules,"[342, 923, 422, 937]",MISC
649,like,"[423, 923, 480, 937]",MISC
650,",","[423, 923, 480, 937]",MISC
651,country,"[481, 923, 574, 937]",MISC
652,",","[481, 923, 574, 937]",MISC
653,currency,"[574, 923, 678, 937]",MISC
654,",","[574, 923, 678, 937]",MISC
655,lend,"[679, 923, 759, 937]",MISC
656,##ers,"[679, 923, 759, 937]",MISC
657,and,"[760, 923, 794, 937]",MISC
658,borrow,"[795, 923, 898, 937]",MISC
659,##ers,"[795, 923, 898, 937]",MISC
660,-,"[900, 923, 901, 937]",MISC
661,NL,"[900, 923, 901, 937]",MISC
662,-,"[900, 923, 901, 937]",MISC
663,Doc,"[133, 940, 286, 953]",MISC
664,##ume,"[133, 940, 286, 953]",MISC
665,##ntation,"[133, 940, 286, 953]",MISC
666,of,"[287, 940, 310, 953]",MISC
667,development,"[310, 940, 440, 953]",MISC
668,activities,"[441, 940, 558, 953]",MISC
669,-,"[559, 940, 561, 953]",MISC
670,NL,"[559, 940, 561, 953]",MISC
671,-,"[559, 940, 561, 953]",MISC
672,Page,"[778, 984, 818, 1000]",MISC
673,1,"[819, 984, 827, 1000]",MISC
674,of,"[829, 984, 848, 1000]",MISC
675,4,"[849, 984, 858, 1000]",MISC
676,-,"[859, 984, 860, 1000]",MISC
677,NL,"[859, 984, 860, 1000]",MISC
678,-,"[859, 984, 860, 1000]",MISC
679,Sigma,"[89, 103, 151, 120]",B-employer_company_name
680,Software,"[151, 103, 251, 120]",I-employer_company_name
681,Solutions,"[252, 103, 364, 120]",I-employer_company_name
682,P,"[365, 103, 427, 120]",I-employer_company_name
683,##v,"[365, 103, 427, 120]",I-employer_company_name
684,##t,"[365, 103, 427, 120]",I-employer_company_name
685,.,"[365, 103, 427, 120]",I-employer_company_name
686,",","[365, 103, 427, 120]",I-employer_company_name
687,Ltd,"[428, 103, 490, 120]",I-employer_company_name
688,.,"[428, 103, 490, 120]",MISC
689,",","[428, 103, 490, 120]",MISC
690,Bangalore,"[491, 103, 615, 120]",MISC
691,",","[491, 103, 615, 120]",MISC
692,-,"[616, 103, 618, 120]",MISC
693,NL,"[616, 103, 618, 120]",MISC
694,-,"[616, 103, 618, 120]",MISC
695,[,"[759, 103, 828, 120]",MISC
696,From,"[759, 103, 828, 120]",MISC
697,Mar,"[830, 103, 871, 120]",MISC
698,2007,"[872, 103, 927, 120]",MISC
699,to,"[929, 103, 955, 120]",MISC
700,Jul,"[957, 103, 998, 120]",MISC
701,-,"[1000, 103, 1001, 120]",MISC
702,NL,"[1000, 103, 1001, 120]",MISC
703,-,"[1000, 103, 1001, 120]",MISC
704,Karnataka,"[89, 120, 210, 137]",MISC
705,.,"[89, 120, 210, 137]",MISC
706,-,"[210, 120, 212, 137]",MISC
707,NL,"[210, 120, 212, 137]",MISC
708,-,"[210, 120, 212, 137]",MISC
709,2013,"[937, 120, 1000, 137]",MISC
710,],"[937, 120, 1000, 137]",MISC
711,-,"[1000, 120, 1001, 137]",MISC
712,NL,"[1000, 120, 1001, 137]",MISC
713,-,"[1000, 120, 1001, 137]",MISC
714,Product,"[89, 154, 174, 171]",MISC
715,Det,"[174, 154, 260, 171]",MISC
716,##ails,"[174, 154, 260, 171]",MISC
717,-,"[260, 154, 262, 171]",MISC
718,NL,"[260, 154, 262, 171]",MISC
719,-,"[260, 154, 262, 171]",MISC
720,#,"[89, 177, 117, 194]",MISC
721,1,"[89, 177, 117, 194]",MISC
722,Product,"[118, 177, 217, 194]",MISC
723,Name,"[219, 177, 290, 194]",MISC
724,:,"[219, 177, 290, 194]",MISC
725,Work,"[291, 177, 436, 194]",MISC
726,##As,"[291, 177, 436, 194]",MISC
727,##sure,"[291, 177, 436, 194]",MISC
728,[,"[436, 177, 493, 194]",MISC
729,Jul,"[436, 177, 493, 194]",MISC
730,2009,"[494, 177, 551, 194]",MISC
731,to,"[552, 177, 580, 194]",MISC
732,Jul,"[581, 177, 623, 194]",MISC
733,2013,"[624, 177, 695, 194]",MISC
734,],"[624, 177, 695, 194]",MISC
735,-,"[696, 177, 698, 194]",MISC
736,NL,"[696, 177, 698, 194]",MISC
737,-,"[696, 177, 698, 194]",MISC
738,C,"[153, 194, 231, 211]",MISC
739,##lient,"[153, 194, 231, 211]",MISC
740,:,"[153, 194, 231, 211]",MISC
741,AR,"[233, 194, 290, 211]",MISC
742,##RI,"[233, 194, 290, 211]",MISC
743,##S,"[233, 194, 290, 211]",MISC
744,-,"[290, 194, 292, 211]",MISC
745,NL,"[290, 194, 292, 211]",MISC
746,-,"[290, 194, 292, 211]",MISC
747,Domain,"[153, 211, 240, 228]",MISC
748,:,"[153, 211, 240, 228]",MISC
749,Cable,"[241, 211, 303, 228]",MISC
750,te,"[304, 211, 416, 228]",MISC
751,##le,"[304, 211, 416, 228]",MISC
752,##phony,"[304, 211, 416, 228]",MISC
753,and,"[417, 211, 455, 228]",MISC
754,Broad,"[455, 211, 567, 228]",MISC
755,##band,"[455, 211, 567, 228]",MISC
756,-,"[568, 211, 570, 228]",MISC
757,NL,"[568, 211, 570, 228]",MISC
758,-,"[568, 211, 570, 228]",MISC
759,Role,"[153, 228, 210, 246]",MISC
760,:,"[153, 228, 210, 246]",MISC
761,Sr,"[210, 228, 244, 246]",B-employer_role
762,.,"[210, 228, 244, 246]",I-employer_role
763,Software,"[245, 228, 336, 246]",I-employer_role
764,Engineer,"[337, 228, 428, 246]",I-employer_role
765,-,"[429, 228, 431, 246]",MISC
766,NL,"[429, 228, 431, 246]",MISC
767,-,"[429, 228, 431, 246]",MISC
768,In,"[89, 250, 112, 267]",MISC
769,Association,"[113, 250, 243, 267]",MISC
770,with,"[244, 250, 290, 267]",MISC
771,this,"[292, 250, 338, 267]",MISC
772,company,"[340, 250, 434, 267]",MISC
773,",","[340, 250, 434, 267]",MISC
774,working,"[436, 250, 518, 267]",MISC
775,on,"[519, 250, 542, 267]",MISC
776,one,"[543, 250, 579, 267]",MISC
777,of,"[579, 250, 602, 267]",MISC
778,the,"[603, 250, 639, 267]",MISC
779,US,"[639, 250, 662, 267]",MISC
780,client,"[663, 250, 734, 267]",MISC
781,project,"[735, 250, 817, 267]",MISC
782,which,"[818, 250, 877, 267]",MISC
783,helps,"[878, 250, 937, 267]",MISC
784,cable,"[938, 250, 997, 267]",MISC
785,-,"[998, 250, 1000, 267]",MISC
786,NL,"[998, 250, 1000, 267]",MISC
787,-,"[998, 250, 1000, 267]",MISC
788,operators,"[89, 267, 194, 284]",MISC
789,to,"[195, 267, 218, 284]",MISC
790,manage,"[219, 267, 288, 284]",MISC
791,their,"[290, 267, 349, 284]",MISC
792,field,"[349, 267, 408, 284]",MISC
793,technicians,"[408, 267, 538, 284]",MISC
794,very,"[538, 267, 584, 284]",MISC
795,efficiently,"[585, 267, 726, 284]",MISC
796,.,"[585, 267, 726, 284]",MISC
797,This,"[727, 267, 774, 284]",MISC
798,is,"[775, 267, 798, 284]",MISC
799,a,"[798, 267, 809, 284]",MISC
800,migration,"[810, 267, 915, 284]",MISC
801,project,"[917, 267, 999, 284]",MISC
802,-,"[1000, 267, 1001, 284]",MISC
803,NL,"[1000, 267, 1001, 284]",MISC
804,-,"[1000, 267, 1001, 284]",MISC
805,to,"[89, 284, 112, 300]",MISC
806,.,"[113, 284, 161, 300]",MISC
807,Net,"[113, 284, 161, 300]",MISC
808,technology,"[162, 284, 284, 300]",MISC
809,from,"[285, 284, 333, 300]",MISC
810,the,"[334, 284, 370, 300]",MISC
811,previous,"[371, 284, 469, 300]",MISC
812,V,"[469, 284, 505, 300]",MISC
813,##B,"[469, 284, 505, 300]",MISC
814,##6,"[469, 284, 505, 300]",MISC
815,technology,"[506, 284, 640, 300]",MISC
816,.,"[506, 284, 640, 300]",MISC
817,This,"[641, 284, 690, 300]",MISC
818,is,"[691, 284, 714, 300]",MISC
819,an,"[715, 284, 738, 300]",MISC
820,ongoing,"[740, 284, 825, 300]",MISC
821,project,"[826, 284, 911, 300]",MISC
822,using,"[912, 284, 972, 300]",MISC
823,an,"[973, 284, 996, 300]",MISC
824,-,"[998, 284, 1000, 300]",MISC
825,NL,"[998, 284, 1000, 300]",MISC
826,-,"[998, 284, 1000, 300]",MISC
827,on,"[89, 300, 270, 317]",MISC
828,##site,"[89, 300, 270, 317]",MISC
829,/,"[89, 300, 270, 317]",MISC
830,offshore,"[89, 300, 270, 317]",MISC
831,model,"[270, 300, 342, 317]",MISC
832,.,"[270, 300, 342, 317]",MISC
833,The,"[343, 300, 379, 317]",MISC
834,earlier,"[380, 300, 463, 317]",MISC
835,version,"[464, 300, 548, 317]",MISC
836,of,"[549, 300, 572, 317]",MISC
837,this,"[573, 300, 622, 317]",MISC
838,product,"[622, 300, 706, 317]",MISC
839,is,"[707, 300, 730, 317]",MISC
840,been,"[731, 300, 779, 317]",MISC
841,there,"[780, 300, 840, 317]",MISC
842,in,"[840, 300, 863, 317]",MISC
843,the,"[864, 300, 900, 317]",MISC
844,field,"[901, 300, 961, 317]",MISC
845,for,"[961, 300, 997, 317]",MISC
846,-,"[998, 300, 1000, 317]",MISC
847,NL,"[998, 300, 1000, 317]",MISC
848,-,"[998, 300, 1000, 317]",MISC
849,almost,"[89, 317, 162, 334]",MISC
850,10,"[163, 317, 187, 334]",MISC
851,y,"[188, 317, 236, 334]",MISC
852,##rs,"[188, 317, 236, 334]",MISC
853,.,"[188, 317, 236, 334]",MISC
854,There,"[238, 317, 299, 334]",MISC
855,are,"[300, 317, 336, 334]",MISC
856,around,"[338, 317, 411, 334]",MISC
857,20,"[412, 317, 448, 334]",MISC
858,##k,"[412, 317, 448, 334]",MISC
859,users,"[450, 317, 510, 334]",MISC
860,using,"[512, 317, 573, 334]",MISC
861,this,"[574, 317, 622, 334]",MISC
862,product,"[624, 317, 722, 334]",MISC
863,",","[624, 317, 722, 334]",MISC
864,which,"[724, 317, 784, 334]",MISC
865,includes,"[786, 317, 884, 334]",MISC
866,automated,"[886, 317, 996, 334]",MISC
867,-,"[998, 317, 1000, 334]",MISC
868,NL,"[998, 317, 1000, 334]",MISC
869,-,"[998, 317, 1000, 334]",MISC
870,scheduling,"[89, 334, 242, 351]",MISC
871,",","[89, 334, 242, 351]",MISC
872,routing,"[243, 334, 341, 351]",MISC
873,and,"[341, 334, 382, 351]",MISC
874,work,"[383, 334, 493, 351]",MISC
875,##flow,"[383, 334, 493, 351]",MISC
876,management,"[495, 334, 634, 351]",MISC
877,tools,"[635, 334, 705, 351]",MISC
878,combined,"[705, 334, 816, 351]",MISC
879,with,"[817, 334, 873, 351]",MISC
880,real,"[873, 334, 998, 351]",MISC
881,-,"[873, 334, 998, 351]",MISC
882,time,"[873, 334, 998, 351]",MISC
883,-,"[1000, 334, 1001, 351]",MISC
884,NL,"[1000, 334, 1001, 351]",MISC
885,-,"[1000, 334, 1001, 351]",MISC
886,communications,"[89, 351, 267, 369]",MISC
887,between,"[268, 351, 357, 369]",MISC
888,the,"[358, 351, 395, 369]",MISC
889,operations,"[396, 351, 522, 369]",MISC
890,center,"[524, 351, 613, 369]",MISC
891,",","[524, 351, 613, 369]",MISC
892,back,"[614, 351, 754, 369]",MISC
893,-,"[614, 351, 754, 369]",MISC
894,office,"[614, 351, 754, 369]",MISC
895,systems,"[754, 351, 844, 369]",MISC
896,and,"[844, 351, 882, 369]",MISC
897,the,"[882, 351, 920, 369]",MISC
898,mobile,"[921, 351, 998, 369]",MISC
899,-,"[998, 351, 1000, 369]",MISC
900,NL,"[998, 351, 1000, 369]",MISC
901,-,"[998, 351, 1000, 369]",MISC
902,workforce,"[89, 369, 222, 384]",MISC
903,.,"[89, 369, 222, 384]",MISC
904,The,"[222, 369, 262, 384]",MISC
905,project,"[262, 369, 355, 384]",MISC
906,is,"[356, 369, 383, 384]",MISC
907,quiet,"[383, 369, 449, 384]",MISC
908,big,"[450, 369, 489, 384]",MISC
909,with,"[490, 369, 543, 384]",MISC
910,around,"[543, 369, 623, 384]",MISC
911,50,"[623, 369, 663, 384]",MISC
912,+,"[623, 369, 663, 384]",MISC
913,modules,"[663, 369, 770, 384]",MISC
914,;,"[663, 369, 770, 384]",MISC
915,using,"[770, 369, 836, 384]",MISC
916,as,"[837, 369, 998, 384]",MISC
917,##ync,"[837, 369, 998, 384]",MISC
918,##hr,"[837, 369, 998, 384]",MISC
919,##ono,"[837, 369, 998, 384]",MISC
920,##us,"[837, 369, 998, 384]",MISC
921,-,"[998, 369, 1000, 384]",MISC
922,NL,"[998, 369, 1000, 384]",MISC
923,-,"[998, 369, 1000, 384]",MISC
924,architecture,"[89, 384, 249, 402]",MISC
925,.,"[89, 384, 249, 402]",MISC
926,Most,"[251, 384, 299, 402]",MISC
927,of,"[300, 384, 324, 402]",MISC
928,the,"[325, 384, 361, 402]",MISC
929,modules,"[363, 384, 448, 402]",MISC
930,are,"[450, 384, 485, 402]",MISC
931,s,"[487, 384, 585, 402]",MISC
932,##cal,"[487, 384, 585, 402]",MISC
933,##able,"[487, 384, 585, 402]",MISC
934,and,"[587, 384, 622, 402]",MISC
935,can,"[624, 384, 660, 402]",MISC
936,easily,"[661, 384, 735, 402]",MISC
937,communicate,"[736, 384, 872, 402]",MISC
938,to,"[873, 384, 896, 402]",MISC
939,any,"[898, 384, 934, 402]",MISC
940,of,"[935, 384, 959, 402]",MISC
941,the,"[960, 384, 996, 402]",MISC
942,-,"[998, 384, 1000, 402]",MISC
943,NL,"[998, 384, 1000, 402]",MISC
944,-,"[998, 384, 1000, 402]",MISC
945,3rd,"[89, 402, 119, 419]",MISC
946,party,"[120, 402, 172, 419]",MISC
947,interfaces,"[173, 402, 289, 419]",MISC
948,.,"[173, 402, 289, 419]",MISC
949,-,"[290, 402, 292, 419]",MISC
950,NL,"[290, 402, 292, 419]",MISC
951,-,"[290, 402, 292, 419]",MISC
952,Technologies,"[89, 436, 238, 453]",MISC
953,used,"[240, 436, 302, 453]",MISC
954,:,"[240, 436, 302, 453]",MISC
955,-,"[303, 436, 304, 453]",MISC
956,NL,"[303, 436, 304, 453]",MISC
957,-,"[303, 436, 304, 453]",MISC
958,Framework,"[134, 458, 252, 469]",MISC
959,4,"[252, 458, 304, 469]",MISC
960,.,"[252, 458, 304, 469]",MISC
961,0,"[252, 458, 304, 469]",MISC
962,",","[252, 458, 304, 469]",MISC
963,C,"[305, 458, 344, 469]",MISC
964,#,"[305, 458, 344, 469]",MISC
965,",","[305, 458, 344, 469]",MISC
966,D,"[345, 458, 436, 469]",MISC
967,##O,"[345, 458, 436, 469]",MISC
968,.,"[345, 458, 436, 469]",MISC
969,NE,"[345, 458, 436, 469]",MISC
970,##T,"[345, 458, 436, 469]",MISC
971,",","[345, 458, 436, 469]",MISC
972,L,"[437, 458, 489, 469]",MISC
973,##IN,"[437, 458, 489, 469]",MISC
974,##Q,"[437, 458, 489, 469]",MISC
975,-,"[490, 458, 491, 469]",MISC
976,NL,"[490, 458, 491, 469]",MISC
977,-,"[490, 458, 491, 469]",MISC
978,AS,"[133, 476, 229, 486]",MISC
979,##P,"[133, 476, 229, 486]",MISC
980,.,"[133, 476, 229, 486]",MISC
981,NE,"[133, 476, 229, 486]",MISC
982,##T,"[133, 476, 229, 486]",MISC
983,",","[133, 476, 229, 486]",MISC
984,H,"[230, 476, 289, 486]",MISC
985,##TM,"[230, 476, 289, 486]",MISC
986,##L,"[230, 476, 289, 486]",MISC
987,",","[230, 476, 289, 486]",MISC
988,CS,"[290, 476, 338, 486]",MISC
989,##S,"[290, 476, 338, 486]",MISC
990,",","[290, 476, 338, 486]",MISC
991,Java,"[339, 476, 471, 486]",MISC
992,##Script,"[339, 476, 471, 486]",MISC
993,",","[339, 476, 471, 486]",MISC
994,J,"[472, 476, 556, 486]",MISC
995,##quer,"[472, 476, 556, 486]",MISC
996,##y,"[472, 476, 556, 486]",MISC
997,",","[472, 476, 556, 486]",MISC
998,AJ,"[557, 476, 616, 486]",MISC
999,##A,"[557, 476, 616, 486]",MISC
1000,##X,"[557, 476, 616, 486]",MISC
1001,",","[557, 476, 616, 486]",MISC
1002,WC,"[617, 476, 653, 486]",MISC
1003,##F,"[617, 476, 653, 486]",MISC
1004,-,"[654, 476, 655, 486]",MISC
1005,NL,"[654, 476, 655, 486]",MISC
1006,-,"[654, 476, 655, 486]",MISC
1007,Role,"[89, 503, 147, 521]",MISC
1008,##s,"[89, 503, 147, 521]",MISC
1009,and,"[148, 503, 184, 521]",MISC
1010,Re,"[184, 503, 385, 521]",MISC
1011,##sp,"[184, 503, 385, 521]",MISC
1012,##ons,"[184, 503, 385, 521]",MISC
1013,##ibi,"[184, 503, 385, 521]",MISC
1014,##lities,"[184, 503, 385, 521]",MISC
1015,:,"[184, 503, 385, 521]",MISC
1016,-,"[386, 503, 388, 521]",MISC
1017,NL,"[386, 503, 388, 521]",MISC
1018,-,"[386, 503, 388, 521]",MISC
1019,Work,"[135, 523, 223, 538]",MISC
1020,##ed,"[135, 523, 223, 538]",MISC
1021,for,"[223, 523, 266, 538]",MISC
1022,this,"[267, 523, 324, 538]",MISC
1023,migration,"[326, 523, 456, 538]",MISC
1024,project,"[458, 523, 559, 538]",MISC
1025,for,"[560, 523, 603, 538]",MISC
1026,4,"[604, 523, 618, 538]",MISC
1027,years,"[619, 523, 692, 538]",MISC
1028,and,"[692, 523, 735, 538]",MISC
1029,handled,"[736, 523, 837, 538]",MISC
1030,many,"[838, 523, 895, 538]",MISC
1031,modules,"[897, 523, 999, 538]",MISC
1032,-,"[1000, 523, 1001, 538]",MISC
1033,NL,"[1000, 523, 1001, 538]",MISC
1034,-,"[1000, 523, 1001, 538]",MISC
1035,independently,"[153, 538, 294, 554]",MISC
1036,-,"[294, 538, 295, 554]",MISC
1037,NL,"[294, 538, 295, 554]",MISC
1038,-,"[294, 538, 295, 554]",MISC
1039,In,"[133, 558, 231, 571]",MISC
1040,##volved,"[133, 558, 231, 571]",MISC
1041,in,"[232, 558, 255, 571]",MISC
1042,formal,"[257, 558, 330, 571]",MISC
1043,SD,"[331, 558, 379, 571]",MISC
1044,##LC,"[331, 558, 379, 571]",MISC
1045,process,"[380, 558, 478, 571]",MISC
1046,",","[380, 558, 478, 571]",MISC
1047,starting,"[479, 558, 577, 571]",MISC
1048,with,"[578, 558, 626, 571]",MISC
1049,the,"[627, 558, 663, 571]",MISC
1050,requirement,"[664, 558, 800, 571]",MISC
1051,gathering,"[800, 558, 923, 571]",MISC
1052,",","[800, 558, 923, 571]",MISC
1053,design,"[924, 558, 997, 571]",MISC
1054,-,"[998, 558, 1000, 571]",MISC
1055,NL,"[998, 558, 1000, 571]",MISC
1056,-,"[998, 558, 1000, 571]",MISC
1057,discussions,"[153, 571, 288, 588]",MISC
1058,",","[153, 571, 288, 588]",MISC
1059,development,"[288, 571, 424, 588]",MISC
1060,",","[288, 571, 424, 588]",MISC
1061,Unit,"[424, 571, 468, 588]",MISC
1062,testing,"[469, 571, 547, 588]",MISC
1063,and,"[548, 571, 582, 588]",MISC
1064,Q,"[582, 571, 603, 588]",MISC
1065,##A,"[582, 571, 603, 588]",MISC
1066,discussions,"[604, 571, 727, 588]",MISC
1067,-,"[729, 571, 730, 588]",MISC
1068,NL,"[729, 571, 730, 588]",MISC
1069,-,"[729, 571, 730, 588]",MISC
1070,In,"[133, 592, 229, 605]",MISC
1071,##volved,"[133, 592, 229, 605]",MISC
1072,in,"[230, 592, 254, 605]",MISC
1073,converting,"[255, 592, 376, 605]",MISC
1074,the,"[377, 592, 412, 605]",MISC
1075,design,"[413, 592, 497, 605]",MISC
1076,",","[413, 592, 497, 605]",MISC
1077,modules,"[498, 592, 582, 605]",MISC
1078,and,"[584, 592, 619, 605]",MISC
1079,framework,"[620, 592, 741, 605]",MISC
1080,##s,"[620, 592, 741, 605]",MISC
1081,from,"[742, 592, 790, 605]",MISC
1082,current,"[791, 592, 874, 605]",MISC
1083,technology,"[876, 592, 997, 605]",MISC
1084,-,"[998, 592, 1000, 605]",MISC
1085,NL,"[998, 592, 1000, 605]",MISC
1086,-,"[998, 592, 1000, 605]",MISC
1087,which,"[153, 605, 215, 623]",MISC
1088,is,"[215, 605, 240, 623]",MISC
1089,in,"[240, 605, 265, 623]",MISC
1090,V,"[265, 605, 303, 623]",MISC
1091,##B,"[265, 605, 303, 623]",MISC
1092,##6,"[265, 605, 303, 623]",MISC
1093,to,"[303, 605, 327, 623]",MISC
1094,-,"[327, 605, 329, 623]",MISC
1095,NL,"[327, 605, 329, 623]",MISC
1096,-,"[327, 605, 329, 623]",MISC
1097,Dot,"[153, 623, 188, 638]",MISC
1098,Net,"[189, 623, 224, 638]",MISC
1099,technology,"[224, 623, 342, 638]",MISC
1100,-,"[344, 623, 345, 638]",MISC
1101,NL,"[344, 623, 345, 638]",MISC
1102,-,"[344, 623, 345, 638]",MISC
1103,Work,"[133, 642, 208, 656]",MISC
1104,##ed,"[133, 642, 208, 656]",MISC
1105,on,"[210, 642, 235, 656]",MISC
1106,Multiple,"[235, 642, 337, 656]",MISC
1107,modules,"[337, 642, 424, 656]",MISC
1108,like,"[426, 642, 476, 656]",MISC
1109,Use,"[477, 642, 527, 656]",MISC
1110,##r,"[477, 642, 527, 656]",MISC
1111,Act,"[527, 642, 629, 656]",MISC
1112,##ivity,"[527, 642, 629, 656]",MISC
1113,module,"[629, 642, 716, 656]",MISC
1114,",","[629, 642, 716, 656]",MISC
1115,Vehicle,"[718, 642, 805, 656]",MISC
1116,Act,"[807, 642, 909, 656]",MISC
1117,##ivity,"[807, 642, 909, 656]",MISC
1118,module,"[909, 642, 996, 656]",MISC
1119,",","[909, 642, 996, 656]",MISC
1120,-,"[998, 642, 1000, 656]",MISC
1121,NL,"[998, 642, 1000, 656]",MISC
1122,-,"[998, 642, 1000, 656]",MISC
1123,Sc,"[153, 656, 270, 673]",MISC
1124,##hed,"[153, 656, 270, 673]",MISC
1125,##ulin,"[153, 656, 270, 673]",MISC
1126,##g,"[153, 656, 270, 673]",MISC
1127,modules,"[272, 656, 354, 673]",MISC
1128,In,"[355, 656, 462, 673]",MISC
1129,##vent,"[355, 656, 462, 673]",MISC
1130,##ory,"[355, 656, 462, 673]",MISC
1131,and,"[463, 656, 498, 673]",MISC
1132,Plant,"[499, 656, 557, 673]",MISC
1133,area,"[558, 656, 605, 673]",MISC
1134,modules,"[606, 656, 688, 673]",MISC
1135,-,"[689, 656, 691, 673]",MISC
1136,NL,"[689, 656, 691, 673]",MISC
1137,-,"[689, 656, 691, 673]",MISC
1138,In,"[133, 677, 229, 690]",MISC
1139,##volved,"[133, 677, 229, 690]",MISC
1140,in,"[231, 677, 254, 690]",MISC
1141,the,"[255, 677, 291, 690]",MISC
1142,user,"[292, 677, 340, 690]",MISC
1143,training,"[341, 677, 437, 690]",MISC
1144,on,"[439, 677, 462, 690]",MISC
1145,the,"[464, 677, 499, 690]",MISC
1146,modules,"[500, 677, 586, 690]",MISC
1147,developed,"[586, 677, 695, 690]",MISC
1148,-,"[696, 677, 698, 690]",MISC
1149,NL,"[696, 677, 698, 690]",MISC
1150,-,"[696, 677, 698, 690]",MISC
1151,Doc,"[134, 693, 262, 707]",MISC
1152,##ume,"[134, 693, 262, 707]",MISC
1153,##nted,"[134, 693, 262, 707]",MISC
1154,all,"[262, 693, 300, 707]",MISC
1155,the,"[301, 693, 338, 707]",MISC
1156,development,"[340, 693, 480, 707]",MISC
1157,work,"[481, 693, 531, 707]",MISC
1158,for,"[533, 693, 570, 707]",MISC
1159,each,"[571, 693, 621, 707]",MISC
1160,enhance,"[623, 693, 763, 707]",MISC
1161,##ment,"[623, 693, 763, 707]",MISC
1162,-,"[764, 693, 766, 707]",MISC
1163,NL,"[764, 693, 766, 707]",MISC
1164,-,"[764, 693, 766, 707]",MISC
1165,#,"[89, 740, 117, 757]",MISC
1166,2,"[89, 740, 117, 757]",MISC
1167,Product,"[118, 740, 222, 757]",MISC
1168,Name,"[222, 740, 296, 757]",MISC
1169,:,"[222, 740, 296, 757]",MISC
1170,Mobile,"[297, 740, 386, 757]",MISC
1171,Work,"[386, 740, 520, 757]",MISC
1172,##F,"[386, 740, 520, 757]",MISC
1173,##or,"[386, 740, 520, 757]",MISC
1174,##ce,"[386, 740, 520, 757]",MISC
1175,Manager,"[520, 740, 623, 757]",MISC
1176,[,"[624, 740, 683, 757]",MISC
1177,Mar,"[624, 740, 683, 757]",MISC
1178,2007,"[683, 740, 742, 757]",MISC
1179,–,"[743, 740, 757, 757]",MISC
1180,Jun,"[758, 740, 802, 757]",MISC
1181,2009,"[802, 740, 875, 757]",MISC
1182,],"[802, 740, 875, 757]",MISC
1183,-,"[877, 740, 878, 757]",MISC
1184,NL,"[877, 740, 878, 757]",MISC
1185,-,"[877, 740, 878, 757]",MISC
1186,C,"[153, 757, 231, 775]",MISC
1187,##lient,"[153, 757, 231, 775]",MISC
1188,:,"[153, 757, 231, 775]",MISC
1189,AR,"[233, 757, 290, 775]",MISC
1190,##RI,"[233, 757, 290, 775]",MISC
1191,##S,"[233, 757, 290, 775]",MISC
1192,-,"[290, 757, 292, 775]",MISC
1193,NL,"[290, 757, 292, 775]",MISC
1194,-,"[290, 757, 292, 775]",MISC
1195,Domain,"[153, 775, 240, 792]",MISC
1196,:,"[153, 775, 240, 792]",MISC
1197,Cable,"[241, 775, 303, 792]",MISC
1198,te,"[304, 775, 416, 792]",MISC
1199,##le,"[304, 775, 416, 792]",MISC
1200,##phony,"[304, 775, 416, 792]",MISC
1201,and,"[417, 775, 455, 792]",MISC
1202,Broad,"[455, 775, 567, 792]",MISC
1203,##band,"[455, 775, 567, 792]",MISC
1204,-,"[568, 775, 570, 792]",MISC
1205,NL,"[568, 775, 570, 792]",MISC
1206,-,"[568, 775, 570, 792]",MISC
1207,Role,"[153, 792, 210, 808]",MISC
1208,:,"[153, 792, 210, 808]",MISC
1209,Software,"[211, 792, 304, 808]",MISC
1210,Engineer,"[304, 792, 397, 808]",MISC
1211,-,"[397, 792, 399, 808]",MISC
1212,NL,"[397, 792, 399, 808]",MISC
1213,-,"[397, 792, 399, 808]",MISC
1214,Mobile,"[89, 825, 165, 842]",MISC
1215,workforce,"[167, 825, 283, 842]",MISC
1216,manager,"[284, 825, 375, 842]",MISC
1217,was,"[375, 825, 412, 842]",MISC
1218,the,"[414, 825, 451, 842]",MISC
1219,previous,"[453, 825, 556, 842]",MISC
1220,version,"[557, 825, 648, 842]",MISC
1221,of,"[648, 825, 673, 842]",MISC
1222,Work,"[674, 825, 817, 842]",MISC
1223,##As,"[674, 825, 817, 842]",MISC
1224,##sure,"[674, 825, 817, 842]",MISC
1225,.,"[674, 825, 817, 842]",MISC
1226,It,"[817, 825, 842, 842]",MISC
1227,was,"[843, 825, 881, 842]",MISC
1228,developed,"[882, 825, 998, 842]",MISC
1229,-,"[1000, 825, 1001, 842]",MISC
1230,NL,"[1000, 825, 1001, 842]",MISC
1231,-,"[1000, 825, 1001, 842]",MISC
1232,using,"[89, 842, 147, 859]",MISC
1233,the,"[148, 842, 184, 859]",MISC
1234,Microsoft,"[184, 842, 291, 859]",MISC
1235,Technologies,"[292, 842, 435, 859]",MISC
1236,-,"[436, 842, 446, 859]",MISC
1237,V,"[447, 842, 494, 859]",MISC
1238,##B,"[447, 842, 494, 859]",MISC
1239,##6,"[447, 842, 494, 859]",MISC
1240,",","[447, 842, 494, 859]",MISC
1241,Classic,"[495, 842, 577, 859]",MISC
1242,AS,"[579, 842, 615, 859]",MISC
1243,##P,"[579, 842, 615, 859]",MISC
1244,and,"[615, 842, 651, 859]",MISC
1245,AD,"[651, 842, 697, 859]",MISC
1246,##O,"[651, 842, 697, 859]",MISC
1247,.,"[651, 842, 697, 859]",MISC
1248,This,"[699, 842, 745, 859]",MISC
1249,is,"[747, 842, 770, 859]",MISC
1250,an,"[770, 842, 794, 859]",MISC
1251,ongoing,"[794, 842, 876, 859]",MISC
1252,project,"[878, 842, 960, 859]",MISC
1253,and,"[962, 842, 997, 859]",MISC
1254,-,"[998, 842, 999, 859]",MISC
1255,NL,"[998, 842, 999, 859]",MISC
1256,-,"[998, 842, 999, 859]",MISC
1257,it,"[89, 859, 112, 876]",MISC
1258,is,"[112, 859, 135, 876]",MISC
1259,been,"[135, 859, 182, 876]",MISC
1260,there,"[182, 859, 239, 876]",MISC
1261,on,"[241, 859, 264, 876]",MISC
1262,the,"[264, 859, 298, 876]",MISC
1263,production,"[299, 859, 415, 876]",MISC
1264,site,"[417, 859, 463, 876]",MISC
1265,for,"[463, 859, 497, 876]",MISC
1266,almost,"[499, 859, 568, 876]",MISC
1267,10,"[569, 859, 592, 876]",MISC
1268,years,"[592, 859, 662, 876]",MISC
1269,.,"[592, 859, 662, 876]",MISC
1270,-,"[663, 859, 664, 876]",MISC
1271,NL,"[663, 859, 664, 876]",MISC
1272,-,"[663, 859, 664, 876]",MISC
1273,Technologies,"[89, 892, 238, 910]",MISC
1274,used,"[240, 892, 302, 910]",MISC
1275,:,"[240, 892, 302, 910]",MISC
1276,-,"[303, 892, 304, 910]",MISC
1277,NL,"[303, 892, 304, 910]",MISC
1278,-,"[303, 892, 304, 910]",MISC
1279,V,"[136, 916, 196, 927]",MISC
1280,##B,"[136, 916, 196, 927]",MISC
1281,##6,"[136, 916, 196, 927]",MISC
1282,",","[136, 916, 196, 927]",MISC
1283,AD,"[196, 916, 257, 927]",MISC
1284,##O,"[196, 916, 257, 927]",MISC
1285,",","[196, 916, 257, 927]",MISC
1286,XML,"[257, 916, 302, 927]",MISC
1287,-,"[303, 916, 304, 927]",MISC
1288,NL,"[303, 916, 304, 927]",MISC
1289,-,"[303, 916, 304, 927]",MISC
1290,AS,"[133, 933, 181, 944]",MISC
1291,##P,"[133, 933, 181, 944]",MISC
1292,",","[133, 933, 181, 944]",MISC
1293,Java,"[183, 933, 318, 944]",MISC
1294,##Script,"[183, 933, 318, 944]",MISC
1295,",","[183, 933, 318, 944]",MISC
1296,H,"[319, 933, 380, 944]",MISC
1297,##TM,"[319, 933, 380, 944]",MISC
1298,##L,"[319, 933, 380, 944]",MISC
1299,",","[319, 933, 380, 944]",MISC
1300,CS,"[381, 933, 417, 944]",MISC
1301,##S,"[381, 933, 417, 944]",MISC
1302,-,"[418, 933, 420, 944]",MISC
1303,NL,"[418, 933, 420, 944]",MISC
1304,-,"[418, 933, 420, 944]",MISC
1305,Oracle,"[133, 951, 206, 961]",MISC
1306,9,"[207, 951, 328, 961]",MISC
1307,##i,"[207, 951, 328, 961]",MISC
1308,/,"[207, 951, 328, 961]",MISC
1309,10,"[207, 951, 328, 961]",MISC
1310,##g,"[207, 951, 328, 961]",MISC
1311,/,"[207, 951, 328, 961]",MISC
1312,11,"[207, 951, 328, 961]",MISC
1313,##g,"[207, 951, 328, 961]",MISC
1314,-,"[329, 951, 331, 961]",MISC
1315,NL,"[329, 951, 331, 961]",MISC
1316,-,"[329, 951, 331, 961]",MISC
1317,Page,"[778, 984, 818, 1000]",MISC
1318,2,"[819, 984, 827, 1000]",MISC
1319,of,"[829, 984, 848, 1000]",MISC
1320,4,"[849, 984, 858, 1000]",MISC
1321,-,"[859, 984, 860, 1000]",MISC
1322,NL,"[859, 984, 860, 1000]",MISC
1323,-,"[859, 984, 860, 1000]",MISC
1324,Mu,"[89, 154, 151, 171]",B-employer_company_name
1325,##dra,"[89, 154, 151, 171]",I-employer_company_name
1326,In,"[152, 154, 252, 171]",I-employer_company_name
1327,##fo,"[152, 154, 252, 171]",I-employer_company_name
1328,##T,"[152, 154, 252, 171]",I-employer_company_name
1329,##ech,"[152, 154, 252, 171]",I-employer_company_name
1330,P,"[253, 154, 315, 171]",I-employer_company_name
1331,##v,"[253, 154, 315, 171]",I-employer_company_name
1332,##t,"[253, 154, 315, 171]",I-employer_company_name
1333,.,"[253, 154, 315, 171]",I-employer_company_name
1334,",","[253, 154, 315, 171]",I-employer_company_name
1335,Ltd,"[316, 154, 379, 171]",I-employer_company_name
1336,.,"[316, 154, 379, 171]",MISC
1337,",","[316, 154, 379, 171]",MISC
1338,Bangalore,"[379, 154, 504, 171]",MISC
1339,",","[379, 154, 504, 171]",MISC
1340,Karnataka,"[506, 154, 631, 171]",MISC
1341,.,"[506, 154, 631, 171]",MISC
1342,-,"[632, 154, 634, 171]",MISC
1343,NL,"[632, 154, 634, 171]",MISC
1344,-,"[632, 154, 634, 171]",MISC
1345,[,"[752, 154, 823, 171]",MISC
1346,From,"[752, 154, 823, 171]",MISC
1347,Apr,"[825, 154, 867, 171]",MISC
1348,2005,"[868, 154, 925, 171]",MISC
1349,to,"[927, 154, 955, 171]",MISC
1350,Apr,"[956, 154, 999, 171]",MISC
1351,-,"[1000, 154, 1001, 171]",MISC
1352,NL,"[1000, 154, 1001, 171]",MISC
1353,-,"[1000, 154, 1001, 171]",MISC
1354,2006,"[937, 171, 1000, 187]",MISC
1355,],"[937, 171, 1000, 187]",MISC
1356,-,"[1000, 171, 1001, 187]",MISC
1357,NL,"[1000, 171, 1001, 187]",MISC
1358,-,"[1000, 171, 1001, 187]",MISC
1359,I,"[89, 205, 101, 222]",MISC
1360,have,"[101, 205, 151, 222]",MISC
1361,worked,"[152, 205, 227, 222]",MISC
1362,for,"[228, 205, 265, 222]",MISC
1363,a,"[265, 205, 278, 222]",MISC
1364,year,"[278, 205, 328, 222]",MISC
1365,as,"[329, 205, 353, 222]",MISC
1366,a,"[354, 205, 366, 222]",MISC
1367,Software,"[366, 205, 466, 222]",MISC
1368,Engineer,"[467, 205, 567, 222]",MISC
1369,in,"[568, 205, 593, 222]",MISC
1370,this,"[594, 205, 644, 222]",MISC
1371,organization,"[644, 205, 796, 222]",MISC
1372,and,"[796, 205, 833, 222]",MISC
1373,involved,"[834, 205, 933, 222]",MISC
1374,in,"[935, 205, 960, 222]",MISC
1375,the,"[960, 205, 997, 222]",MISC
1376,-,"[998, 205, 1000, 222]",MISC
1377,NL,"[998, 205, 1000, 222]",MISC
1378,-,"[998, 205, 1000, 222]",MISC
1379,following,"[89, 222, 183, 239]",MISC
1380,ER,"[184, 222, 214, 239]",MISC
1381,##P,"[184, 222, 214, 239]",MISC
1382,projects,"[216, 222, 310, 239]",MISC
1383,.,"[216, 222, 310, 239]",MISC
1384,-,"[311, 222, 313, 239]",MISC
1385,NL,"[311, 222, 313, 239]",MISC
1386,-,"[311, 222, 313, 239]",MISC
1387,Re,"[89, 256, 274, 272]",MISC
1388,##sp,"[89, 256, 274, 272]",MISC
1389,##ons,"[89, 256, 274, 272]",MISC
1390,##ibi,"[89, 256, 274, 272]",MISC
1391,##lities,"[89, 256, 274, 272]",MISC
1392,handled,"[274, 256, 367, 272]",MISC
1393,:,"[274, 256, 367, 272]",MISC
1394,-,"[367, 256, 368, 272]",MISC
1395,NL,"[367, 256, 368, 272]",MISC
1396,-,"[367, 256, 368, 272]",MISC
1397,Re,"[133, 276, 265, 289]",MISC
1398,##quire,"[133, 276, 265, 289]",MISC
1399,##ment,"[133, 276, 265, 289]",MISC
1400,gathering,"[265, 276, 372, 289]",MISC
1401,from,"[373, 276, 419, 289]",MISC
1402,the,"[421, 276, 457, 289]",MISC
1403,clients,"[457, 276, 541, 289]",MISC
1404,-,"[541, 276, 543, 289]",MISC
1405,NL,"[541, 276, 543, 289]",MISC
1406,-,"[541, 276, 543, 289]",MISC
1407,Design,"[135, 293, 221, 306]",MISC
1408,-,"[221, 293, 222, 306]",MISC
1409,NL,"[221, 293, 222, 306]",MISC
1410,-,"[221, 293, 222, 306]",MISC
1411,Development,"[134, 310, 284, 324]",MISC
1412,-,"[285, 310, 286, 324]",MISC
1413,NL,"[285, 310, 286, 324]",MISC
1414,-,"[285, 310, 286, 324]",MISC
1415,Unit,"[133, 326, 181, 341]",MISC
1416,testing,"[183, 326, 268, 341]",MISC
1417,and,"[269, 326, 305, 341]",MISC
1418,Support,"[307, 326, 392, 341]",MISC
1419,-,"[393, 326, 395, 341]",MISC
1420,NL,"[393, 326, 395, 341]",MISC
1421,-,"[393, 326, 395, 341]",MISC
1422,Project,"[89, 357, 169, 374]",MISC
1423,Det,"[170, 357, 250, 374]",MISC
1424,##ails,"[170, 357, 250, 374]",MISC
1425,-,"[251, 357, 253, 374]",MISC
1426,NL,"[251, 357, 253, 374]",MISC
1427,-,"[251, 357, 253, 374]",MISC
1428,#,"[89, 380, 115, 398]",MISC
1429,1,"[89, 380, 115, 398]",MISC
1430,Project,"[116, 380, 212, 398]",MISC
1431,Name,"[212, 380, 280, 398]",MISC
1432,:,"[212, 380, 280, 398]",MISC
1433,In,"[281, 380, 404, 398]",MISC
1434,##vent,"[281, 380, 404, 398]",MISC
1435,##ory,"[281, 380, 404, 398]",MISC
1436,Management,"[405, 380, 542, 398]",MISC
1437,System,"[543, 380, 625, 398]",MISC
1438,-,"[625, 380, 627, 398]",MISC
1439,NL,"[625, 380, 627, 398]",MISC
1440,-,"[625, 380, 627, 398]",MISC
1441,Role,"[153, 398, 210, 415]",MISC
1442,:,"[153, 398, 210, 415]",MISC
1443,Software,"[211, 398, 301, 415]",MISC
1444,Engineer,"[303, 398, 394, 415]",MISC
1445,-,"[395, 398, 397, 415]",MISC
1446,NL,"[395, 398, 397, 415]",MISC
1447,-,"[395, 398, 397, 415]",MISC
1448,Environment,"[153, 415, 308, 431]",MISC
1449,:,"[153, 415, 308, 431]",MISC
1450,V,"[308, 415, 360, 431]",MISC
1451,##B,"[308, 415, 360, 431]",MISC
1452,##6,"[308, 415, 360, 431]",MISC
1453,",","[308, 415, 360, 431]",MISC
1454,MS,"[360, 415, 385, 431]",MISC
1455,Access,"[385, 415, 462, 431]",MISC
1456,-,"[463, 415, 465, 431]",MISC
1457,NL,"[463, 415, 465, 431]",MISC
1458,-,"[463, 415, 465, 431]",MISC
1459,O,"[89, 448, 199, 465]",MISC
1460,##bject,"[89, 448, 199, 465]",MISC
1461,##ive,"[89, 448, 199, 465]",MISC
1462,of,"[199, 448, 222, 465]",MISC
1463,the,"[224, 448, 259, 465]",MISC
1464,project,"[261, 448, 346, 465]",MISC
1465,was,"[347, 448, 382, 465]",MISC
1466,to,"[383, 448, 407, 465]",MISC
1467,keep,"[408, 448, 456, 465]",MISC
1468,track,"[457, 448, 518, 465]",MISC
1469,of,"[519, 448, 542, 465]",MISC
1470,all,"[543, 448, 579, 465]",MISC
1471,the,"[580, 448, 616, 465]",MISC
1472,transactions,"[617, 448, 763, 465]",MISC
1473,made,"[764, 448, 812, 465]",MISC
1474,with,"[813, 448, 862, 465]",MISC
1475,Custom,"[863, 448, 961, 465]",MISC
1476,##er,"[863, 448, 961, 465]",MISC
1477,and,"[961, 448, 997, 465]",MISC
1478,-,"[998, 448, 1000, 465]",MISC
1479,NL,"[998, 448, 1000, 465]",MISC
1480,-,"[998, 448, 1000, 465]",MISC
1481,Su,"[89, 465, 215, 482]",MISC
1482,##pp,"[89, 465, 215, 482]",MISC
1483,##liers,"[89, 465, 215, 482]",MISC
1484,.,"[89, 465, 215, 482]",MISC
1485,The,"[217, 465, 254, 482]",MISC
1486,project,"[255, 465, 344, 482]",MISC
1487,which,"[345, 465, 407, 482]",MISC
1488,was,"[409, 465, 446, 482]",MISC
1489,designed,"[447, 465, 549, 482]",MISC
1490,includes,"[550, 465, 651, 482]",MISC
1491,several,"[652, 465, 741, 482]",MISC
1492,modules,"[742, 465, 831, 482]",MISC
1493,which,"[831, 465, 894, 482]",MISC
1494,deal,"[895, 465, 945, 482]",MISC
1495,with,"[947, 465, 996, 482]",MISC
1496,-,"[998, 465, 1000, 482]",MISC
1497,NL,"[998, 465, 1000, 482]",MISC
1498,-,"[998, 465, 1000, 482]",MISC
1499,creation,"[89, 482, 183, 500]",MISC
1500,of,"[184, 482, 207, 500]",MISC
1501,It,"[208, 482, 267, 500]",MISC
1502,##ems,"[208, 482, 267, 500]",MISC
1503,along,"[268, 482, 327, 500]",MISC
1504,with,"[328, 482, 374, 500]",MISC
1505,their,"[376, 482, 435, 500]",MISC
1506,different,"[436, 482, 542, 500]",MISC
1507,parameters,"[543, 482, 663, 500]",MISC
1508,and,"[663, 482, 698, 500]",MISC
1509,their,"[699, 482, 757, 500]",MISC
1510,Su,"[758, 482, 878, 500]",MISC
1511,##pp,"[758, 482, 878, 500]",MISC
1512,##liers,"[758, 482, 878, 500]",MISC
1513,.,"[758, 482, 878, 500]",MISC
1514,The,"[878, 482, 914, 500]",MISC
1515,project,"[914, 482, 996, 500]",MISC
1516,-,"[998, 482, 1000, 500]",MISC
1517,NL,"[998, 482, 1000, 500]",MISC
1518,-,"[998, 482, 1000, 500]",MISC
1519,includes,"[89, 500, 181, 515]",MISC
1520,some,"[183, 500, 229, 515]",MISC
1521,other,"[230, 500, 289, 515]",MISC
1522,modules,"[289, 500, 371, 515]",MISC
1523,to,"[372, 500, 395, 515]",MISC
1524,give,"[396, 500, 442, 515]",MISC
1525,clear,"[443, 500, 502, 515]",MISC
1526,idea,"[502, 500, 548, 515]",MISC
1527,about,"[549, 500, 608, 515]",MISC
1528,Stock,"[608, 500, 667, 515]",MISC
1529,availability,"[667, 500, 820, 515]",MISC
1530,",","[667, 500, 820, 515]",MISC
1531,P,"[821, 500, 926, 515]",MISC
1532,##ur,"[821, 500, 926, 515]",MISC
1533,##chase,"[821, 500, 926, 515]",MISC
1534,",","[821, 500, 926, 515]",MISC
1535,Sales,"[927, 500, 996, 515]",MISC
1536,",","[927, 500, 996, 515]",MISC
1537,-,"[998, 500, 1000, 515]",MISC
1538,NL,"[998, 500, 1000, 515]",MISC
1539,-,"[998, 500, 1000, 515]",MISC
1540,A,"[89, 515, 197, 533]",MISC
1541,##cco,"[89, 515, 197, 533]",MISC
1542,##unts,"[89, 515, 197, 533]",MISC
1543,.,"[89, 515, 197, 533]",MISC
1544,The,"[198, 515, 233, 533]",MISC
1545,project,"[234, 515, 318, 533]",MISC
1546,which,"[319, 515, 380, 533]",MISC
1547,was,"[380, 515, 415, 533]",MISC
1548,designed,"[416, 515, 512, 533]",MISC
1549,includes,"[513, 515, 609, 533]",MISC
1550,report,"[610, 515, 681, 533]",MISC
1551,section,"[683, 515, 766, 533]",MISC
1552,to,"[767, 515, 791, 533]",MISC
1553,generate,"[792, 515, 888, 533]",MISC
1554,different,"[889, 515, 997, 533]",MISC
1555,-,"[998, 515, 1000, 533]",MISC
1556,NL,"[998, 515, 1000, 533]",MISC
1557,-,"[998, 515, 1000, 533]",MISC
1558,types,"[89, 533, 146, 550]",MISC
1559,of,"[146, 533, 168, 550]",MISC
1560,report,"[169, 533, 237, 550]",MISC
1561,related,"[239, 533, 319, 550]",MISC
1562,to,"[319, 533, 341, 550]",MISC
1563,customers,"[342, 533, 456, 550]",MISC
1564,",","[342, 533, 456, 550]",MISC
1565,vendors,"[458, 533, 548, 550]",MISC
1566,",","[458, 533, 548, 550]",MISC
1567,sales,"[550, 533, 607, 550]",MISC
1568,activity,"[607, 533, 711, 550]",MISC
1569,",","[607, 533, 711, 550]",MISC
1570,account,"[711, 533, 791, 550]",MISC
1571,details,"[792, 533, 872, 550]",MISC
1572,etc,"[873, 533, 917, 550]",MISC
1573,.,"[873, 533, 917, 550]",MISC
1574,Sea,"[919, 533, 999, 550]",MISC
1575,##gate,"[919, 533, 999, 550]",MISC
1576,-,"[1000, 533, 1001, 550]",MISC
1577,NL,"[1000, 533, 1001, 550]",MISC
1578,-,"[1000, 533, 1001, 550]",MISC
1579,Crystal,"[89, 550, 171, 567]",MISC
1580,Report,"[172, 550, 243, 567]",MISC
1581,7,"[243, 550, 279, 567]",MISC
1582,.,"[243, 550, 279, 567]",MISC
1583,5,"[243, 550, 279, 567]",MISC
1584,was,"[279, 550, 315, 567]",MISC
1585,used,"[315, 550, 361, 567]",MISC
1586,to,"[363, 550, 386, 567]",MISC
1587,design,"[386, 550, 458, 567]",MISC
1588,the,"[458, 550, 494, 567]",MISC
1589,reports,"[494, 550, 576, 567]",MISC
1590,-,"[577, 550, 579, 567]",MISC
1591,NL,"[577, 550, 579, 567]",MISC
1592,-,"[577, 550, 579, 567]",MISC
1593,#,"[89, 584, 115, 600]",MISC
1594,2,"[89, 584, 115, 600]",MISC
1595,Project,"[116, 584, 208, 600]",MISC
1596,Name,"[210, 584, 276, 600]",MISC
1597,:,"[210, 584, 276, 600]",MISC
1598,Smart,"[277, 584, 343, 600]",MISC
1599,Resource,"[344, 584, 451, 600]",MISC
1600,Plan,"[451, 584, 544, 600]",MISC
1601,##ner,"[451, 584, 544, 600]",MISC
1602,(,"[546, 584, 611, 600]",MISC
1603,SR,"[546, 584, 611, 600]",MISC
1604,##P,"[546, 584, 611, 600]",MISC
1605,),"[546, 584, 611, 600]",MISC
1606,-,"[613, 584, 614, 600]",MISC
1607,NL,"[613, 584, 614, 600]",MISC
1608,-,"[613, 584, 614, 600]",MISC
1609,Role,"[153, 600, 210, 617]",MISC
1610,:,"[153, 600, 210, 617]",MISC
1611,Software,"[211, 600, 301, 617]",MISC
1612,Engineer,"[303, 600, 394, 617]",MISC
1613,-,"[395, 600, 397, 617]",MISC
1614,NL,"[395, 600, 397, 617]",MISC
1615,-,"[395, 600, 397, 617]",MISC
1616,Environment,"[153, 617, 308, 634]",MISC
1617,:,"[153, 617, 308, 634]",MISC
1618,V,"[308, 617, 360, 634]",MISC
1619,##B,"[308, 617, 360, 634]",MISC
1620,##6,"[308, 617, 360, 634]",MISC
1621,",","[308, 617, 360, 634]",MISC
1622,MS,"[360, 617, 385, 634]",MISC
1623,Access,"[385, 617, 462, 634]",MISC
1624,-,"[463, 617, 465, 634]",MISC
1625,NL,"[463, 617, 465, 634]",MISC
1626,-,"[463, 617, 465, 634]",MISC
1627,SR,"[89, 652, 126, 669]",MISC
1628,##P,"[89, 652, 126, 669]",MISC
1629,was,"[127, 652, 164, 669]",MISC
1630,an,"[164, 652, 189, 669]",MISC
1631,ER,"[190, 652, 227, 669]",MISC
1632,##P,"[190, 652, 227, 669]",MISC
1633,project,"[228, 652, 315, 669]",MISC
1634,and,"[316, 652, 353, 669]",MISC
1635,developed,"[354, 652, 466, 669]",MISC
1636,for,"[467, 652, 505, 669]",MISC
1637,medium,"[505, 652, 580, 669]",MISC
1638,scale,"[581, 652, 643, 669]",MISC
1639,industries,"[644, 652, 781, 669]",MISC
1640,.,"[644, 652, 781, 669]",MISC
1641,The,"[783, 652, 821, 669]",MISC
1642,objective,"[821, 652, 933, 669]",MISC
1643,of,"[935, 652, 960, 669]",MISC
1644,the,"[960, 652, 997, 669]",MISC
1645,-,"[998, 652, 1000, 669]",MISC
1646,NL,"[998, 652, 1000, 669]",MISC
1647,-,"[998, 652, 1000, 669]",MISC
1648,project,"[89, 669, 176, 685]",MISC
1649,was,"[177, 669, 214, 685]",MISC
1650,to,"[215, 669, 240, 685]",MISC
1651,keep,"[240, 669, 290, 685]",MISC
1652,track,"[291, 669, 353, 685]",MISC
1653,of,"[354, 669, 379, 685]",MISC
1654,inward,"[379, 669, 454, 685]",MISC
1655,and,"[455, 669, 492, 685]",MISC
1656,outward,"[493, 669, 580, 685]",MISC
1657,register,"[581, 669, 693, 685]",MISC
1658,",","[581, 669, 693, 685]",MISC
1659,maintain,"[695, 669, 795, 685]",MISC
1660,stock,"[796, 669, 858, 685]",MISC
1661,details,"[859, 669, 959, 685]",MISC
1662,",","[859, 669, 959, 685]",MISC
1663,and,"[960, 669, 997, 685]",MISC
1664,-,"[998, 669, 1000, 685]",MISC
1665,NL,"[998, 669, 1000, 685]",MISC
1666,-,"[998, 669, 1000, 685]",MISC
1667,generate,"[89, 685, 181, 702]",MISC
1668,stock,"[183, 685, 242, 702]",MISC
1669,sum,"[242, 685, 360, 702]",MISC
1670,##mar,"[242, 685, 360, 702]",MISC
1671,##ies,"[242, 685, 360, 702]",MISC
1672,.,"[242, 685, 360, 702]",MISC
1673,Project,"[360, 685, 442, 702]",MISC
1674,includes,"[443, 685, 536, 702]",MISC
1675,modules,"[537, 685, 619, 702]",MISC
1676,like,"[620, 685, 666, 702]",MISC
1677,P,"[667, 685, 772, 702]",MISC
1678,##ur,"[667, 685, 772, 702]",MISC
1679,##chase,"[667, 685, 772, 702]",MISC
1680,",","[667, 685, 772, 702]",MISC
1681,Production,"[773, 685, 902, 702]",MISC
1682,",","[773, 685, 902, 702]",MISC
1683,and,"[903, 685, 937, 702]",MISC
1684,Sales,"[939, 685, 998, 702]",MISC
1685,-,"[998, 685, 1000, 702]",MISC
1686,NL,"[998, 685, 1000, 702]",MISC
1687,-,"[998, 685, 1000, 702]",MISC
1688,etc,"[89, 702, 133, 719]",MISC
1689,.,"[89, 702, 133, 719]",MISC
1690,The,"[134, 702, 168, 719]",MISC
1691,project,"[168, 702, 247, 719]",MISC
1692,supports,"[248, 702, 339, 719]",MISC
1693,to,"[339, 702, 361, 719]",MISC
1694,generate,"[362, 702, 453, 719]",MISC
1695,Material,"[453, 702, 544, 719]",MISC
1696,re,"[544, 702, 669, 719]",MISC
1697,##quisition,"[544, 702, 669, 719]",MISC
1698,slip,"[669, 702, 714, 719]",MISC
1699,(,"[715, 702, 770, 719]",MISC
1700,MR,"[715, 702, 770, 719]",MISC
1701,##S,"[715, 702, 770, 719]",MISC
1702,),"[715, 702, 770, 719]",MISC
1703,and,"[772, 702, 806, 719]",MISC
1704,Material,"[806, 702, 897, 719]",MISC
1705,issue,"[897, 702, 952, 719]",MISC
1706,slip,"[954, 702, 999, 719]",MISC
1707,-,"[1000, 702, 1001, 719]",MISC
1708,NL,"[1000, 702, 1001, 719]",MISC
1709,-,"[1000, 702, 1001, 719]",MISC
1710,(,"[89, 719, 146, 736]",MISC
1711,MI,"[89, 719, 146, 736]",MISC
1712,##S,"[89, 719, 146, 736]",MISC
1713,),"[89, 719, 146, 736]",MISC
1714,for,"[147, 719, 181, 736]",MISC
1715,both,"[182, 719, 228, 736]",MISC
1716,production,"[228, 719, 344, 736]",MISC
1717,and,"[345, 719, 379, 736]",MISC
1718,purchase,"[380, 719, 473, 736]",MISC
1719,de,"[473, 719, 530, 736]",MISC
1720,##pt,"[473, 719, 530, 736]",MISC
1721,.,"[473, 719, 530, 736]",MISC
1722,The,"[532, 719, 565, 736]",MISC
1723,project,"[566, 719, 647, 736]",MISC
1724,includes,"[648, 719, 741, 736]",MISC
1725,different,"[741, 719, 845, 736]",MISC
1726,kinds,"[846, 719, 903, 736]",MISC
1727,of,"[904, 719, 928, 736]",MISC
1728,report,"[928, 719, 997, 736]",MISC
1729,-,"[998, 719, 1000, 736]",MISC
1730,NL,"[998, 719, 1000, 736]",MISC
1731,-,"[998, 719, 1000, 736]",MISC
1732,like,"[89, 736, 133, 753]",MISC
1733,vendor,"[134, 736, 202, 753]",MISC
1734,details,"[202, 736, 291, 753]",MISC
1735,",","[202, 736, 291, 753]",MISC
1736,customer,"[292, 736, 381, 753]",MISC
1737,details,"[383, 736, 472, 753]",MISC
1738,",","[383, 736, 472, 753]",MISC
1739,and,"[473, 736, 507, 753]",MISC
1740,rack,"[507, 736, 552, 753]",MISC
1741,details,"[552, 736, 642, 753]",MISC
1742,",","[552, 736, 642, 753]",MISC
1743,purchased,"[643, 736, 745, 753]",MISC
1744,items,"[745, 736, 813, 753]",MISC
1745,",","[745, 736, 813, 753]",MISC
1746,MR,"[813, 736, 857, 753]",MISC
1747,##S,"[813, 736, 857, 753]",MISC
1748,",","[813, 736, 857, 753]",MISC
1749,MI,"[858, 736, 892, 753]",MISC
1750,##S,"[858, 736, 892, 753]",MISC
1751,etc,"[892, 736, 936, 753]",MISC
1752,.,"[892, 736, 936, 753]",MISC
1753,-,"[937, 736, 939, 753]",MISC
1754,NL,"[937, 736, 939, 753]",MISC
1755,-,"[937, 736, 939, 753]",MISC
1756,#,"[89, 769, 115, 787]",MISC
1757,3,"[89, 769, 115, 787]",MISC
1758,Project,"[116, 769, 213, 787]",MISC
1759,Name,"[214, 769, 281, 787]",MISC
1760,:,"[214, 769, 281, 787]",MISC
1761,Stock,"[283, 769, 351, 787]",MISC
1762,Auto,"[353, 769, 490, 787]",MISC
1763,##mation,"[353, 769, 490, 787]",MISC
1764,-,"[491, 769, 493, 787]",MISC
1765,NL,"[491, 769, 493, 787]",MISC
1766,-,"[491, 769, 493, 787]",MISC
1767,Role,"[153, 787, 210, 804]",MISC
1768,:,"[153, 787, 210, 804]",MISC
1769,Software,"[211, 787, 301, 804]",MISC
1770,Engineer,"[303, 787, 394, 804]",MISC
1771,-,"[395, 787, 397, 804]",MISC
1772,NL,"[395, 787, 397, 804]",MISC
1773,-,"[395, 787, 397, 804]",MISC
1774,Environment,"[153, 804, 308, 821]",MISC
1775,:,"[153, 804, 308, 821]",MISC
1776,V,"[308, 804, 360, 821]",MISC
1777,##B,"[308, 804, 360, 821]",MISC
1778,##6,"[308, 804, 360, 821]",MISC
1779,",","[308, 804, 360, 821]",MISC
1780,MS,"[360, 804, 385, 821]",MISC
1781,Access,"[385, 804, 462, 821]",MISC
1782,-,"[463, 804, 465, 821]",MISC
1783,NL,"[463, 804, 465, 821]",MISC
1784,-,"[463, 804, 465, 821]",MISC
1785,The,"[89, 838, 122, 854]",MISC
1786,project,"[124, 838, 206, 854]",MISC
1787,was,"[207, 838, 241, 854]",MISC
1788,mainly,"[242, 838, 312, 854]",MISC
1789,developed,"[313, 838, 418, 854]",MISC
1790,for,"[419, 838, 453, 854]",MISC
1791,sales,"[455, 838, 513, 854]",MISC
1792,oriented,"[514, 838, 678, 854]",MISC
1793,##fi,"[514, 838, 678, 854]",MISC
1794,##rms,"[514, 838, 678, 854]",MISC
1795,.,"[514, 838, 678, 854]",MISC
1796,The,"[679, 838, 713, 854]",MISC
1797,objective,"[714, 838, 820, 854]",MISC
1798,of,"[821, 838, 844, 854]",MISC
1799,the,"[844, 838, 878, 854]",MISC
1800,project,"[880, 838, 962, 854]",MISC
1801,was,"[962, 838, 996, 854]",MISC
1802,-,"[998, 838, 1000, 854]",MISC
1803,NL,"[998, 838, 1000, 854]",MISC
1804,-,"[998, 838, 1000, 854]",MISC
1805,to,"[89, 854, 112, 871]",MISC
1806,raise,"[112, 854, 171, 871]",MISC
1807,the,"[171, 854, 205, 871]",MISC
1808,P,"[207, 854, 299, 871]",MISC
1809,##ur,"[207, 854, 299, 871]",MISC
1810,##chase,"[207, 854, 299, 871]",MISC
1811,Orders,"[301, 854, 371, 871]",MISC
1812,to,"[372, 854, 395, 871]",MISC
1813,the,"[396, 854, 429, 871]",MISC
1814,vendors,"[431, 854, 524, 871]",MISC
1815,",","[431, 854, 524, 871]",MISC
1816,generate,"[525, 854, 618, 871]",MISC
1817,the,"[620, 854, 654, 871]",MISC
1818,In,"[655, 854, 737, 871]",MISC
1819,##vo,"[655, 854, 737, 871]",MISC
1820,##ice,"[655, 854, 737, 871]",MISC
1821,to,"[738, 854, 761, 871]",MISC
1822,the,"[762, 854, 795, 871]",MISC
1823,customers,"[797, 854, 915, 871]",MISC
1824,",","[797, 854, 915, 871]",MISC
1825,process,"[915, 854, 997, 871]",MISC
1826,-,"[998, 854, 1000, 871]",MISC
1827,NL,"[998, 854, 1000, 871]",MISC
1828,-,"[998, 854, 1000, 871]",MISC
1829,the,"[89, 871, 221, 888]",MISC
1830,##fin,"[89, 871, 221, 888]",MISC
1831,##an,"[89, 871, 221, 888]",MISC
1832,##cial,"[89, 871, 221, 888]",MISC
1833,activities,"[222, 871, 343, 888]",MISC
1834,",","[222, 871, 343, 888]",MISC
1835,generate,"[344, 871, 431, 888]",MISC
1836,the,"[432, 871, 464, 888]",MISC
1837,stock,"[466, 871, 521, 888]",MISC
1838,sum,"[521, 871, 632, 888]",MISC
1839,##mar,"[521, 871, 632, 888]",MISC
1840,##ies,"[521, 871, 632, 888]",MISC
1841,",","[521, 871, 632, 888]",MISC
1842,availability,"[632, 871, 764, 888]",MISC
1843,of,"[765, 871, 786, 888]",MISC
1844,stock,"[787, 871, 853, 888]",MISC
1845,",","[787, 871, 853, 888]",MISC
1846,and,"[854, 871, 886, 888]",MISC
1847,to,"[887, 871, 908, 888]",MISC
1848,track,"[909, 871, 964, 888]",MISC
1849,the,"[964, 871, 997, 888]",MISC
1850,-,"[998, 871, 1000, 888]",MISC
1851,NL,"[998, 871, 1000, 888]",MISC
1852,-,"[998, 871, 1000, 888]",MISC
1853,short,"[89, 888, 153, 906]",MISC
1854,supply,"[154, 888, 230, 906]",MISC
1855,and,"[232, 888, 269, 906]",MISC
1856,rejected,"[271, 888, 374, 906]",MISC
1857,materials,"[375, 888, 505, 906]",MISC
1858,.,"[375, 888, 505, 906]",MISC
1859,The,"[505, 888, 542, 906]",MISC
1860,project,"[544, 888, 635, 906]",MISC
1861,which,"[635, 888, 699, 906]",MISC
1862,was,"[700, 888, 738, 906]",MISC
1863,designed,"[739, 888, 843, 906]",MISC
1864,includes,"[843, 888, 947, 906]",MISC
1865,many,"[947, 888, 999, 906]",MISC
1866,-,"[1000, 888, 1001, 906]",MISC
1867,NL,"[1000, 888, 1001, 906]",MISC
1868,-,"[1000, 888, 1001, 906]",MISC
1869,modules,"[89, 906, 169, 923]",MISC
1870,to,"[170, 906, 193, 923]",MISC
1871,handle,"[193, 906, 263, 923]",MISC
1872,all,"[263, 906, 297, 923]",MISC
1873,these,"[298, 906, 355, 923]",MISC
1874,process,"[356, 906, 448, 923]",MISC
1875,.,"[356, 906, 448, 923]",MISC
1876,-,"[449, 906, 450, 923]",MISC
1877,NL,"[449, 906, 450, 923]",MISC
1878,-,"[449, 906, 450, 923]",MISC
1879,Page,"[778, 984, 818, 1000]",MISC
1880,3,"[819, 984, 827, 1000]",MISC
1881,of,"[829, 984, 848, 1000]",MISC
1882,4,"[849, 984, 858, 1000]",MISC
1883,-,"[859, 984, 860, 1000]",MISC
1884,NL,"[859, 984, 860, 1000]",MISC
1885,-,"[859, 984, 860, 1000]",MISC
1886,Educational,"[89, 205, 219, 222]",MISC
1887,qualification,"[219, 205, 385, 222]",MISC
1888,:,"[219, 205, 385, 222]",MISC
1889,Diploma,"[385, 205, 467, 222]",B-education_degree
1890,in,"[468, 205, 492, 222]",MISC
1891,Computer,"[492, 205, 587, 222]",B-education_course
1892,Science,"[587, 205, 669, 222]",I-education_course
1893,(,"[670, 205, 729, 222]",MISC
1894,From,"[670, 205, 729, 222]",MISC
1895,Board,"[729, 205, 788, 222]",MISC
1896,of,"[789, 205, 812, 222]",MISC
1897,Technical,"[812, 205, 918, 222]",MISC
1898,-,"[919, 205, 921, 222]",MISC
1899,NL,"[919, 205, 921, 222]",MISC
1900,-,"[919, 205, 921, 222]",MISC
1901,Education,"[89, 222, 190, 239]",MISC
1902,–,"[191, 222, 202, 239]",MISC
1903,Karnataka,"[203, 222, 317, 239]",MISC
1904,),"[203, 222, 317, 239]",MISC
1905,-,"[317, 222, 319, 239]",MISC
1906,NL,"[317, 222, 319, 239]",MISC
1907,-,"[317, 222, 319, 239]",MISC
1908,Personal,"[89, 247, 181, 264]",B-personal_details_heading
1909,details,"[181, 247, 274, 264]",I-personal_details_heading
1910,:,"[181, 247, 274, 264]",I-personal_details_heading
1911,-,"[274, 247, 276, 264]",MISC
1912,NL,"[274, 247, 276, 264]",MISC
1913,-,"[274, 247, 276, 264]",MISC
1914,Full,"[153, 264, 210, 280]",MISC
1915,Name,"[210, 264, 267, 280]",MISC
1916,:,"[267, 264, 281, 280]",MISC
1917,Mad,"[281, 264, 438, 280]",MISC
1918,##hus,"[281, 264, 438, 280]",MISC
1919,##uda,"[281, 264, 438, 280]",MISC
1920,##na,"[281, 264, 438, 280]",MISC
1921,A,"[438, 264, 552, 280]",MISC
1922,##rs,"[438, 264, 552, 280]",MISC
1923,##ike,"[438, 264, 552, 280]",MISC
1924,##re,"[438, 264, 552, 280]",MISC
1925,Chandra,"[552, 264, 737, 280]",MISC
1926,##she,"[552, 264, 737, 280]",MISC
1927,##kar,"[552, 264, 737, 280]",MISC
1928,-,"[737, 264, 739, 280]",MISC
1929,NL,"[737, 264, 739, 280]",MISC
1930,-,"[737, 264, 739, 280]",MISC
1931,Date,"[153, 280, 212, 297]",MISC
1932,of,"[212, 280, 241, 297]",MISC
1933,Birth,"[242, 280, 315, 297]",MISC
1934,:,"[316, 280, 330, 297]",MISC
1935,6th,"[330, 280, 373, 297]",MISC
1936,Apr,"[375, 280, 418, 297]",MISC
1937,1979,"[419, 280, 492, 297]",MISC
1938,.,"[419, 280, 492, 297]",MISC
1939,-,"[493, 280, 495, 297]",MISC
1940,NL,"[493, 280, 495, 297]",MISC
1941,-,"[493, 280, 495, 297]",MISC
1942,Pass,"[153, 297, 258, 314]",MISC
1943,##port,"[153, 297, 258, 314]",MISC
1944,Number,"[259, 297, 338, 314]",MISC
1945,:,"[339, 297, 352, 314]",MISC
1946,H,"[353, 297, 458, 314]",MISC
1947,##80,"[353, 297, 458, 314]",MISC
1948,##28,"[353, 297, 458, 314]",MISC
1949,##9,"[353, 297, 458, 314]",MISC
1950,##80,"[353, 297, 458, 314]",MISC
1951,-,"[459, 297, 461, 314]",MISC
1952,NL,"[459, 297, 461, 314]",MISC
1953,-,"[459, 297, 461, 314]",MISC
1954,Pan,"[153, 314, 203, 332]",MISC
1955,Number,"[203, 314, 303, 332]",MISC
1956,:,"[304, 314, 320, 332]",MISC
1957,AP,"[321, 314, 489, 332]",MISC
1958,##OP,"[321, 314, 489, 332]",MISC
1959,##M,"[321, 314, 489, 332]",MISC
1960,##8,"[321, 314, 489, 332]",MISC
1961,##41,"[321, 314, 489, 332]",MISC
1962,##6,"[321, 314, 489, 332]",MISC
1963,##K,"[321, 314, 489, 332]",MISC
1964,-,"[490, 314, 491, 332]",MISC
1965,NL,"[490, 314, 491, 332]",MISC
1966,-,"[490, 314, 491, 332]",MISC
1967,Mari,"[153, 332, 267, 349]",MISC
1968,##tal,"[153, 332, 267, 349]",MISC
1969,Status,"[267, 332, 366, 349]",MISC
1970,:,"[366, 332, 382, 349]",MISC
1971,Married,"[382, 332, 496, 349]",MISC
1972,-,"[497, 332, 499, 349]",MISC
1973,NL,"[497, 332, 499, 349]",MISC
1974,-,"[497, 332, 499, 349]",MISC
1975,Languages,"[153, 349, 263, 365]",MISC
1976,Known,"[264, 349, 324, 365]",MISC
1977,:,"[326, 349, 336, 365]",MISC
1978,English,"[338, 349, 436, 365]",MISC
1979,",","[338, 349, 436, 365]",MISC
1980,Kannada,"[437, 349, 522, 365]",MISC
1981,and,"[523, 349, 559, 365]",MISC
1982,Hindi,"[560, 349, 633, 365]",MISC
1983,.,"[560, 349, 633, 365]",MISC
1984,-,"[634, 349, 636, 365]",MISC
1985,NL,"[634, 349, 636, 365]",MISC
1986,-,"[634, 349, 636, 365]",MISC
1987,Contact,"[89, 408, 169, 425]",B-personal_details_heading
1988,details,"[170, 408, 263, 425]",I-personal_details_heading
1989,:,"[170, 408, 263, 425]",I-personal_details_heading
1990,-,"[263, 408, 265, 425]",MISC
1991,NL,"[263, 408, 265, 425]",MISC
1992,-,"[263, 408, 265, 425]",MISC
1993,Mobile,"[153, 425, 269, 443]",MISC
1994,:,"[269, 425, 287, 443]",MISC
1995,97,"[289, 425, 481, 443]",B-phones_phone
1996,##40,"[289, 425, 481, 443]",I-phones_phone
1997,##12,"[289, 425, 481, 443]",I-phones_phone
1998,##27,"[289, 425, 481, 443]",I-phones_phone
1999,##00,"[289, 425, 481, 443]",I-phones_phone
2000,-,"[483, 425, 484, 443]",MISC
2001,NL,"[483, 425, 484, 443]",MISC
2002,-,"[483, 425, 484, 443]",MISC
2003,Em,"[153, 443, 224, 458]",MISC
2004,##ail,"[153, 443, 224, 458]",MISC
2005,:,"[225, 443, 239, 458]",MISC
2006,mad,"[239, 443, 583, 458]",B-emails_email
2007,##hus,"[239, 443, 583, 458]",I-emails_email
2008,##uda,"[239, 443, 583, 458]",I-emails_email
2009,##na,"[239, 443, 583, 458]",I-emails_email
2010,.,"[239, 443, 583, 458]",I-emails_email
2011,a,"[239, 443, 583, 458]",I-emails_email
2012,##c,"[239, 443, 583, 458]",I-emails_email
2013,@,"[239, 443, 583, 458]",I-emails_email
2014,g,"[239, 443, 583, 458]",I-emails_email
2015,##mail,"[239, 443, 583, 458]",I-emails_email
2016,.,"[239, 443, 583, 458]",I-emails_email
2017,com,"[239, 443, 583, 458]",I-emails_email
2018,-,"[584, 443, 586, 458]",MISC
2019,NL,"[584, 443, 586, 458]",MISC
2020,-,"[584, 443, 586, 458]",MISC
2021,Ad,"[153, 458, 258, 476]",MISC
2022,##dress,"[153, 458, 258, 476]",MISC
2023,:,"[259, 458, 273, 476]",MISC
2024,#,"[274, 458, 349, 476]",MISC
2025,67,"[274, 458, 349, 476]",MISC
2026,##8,"[274, 458, 349, 476]",MISC
2027,",","[274, 458, 349, 476]",MISC
2028,2nd,"[349, 458, 394, 476]",MISC
2029,Block,"[395, 458, 484, 476]",MISC
2030,",","[395, 458, 484, 476]",MISC
2031,5th,"[485, 458, 530, 476]",MISC
2032,Cross,"[531, 458, 620, 476]",MISC
2033,",","[531, 458, 620, 476]",MISC
2034,-,"[622, 458, 623, 476]",MISC
2035,NL,"[622, 458, 623, 476]",MISC
2036,-,"[622, 458, 623, 476]",MISC
2037,8th,"[281, 476, 313, 493]",MISC
2038,Main,"[315, 476, 370, 493]",MISC
2039,",","[315, 476, 370, 493]",MISC
2040,BS,"[371, 476, 403, 493]",MISC
2041,##K,"[371, 476, 403, 493]",MISC
2042,1st,"[405, 476, 437, 493]",MISC
2043,Stage,"[438, 476, 504, 493]",MISC
2044,",","[438, 476, 504, 493]",MISC
2045,-,"[506, 476, 508, 493]",MISC
2046,NL,"[506, 476, 508, 493]",MISC
2047,-,"[506, 476, 508, 493]",MISC
2048,Ash,"[281, 493, 344, 510]",MISC
2049,##ok,"[281, 493, 344, 510]",MISC
2050,Nagar,"[344, 493, 406, 510]",MISC
2051,-,"[406, 493, 408, 510]",MISC
2052,NL,"[406, 493, 408, 510]",MISC
2053,-,"[406, 493, 408, 510]",MISC
2054,Bangalore,"[281, 510, 413, 527]",MISC
2055,-,"[281, 510, 413, 527]",MISC
2056,50,"[281, 510, 413, 527]",MISC
2057,-,"[413, 510, 415, 527]",MISC
2058,NL,"[413, 510, 415, 527]",MISC
2059,-,"[413, 510, 415, 527]",MISC
2060,Declaration,"[89, 533, 217, 550]",B-others_heading
2061,-,"[217, 533, 219, 550]",MISC
2062,NL,"[217, 533, 219, 550]",MISC
2063,-,"[217, 533, 219, 550]",MISC
2064,I,"[89, 559, 99, 576]",MISC
2065,here,"[101, 559, 172, 576]",MISC
2066,##by,"[101, 559, 172, 576]",MISC
2067,declare,"[173, 559, 257, 576]",MISC
2068,that,"[257, 559, 305, 576]",MISC
2069,the,"[305, 559, 341, 576]",MISC
2070,above,"[341, 559, 521, 576]",MISC
2071,-,"[341, 559, 521, 576]",MISC
2072,mentioned,"[341, 559, 521, 576]",MISC
2073,facts,"[522, 559, 581, 576]",MISC
2074,are,"[582, 559, 618, 576]",MISC
2075,true,"[618, 559, 666, 576]",MISC
2076,to,"[666, 559, 689, 576]",MISC
2077,the,"[690, 559, 726, 576]",MISC
2078,best,"[726, 559, 774, 576]",MISC
2079,of,"[774, 559, 798, 576]",MISC
2080,my,"[799, 559, 822, 576]",MISC
2081,knowledge,"[823, 559, 942, 576]",MISC
2082,.,"[823, 559, 942, 576]",MISC
2083,I,"[943, 559, 954, 576]",MISC
2084,-,"[955, 559, 957, 576]",MISC
2085,NL,"[955, 559, 957, 576]",MISC
2086,-,"[955, 559, 957, 576]",MISC
2087,have,"[89, 576, 137, 593]",MISC
2088,confidence,"[138, 576, 259, 593]",MISC
2089,that,"[260, 576, 308, 593]",MISC
2090,when,"[309, 576, 357, 593]",MISC
2091,I,"[358, 576, 368, 593]",MISC
2092,get,"[370, 576, 406, 593]",MISC
2093,offer,"[407, 576, 480, 593]",MISC
2094,",","[407, 576, 480, 593]",MISC
2095,I,"[480, 576, 491, 593]",MISC
2096,will,"[492, 576, 540, 593]",MISC
2097,be,"[541, 576, 564, 593]",MISC
2098,able,"[566, 576, 614, 593]",MISC
2099,to,"[615, 576, 638, 593]",MISC
2100,perform,"[639, 576, 725, 593]",MISC
2101,my,"[725, 576, 748, 593]",MISC
2102,duties,"[749, 576, 822, 593]",MISC
2103,to,"[823, 576, 846, 593]",MISC
2104,the,"[847, 576, 883, 593]",MISC
2105,best,"[884, 576, 932, 593]",MISC
2106,of,"[933, 576, 956, 593]",MISC
2107,my,"[957, 576, 980, 593]",MISC
2108,-,"[982, 576, 983, 593]",MISC
2109,NL,"[982, 576, 983, 593]",MISC
2110,-,"[982, 576, 983, 593]",MISC
2111,abilities,"[89, 593, 171, 609]",MISC
2112,.,"[89, 593, 171, 609]",MISC
2113,-,"[171, 593, 172, 609]",MISC
2114,NL,"[171, 593, 172, 609]",MISC
2115,-,"[171, 593, 172, 609]",MISC
2116,Mad,"[89, 644, 226, 661]",MISC
2117,##hus,"[89, 644, 226, 661]",MISC
2118,##uda,"[89, 644, 226, 661]",MISC
2119,##na,"[89, 644, 226, 661]",MISC
2120,-,"[226, 644, 228, 661]",MISC
2121,NL,"[226, 644, 228, 661]",MISC
2122,-,"[226, 644, 228, 661]",MISC
2123,Page,"[778, 984, 818, 1000]",MISC
2124,4,"[819, 984, 827, 1000]",MISC
2125,of,"[829, 984, 848, 1000]",MISC
2126,4,"[849, 984, 858, 1000]",MISC
2127,-,"[859, 984, 860, 1000]",MISC
2128,NL,"[859, 984, 860, 1000]",MISC
2129,-,"[859, 984, 860, 1000]",MISC
