,token,box,label
0,G,"[523, 89, 619, 107]",B-name
1,##au,"[523, 89, 619, 107]",I-name
2,##ra,"[523, 89, 619, 107]",I-name
3,##v,"[523, 89, 619, 107]",I-name
4,Dub,"[620, 89, 700, 107]",I-name
5,##ey,"[620, 89, 700, 107]",I-name
6,-,"[701, 89, 703, 107]",MISC
7,NL,"[701, 89, 703, 107]",MISC
8,-,"[701, 89, 703, 107]",MISC
9,Contact,"[133, 138, 226, 154]",MISC
10,no,"[226, 138, 265, 154]",MISC
11,:,"[226, 138, 265, 154]",MISC
12,+,"[266, 138, 452, 154]",B-phones_phone
13,91,"[266, 138, 452, 154]",I-phones_phone
14,-,"[266, 138, 452, 154]",I-phones_phone
15,82,"[266, 138, 452, 154]",I-phones_phone
16,##7,"[266, 138, 452, 154]",I-phones_phone
17,##37,"[266, 138, 452, 154]",I-phones_phone
18,##38,"[266, 138, 452, 154]",I-phones_phone
19,##42,"[266, 138, 452, 154]",I-phones_phone
20,##4,"[266, 138, 452, 154]",I-phones_phone
21,-,"[452, 138, 454, 154]",MISC
22,NL,"[452, 138, 454, 154]",MISC
23,-,"[452, 138, 454, 154]",MISC
24,Em,"[133, 155, 191, 170]",MISC
25,##ail,"[133, 155, 191, 170]",MISC
26,I,"[191, 155, 224, 170]",MISC
27,##d,"[191, 155, 224, 170]",MISC
28,:,"[191, 155, 224, 170]",MISC
29,g,"[225, 155, 455, 170]",B-emails_email
30,##au,"[225, 155, 455, 170]",I-emails_email
31,##ra,"[225, 155, 455, 170]",I-emails_email
32,##v,"[225, 155, 455, 170]",I-emails_email
33,##d,"[225, 155, 455, 170]",I-emails_email
34,##b,"[225, 155, 455, 170]",I-emails_email
35,##24,"[225, 155, 455, 170]",I-emails_email
36,@,"[225, 155, 455, 170]",I-emails_email
37,g,"[225, 155, 455, 170]",I-emails_email
38,##mail,"[225, 155, 455, 170]",I-emails_email
39,.,"[225, 155, 455, 170]",I-emails_email
40,com,"[225, 155, 455, 170]",I-emails_email
41,-,"[456, 155, 458, 170]",MISC
42,NL,"[456, 155, 458, 170]",MISC
43,-,"[456, 155, 458, 170]",MISC
44,O,"[133, 187, 250, 201]",B-summary_heading
45,##bject,"[133, 187, 250, 201]",I-summary_heading
46,##ive,"[133, 187, 250, 201]",I-summary_heading
47,:,"[133, 187, 250, 201]",I-summary_heading
48,-,"[250, 187, 252, 201]",MISC
49,NL,"[250, 187, 252, 201]",MISC
50,-,"[250, 187, 252, 201]",MISC
51,A,"[133, 218, 191, 233]",MISC
52,##pp,"[133, 218, 191, 233]",MISC
53,##ly,"[133, 218, 191, 233]",MISC
54,my,"[192, 218, 214, 233]",MISC
55,skills,"[216, 218, 286, 233]",MISC
56,as,"[286, 218, 309, 233]",MISC
57,a,"[310, 218, 321, 233]",MISC
58,Software,"[322, 218, 414, 233]",MISC
59,Engineer,"[416, 218, 509, 233]",MISC
60,to,"[510, 218, 533, 233]",MISC
61,a,"[534, 218, 545, 233]",MISC
62,new,"[546, 218, 581, 233]",MISC
63,challenge,"[581, 218, 687, 233]",MISC
64,with,"[687, 218, 733, 233]",MISC
65,a,"[734, 218, 745, 233]",MISC
66,company,"[746, 218, 828, 233]",MISC
67,focused,"[828, 218, 910, 233]",MISC
68,on,"[911, 218, 933, 233]",MISC
69,-,"[935, 218, 936, 233]",MISC
70,NL,"[935, 218, 936, 233]",MISC
71,-,"[935, 218, 936, 233]",MISC
72,quality,"[133, 235, 211, 249]",MISC
73,",","[133, 235, 211, 249]",MISC
74,dedication,"[212, 235, 320, 249]",MISC
75,",","[212, 235, 320, 249]",MISC
76,and,"[321, 235, 351, 249]",MISC
77,ing,"[351, 235, 450, 249]",MISC
78,##en,"[351, 235, 450, 249]",MISC
79,##uity,"[351, 235, 450, 249]",MISC
80,.,"[351, 235, 450, 249]",MISC
81,-,"[450, 235, 452, 249]",MISC
82,NL,"[450, 235, 452, 249]",MISC
83,-,"[450, 235, 452, 249]",MISC
84,Professional,"[133, 268, 291, 283]",B-summary_heading
85,Su,"[292, 268, 398, 283]",I-summary_heading
86,##mma,"[292, 268, 398, 283]",I-summary_heading
87,##ry,"[292, 268, 398, 283]",I-summary_heading
88,:,"[292, 268, 398, 283]",I-summary_heading
89,-,"[398, 268, 400, 283]",MISC
90,NL,"[398, 268, 400, 283]",MISC
91,-,"[398, 268, 400, 283]",MISC
92,Having,"[178, 301, 247, 312]",MISC
93,2,"[247, 301, 281, 312]",MISC
94,.,"[247, 301, 281, 312]",MISC
95,3,"[247, 301, 281, 312]",MISC
96,years,"[282, 301, 340, 312]",MISC
97,of,"[340, 301, 362, 312]",MISC
98,experience,"[363, 301, 478, 312]",MISC
99,in,"[479, 301, 501, 312]",MISC
100,Development,"[502, 301, 628, 312]",MISC
101,as,"[629, 301, 652, 312]",MISC
102,software,"[652, 301, 743, 312]",MISC
103,engineer,"[745, 301, 849, 312]",MISC
104,.,"[745, 301, 849, 312]",MISC
105,-,"[849, 301, 851, 312]",MISC
106,NL,"[849, 301, 851, 312]",MISC
107,-,"[849, 301, 851, 312]",MISC
108,Having,"[178, 322, 245, 334]",MISC
109,4,"[246, 322, 257, 334]",MISC
110,years,"[258, 322, 313, 334]",MISC
111,of,"[315, 322, 337, 334]",MISC
112,experience,"[338, 322, 451, 334]",MISC
113,in,"[452, 322, 474, 334]",MISC
114,teaching,"[474, 322, 701, 334]",MISC
115,(,"[474, 322, 701, 334]",MISC
116,2007,"[474, 322, 701, 334]",MISC
117,-,"[474, 322, 701, 334]",MISC
118,2011,"[474, 322, 701, 334]",MISC
119,),"[474, 322, 701, 334]",MISC
120,.,"[474, 322, 701, 334]",MISC
121,-,"[703, 322, 705, 334]",MISC
122,NL,"[703, 322, 705, 334]",MISC
123,-,"[703, 322, 705, 334]",MISC
124,Prof,"[178, 344, 289, 356]",MISC
125,##icient,"[178, 344, 289, 356]",MISC
126,in,"[291, 344, 313, 356]",MISC
127,Software,"[314, 344, 403, 356]",MISC
128,Application,"[404, 344, 528, 356]",MISC
129,Development,"[528, 344, 653, 356]",MISC
130,using,"[653, 344, 709, 356]",MISC
131,CO,"[709, 344, 980, 356]",MISC
132,##RE,"[709, 344, 980, 356]",MISC
133,-,"[709, 344, 980, 356]",MISC
134,J,"[709, 344, 980, 356]",MISC
135,##AV,"[709, 344, 980, 356]",MISC
136,##A,"[709, 344, 980, 356]",MISC
137,",","[709, 344, 980, 356]",MISC
138,J,"[709, 344, 980, 356]",MISC
139,##2,"[709, 344, 980, 356]",MISC
140,##EE,"[709, 344, 980, 356]",MISC
141,",","[709, 344, 980, 356]",MISC
142,ST,"[709, 344, 980, 356]",MISC
143,##R,"[709, 344, 980, 356]",MISC
144,##UT,"[709, 344, 980, 356]",MISC
145,##S,"[709, 344, 980, 356]",MISC
146,-,"[709, 344, 980, 356]",MISC
147,2,"[709, 344, 980, 356]",MISC
148,.,"[709, 344, 980, 356]",MISC
149,-,"[981, 344, 983, 356]",MISC
150,NL,"[981, 344, 983, 356]",MISC
151,-,"[981, 344, 983, 356]",MISC
152,I,"[178, 366, 304, 377]",MISC
153,##mple,"[178, 366, 304, 377]",MISC
154,##mented,"[178, 366, 304, 377]",MISC
155,Con,"[305, 366, 442, 377]",MISC
156,##nect,"[305, 366, 442, 377]",MISC
157,##ivity,"[305, 366, 442, 377]",MISC
158,to,"[443, 366, 465, 377]",MISC
159,databases,"[466, 366, 568, 377]",MISC
160,using,"[569, 366, 627, 377]",MISC
161,J,"[627, 366, 684, 377]",MISC
162,##D,"[627, 366, 684, 377]",MISC
163,##BC,"[627, 366, 684, 377]",MISC
164,.,"[627, 366, 684, 377]",MISC
165,-,"[684, 366, 686, 377]",MISC
166,NL,"[684, 366, 686, 377]",MISC
167,-,"[684, 366, 686, 377]",MISC
168,Having,"[178, 387, 249, 400]",MISC
169,good,"[249, 387, 401, 400]",MISC
170,",","[249, 387, 401, 400]",MISC
171,in,"[249, 387, 401, 400]",MISC
172,-,"[249, 387, 401, 400]",MISC
173,depth,"[249, 387, 401, 400]",MISC
174,knowledge,"[403, 387, 509, 400]",MISC
175,of,"[510, 387, 532, 400]",MISC
176,MV,"[533, 387, 569, 400]",MISC
177,##C,"[533, 387, 569, 400]",MISC
178,pattern,"[569, 387, 664, 400]",MISC
179,.,"[569, 387, 664, 400]",MISC
180,-,"[664, 387, 666, 400]",MISC
181,NL,"[664, 387, 666, 400]",MISC
182,-,"[664, 387, 666, 400]",MISC
183,Hands,"[179, 410, 281, 421]",MISC
184,-,"[179, 410, 281, 421]",MISC
185,on,"[179, 410, 281, 421]",MISC
186,experience,"[282, 410, 410, 421]",MISC
187,on,"[410, 410, 434, 421]",MISC
188,R,"[436, 410, 601, 421]",MISC
189,##ED,"[436, 410, 601, 421]",MISC
190,##HA,"[436, 410, 601, 421]",MISC
191,##T,"[436, 410, 601, 421]",MISC
192,-,"[436, 410, 601, 421]",MISC
193,Linux,"[436, 410, 601, 421]",MISC
194,",","[436, 410, 601, 421]",MISC
195,and,"[602, 410, 639, 421]",MISC
196,also,"[641, 410, 691, 421]",MISC
197,possesses,"[692, 410, 807, 421]",MISC
198,good,"[807, 410, 857, 421]",MISC
199,knowledge,"[859, 410, 974, 421]",MISC
200,of,"[974, 410, 998, 421]",MISC
201,-,"[1000, 410, 1001, 421]",MISC
202,NL,"[1000, 410, 1001, 421]",MISC
203,-,"[1000, 410, 1001, 421]",MISC
204,De,"[200, 428, 261, 443]",MISC
205,##bian,"[200, 428, 261, 443]",MISC
206,family,"[262, 428, 332, 443]",MISC
207,.,"[262, 428, 332, 443]",MISC
208,-,"[333, 428, 335, 443]",MISC
209,NL,"[333, 428, 335, 443]",MISC
210,-,"[333, 428, 335, 443]",MISC
211,Having,"[178, 453, 247, 465]",MISC
212,the,"[247, 453, 280, 465]",MISC
213,in,"[282, 453, 361, 465]",MISC
214,##de,"[282, 453, 361, 465]",MISC
215,##pt,"[282, 453, 361, 465]",MISC
216,##h,"[282, 453, 361, 465]",MISC
217,knowledge,"[362, 453, 464, 465]",MISC
218,of,"[466, 453, 488, 465]",MISC
219,S,"[489, 453, 533, 465]",MISC
220,##N,"[489, 453, 533, 465]",MISC
221,##MP,"[489, 453, 533, 465]",MISC
222,protocol,"[535, 453, 891, 465]",MISC
223,",","[535, 453, 891, 465]",MISC
224,S,"[535, 453, 891, 465]",MISC
225,##N,"[535, 453, 891, 465]",MISC
226,##MP,"[535, 453, 891, 465]",MISC
227,-,"[535, 453, 891, 465]",MISC
228,Agent,"[535, 453, 891, 465]",MISC
229,",","[535, 453, 891, 465]",MISC
230,S,"[535, 453, 891, 465]",MISC
231,##N,"[535, 453, 891, 465]",MISC
232,##MP,"[535, 453, 891, 465]",MISC
233,-,"[535, 453, 891, 465]",MISC
234,T,"[535, 453, 891, 465]",MISC
235,##rap,"[535, 453, 891, 465]",MISC
236,##s,"[535, 453, 891, 465]",MISC
237,.,"[535, 453, 891, 465]",MISC
238,-,"[892, 453, 894, 465]",MISC
239,NL,"[892, 453, 894, 465]",MISC
240,-,"[892, 453, 894, 465]",MISC
241,En,"[178, 475, 324, 486]",MISC
242,##thus,"[178, 475, 324, 486]",MISC
243,##ias,"[178, 475, 324, 486]",MISC
244,##tic,"[178, 475, 324, 486]",MISC
245,",","[178, 475, 324, 486]",MISC
246,self,"[326, 475, 371, 486]",MISC
247,motivated,"[372, 475, 474, 486]",MISC
248,and,"[475, 475, 508, 486]",MISC
249,a,"[509, 475, 520, 486]",MISC
250,good,"[520, 475, 565, 486]",MISC
251,team,"[566, 475, 610, 486]",MISC
252,player,"[612, 475, 691, 486]",MISC
253,.,"[612, 475, 691, 486]",MISC
254,-,"[692, 475, 693, 486]",MISC
255,NL,"[692, 475, 693, 486]",MISC
256,-,"[692, 475, 693, 486]",MISC
257,Educational,"[133, 516, 261, 531]",B-education_heading
258,Qualification,"[263, 516, 428, 531]",I-education_heading
259,:,"[263, 516, 428, 531]",I-education_heading
260,-,"[428, 516, 430, 531]",MISC
261,NL,"[428, 516, 430, 531]",MISC
262,-,"[428, 516, 430, 531]",MISC
263,B,"[178, 551, 260, 562]",B-education_degree
264,.,"[178, 551, 260, 562]",I-education_degree
265,Tech,"[178, 551, 260, 562]",I-education_degree
266,",","[178, 551, 260, 562]",MISC
267,from,"[262, 551, 308, 562]",MISC
268,B,"[309, 551, 344, 562]",B-education_institute
269,##IT,"[309, 551, 344, 562]",I-education_institute
270,Mu,"[345, 551, 558, 562]",I-education_institute
271,##za,"[345, 551, 558, 562]",I-education_institute
272,##ff,"[345, 551, 558, 562]",I-education_institute
273,##ar,"[345, 551, 558, 562]",I-education_institute
274,##N,"[345, 551, 558, 562]",I-education_institute
275,##aga,"[345, 551, 558, 562]",I-education_institute
276,##r,"[345, 551, 558, 562]",I-education_institute
277,",","[345, 551, 558, 562]",I-education_institute
278,UP,"[345, 551, 558, 562]",I-education_institute
279,##TU,"[345, 551, 558, 562]",I-education_institute
280,",","[559, 551, 570, 562]",MISC
281,in,"[570, 551, 593, 562]",MISC
282,June,"[594, 551, 641, 562]",MISC
283,2007,"[642, 551, 688, 562]",MISC
284,with,"[689, 551, 736, 562]",MISC
285,65,"[737, 551, 783, 562]",MISC
286,%,"[737, 551, 783, 562]",MISC
287,.,"[737, 551, 783, 562]",MISC
288,-,"[784, 551, 786, 562]",MISC
289,NL,"[784, 551, 786, 562]",MISC
290,-,"[784, 551, 786, 562]",MISC
291,Professional,"[133, 579, 280, 596]",B-work_experience_heading
292,Experience,"[281, 579, 417, 596]",I-work_experience_heading
293,:,"[281, 579, 417, 596]",I-work_experience_heading
294,-,"[417, 579, 419, 596]",MISC
295,NL,"[417, 579, 419, 596]",MISC
296,-,"[417, 579, 419, 596]",MISC
297,Currently,"[145, 614, 255, 627]",MISC
298,working,"[256, 614, 342, 627]",MISC
299,as,"[343, 614, 367, 627]",MISC
300,software,"[367, 614, 466, 627]",MISC
301,engineer,"[466, 614, 564, 627]",MISC
302,in,"[564, 614, 588, 627]",MISC
303,Ronan,"[589, 614, 674, 627]",B-employer_company_name
304,##ki,"[589, 614, 674, 627]",I-employer_company_name
305,In,"[675, 614, 774, 627]",I-employer_company_name
306,##fo,"[675, 614, 774, 627]",I-employer_company_name
307,##T,"[675, 614, 774, 627]",I-employer_company_name
308,##ech,"[675, 614, 774, 627]",I-employer_company_name
309,P,"[774, 614, 822, 627]",I-employer_company_name
310,##v,"[774, 614, 822, 627]",I-employer_company_name
311,##t,"[774, 614, 822, 627]",I-employer_company_name
312,.,"[774, 614, 822, 627]",I-employer_company_name
313,Ltd,"[823, 614, 871, 627]",I-employer_company_name
314,.,"[823, 614, 871, 627]",I-employer_company_name
315,from,"[872, 614, 921, 627]",MISC
316,Oct,"[922, 614, 957, 627]",MISC
317,-,"[959, 614, 961, 627]",MISC
318,NL,"[959, 614, 961, 627]",MISC
319,-,"[959, 614, 961, 627]",MISC
320,17th,"[133, 628, 178, 643]",MISC
321,2011,"[178, 628, 223, 643]",MISC
322,to,"[223, 628, 245, 643]",MISC
323,till,"[245, 628, 290, 643]",MISC
324,date,"[290, 628, 335, 643]",MISC
325,-,"[335, 628, 337, 643]",MISC
326,NL,"[335, 628, 337, 643]",MISC
327,-,"[335, 628, 337, 643]",MISC
328,Ski,"[133, 660, 189, 677]",B-skills_heading
329,##ll,"[133, 660, 189, 677]",I-skills_heading
330,Set,"[190, 660, 234, 677]",I-skills_heading
331,:,"[190, 660, 234, 677]",I-skills_heading
332,-,"[235, 660, 237, 677]",MISC
333,NL,"[235, 660, 237, 677]",MISC
334,-,"[235, 660, 237, 677]",MISC
335,Languages,"[180, 695, 305, 708]",MISC
336,:,"[306, 695, 319, 708]",MISC
337,Per,"[320, 695, 780, 708]",MISC
338,##l,"[320, 695, 780, 708]",MISC
339,",","[320, 695, 780, 708]",MISC
340,J,"[320, 695, 780, 708]",MISC
341,##AV,"[320, 695, 780, 708]",MISC
342,##A,"[320, 695, 780, 708]",MISC
343,",","[320, 695, 780, 708]",MISC
344,J,"[320, 695, 780, 708]",MISC
345,##SP,"[320, 695, 780, 708]",MISC
346,",","[320, 695, 780, 708]",MISC
347,SE,"[320, 695, 780, 708]",MISC
348,##R,"[320, 695, 780, 708]",MISC
349,##V,"[320, 695, 780, 708]",MISC
350,##LE,"[320, 695, 780, 708]",MISC
351,##TS,"[320, 695, 780, 708]",MISC
352,",","[320, 695, 780, 708]",MISC
353,St,"[320, 695, 780, 708]",MISC
354,##ru,"[320, 695, 780, 708]",MISC
355,##ts,"[320, 695, 780, 708]",MISC
356,-,"[320, 695, 780, 708]",MISC
357,2,"[320, 695, 780, 708]",MISC
358,.,"[320, 695, 780, 708]",MISC
359,x,"[320, 695, 780, 708]",MISC
360,-,"[781, 695, 782, 708]",MISC
361,NL,"[781, 695, 782, 708]",MISC
362,-,"[781, 695, 782, 708]",MISC
363,Application,"[179, 713, 314, 724]",MISC
364,Server,"[315, 713, 390, 724]",MISC
365,:,"[390, 713, 401, 724]",MISC
366,J,"[402, 713, 464, 724]",MISC
367,##bos,"[402, 713, 464, 724]",MISC
368,##s,"[402, 713, 464, 724]",MISC
369,4,"[464, 713, 526, 724]",MISC
370,.,"[464, 713, 526, 724]",MISC
371,2,"[464, 713, 526, 724]",MISC
372,.,"[464, 713, 526, 724]",MISC
373,2,"[464, 713, 526, 724]",MISC
374,-,"[526, 713, 528, 724]",MISC
375,NL,"[526, 713, 528, 724]",MISC
376,-,"[526, 713, 528, 724]",MISC
377,Web,"[186, 729, 356, 740]",MISC
378,##S,"[186, 729, 356, 740]",MISC
379,##erve,"[186, 729, 356, 740]",MISC
380,##r,"[186, 729, 356, 740]",MISC
381,:,"[357, 729, 376, 740]",MISC
382,Tom,"[376, 729, 489, 740]",MISC
383,##cat,"[376, 729, 489, 740]",MISC
384,7,"[491, 729, 509, 740]",MISC
385,-,"[510, 729, 512, 740]",MISC
386,NL,"[510, 729, 512, 740]",MISC
387,-,"[510, 729, 512, 740]",MISC
388,Database,"[184, 746, 325, 758]",MISC
389,:,"[325, 746, 342, 758]",MISC
390,My,"[343, 746, 447, 758]",MISC
391,##s,"[343, 746, 447, 758]",MISC
392,##q,"[343, 746, 447, 758]",MISC
393,##l,"[343, 746, 447, 758]",MISC
394,",","[343, 746, 447, 758]",MISC
395,Oracle,"[448, 746, 552, 758]",MISC
396,-,"[554, 746, 556, 758]",MISC
397,NL,"[554, 746, 556, 758]",MISC
398,-,"[554, 746, 556, 758]",MISC
399,OS,"[186, 763, 225, 774]",MISC
400,:,"[226, 763, 245, 774]",MISC
401,Windows,"[246, 763, 385, 774]",MISC
402,X,"[385, 763, 484, 774]",MISC
403,##p,"[385, 763, 484, 774]",MISC
404,/,"[385, 763, 484, 774]",MISC
405,7,"[385, 763, 484, 774]",MISC
406,",","[385, 763, 484, 774]",MISC
407,Linux,"[485, 763, 583, 774]",MISC
408,(,"[584, 763, 662, 774]",MISC
409,Red,"[584, 763, 662, 774]",MISC
410,H,"[664, 763, 742, 774]",MISC
411,##AT,"[664, 763, 742, 774]",MISC
412,),"[664, 763, 742, 774]",MISC
413,-,"[743, 763, 745, 774]",MISC
414,NL,"[743, 763, 745, 774]",MISC
415,-,"[743, 763, 745, 774]",MISC
416,Project,"[133, 807, 259, 822]",MISC
417,#,"[133, 807, 259, 822]",MISC
418,1,"[133, 807, 259, 822]",MISC
419,:,"[260, 807, 273, 822]",MISC
420,RA,"[274, 807, 443, 822]",B-project_title
421,##CS,"[274, 807, 443, 822]",I-project_title
422,(,"[274, 807, 443, 822]",I-project_title
423,Ronan,"[274, 807, 443, 822]",I-project_title
424,##ki,"[274, 807, 443, 822]",I-project_title
425,Auto,"[443, 807, 498, 822]",I-project_title
426,configuration,"[499, 807, 681, 822]",I-project_title
427,Server,"[682, 807, 780, 822]",I-project_title
428,),"[682, 807, 780, 822]",I-project_title
429,-,"[781, 807, 782, 822]",MISC
430,NL,"[781, 807, 782, 822]",MISC
431,-,"[781, 807, 782, 822]",MISC
432,C,"[133, 822, 213, 837]",MISC
433,##lient,"[133, 822, 213, 837]",MISC
434,:,"[213, 822, 226, 837]",MISC
435,C,"[226, 822, 425, 837]",B-project_company_name
436,.,"[226, 822, 425, 837]",I-project_company_name
437,A,"[226, 822, 425, 837]",I-project_company_name
438,.,"[226, 822, 425, 837]",I-project_company_name
439,I,"[226, 822, 425, 837]",I-project_company_name
440,.,"[226, 822, 425, 837]",I-project_company_name
441,R,"[226, 822, 425, 837]",I-project_company_name
442,.,"[226, 822, 425, 837]",I-project_company_name
443,(,"[226, 822, 425, 837]",I-project_company_name
444,Center,"[226, 822, 425, 837]",I-project_company_name
445,for,"[426, 822, 465, 837]",I-project_company_name
446,Art,"[466, 822, 585, 837]",I-project_company_name
447,##ific,"[466, 822, 585, 837]",I-project_company_name
448,##al,"[466, 822, 585, 837]",I-project_company_name
449,Intelligence,"[586, 822, 746, 837]",I-project_company_name
450,Research,"[746, 822, 865, 837]",I-project_company_name
451,),"[746, 822, 865, 837]",I-project_company_name
452,-,"[866, 822, 868, 837]",MISC
453,NL,"[866, 822, 868, 837]",MISC
454,-,"[866, 822, 868, 837]",MISC
455,Domain,"[133, 837, 250, 851]",MISC
456,:,"[251, 837, 270, 851]",MISC
457,Telecom,"[271, 837, 427, 851]",MISC
458,.,"[271, 837, 427, 851]",MISC
459,-,"[428, 837, 430, 851]",MISC
460,NL,"[428, 837, 430, 851]",MISC
461,-,"[428, 837, 430, 851]",MISC
462,Language,"[133, 851, 272, 866]",MISC
463,:,"[273, 851, 360, 866]",MISC
464,Core,"[273, 851, 360, 866]",MISC
465,Java,"[360, 851, 429, 866]",MISC
466,-,"[430, 851, 432, 866]",MISC
467,NL,"[430, 851, 432, 866]",MISC
468,-,"[430, 851, 432, 866]",MISC
469,Too,"[133, 866, 198, 881]",MISC
470,##ls,"[133, 866, 198, 881]",MISC
471,used,"[199, 866, 250, 881]",MISC
472,:,"[251, 866, 264, 881]",MISC
473,St,"[264, 866, 381, 881]",MISC
474,##ru,"[264, 866, 381, 881]",MISC
475,##ts,"[264, 866, 381, 881]",MISC
476,-,"[264, 866, 381, 881]",MISC
477,2,"[264, 866, 381, 881]",MISC
478,",","[264, 866, 381, 881]",MISC
479,Hi,"[382, 866, 590, 881]",MISC
480,##ber,"[382, 866, 590, 881]",MISC
481,##nate,"[382, 866, 590, 881]",MISC
482,",","[382, 866, 590, 881]",MISC
483,My,"[382, 866, 590, 881]",MISC
484,##S,"[382, 866, 590, 881]",MISC
485,##q,"[382, 866, 590, 881]",MISC
486,##l,"[382, 866, 590, 881]",MISC
487,.,"[382, 866, 590, 881]",MISC
488,-,"[591, 866, 593, 881]",MISC
489,NL,"[591, 866, 593, 881]",MISC
490,-,"[591, 866, 593, 881]",MISC
491,Server,"[139, 881, 246, 895]",MISC
492,:,"[247, 881, 264, 895]",MISC
493,J,"[265, 881, 355, 895]",MISC
494,##bos,"[265, 881, 355, 895]",MISC
495,##s,"[265, 881, 355, 895]",MISC
496,4,"[356, 881, 445, 895]",MISC
497,.,"[356, 881, 445, 895]",MISC
498,2,"[356, 881, 445, 895]",MISC
499,.,"[356, 881, 445, 895]",MISC
500,2,"[356, 881, 445, 895]",MISC
501,-,"[447, 881, 448, 895]",MISC
502,NL,"[447, 881, 448, 895]",MISC
503,-,"[447, 881, 448, 895]",MISC
504,Du,"[133, 895, 246, 910]",MISC
505,##ration,"[133, 895, 246, 910]",MISC
506,:,"[248, 895, 261, 910]",MISC
507,Oct,"[262, 895, 305, 910]",MISC
508,2011,"[305, 895, 506, 910]",MISC
509,-,"[305, 895, 506, 910]",MISC
510,till,"[305, 895, 506, 910]",MISC
511,##date,"[305, 895, 506, 910]",MISC
512,.,"[305, 895, 506, 910]",MISC
513,-,"[506, 895, 508, 910]",MISC
514,NL,"[506, 895, 508, 910]",MISC
515,-,"[506, 895, 508, 910]",MISC
516,Team,"[133, 910, 222, 925]",MISC
517,size,"[223, 910, 312, 925]",MISC
518,:,"[313, 910, 335, 925]",MISC
519,4,"[335, 910, 357, 925]",MISC
520,-,"[358, 910, 359, 925]",MISC
521,NL,"[358, 910, 359, 925]",MISC
522,-,"[358, 910, 359, 925]",MISC
523,Des,"[133, 925, 289, 938]",MISC
524,##cription,"[133, 925, 289, 938]",MISC
525,:,"[133, 925, 289, 938]",MISC
526,RA,"[291, 925, 343, 938]",MISC
527,##CS,"[291, 925, 343, 938]",MISC
528,is,"[343, 925, 369, 938]",MISC
529,a,"[369, 925, 382, 938]",MISC
530,multi,"[383, 925, 605, 938]",MISC
531,-,"[383, 925, 605, 938]",MISC
532,dimensional,"[383, 925, 605, 938]",MISC
533,CW,"[606, 925, 658, 938]",MISC
534,##MP,"[606, 925, 658, 938]",MISC
535,(,"[658, 925, 710, 938]",MISC
536,CP,"[658, 925, 710, 938]",MISC
537,##E,"[658, 925, 710, 938]",MISC
538,WA,"[711, 925, 750, 938]",MISC
539,##N,"[711, 925, 750, 938]",MISC
540,Management,"[750, 925, 880, 938]",MISC
541,Protocol,"[881, 925, 998, 938]",MISC
542,),"[881, 925, 998, 938]",MISC
543,-,"[999, 925, 1001, 938]",MISC
544,NL,"[999, 925, 1001, 938]",MISC
545,-,"[999, 925, 1001, 938]",MISC
546,com,"[133, 938, 231, 953]",MISC
547,##pliant,"[133, 938, 231, 953]",MISC
548,server,"[233, 938, 298, 953]",MISC
549,that,"[300, 938, 342, 953]",MISC
550,offers,"[344, 938, 409, 953]",MISC
551,simple,"[411, 938, 476, 953]",MISC
552,and,"[477, 938, 509, 953]",MISC
553,stream,"[511, 938, 631, 953]",MISC
554,##lined,"[511, 938, 631, 953]",MISC
555,control,"[633, 938, 709, 953]",MISC
556,of,"[711, 938, 731, 953]",MISC
557,the,"[733, 938, 764, 953]",MISC
558,CP,"[766, 938, 809, 953]",MISC
559,##Es,"[766, 938, 809, 953]",MISC
560,(,"[811, 938, 909, 953]",MISC
561,Custom,"[811, 938, 909, 953]",MISC
562,##er,"[811, 938, 909, 953]",MISC
563,Pre,"[911, 938, 998, 953]",MISC
564,##mise,"[911, 938, 998, 953]",MISC
565,##s,"[911, 938, 998, 953]",MISC
566,-,"[1000, 938, 1001, 953]",MISC
567,NL,"[1000, 938, 1001, 953]",MISC
568,-,"[1000, 938, 1001, 953]",MISC
569,Equipment,"[133, 953, 259, 968]",MISC
570,##s,"[133, 953, 259, 968]",MISC
571,),"[133, 953, 259, 968]",MISC
572,for,"[260, 953, 294, 968]",MISC
573,basic,"[295, 953, 352, 968]",MISC
574,and,"[353, 953, 386, 968]",MISC
575,enhanced,"[387, 953, 478, 968]",MISC
576,services,"[480, 953, 584, 968]",MISC
577,.,"[480, 953, 584, 968]",MISC
578,RA,"[584, 953, 628, 968]",MISC
579,##CS,"[584, 953, 628, 968]",MISC
580,(,"[630, 953, 721, 968]",MISC
581,Ronan,"[630, 953, 721, 968]",MISC
582,##ki,"[630, 953, 721, 968]",MISC
583,Auto,"[722, 953, 767, 968]",MISC
584,Con,"[768, 953, 917, 968]",MISC
585,##fi,"[768, 953, 917, 968]",MISC
586,##gu,"[768, 953, 917, 968]",MISC
587,##ration,"[768, 953, 917, 968]",MISC
588,Server,"[919, 953, 998, 968]",MISC
589,),"[919, 953, 998, 968]",MISC
590,-,"[1000, 953, 1001, 968]",MISC
591,NL,"[1000, 953, 1001, 968]",MISC
592,-,"[1000, 953, 1001, 968]",MISC
593,enables,"[133, 968, 207, 982]",MISC
594,provision,"[209, 968, 348, 982]",MISC
595,##ing,"[209, 968, 348, 982]",MISC
596,",","[209, 968, 348, 982]",MISC
597,configuration,"[350, 968, 500, 982]",MISC
598,",","[350, 968, 500, 982]",MISC
599,monitoring,"[501, 968, 609, 982]",MISC
600,and,"[610, 968, 728, 982]",MISC
601,##fi,"[610, 968, 728, 982]",MISC
602,##rm,"[610, 968, 728, 982]",MISC
603,##ware,"[610, 968, 728, 982]",MISC
604,upgrades,"[729, 968, 814, 982]",MISC
605,of,"[815, 968, 836, 982]",MISC
606,distributed,"[837, 968, 956, 982]",MISC
607,CP,"[956, 968, 999, 982]",MISC
608,##Es,"[956, 968, 999, 982]",MISC
609,-,"[1000, 968, 1001, 982]",MISC
610,NL,"[1000, 968, 1001, 982]",MISC
611,-,"[1000, 968, 1001, 982]",MISC
612,connected,"[133, 982, 243, 997]",MISC
613,over,"[243, 982, 291, 997]",MISC
614,WA,"[292, 982, 327, 997]",MISC
615,##N,"[292, 982, 327, 997]",MISC
616,(,"[328, 982, 388, 997]",MISC
617,Wide,"[328, 982, 388, 997]",MISC
618,Area,"[389, 982, 438, 997]",MISC
619,Network,"[438, 982, 548, 997]",MISC
620,),"[438, 982, 548, 997]",MISC
621,.,"[438, 982, 548, 997]",MISC
622,The,"[548, 982, 583, 997]",MISC
623,RA,"[585, 982, 633, 997]",MISC
624,##CS,"[585, 982, 633, 997]",MISC
625,provision,"[633, 982, 778, 997]",MISC
626,##ing,"[633, 982, 778, 997]",MISC
627,mechanism,"[780, 982, 889, 997]",MISC
628,allows,"[890, 982, 962, 997]",MISC
629,CP,"[963, 982, 998, 997]",MISC
630,##E,"[963, 982, 998, 997]",MISC
631,-,"[1000, 982, 1001, 997]",MISC
632,NL,"[1000, 982, 1001, 997]",MISC
633,-,"[1000, 982, 1001, 997]",MISC
634,provision,"[133, 89, 272, 103]",MISC
635,##ing,"[133, 89, 272, 103]",MISC
636,at,"[274, 89, 296, 103]",MISC
637,the,"[297, 89, 330, 103]",MISC
638,time,"[332, 89, 379, 103]",MISC
639,of,"[379, 89, 401, 103]",MISC
640,initial,"[402, 89, 484, 103]",MISC
641,connection,"[484, 89, 601, 103]",MISC
642,to,"[601, 89, 624, 103]",MISC
643,the,"[625, 89, 658, 103]",MISC
644,broadband,"[660, 89, 764, 103]",MISC
645,access,"[765, 89, 834, 103]",MISC
646,network,"[836, 89, 928, 103]",MISC
647,",","[836, 89, 928, 103]",MISC
648,and,"[929, 89, 963, 103]",MISC
649,the,"[964, 89, 998, 103]",MISC
650,-,"[1000, 89, 1001, 103]",MISC
651,NL,"[1000, 89, 1001, 103]",MISC
652,-,"[1000, 89, 1001, 103]",MISC
653,ability,"[133, 103, 211, 118]",MISC
654,to,"[212, 103, 234, 118]",MISC
655,re,"[234, 103, 368, 118]",MISC
656,-,"[234, 103, 368, 118]",MISC
657,provision,"[234, 103, 368, 118]",MISC
658,or,"[369, 103, 392, 118]",MISC
659,re,"[392, 103, 525, 118]",MISC
660,-,"[392, 103, 525, 118]",MISC
661,con,"[392, 103, 525, 118]",MISC
662,##fi,"[392, 103, 525, 118]",MISC
663,##gu,"[392, 103, 525, 118]",MISC
664,##re,"[392, 103, 525, 118]",MISC
665,at,"[527, 103, 549, 118]",MISC
666,any,"[549, 103, 583, 118]",MISC
667,subsequent,"[583, 103, 694, 118]",MISC
668,time,"[696, 103, 751, 118]",MISC
669,.,"[696, 103, 751, 118]",MISC
670,This,"[752, 103, 796, 118]",MISC
671,includes,"[797, 103, 886, 118]",MISC
672,support,"[887, 103, 965, 118]",MISC
673,for,"[966, 103, 999, 118]",MISC
674,-,"[1000, 103, 1001, 118]",MISC
675,NL,"[1000, 103, 1001, 118]",MISC
676,-,"[1000, 103, 1001, 118]",MISC
677,as,"[133, 123, 257, 138]",MISC
678,##ync,"[133, 123, 257, 138]",MISC
679,##hr,"[133, 123, 257, 138]",MISC
680,##ono,"[133, 123, 257, 138]",MISC
681,##us,"[133, 123, 257, 138]",MISC
682,AC,"[258, 123, 394, 138]",MISC
683,##S,"[258, 123, 394, 138]",MISC
684,-,"[258, 123, 394, 138]",MISC
685,initiated,"[258, 123, 394, 138]",MISC
686,re,"[394, 123, 549, 138]",MISC
687,-,"[394, 123, 549, 138]",MISC
688,provision,"[394, 123, 549, 138]",MISC
689,##ing,"[394, 123, 549, 138]",MISC
690,of,"[550, 123, 570, 138]",MISC
691,a,"[571, 123, 580, 138]",MISC
692,CP,"[581, 123, 622, 138]",MISC
693,##E,"[581, 123, 622, 138]",MISC
694,.,"[581, 123, 622, 138]",MISC
695,-,"[623, 123, 625, 138]",MISC
696,NL,"[623, 123, 625, 138]",MISC
697,-,"[623, 123, 625, 138]",MISC
698,Mo,"[133, 153, 213, 167]",MISC
699,##du,"[133, 153, 213, 167]",MISC
700,##les,"[133, 153, 213, 167]",MISC
701,in,"[214, 153, 236, 167]",MISC
702,RA,"[237, 153, 294, 167]",MISC
703,##CS,"[237, 153, 294, 167]",MISC
704,.,"[237, 153, 294, 167]",MISC
705,-,"[294, 153, 296, 167]",MISC
706,NL,"[294, 153, 296, 167]",MISC
707,-,"[294, 153, 296, 167]",MISC
708,1,"[133, 182, 153, 197]",MISC
709,),"[133, 182, 153, 197]",MISC
710,Devi,"[154, 182, 235, 197]",MISC
711,##ces,"[154, 182, 235, 197]",MISC
712,.,"[154, 182, 235, 197]",MISC
713,-,"[237, 182, 239, 197]",MISC
714,NL,"[237, 182, 239, 197]",MISC
715,-,"[237, 182, 239, 197]",MISC
716,2,"[133, 197, 153, 210]",MISC
717,),"[133, 197, 153, 210]",MISC
718,Hard,"[155, 197, 253, 210]",MISC
719,##ware,"[155, 197, 253, 210]",MISC
720,.,"[155, 197, 253, 210]",MISC
721,-,"[254, 197, 256, 210]",MISC
722,NL,"[254, 197, 256, 210]",MISC
723,-,"[254, 197, 256, 210]",MISC
724,3,"[133, 213, 152, 228]",MISC
725,),"[133, 213, 152, 228]",MISC
726,Devi,"[153, 213, 212, 228]",MISC
727,##ce,"[153, 213, 212, 228]",MISC
728,profiles,"[213, 213, 302, 228]",MISC
729,.,"[213, 213, 302, 228]",MISC
730,-,"[302, 213, 304, 228]",MISC
731,NL,"[302, 213, 304, 228]",MISC
732,-,"[302, 213, 304, 228]",MISC
733,Role,"[133, 245, 189, 260]",MISC
734,##s,"[133, 245, 189, 260]",MISC
735,:,"[133, 245, 189, 260]",MISC
736,-,"[189, 245, 191, 260]",MISC
737,NL,"[189, 245, 191, 260]",MISC
738,-,"[189, 245, 191, 260]",MISC
739,In,"[178, 263, 269, 275]",MISC
740,##volved,"[178, 263, 269, 275]",MISC
741,in,"[270, 263, 292, 275]",MISC
742,coding,"[293, 263, 361, 275]",MISC
743,the,"[362, 263, 395, 275]",MISC
744,project,"[396, 263, 476, 275]",MISC
745,-,"[476, 263, 478, 275]",MISC
746,NL,"[476, 263, 478, 275]",MISC
747,-,"[476, 263, 478, 275]",MISC
748,Fi,"[179, 278, 251, 289]",MISC
749,##xing,"[179, 278, 251, 289]",MISC
750,the,"[251, 278, 287, 289]",MISC
751,bugs,"[288, 278, 347, 289]",MISC
752,.,"[288, 278, 347, 289]",MISC
753,-,"[348, 278, 350, 289]",MISC
754,NL,"[348, 278, 350, 289]",MISC
755,-,"[348, 278, 350, 289]",MISC
756,Doc,"[178, 293, 271, 304]",MISC
757,##ume,"[178, 293, 271, 304]",MISC
758,##nt,"[178, 293, 271, 304]",MISC
759,the,"[271, 293, 304, 304]",MISC
760,design,"[306, 293, 375, 304]",MISC
761,changes,"[376, 293, 455, 304]",MISC
762,with,"[457, 293, 503, 304]",MISC
763,version,"[504, 293, 583, 304]",MISC
764,control,"[585, 293, 665, 304]",MISC
765,(,"[666, 293, 735, 304]",MISC
766,SV,"[666, 293, 735, 304]",MISC
767,##N,"[666, 293, 735, 304]",MISC
768,),"[666, 293, 735, 304]",MISC
769,.,"[666, 293, 735, 304]",MISC
770,-,"[736, 293, 738, 304]",MISC
771,NL,"[736, 293, 738, 304]",MISC
772,-,"[736, 293, 738, 304]",MISC
773,As,"[178, 306, 247, 319]",MISC
774,##sist,"[178, 306, 247, 319]",MISC
775,in,"[248, 306, 271, 319]",MISC
776,planning,"[272, 306, 365, 319]",MISC
777,and,"[365, 306, 399, 319]",MISC
778,execution,"[401, 306, 504, 319]",MISC
779,of,"[506, 306, 528, 319]",MISC
780,new,"[529, 306, 563, 319]",MISC
781,modules,"[564, 306, 657, 319]",MISC
782,.,"[564, 306, 657, 319]",MISC
783,-,"[658, 306, 660, 319]",MISC
784,NL,"[658, 306, 660, 319]",MISC
785,-,"[658, 306, 660, 319]",MISC
786,Project,"[133, 365, 244, 381]",MISC
787,#,"[133, 365, 244, 381]",MISC
788,2,"[133, 365, 244, 381]",MISC
789,-,"[244, 365, 246, 381]",MISC
790,NL,"[244, 365, 246, 381]",MISC
791,-,"[244, 365, 246, 381]",MISC
792,Project,"[133, 381, 228, 395]",MISC
793,Name,"[228, 381, 282, 395]",MISC
794,:,"[282, 381, 295, 395]",MISC
795,Ronan,"[295, 381, 390, 395]",B-project_title
796,##ki,"[295, 381, 390, 395]",I-project_title
797,Network,"[390, 381, 485, 395]",I-project_title
798,Management,"[485, 381, 618, 395]",I-project_title
799,System,"[620, 381, 699, 395]",I-project_title
800,-,"[701, 381, 703, 395]",MISC
801,NL,"[701, 381, 703, 395]",MISC
802,-,"[701, 381, 703, 395]",MISC
803,C,"[133, 397, 243, 412]",MISC
804,##lient,"[133, 397, 243, 412]",MISC
805,:,"[243, 397, 259, 412]",MISC
806,Product,"[261, 397, 387, 412]",MISC
807,based,"[389, 397, 480, 412]",MISC
808,-,"[480, 397, 482, 412]",MISC
809,NL,"[480, 397, 482, 412]",MISC
810,-,"[480, 397, 482, 412]",MISC
811,Language,"[133, 413, 267, 428]",MISC
812,:,"[267, 413, 283, 428]",MISC
813,Java,"[283, 413, 434, 428]",MISC
814,",","[283, 413, 434, 428]",MISC
815,J,"[283, 413, 434, 428]",MISC
816,##2,"[283, 413, 434, 428]",MISC
817,##EE,"[283, 413, 434, 428]",MISC
818,-,"[434, 413, 435, 428]",MISC
819,NL,"[434, 413, 435, 428]",MISC
820,-,"[434, 413, 435, 428]",MISC
821,Too,"[133, 431, 209, 445]",MISC
822,##ls,"[133, 431, 209, 445]",MISC
823,used,"[209, 431, 269, 445]",MISC
824,:,"[270, 431, 285, 445]",MISC
825,St,"[285, 431, 437, 445]",MISC
826,##ru,"[285, 431, 437, 445]",MISC
827,##ts,"[285, 431, 437, 445]",MISC
828,-,"[285, 431, 437, 445]",MISC
829,2,"[285, 431, 437, 445]",MISC
830,.,"[285, 431, 437, 445]",MISC
831,x,"[285, 431, 437, 445]",MISC
832,-,"[437, 431, 439, 445]",MISC
833,NL,"[437, 431, 439, 445]",MISC
834,-,"[437, 431, 439, 445]",MISC
835,Sc,"[133, 447, 291, 462]",MISC
836,##rip,"[133, 447, 291, 462]",MISC
837,##ting,"[133, 447, 291, 462]",MISC
838,:,"[292, 447, 308, 462]",MISC
839,Per,"[309, 447, 380, 462]",MISC
840,##l,"[309, 447, 380, 462]",MISC
841,-,"[380, 447, 382, 462]",MISC
842,NL,"[380, 447, 382, 462]",MISC
843,-,"[380, 447, 382, 462]",MISC
844,Du,"[133, 463, 250, 478]",MISC
845,##ration,"[133, 463, 250, 478]",MISC
846,:,"[250, 463, 263, 478]",MISC
847,February,"[265, 463, 382, 478]",MISC
848,2012,"[382, 463, 440, 478]",MISC
849,–,"[441, 463, 454, 478]",MISC
850,till,"[456, 463, 513, 478]",MISC
851,Date,"[514, 463, 572, 478]",MISC
852,-,"[573, 463, 575, 478]",MISC
853,NL,"[573, 463, 575, 478]",MISC
854,-,"[573, 463, 575, 478]",MISC
855,Database,"[133, 481, 285, 495]",MISC
856,:,"[287, 481, 305, 495]",MISC
857,My,"[306, 481, 401, 495]",MISC
858,##S,"[306, 481, 401, 495]",MISC
859,##q,"[306, 481, 401, 495]",MISC
860,##l,"[306, 481, 401, 495]",MISC
861,-,"[402, 481, 404, 495]",MISC
862,NL,"[402, 481, 404, 495]",MISC
863,-,"[402, 481, 404, 495]",MISC
864,Application,"[133, 497, 257, 512]",MISC
865,Server,"[258, 497, 325, 512]",MISC
866,:,"[326, 497, 338, 512]",MISC
867,J,"[338, 497, 393, 512]",MISC
868,##B,"[338, 497, 393, 512]",MISC
869,##oss,"[338, 497, 393, 512]",MISC
870,-,"[395, 497, 397, 512]",MISC
871,NL,"[395, 497, 397, 512]",MISC
872,-,"[395, 497, 397, 512]",MISC
873,Team,"[133, 513, 222, 528]",MISC
874,size,"[223, 513, 312, 528]",MISC
875,:,"[313, 513, 335, 528]",MISC
876,7,"[335, 513, 357, 528]",MISC
877,-,"[358, 513, 359, 528]",MISC
878,NL,"[358, 513, 359, 528]",MISC
879,-,"[358, 513, 359, 528]",MISC
880,Role,"[133, 531, 192, 544]",MISC
881,:,"[194, 531, 209, 544]",MISC
882,In,"[210, 531, 391, 544]",MISC
883,##ves,"[210, 531, 391, 544]",MISC
884,##ti,"[210, 531, 391, 544]",MISC
885,##gat,"[210, 531, 391, 544]",MISC
886,##or,"[210, 531, 391, 544]",MISC
887,&,"[393, 531, 408, 544]",MISC
888,Sc,"[408, 531, 499, 544]",MISC
889,##rip,"[408, 531, 499, 544]",MISC
890,##t,"[408, 531, 499, 544]",MISC
891,Dev,"[500, 531, 637, 544]",MISC
892,##elo,"[500, 531, 637, 544]",MISC
893,##per,"[500, 531, 637, 544]",MISC
894,-,"[638, 531, 640, 544]",MISC
895,NL,"[638, 531, 640, 544]",MISC
896,-,"[638, 531, 640, 544]",MISC
897,Des,"[133, 562, 272, 576]",MISC
898,##cription,"[133, 562, 272, 576]",MISC
899,:,"[133, 562, 272, 576]",MISC
900,N,"[272, 562, 306, 576]",MISC
901,##MS,"[272, 562, 306, 576]",MISC
902,(,"[307, 562, 400, 576]",MISC
903,Network,"[307, 562, 400, 576]",MISC
904,Management,"[400, 562, 515, 576]",MISC
905,System,"[516, 562, 596, 576]",MISC
906,),"[516, 562, 596, 576]",MISC
907,is,"[597, 562, 620, 576]",MISC
908,an,"[621, 562, 643, 576]",MISC
909,enterprise,"[644, 562, 759, 576]",MISC
910,grade,"[760, 562, 818, 576]",MISC
911,network,"[818, 562, 898, 576]",MISC
912,-,"[899, 562, 901, 576]",MISC
913,NL,"[899, 562, 901, 576]",MISC
914,-,"[899, 562, 901, 576]",MISC
915,monitoring,"[133, 578, 244, 593]",MISC
916,system,"[245, 578, 323, 593]",MISC
917,.,"[245, 578, 323, 593]",MISC
918,The,"[323, 578, 356, 593]",MISC
919,goal,"[356, 578, 401, 593]",MISC
920,is,"[401, 578, 423, 593]",MISC
921,for,"[423, 578, 457, 593]",MISC
922,R,"[457, 578, 501, 593]",MISC
923,##N,"[457, 578, 501, 593]",MISC
924,##MS,"[457, 578, 501, 593]",MISC
925,to,"[501, 578, 524, 593]",MISC
926,be,"[524, 578, 546, 593]",MISC
927,truly,"[546, 578, 602, 593]",MISC
928,distributed,"[602, 578, 735, 593]",MISC
929,",","[602, 578, 735, 593]",MISC
930,s,"[736, 578, 825, 593]",MISC
931,##cal,"[736, 578, 825, 593]",MISC
932,##able,"[736, 578, 825, 593]",MISC
933,management,"[825, 578, 936, 593]",MISC
934,-,"[936, 578, 938, 593]",MISC
935,NL,"[936, 578, 938, 593]",MISC
936,-,"[936, 578, 938, 593]",MISC
937,application,"[133, 594, 257, 609]",MISC
938,platform,"[258, 594, 347, 609]",MISC
939,for,"[349, 594, 382, 609]",MISC
940,all,"[383, 594, 416, 609]",MISC
941,aspects,"[417, 594, 495, 609]",MISC
942,of,"[496, 594, 518, 609]",MISC
943,the,"[519, 594, 552, 609]",MISC
944,FC,"[553, 594, 608, 609]",MISC
945,##AP,"[553, 594, 608, 609]",MISC
946,##S,"[553, 594, 608, 609]",MISC
947,network,"[609, 594, 687, 609]",MISC
948,management,"[689, 594, 802, 609]",MISC
949,model,"[802, 594, 869, 609]",MISC
950,.,"[802, 594, 869, 609]",MISC
951,It,"[870, 594, 892, 609]",MISC
952,is,"[893, 594, 915, 609]",MISC
953,an,"[916, 594, 938, 609]",MISC
954,-,"[938, 594, 940, 609]",MISC
955,NL,"[938, 594, 940, 609]",MISC
956,-,"[938, 594, 940, 609]",MISC
957,advanced,"[133, 612, 222, 625]",MISC
958,provision,"[223, 612, 356, 625]",MISC
959,##ing,"[223, 612, 356, 625]",MISC
960,system,"[357, 612, 423, 625]",MISC
961,for,"[424, 612, 457, 625]",MISC
962,adding,"[457, 612, 524, 625]",MISC
963,devices,"[524, 612, 602, 625]",MISC
964,automatically,"[603, 612, 747, 625]",MISC
965,to,"[748, 612, 770, 625]",MISC
966,the,"[770, 612, 804, 625]",MISC
967,management,"[804, 612, 915, 625]",MISC
968,system,"[916, 612, 994, 625]",MISC
969,.,"[916, 612, 994, 625]",MISC
970,-,"[994, 612, 996, 625]",MISC
971,NL,"[994, 612, 996, 625]",MISC
972,-,"[994, 612, 996, 625]",MISC
973,By,"[133, 628, 153, 643]",MISC
974,using,"[155, 628, 208, 643]",MISC
975,monitors,"[209, 628, 294, 643]",MISC
976,it,"[295, 628, 315, 643]",MISC
977,can,"[317, 628, 391, 643]",MISC
978,##fin,"[317, 628, 391, 643]",MISC
979,##d,"[317, 628, 391, 643]",MISC
980,the,"[392, 628, 424, 643]",MISC
981,availability,"[424, 628, 552, 643]",MISC
982,of,"[554, 628, 574, 643]",MISC
983,system,"[575, 628, 650, 643]",MISC
984,.,"[575, 628, 650, 643]",MISC
985,And,"[651, 628, 683, 643]",MISC
986,performance,"[683, 628, 800, 643]",MISC
987,data,"[802, 628, 845, 643]",MISC
988,collection,"[845, 628, 953, 643]",MISC
989,-,"[953, 628, 955, 643]",MISC
990,NL,"[953, 628, 955, 643]",MISC
991,-,"[953, 628, 955, 643]",MISC
992,exists,"[133, 644, 200, 659]",MISC
993,in,"[200, 644, 223, 659]",MISC
994,R,"[223, 644, 267, 659]",MISC
995,##N,"[223, 644, 267, 659]",MISC
996,##MS,"[223, 644, 267, 659]",MISC
997,for,"[268, 644, 301, 659]",MISC
998,a,"[302, 644, 313, 659]",MISC
999,number,"[313, 644, 380, 659]",MISC
1000,of,"[380, 644, 403, 659]",MISC
1001,network,"[403, 644, 481, 659]",MISC
1002,protocols,"[481, 644, 593, 659]",MISC
1003,.,"[481, 644, 593, 659]",MISC
1004,Out,"[594, 644, 661, 659]",MISC
1005,##age,"[594, 644, 661, 659]",MISC
1006,information,"[661, 644, 784, 659]",MISC
1007,is,"[785, 644, 807, 659]",MISC
1008,stored,"[807, 644, 874, 659]",MISC
1009,in,"[875, 644, 897, 659]",MISC
1010,the,"[897, 644, 931, 659]",MISC
1011,-,"[931, 644, 933, 659]",MISC
1012,NL,"[931, 644, 933, 659]",MISC
1013,-,"[931, 644, 933, 659]",MISC
1014,database,"[133, 662, 222, 675]",MISC
1015,and,"[222, 662, 256, 675]",MISC
1016,can,"[256, 662, 289, 675]",MISC
1017,be,"[289, 662, 312, 675]",MISC
1018,used,"[312, 662, 356, 675]",MISC
1019,to,"[356, 662, 378, 675]",MISC
1020,generate,"[379, 662, 468, 675]",MISC
1021,availability,"[468, 662, 601, 675]",MISC
1022,reports,"[602, 662, 691, 675]",MISC
1023,",","[602, 662, 691, 675]",MISC
1024,and,"[691, 662, 724, 675]",MISC
1025,also,"[724, 662, 769, 675]",MISC
1026,remote,"[769, 662, 836, 675]",MISC
1027,poll,"[836, 662, 914, 675]",MISC
1028,##ers,"[836, 662, 914, 675]",MISC
1029,can,"[914, 662, 947, 675]",MISC
1030,be,"[948, 662, 970, 675]",MISC
1031,-,"[970, 662, 972, 675]",MISC
1032,NL,"[970, 662, 972, 675]",MISC
1033,-,"[970, 662, 972, 675]",MISC
1034,deployed,"[133, 678, 215, 693]",MISC
1035,to,"[216, 678, 236, 693]",MISC
1036,measure,"[237, 678, 309, 693]",MISC
1037,availability,"[309, 678, 432, 693]",MISC
1038,from,"[433, 678, 474, 693]",MISC
1039,distant,"[475, 678, 547, 693]",MISC
1040,locations,"[547, 678, 649, 693]",MISC
1041,.,"[547, 678, 649, 693]",MISC
1042,-,"[651, 678, 653, 693]",MISC
1043,NL,"[651, 678, 653, 693]",MISC
1044,-,"[651, 678, 653, 693]",MISC
1045,Re,"[133, 709, 306, 724]",MISC
1046,##sp,"[133, 709, 306, 724]",MISC
1047,##ons,"[133, 709, 306, 724]",MISC
1048,##ibi,"[133, 709, 306, 724]",MISC
1049,##lities,"[133, 709, 306, 724]",MISC
1050,:,"[133, 709, 306, 724]",MISC
1051,-,"[306, 709, 307, 724]",MISC
1052,NL,"[306, 709, 307, 724]",MISC
1053,-,"[306, 709, 307, 724]",MISC
1054,In,"[178, 729, 269, 740]",MISC
1055,##volved,"[178, 729, 269, 740]",MISC
1056,in,"[269, 729, 291, 740]",MISC
1057,understanding,"[291, 729, 438, 740]",MISC
1058,the,"[439, 729, 473, 740]",MISC
1059,requirement,"[473, 729, 598, 740]",MISC
1060,from,"[598, 729, 643, 740]",MISC
1061,Doc,"[644, 729, 801, 740]",MISC
1062,##ume,"[644, 729, 801, 740]",MISC
1063,##ntation,"[644, 729, 801, 740]",MISC
1064,.,"[644, 729, 801, 740]",MISC
1065,-,"[803, 729, 805, 740]",MISC
1066,NL,"[803, 729, 805, 740]",MISC
1067,-,"[803, 729, 805, 740]",MISC
1068,Doing,"[178, 745, 236, 758]",MISC
1069,investigation,"[236, 745, 387, 758]",MISC
1070,on,"[388, 745, 410, 758]",MISC
1071,S,"[411, 745, 458, 758]",MISC
1072,##N,"[411, 745, 458, 758]",MISC
1073,##MP,"[411, 745, 458, 758]",MISC
1074,protocol,"[458, 745, 550, 758]",MISC
1075,&,"[551, 745, 562, 758]",MISC
1076,its,"[563, 745, 596, 758]",MISC
1077,commands,"[598, 745, 690, 758]",MISC
1078,for,"[691, 745, 724, 758]",MISC
1079,device,"[726, 745, 794, 758]",MISC
1080,communication,"[796, 745, 957, 758]",MISC
1081,.,"[796, 745, 957, 758]",MISC
1082,-,"[959, 745, 961, 758]",MISC
1083,NL,"[959, 745, 961, 758]",MISC
1084,-,"[959, 745, 961, 758]",MISC
1085,Doing,"[178, 763, 236, 774]",MISC
1086,investigation,"[237, 763, 389, 774]",MISC
1087,on,"[391, 763, 413, 774]",MISC
1088,S,"[414, 763, 461, 774]",MISC
1089,##N,"[414, 763, 461, 774]",MISC
1090,##MP,"[414, 763, 461, 774]",MISC
1091,T,"[461, 763, 508, 774]",MISC
1092,##rap,"[461, 763, 508, 774]",MISC
1093,da,"[509, 763, 579, 774]",MISC
1094,##emon,"[509, 763, 579, 774]",MISC
1095,&,"[579, 763, 591, 774]",MISC
1096,its,"[591, 763, 626, 774]",MISC
1097,configuration,"[627, 763, 779, 774]",MISC
1098,on,"[780, 763, 802, 774]",MISC
1099,both,"[804, 763, 850, 774]",MISC
1100,l,"[851, 763, 908, 774]",MISC
1101,##in,"[851, 763, 908, 774]",MISC
1102,##ux,"[851, 763, 908, 774]",MISC
1103,&,"[910, 763, 921, 774]",MISC
1104,-,"[922, 763, 923, 774]",MISC
1105,NL,"[922, 763, 923, 774]",MISC
1106,-,"[922, 763, 923, 774]",MISC
1107,windows,"[200, 776, 274, 790]",MISC
1108,servers,"[274, 776, 358, 790]",MISC
1109,.,"[274, 776, 358, 790]",MISC
1110,-,"[359, 776, 361, 790]",MISC
1111,NL,"[359, 776, 361, 790]",MISC
1112,-,"[359, 776, 361, 790]",MISC
1113,Doing,"[178, 795, 233, 807]",MISC
1114,investigation,"[234, 795, 381, 807]",MISC
1115,on,"[381, 795, 403, 807]",MISC
1116,S,"[404, 795, 448, 807]",MISC
1117,##N,"[404, 795, 448, 807]",MISC
1118,##MP,"[404, 795, 448, 807]",MISC
1119,O,"[449, 795, 560, 807]",MISC
1120,##ID,"[449, 795, 560, 807]",MISC
1121,’,"[449, 795, 560, 807]",MISC
1122,s,"[449, 795, 560, 807]",MISC
1123,",","[449, 795, 560, 807]",MISC
1124,both,"[449, 795, 560, 807]",MISC
1125,general,"[562, 795, 640, 807]",MISC
1126,mi,"[641, 795, 765, 807]",MISC
1127,##bs,"[641, 795, 765, 807]",MISC
1128,(,"[641, 795, 765, 807]",MISC
1129,MI,"[641, 795, 765, 807]",MISC
1130,##B,"[641, 795, 765, 807]",MISC
1131,-,"[641, 795, 765, 807]",MISC
1132,2,"[641, 795, 765, 807]",MISC
1133,),"[641, 795, 765, 807]",MISC
1134,&,"[765, 795, 777, 807]",MISC
1135,private,"[777, 795, 855, 807]",MISC
1136,mi,"[856, 795, 911, 807]",MISC
1137,##bs,"[856, 795, 911, 807]",MISC
1138,.,"[856, 795, 911, 807]",MISC
1139,-,"[912, 795, 914, 807]",MISC
1140,NL,"[912, 795, 914, 807]",MISC
1141,-,"[912, 795, 914, 807]",MISC
1142,Writing,"[178, 812, 258, 824]",MISC
1143,per,"[258, 812, 303, 824]",MISC
1144,##l,"[258, 812, 303, 824]",MISC
1145,script,"[305, 812, 373, 824]",MISC
1146,to,"[374, 812, 396, 824]",MISC
1147,extend,"[397, 812, 465, 824]",MISC
1148,the,"[466, 812, 499, 824]",MISC
1149,S,"[500, 812, 615, 824]",MISC
1150,##N,"[500, 812, 615, 824]",MISC
1151,##MP,"[500, 812, 615, 824]",MISC
1152,-,"[500, 812, 615, 824]",MISC
1153,agent,"[500, 812, 615, 824]",MISC
1154,on,"[615, 812, 637, 824]",MISC
1155,the,"[638, 812, 671, 824]",MISC
1156,basis,"[673, 812, 730, 824]",MISC
1157,of,"[730, 812, 752, 824]",MISC
1158,customer,"[753, 812, 844, 824]",MISC
1159,requirement,"[845, 812, 971, 824]",MISC
1160,-,"[972, 812, 974, 824]",MISC
1161,NL,"[972, 812, 974, 824]",MISC
1162,-,"[972, 812, 974, 824]",MISC
1163,basically,"[200, 826, 296, 840]",MISC
1164,for,"[298, 826, 330, 840]",MISC
1165,Linux,"[331, 826, 385, 840]",MISC
1166,and,"[385, 826, 417, 840]",MISC
1167,Windows,"[418, 826, 494, 840]",MISC
1168,servers,"[495, 826, 571, 840]",MISC
1169,-,"[571, 826, 573, 840]",MISC
1170,NL,"[571, 826, 573, 840]",MISC
1171,-,"[571, 826, 573, 840]",MISC
1172,Pre,"[178, 845, 284, 857]",MISC
1173,##par,"[178, 845, 284, 857]",MISC
1174,##ing,"[178, 845, 284, 857]",MISC
1175,reports,"[285, 845, 367, 857]",MISC
1176,on,"[368, 845, 390, 857]",MISC
1177,weekly,"[392, 845, 462, 857]",MISC
1178,&,"[463, 845, 474, 857]",MISC
1179,monthly,"[475, 845, 557, 857]",MISC
1180,basis,"[558, 845, 616, 857]",MISC
1181,-,"[617, 845, 619, 857]",MISC
1182,NL,"[617, 845, 619, 857]",MISC
1183,-,"[617, 845, 619, 857]",MISC
1184,In,"[178, 862, 267, 874]",MISC
1185,##volved,"[178, 862, 267, 874]",MISC
1186,in,"[267, 862, 289, 874]",MISC
1187,documentation,"[290, 862, 434, 874]",MISC
1188,of,"[435, 862, 457, 874]",MISC
1189,project,"[457, 862, 546, 874]",MISC
1190,.,"[457, 862, 546, 874]",MISC
1191,-,"[547, 862, 549, 874]",MISC
1192,NL,"[547, 862, 549, 874]",MISC
1193,-,"[547, 862, 549, 874]",MISC
1194,Writing,"[179, 879, 266, 890]",MISC
1195,of,"[266, 879, 291, 890]",MISC
1196,S,"[291, 879, 340, 890]",MISC
1197,##N,"[291, 879, 340, 890]",MISC
1198,##MP,"[291, 879, 340, 890]",MISC
1199,&,"[341, 879, 352, 890]",MISC
1200,S,"[354, 879, 465, 890]",MISC
1201,##N,"[354, 879, 465, 890]",MISC
1202,##MP,"[354, 879, 465, 890]",MISC
1203,-,"[354, 879, 465, 890]",MISC
1204,T,"[354, 879, 465, 890]",MISC
1205,##RA,"[354, 879, 465, 890]",MISC
1206,##P,"[354, 879, 465, 890]",MISC
1207,Sc,"[466, 879, 541, 890]",MISC
1208,##rip,"[466, 879, 541, 890]",MISC
1209,##t,"[466, 879, 541, 890]",MISC
1210,-,"[541, 879, 543, 890]",MISC
1211,NL,"[541, 879, 543, 890]",MISC
1212,-,"[541, 879, 543, 890]",MISC
1213,St,"[133, 925, 254, 941]",B-skills_heading
1214,##ren,"[133, 925, 254, 941]",I-skills_heading
1215,##gth,"[133, 925, 254, 941]",I-skills_heading
1216,##s,"[133, 925, 254, 941]",I-skills_heading
1217,:,"[133, 925, 254, 941]",I-skills_heading
1218,-,"[254, 925, 256, 941]",MISC
1219,NL,"[254, 925, 256, 941]",MISC
1220,-,"[254, 925, 256, 941]",MISC
1221,Self,"[178, 958, 222, 970]",MISC
1222,Con,"[223, 958, 337, 970]",MISC
1223,##fi,"[223, 958, 337, 970]",MISC
1224,##dence,"[223, 958, 337, 970]",MISC
1225,and,"[337, 958, 371, 970]",MISC
1226,De,"[371, 958, 485, 970]",MISC
1227,##dication,"[371, 958, 485, 970]",MISC
1228,towards,"[485, 958, 563, 970]",MISC
1229,the,"[565, 958, 598, 970]",MISC
1230,Goal,"[599, 958, 644, 970]",MISC
1231,Orient,"[645, 958, 780, 970]",MISC
1232,##ation,"[645, 958, 780, 970]",MISC
1233,",","[645, 958, 780, 970]",MISC
1234,with,"[781, 958, 826, 970]",MISC
1235,a,"[827, 958, 838, 970]",MISC
1236,motto,"[838, 958, 894, 970]",MISC
1237,in,"[895, 958, 917, 970]",MISC
1238,-,"[918, 958, 920, 970]",MISC
1239,NL,"[918, 958, 920, 970]",MISC
1240,-,"[918, 958, 920, 970]",MISC
1241,the,"[200, 970, 230, 985]",MISC
1242,delivering,"[231, 970, 333, 985]",MISC
1243,the,"[334, 970, 364, 985]",MISC
1244,Best,"[365, 970, 415, 985]",MISC
1245,.,"[365, 970, 415, 985]",MISC
1246,-,"[417, 970, 419, 985]",MISC
1247,NL,"[417, 970, 419, 985]",MISC
1248,-,"[417, 970, 419, 985]",MISC
1249,Having,"[178, 987, 244, 1000]",MISC
1250,Good,"[245, 987, 289, 1000]",MISC
1251,Communication,"[289, 987, 434, 1000]",MISC
1252,Skills,"[434, 987, 501, 1000]",MISC
1253,and,"[501, 987, 535, 1000]",MISC
1254,Inter,"[535, 987, 591, 1000]",MISC
1255,Personal,"[591, 987, 680, 1000]",MISC
1256,Skills,"[680, 987, 758, 1000]",MISC
1257,.,"[680, 987, 758, 1000]",MISC
1258,-,"[758, 987, 760, 1000]",MISC
1259,NL,"[758, 987, 760, 1000]",MISC
1260,-,"[758, 987, 760, 1000]",MISC
1261,Po,"[178, 89, 273, 103]",MISC
1262,##sitive,"[178, 89, 273, 103]",MISC
1263,minds,"[273, 89, 355, 103]",MISC
1264,##et,"[273, 89, 355, 103]",MISC
1265,and,"[356, 89, 391, 103]",MISC
1266,Smart,"[391, 89, 449, 103]",MISC
1267,Working,"[451, 89, 532, 103]",MISC
1268,in,"[533, 89, 556, 103]",MISC
1269,reaching,"[557, 89, 652, 103]",MISC
1270,the,"[652, 89, 687, 103]",MISC
1271,Target,"[687, 89, 769, 103]",MISC
1272,##s,"[687, 89, 769, 103]",MISC
1273,at,"[770, 89, 793, 103]",MISC
1274,the,"[794, 89, 829, 103]",MISC
1275,Op,"[829, 89, 911, 103]",MISC
1276,##ti,"[829, 89, 911, 103]",MISC
1277,##mum,"[829, 89, 911, 103]",MISC
1278,-,"[912, 89, 914, 103]",MISC
1279,NL,"[912, 89, 914, 103]",MISC
1280,-,"[912, 89, 914, 103]",MISC
1281,Time,"[202, 103, 244, 118]",MISC
1282,period,"[246, 103, 310, 118]",MISC
1283,-,"[311, 103, 313, 118]",MISC
1284,NL,"[311, 103, 313, 118]",MISC
1285,-,"[311, 103, 313, 118]",MISC
1286,Personal,"[133, 134, 230, 149]",B-personal_details_heading
1287,Det,"[230, 134, 327, 149]",I-personal_details_heading
1288,##ails,"[230, 134, 327, 149]",I-personal_details_heading
1289,:,"[230, 134, 327, 149]",I-personal_details_heading
1290,-,"[328, 134, 330, 149]",MISC
1291,NL,"[328, 134, 330, 149]",MISC
1292,-,"[328, 134, 330, 149]",MISC
1293,Name,"[133, 165, 218, 180]",MISC
1294,:,"[219, 165, 240, 180]",MISC
1295,G,"[241, 165, 369, 180]",B-name
1296,##au,"[241, 165, 369, 180]",I-name
1297,##ra,"[241, 165, 369, 180]",I-name
1298,##v,"[241, 165, 369, 180]",I-name
1299,Dub,"[370, 165, 478, 180]",I-name
1300,##ey,"[370, 165, 478, 180]",I-name
1301,-,"[478, 165, 480, 180]",MISC
1302,NL,"[478, 165, 480, 180]",MISC
1303,-,"[478, 165, 480, 180]",MISC
1304,Date,"[133, 180, 192, 195]",MISC
1305,of,"[194, 180, 224, 195]",MISC
1306,birth,"[225, 180, 301, 195]",MISC
1307,:,"[301, 180, 316, 195]",MISC
1308,01,"[316, 180, 346, 195]",MISC
1309,March,"[347, 180, 423, 195]",MISC
1310,1985,"[423, 180, 482, 195]",MISC
1311,-,"[484, 180, 486, 195]",MISC
1312,NL,"[484, 180, 486, 195]",MISC
1313,-,"[484, 180, 486, 195]",MISC
1314,Mari,"[133, 195, 224, 209]",MISC
1315,##tal,"[133, 195, 224, 209]",MISC
1316,Status,"[225, 195, 303, 209]",MISC
1317,:,"[304, 195, 317, 209]",MISC
1318,Married,"[317, 195, 421, 209]",MISC
1319,.,"[317, 195, 421, 209]",MISC
1320,-,"[423, 195, 424, 209]",MISC
1321,NL,"[423, 195, 424, 209]",MISC
1322,-,"[423, 195, 424, 209]",MISC
1323,Languages,"[133, 209, 241, 224]",MISC
1324,known,"[242, 209, 301, 224]",MISC
1325,:,"[302, 209, 313, 224]",MISC
1326,English,"[314, 209, 410, 224]",MISC
1327,",","[314, 209, 410, 224]",MISC
1328,Hindi,"[410, 209, 470, 224]",MISC
1329,-,"[471, 209, 473, 224]",MISC
1330,NL,"[471, 209, 473, 224]",MISC
1331,-,"[471, 209, 473, 224]",MISC
1332,(,"[133, 268, 237, 285]",MISC
1333,G,"[133, 268, 237, 285]",B-name
1334,##au,"[133, 268, 237, 285]",I-name
1335,##ra,"[133, 268, 237, 285]",I-name
1336,##v,"[133, 268, 237, 285]",I-name
1337,Dub,"[238, 268, 327, 285]",I-name
1338,##ey,"[238, 268, 327, 285]",I-name
1339,),"[238, 268, 327, 285]",MISC
1340,-,"[328, 268, 330, 285]",MISC
1341,NL,"[328, 268, 330, 285]",MISC
1342,-,"[328, 268, 330, 285]",MISC
1343,Bang,"[133, 285, 246, 302]",MISC
1344,##lore,"[133, 285, 246, 302]",MISC
1345,-,"[246, 285, 248, 302]",MISC
1346,NL,"[246, 285, 248, 302]",MISC
1347,-,"[246, 285, 248, 302]",MISC
