,token,box,label
0,97,"[746, 52, 846, 67]",B-phones_phone
1,##17,"[746, 52, 846, 67]",I-phones_phone
2,##13,"[746, 52, 846, 67]",I-phones_phone
3,##19,"[746, 52, 846, 67]",I-phones_phone
4,##9,"[746, 52, 846, 67]",I-phones_phone
5,##3,"[746, 52, 846, 67]",I-phones_phone
6,-,"[846, 52, 848, 67]",MISC
7,NL,"[846, 52, 848, 67]",MISC
8,-,"[846, 52, 848, 67]",MISC
9,MD,"[222, 64, 312, 95]",B-name
10,.,"[222, 64, 312, 95]",I-name
11,WA,"[312, 64, 462, 95]",I-name
12,##Q,"[312, 64, 462, 95]",I-name
13,##AR,"[312, 64, 462, 95]",I-name
14,-,"[463, 64, 465, 95]",MISC
15,NL,"[463, 64, 465, 95]",MISC
16,-,"[463, 64, 465, 95]",MISC
17,wa,"[746, 64, 959, 86]",B-emails_email
18,##qa,"[746, 64, 959, 86]",I-emails_email
19,##r,"[746, 64, 959, 86]",I-emails_email
20,.,"[746, 64, 959, 86]",I-emails_email
21,ni,"[746, 64, 959, 86]",I-emails_email
22,##et,"[746, 64, 959, 86]",I-emails_email
23,##51,"[746, 64, 959, 86]",I-emails_email
24,##1,"[746, 64, 959, 86]",I-emails_email
25,@,"[746, 64, 959, 86]",I-emails_email
26,g,"[746, 64, 959, 86]",I-emails_email
27,##mail,"[746, 64, 959, 86]",I-emails_email
28,.,"[746, 64, 959, 86]",I-emails_email
29,com,"[746, 64, 959, 86]",I-emails_email
30,-,"[959, 64, 961, 86]",MISC
31,NL,"[959, 64, 961, 86]",MISC
32,-,"[959, 64, 961, 86]",MISC
33,G,"[746, 105, 798, 118]",MISC
34,-,"[746, 105, 798, 118]",MISC
35,58,"[746, 105, 798, 118]",MISC
36,##6,"[746, 105, 798, 118]",MISC
37,",","[746, 105, 798, 118]",MISC
38,Alpha,"[800, 105, 844, 118]",MISC
39,2,"[845, 105, 853, 118]",MISC
40,",","[854, 105, 862, 118]",MISC
41,G,"[863, 105, 889, 118]",MISC
42,##r,"[863, 105, 889, 118]",MISC
43,.,"[863, 105, 889, 118]",MISC
44,No,"[890, 105, 934, 118]",MISC
45,##ida,"[890, 105, 934, 118]",MISC
46,",","[935, 105, 944, 118]",MISC
47,2013,"[944, 105, 997, 118]",MISC
48,##0,"[944, 105, 997, 118]",MISC
49,##8,"[944, 105, 997, 118]",MISC
50,-,"[998, 105, 1000, 118]",MISC
51,NL,"[998, 105, 1000, 118]",MISC
52,-,"[998, 105, 1000, 118]",MISC
53,https,"[746, 126, 947, 139]",MISC
54,:,"[746, 126, 947, 139]",MISC
55,/,"[746, 126, 947, 139]",MISC
56,/,"[746, 126, 947, 139]",MISC
57,www,"[746, 126, 947, 139]",MISC
58,.,"[746, 126, 947, 139]",MISC
59,linked,"[746, 126, 947, 139]",MISC
60,##in,"[746, 126, 947, 139]",MISC
61,.,"[746, 126, 947, 139]",MISC
62,com,"[746, 126, 947, 139]",MISC
63,/,"[746, 126, 947, 139]",MISC
64,in,"[746, 126, 947, 139]",MISC
65,/,"[746, 126, 947, 139]",MISC
66,-,"[947, 126, 948, 139]",MISC
67,NL,"[947, 126, 948, 139]",MISC
68,-,"[947, 126, 948, 139]",MISC
69,m,"[746, 139, 964, 151]",MISC
70,##oh,"[746, 139, 964, 151]",MISC
71,##am,"[746, 139, 964, 151]",MISC
72,##mad,"[746, 139, 964, 151]",MISC
73,-,"[746, 139, 964, 151]",MISC
74,wa,"[746, 139, 964, 151]",MISC
75,##qa,"[746, 139, 964, 151]",MISC
76,##r,"[746, 139, 964, 151]",MISC
77,-,"[746, 139, 964, 151]",MISC
78,52,"[746, 139, 964, 151]",MISC
79,##7,"[746, 139, 964, 151]",MISC
80,##6,"[746, 139, 964, 151]",MISC
81,##10,"[746, 139, 964, 151]",MISC
82,##18,"[746, 139, 964, 151]",MISC
83,##4,"[746, 139, 964, 151]",MISC
84,-,"[964, 139, 966, 151]",MISC
85,NL,"[964, 139, 966, 151]",MISC
86,-,"[964, 139, 966, 151]",MISC
87,O,"[72, 155, 250, 182]",B-summary_heading
88,##B,"[72, 155, 250, 182]",I-summary_heading
89,##J,"[72, 155, 250, 182]",I-summary_heading
90,##EC,"[72, 155, 250, 182]",I-summary_heading
91,##TI,"[72, 155, 250, 182]",I-summary_heading
92,##VE,"[72, 155, 250, 182]",I-summary_heading
93,:,"[72, 155, 250, 182]",I-summary_heading
94,-,"[250, 155, 252, 182]",MISC
95,NL,"[250, 155, 252, 182]",MISC
96,-,"[250, 155, 252, 182]",MISC
97,To,"[313, 155, 331, 170]",MISC
98,work,"[333, 155, 370, 170]",MISC
99,for,"[371, 155, 400, 170]",MISC
100,an,"[400, 155, 418, 170]",MISC
101,organization,"[420, 155, 534, 170]",MISC
102,which,"[536, 155, 583, 170]",MISC
103,provides,"[584, 155, 660, 170]",MISC
104,me,"[661, 155, 679, 170]",MISC
105,the,"[681, 155, 709, 170]",MISC
106,opportunity,"[710, 155, 815, 170]",MISC
107,to,"[816, 155, 833, 170]",MISC
108,improve,"[835, 155, 902, 170]",MISC
109,my,"[903, 155, 920, 170]",MISC
110,skills,"[922, 155, 979, 170]",MISC
111,-,"[980, 155, 982, 170]",MISC
112,NL,"[980, 155, 982, 170]",MISC
113,-,"[980, 155, 982, 170]",MISC
114,and,"[313, 170, 342, 183]",MISC
115,knowledge,"[342, 170, 426, 183]",MISC
116,to,"[427, 170, 444, 183]",MISC
117,growth,"[446, 170, 502, 183]",MISC
118,along,"[502, 170, 548, 183]",MISC
119,with,"[550, 170, 587, 183]",MISC
120,the,"[588, 170, 616, 183]",MISC
121,organization,"[616, 170, 729, 183]",MISC
122,objective,"[729, 170, 814, 183]",MISC
123,-,"[814, 170, 816, 183]",MISC
124,NL,"[814, 170, 816, 183]",MISC
125,-,"[814, 170, 816, 183]",MISC
126,E,"[72, 197, 255, 225]",B-education_heading
127,##D,"[72, 197, 255, 225]",I-education_heading
128,##UC,"[72, 197, 255, 225]",I-education_heading
129,##AT,"[72, 197, 255, 225]",I-education_heading
130,##ION,"[72, 197, 255, 225]",I-education_heading
131,B,"[256, 197, 399, 225]",I-education_heading
132,.,"[256, 197, 399, 225]",I-education_heading
133,T,"[256, 197, 399, 225]",I-education_heading
134,##EC,"[256, 197, 399, 225]",I-education_heading
135,##H,"[256, 197, 399, 225]",I-education_heading
136,",","[256, 197, 399, 225]",I-education_heading
137,-,"[400, 197, 402, 225]",MISC
138,NL,"[400, 197, 402, 225]",MISC
139,-,"[400, 197, 402, 225]",MISC
140,A,"[663, 207, 830, 236]",MISC
141,##WA,"[663, 207, 830, 236]",MISC
142,##RD,"[663, 207, 830, 236]",MISC
143,##S,"[663, 207, 830, 236]",MISC
144,&,"[830, 207, 857, 236]",MISC
145,-,"[858, 207, 860, 236]",MISC
146,NL,"[858, 207, 860, 236]",MISC
147,-,"[858, 207, 860, 236]",MISC
148,E,"[313, 214, 460, 232]",MISC
149,##LE,"[313, 214, 460, 232]",MISC
150,##CT,"[313, 214, 460, 232]",MISC
151,##RI,"[313, 214, 460, 232]",MISC
152,##CA,"[313, 214, 460, 232]",MISC
153,##L,"[313, 214, 460, 232]",MISC
154,AND,"[460, 214, 502, 232]",MISC
155,-,"[504, 214, 506, 232]",MISC
156,NL,"[504, 214, 506, 232]",MISC
157,-,"[504, 214, 506, 232]",MISC
158,:,"[72, 232, 88, 267]",MISC
159,E,"[89, 232, 274, 267]",MISC
160,##LE,"[89, 232, 274, 267]",MISC
161,##CT,"[89, 232, 274, 267]",MISC
162,##RO,"[89, 232, 274, 267]",MISC
163,##NI,"[89, 232, 274, 267]",MISC
164,##CS,"[89, 232, 274, 267]",MISC
165,E,"[275, 232, 460, 267]",MISC
166,##NG,"[275, 232, 460, 267]",MISC
167,##IN,"[275, 232, 460, 267]",MISC
168,##EE,"[275, 232, 460, 267]",MISC
169,##RI,"[275, 232, 460, 267]",MISC
170,##NG,"[275, 232, 460, 267]",MISC
171,-,"[462, 232, 463, 267]",MISC
172,NL,"[462, 232, 463, 267]",MISC
173,-,"[462, 232, 463, 267]",MISC
174,D,"[663, 236, 894, 264]",MISC
175,##IS,"[663, 236, 894, 264]",MISC
176,##TI,"[663, 236, 894, 264]",MISC
177,##NC,"[663, 236, 894, 264]",MISC
178,##TI,"[663, 236, 894, 264]",MISC
179,##ON,"[663, 236, 894, 264]",MISC
180,-,"[894, 236, 895, 264]",MISC
181,NL,"[894, 236, 895, 264]",MISC
182,-,"[894, 236, 895, 264]",MISC
183,U,"[663, 276, 726, 290]",MISC
184,##i,"[663, 276, 726, 290]",MISC
185,##P,"[663, 276, 726, 290]",MISC
186,##ath,"[663, 276, 726, 290]",MISC
187,Robot,"[726, 276, 800, 290]",MISC
188,##ic,"[726, 276, 800, 290]",MISC
189,Process,"[800, 276, 874, 290]",MISC
190,Auto,"[874, 276, 980, 290]",MISC
191,##mation,"[874, 276, 980, 290]",MISC
192,-,"[980, 276, 982, 290]",MISC
193,NL,"[980, 276, 982, 290]",MISC
194,-,"[980, 276, 982, 290]",MISC
195,Key,"[663, 290, 689, 303]",MISC
196,skills,"[690, 290, 845, 303]",MISC
197,-,"[690, 290, 845, 303]",MISC
198,Auto,"[690, 290, 845, 303]",MISC
199,##mation,"[690, 290, 845, 303]",MISC
200,-,"[846, 290, 848, 303]",MISC
201,NL,"[846, 290, 848, 303]",MISC
202,-,"[846, 290, 848, 303]",MISC
203,B,"[72, 300, 126, 315]",MISC
204,.,"[72, 300, 126, 315]",MISC
205,tech,"[72, 300, 126, 315]",MISC
206,(,"[127, 300, 254, 315]",MISC
207,2016,"[127, 300, 254, 315]",MISC
208,-,"[127, 300, 254, 315]",MISC
209,Current,"[127, 300, 254, 315]",MISC
210,),"[127, 300, 254, 315]",MISC
211,N,"[255, 300, 290, 315]",MISC
212,##IE,"[255, 300, 290, 315]",MISC
213,##T,"[255, 300, 290, 315]",MISC
214,G,"[291, 300, 318, 315]",MISC
215,##r,"[291, 300, 318, 315]",MISC
216,.,"[291, 300, 318, 315]",MISC
217,No,"[319, 300, 363, 315]",MISC
218,##ida,"[319, 300, 363, 315]",MISC
219,-,"[365, 300, 366, 315]",MISC
220,NL,"[365, 300, 366, 315]",MISC
221,-,"[365, 300, 366, 315]",MISC
222,68,"[403, 300, 423, 315]",MISC
223,-,"[423, 300, 425, 315]",MISC
224,NL,"[423, 300, 425, 315]",MISC
225,-,"[423, 300, 425, 315]",MISC
226,Level,"[663, 304, 738, 318]",MISC
227,-,"[663, 304, 738, 318]",MISC
228,1,"[663, 304, 738, 318]",MISC
229,:,"[663, 304, 738, 318]",MISC
230,Foundation,"[740, 304, 835, 318]",MISC
231,Training,"[836, 304, 912, 318]",MISC
232,-,"[913, 304, 915, 318]",MISC
233,NL,"[913, 304, 915, 318]",MISC
234,-,"[913, 304, 915, 318]",MISC
235,Level,"[663, 318, 737, 331]",MISC
236,-,"[663, 318, 737, 331]",MISC
237,2,"[663, 318, 737, 331]",MISC
238,:,"[663, 318, 737, 331]",MISC
239,Orchestra,"[738, 318, 849, 331]",MISC
240,##tor,"[738, 318, 849, 331]",MISC
241,Training,"[850, 318, 924, 331]",MISC
242,-,"[925, 318, 927, 331]",MISC
243,NL,"[925, 318, 927, 331]",MISC
244,-,"[925, 318, 927, 331]",MISC
245,Certificate,"[663, 350, 772, 364]",MISC
246,in,"[773, 350, 793, 364]",MISC
247,R,"[793, 350, 873, 364]",MISC
248,##O,"[793, 350, 873, 364]",MISC
249,##BO,"[793, 350, 873, 364]",MISC
250,##TI,"[793, 350, 873, 364]",MISC
251,##CS,"[793, 350, 873, 364]",MISC
252,(,"[874, 350, 893, 364]",MISC
253,6,"[874, 350, 893, 364]",MISC
254,Days,"[894, 350, 933, 364]",MISC
255,-,"[934, 350, 936, 364]",MISC
256,NL,"[934, 350, 936, 364]",MISC
257,-,"[934, 350, 936, 364]",MISC
258,12th,"[81, 357, 119, 372]",B-education_degree
259,(,"[120, 357, 178, 372]",MISC
260,2015,"[120, 357, 178, 372]",MISC
261,),"[120, 357, 178, 372]",MISC
262,E,"[178, 357, 236, 372]",MISC
263,.,"[178, 357, 236, 372]",MISC
264,C,"[178, 357, 236, 372]",MISC
265,.,"[178, 357, 236, 372]",MISC
266,R,"[178, 357, 236, 372]",MISC
267,.,"[178, 357, 236, 372]",MISC
268,Inter,"[237, 357, 284, 372]",MISC
269,College,"[285, 357, 391, 372]",MISC
270,(,"[285, 357, 391, 372]",MISC
271,UP,"[285, 357, 391, 372]",MISC
272,),"[285, 357, 391, 372]",MISC
273,68,"[393, 357, 431, 372]",MISC
274,.,"[393, 357, 431, 372]",MISC
275,8,"[393, 357, 431, 372]",MISC
276,-,"[432, 357, 433, 372]",MISC
277,NL,"[432, 357, 433, 372]",MISC
278,-,"[432, 357, 433, 372]",MISC
279,Training,"[663, 364, 742, 379]",MISC
280,Program,"[742, 364, 830, 379]",MISC
281,),"[742, 364, 830, 379]",MISC
282,.,"[742, 364, 830, 379]",MISC
283,-,"[832, 364, 834, 379]",MISC
284,NL,"[832, 364, 834, 379]",MISC
285,-,"[832, 364, 834, 379]",MISC
286,Certificate,"[663, 407, 770, 421]",MISC
287,in,"[771, 407, 790, 421]",MISC
288,CO,"[790, 407, 868, 421]",MISC
289,##MP,"[790, 407, 868, 421]",MISC
290,##UT,"[790, 407, 868, 421]",MISC
291,##ER,"[790, 407, 868, 421]",MISC
292,-,"[869, 407, 871, 421]",MISC
293,NL,"[869, 407, 871, 421]",MISC
294,-,"[869, 407, 871, 421]",MISC
295,10th,"[97, 414, 292, 429]",MISC
296,(,"[97, 414, 292, 429]",MISC
297,2013,"[97, 414, 292, 429]",MISC
298,),"[97, 414, 292, 429]",MISC
299,E,"[97, 414, 292, 429]",MISC
300,.,"[97, 414, 292, 429]",MISC
301,C,"[97, 414, 292, 429]",MISC
302,.,"[97, 414, 292, 429]",MISC
303,R,"[97, 414, 292, 429]",MISC
304,.,"[97, 414, 292, 429]",MISC
305,Inter,"[97, 414, 292, 429]",MISC
306,College,"[294, 414, 396, 429]",MISC
307,(,"[294, 414, 396, 429]",MISC
308,UP,"[294, 414, 396, 429]",MISC
309,),"[294, 414, 396, 429]",MISC
310,80,"[397, 414, 443, 429]",MISC
311,.,"[397, 414, 443, 429]",MISC
312,33,"[397, 414, 443, 429]",MISC
313,-,"[444, 414, 446, 429]",MISC
314,NL,"[444, 414, 446, 429]",MISC
315,-,"[444, 414, 446, 429]",MISC
316,AP,"[663, 421, 832, 435]",MISC
317,##PL,"[663, 421, 832, 435]",MISC
318,##IC,"[663, 421, 832, 435]",MISC
319,##AT,"[663, 421, 832, 435]",MISC
320,##ION,"[663, 421, 832, 435]",MISC
321,(,"[663, 421, 832, 435]",MISC
322,CC,"[663, 421, 832, 435]",MISC
323,##A,"[663, 421, 832, 435]",MISC
324,),"[663, 421, 832, 435]",MISC
325,-,"[832, 421, 834, 435]",MISC
326,NL,"[832, 421, 834, 435]",MISC
327,-,"[832, 421, 834, 435]",MISC
328,0,"[365, 453, 377, 469]",MISC
329,20,"[377, 453, 402, 469]",MISC
330,40,"[402, 453, 427, 469]",MISC
331,60,"[427, 453, 452, 469]",MISC
332,80,"[452, 453, 514, 469]",MISC
333,##100,"[452, 453, 514, 469]",MISC
334,-,"[514, 453, 516, 469]",MISC
335,NL,"[514, 453, 516, 469]",MISC
336,-,"[514, 453, 516, 469]",MISC
337,Certificate,"[668, 462, 786, 476]",MISC
338,in,"[788, 462, 809, 476]",MISC
339,CO,"[809, 462, 875, 476]",MISC
340,##UR,"[809, 462, 875, 476]",MISC
341,##SE,"[809, 462, 875, 476]",MISC
342,ON,"[875, 462, 896, 476]",MISC
343,CO,"[897, 462, 983, 476]",MISC
344,##MP,"[897, 462, 983, 476]",MISC
345,##UT,"[897, 462, 983, 476]",MISC
346,##ER,"[897, 462, 983, 476]",MISC
347,-,"[984, 462, 985, 476]",MISC
348,NL,"[984, 462, 985, 476]",MISC
349,-,"[984, 462, 985, 476]",MISC
350,CO,"[663, 476, 813, 489]",MISC
351,##NC,"[663, 476, 813, 489]",MISC
352,##EP,"[663, 476, 813, 489]",MISC
353,##TS,"[663, 476, 813, 489]",MISC
354,(,"[663, 476, 813, 489]",MISC
355,CC,"[663, 476, 813, 489]",MISC
356,##C,"[663, 476, 813, 489]",MISC
357,),"[663, 476, 813, 489]",MISC
358,.,"[663, 476, 813, 489]",MISC
359,-,"[813, 476, 814, 489]",MISC
360,NL,"[813, 476, 814, 489]",MISC
361,-,"[813, 476, 814, 489]",MISC
362,Many,"[663, 516, 698, 531]",MISC
363,Certificate,"[699, 516, 809, 531]",MISC
364,##s,"[699, 516, 809, 531]",MISC
365,earned,"[810, 516, 864, 531]",MISC
366,in,"[865, 516, 882, 531]",MISC
367,Schools,"[883, 516, 946, 531]",MISC
368,for,"[947, 516, 974, 531]",MISC
369,-,"[975, 516, 977, 531]",MISC
370,NL,"[975, 516, 977, 531]",MISC
371,-,"[975, 516, 977, 531]",MISC
372,participating,"[663, 531, 781, 545]",MISC
373,in,"[782, 531, 799, 545]",MISC
374,events,"[800, 531, 855, 545]",MISC
375,like,"[855, 531, 890, 545]",MISC
376,DE,"[891, 531, 955, 545]",MISC
377,##BA,"[891, 531, 955, 545]",MISC
378,##TE,"[891, 531, 955, 545]",MISC
379,",","[891, 531, 955, 545]",MISC
380,-,"[955, 531, 957, 545]",MISC
381,NL,"[955, 531, 957, 545]",MISC
382,-,"[955, 531, 957, 545]",MISC
383,SP,"[663, 545, 738, 560]",MISC
384,##EE,"[663, 545, 738, 560]",MISC
385,##CH,"[663, 545, 738, 560]",MISC
386,.,"[663, 545, 738, 560]",MISC
387,-,"[738, 545, 740, 560]",MISC
388,NL,"[738, 545, 740, 560]",MISC
389,-,"[738, 545, 740, 560]",MISC
390,Experience,"[663, 572, 770, 585]",MISC
391,in,"[771, 572, 792, 585]",MISC
392,M,"[793, 572, 846, 585]",MISC
393,##OD,"[793, 572, 846, 585]",MISC
394,##EL,"[793, 572, 846, 585]",MISC
395,MA,"[847, 572, 911, 585]",MISC
396,##K,"[847, 572, 911, 585]",MISC
397,##ING,"[847, 572, 911, 585]",MISC
398,&,"[913, 572, 923, 585]",MISC
399,College,"[923, 572, 999, 585]",MISC
400,-,"[1000, 572, 1001, 585]",MISC
401,NL,"[1000, 572, 1001, 585]",MISC
402,-,"[1000, 572, 1001, 585]",MISC
403,T,"[663, 585, 707, 600]",MISC
404,##EC,"[663, 585, 707, 600]",MISC
405,##H,"[663, 585, 707, 600]",MISC
406,F,"[708, 585, 765, 600]",MISC
407,##ES,"[708, 585, 765, 600]",MISC
408,##T,"[708, 585, 765, 600]",MISC
409,.,"[708, 585, 765, 600]",MISC
410,-,"[765, 585, 767, 600]",MISC
411,NL,"[765, 585, 767, 600]",MISC
412,-,"[765, 585, 767, 600]",MISC
413,F,"[308, 657, 310, 658]",MISC
414,##f,"[308, 657, 310, 658]",MISC
415,-,"[310, 657, 312, 658]",MISC
416,NL,"[310, 657, 312, 658]",MISC
417,-,"[310, 657, 312, 658]",MISC
418,T,"[93, 672, 250, 693]",MISC
419,##RA,"[93, 672, 250, 693]",MISC
420,##IN,"[93, 672, 250, 693]",MISC
421,##ING,"[93, 672, 250, 693]",MISC
422,##S,"[93, 672, 250, 693]",MISC
423,|,"[251, 672, 267, 693]",MISC
424,PR,"[268, 672, 408, 693]",MISC
425,##O,"[268, 672, 408, 693]",MISC
426,##J,"[268, 672, 408, 693]",MISC
427,##EC,"[268, 672, 408, 693]",MISC
428,##TS,"[268, 672, 408, 693]",MISC
429,-,"[409, 672, 410, 693]",MISC
430,NL,"[409, 672, 410, 693]",MISC
431,-,"[409, 672, 410, 693]",MISC
432,More,"[493, 672, 571, 693]",MISC
433,of,"[572, 672, 611, 693]",MISC
434,ME,"[611, 672, 650, 693]",MISC
435,-,"[650, 672, 652, 693]",MISC
436,NL,"[650, 672, 652, 693]",MISC
437,-,"[650, 672, 652, 693]",MISC
438,T,"[730, 672, 883, 693]",MISC
439,##EC,"[730, 672, 883, 693]",MISC
440,##H,"[730, 672, 883, 693]",MISC
441,##NI,"[730, 672, 883, 693]",MISC
442,##CA,"[730, 672, 883, 693]",MISC
443,##L,"[730, 672, 883, 693]",MISC
444,SK,"[884, 672, 986, 693]",MISC
445,##IL,"[884, 672, 986, 693]",MISC
446,##LS,"[884, 672, 986, 693]",MISC
447,-,"[987, 672, 989, 693]",MISC
448,NL,"[987, 672, 989, 693]",MISC
449,-,"[987, 672, 989, 693]",MISC
450,Semi,"[112, 743, 181, 757]",MISC
451,##nar,"[112, 743, 181, 757]",MISC
452,Present,"[181, 743, 319, 757]",MISC
453,##ation,"[181, 743, 319, 757]",MISC
454,:,"[181, 743, 319, 757]",MISC
455,-,"[181, 743, 319, 757]",MISC
456,-,"[319, 743, 320, 757]",MISC
457,NL,"[319, 743, 320, 757]",MISC
458,-,"[319, 743, 320, 757]",MISC
459,1,"[144, 771, 169, 785]",MISC
460,.,"[144, 771, 169, 785]",MISC
461,R,"[169, 771, 256, 785]",MISC
462,##O,"[169, 771, 256, 785]",MISC
463,##BO,"[169, 771, 256, 785]",MISC
464,##TI,"[169, 771, 256, 785]",MISC
465,##C,"[169, 771, 256, 785]",MISC
466,AR,"[257, 771, 294, 785]",MISC
467,##M,"[257, 771, 294, 785]",MISC
468,-,"[294, 771, 296, 785]",MISC
469,NL,"[294, 771, 296, 785]",MISC
470,-,"[294, 771, 296, 785]",MISC
471,Lang,"[758, 775, 823, 789]",MISC
472,##ua,"[758, 775, 823, 789]",MISC
473,-,"[823, 775, 825, 789]",MISC
474,NL,"[823, 775, 825, 789]",MISC
475,-,"[823, 775, 825, 789]",MISC
476,C,"[239, 782, 319, 798]",MISC
477,2,"[320, 782, 478, 798]",MISC
478,.,"[320, 782, 478, 798]",MISC
479,E,"[480, 782, 960, 798]",MISC
480,-,"[480, 782, 960, 798]",MISC
481,B,"[480, 782, 960, 798]",MISC
482,##OM,"[480, 782, 960, 798]",MISC
483,##B,"[480, 782, 960, 798]",MISC
484,-,"[961, 782, 962, 798]",MISC
485,NL,"[961, 782, 962, 798]",MISC
486,-,"[961, 782, 962, 798]",MISC
487,g,"[774, 788, 805, 802]",MISC
488,##es,"[774, 788, 805, 802]",MISC
489,-,"[805, 788, 807, 802]",MISC
490,NL,"[805, 788, 807, 802]",MISC
491,-,"[805, 788, 807, 802]",MISC
492,Minor,"[112, 813, 160, 827]",MISC
493,Projects,"[160, 813, 255, 827]",MISC
494,:,"[160, 813, 255, 827]",MISC
495,-,"[160, 813, 255, 827]",MISC
496,-,"[255, 813, 257, 827]",MISC
497,NL,"[255, 813, 257, 827]",MISC
498,-,"[255, 813, 257, 827]",MISC
499,1,"[144, 840, 164, 854]",MISC
500,.,"[144, 840, 164, 854]",MISC
501,Light,"[164, 840, 211, 854]",MISC
502,B,"[213, 840, 291, 854]",MISC
503,##link,"[213, 840, 291, 854]",MISC
504,##ing,"[213, 840, 291, 854]",MISC
505,On,"[292, 840, 311, 854]",MISC
506,Music,"[312, 840, 359, 854]",MISC
507,-,"[361, 840, 363, 854]",MISC
508,NL,"[361, 840, 363, 854]",MISC
509,-,"[361, 840, 363, 854]",MISC
510,Beat,"[176, 848, 213, 869]",MISC
511,-,"[213, 848, 215, 869]",MISC
512,NL,"[213, 848, 215, 869]",MISC
513,-,"[213, 848, 215, 869]",MISC
514,My,"[447, 848, 481, 867]",B-skills_heading
515,ST,"[481, 848, 631, 867]",I-skills_heading
516,##RE,"[481, 848, 631, 867]",I-skills_heading
517,##NG,"[481, 848, 631, 867]",I-skills_heading
518,##TH,"[481, 848, 631, 867]",I-skills_heading
519,##S,"[481, 848, 631, 867]",I-skills_heading
520,-,"[633, 848, 634, 867]",MISC
521,NL,"[633, 848, 634, 867]",MISC
522,-,"[633, 848, 634, 867]",MISC
523,2,"[144, 870, 164, 882]",MISC
524,.,"[144, 870, 164, 882]",MISC
525,Solar,"[164, 870, 211, 882]",MISC
526,City,"[213, 870, 251, 882]",MISC
527,-,"[252, 870, 253, 882]",MISC
528,NL,"[252, 870, 253, 882]",MISC
529,-,"[252, 870, 253, 882]",MISC
530,Quick,"[490, 870, 545, 881]",MISC
531,Lea,"[545, 870, 621, 881]",MISC
532,##rner,"[545, 870, 621, 881]",MISC
533,-,"[622, 870, 624, 881]",MISC
534,NL,"[622, 870, 624, 881]",MISC
535,-,"[622, 870, 624, 881]",MISC
536,Good,"[491, 883, 537, 896]",MISC
537,Team,"[539, 883, 584, 896]",MISC
538,Player,"[586, 883, 657, 896]",MISC
539,-,"[657, 883, 659, 896]",MISC
540,NL,"[657, 883, 659, 896]",MISC
541,-,"[657, 883, 659, 896]",MISC
542,Opera,"[756, 887, 823, 901]",MISC
543,##ti,"[756, 887, 823, 901]",MISC
544,-,"[823, 887, 825, 901]",MISC
545,NL,"[823, 887, 825, 901]",MISC
546,-,"[823, 887, 825, 901]",MISC
547,Training,"[139, 898, 225, 910]",MISC
548,:,"[139, 898, 225, 910]",MISC
549,-,"[139, 898, 225, 910]",MISC
550,-,"[225, 898, 227, 910]",MISC
551,NL,"[225, 898, 227, 910]",MISC
552,-,"[225, 898, 227, 910]",MISC
553,Open,"[491, 898, 537, 909]",MISC
554,to,"[539, 898, 562, 909]",MISC
555,learn,"[562, 898, 621, 909]",MISC
556,new,"[622, 898, 657, 909]",MISC
557,-,"[657, 898, 659, 909]",MISC
558,NL,"[657, 898, 659, 909]",MISC
559,-,"[657, 898, 659, 909]",MISC
560,ng,"[779, 900, 802, 914]",MISC
561,-,"[802, 900, 804, 914]",MISC
562,NL,"[802, 900, 804, 914]",MISC
563,-,"[802, 900, 804, 914]",MISC
564,Windows,"[908, 900, 978, 914]",MISC
565,-,"[978, 900, 980, 914]",MISC
566,NL,"[978, 900, 980, 914]",MISC
567,-,"[978, 900, 980, 914]",MISC
568,ideas,"[511, 909, 553, 924]",MISC
569,-,"[553, 909, 555, 924]",MISC
570,NL,"[553, 909, 555, 924]",MISC
571,-,"[553, 909, 555, 924]",MISC
572,system,"[758, 913, 821, 927]",MISC
573,-,"[821, 913, 823, 927]",MISC
574,NL,"[821, 913, 823, 927]",MISC
575,-,"[821, 913, 823, 927]",MISC
576,Industrial,"[149, 925, 234, 939]",MISC
577,Training,"[234, 925, 301, 939]",MISC
578,from,"[302, 925, 336, 939]",MISC
579,-,"[336, 925, 338, 939]",MISC
580,NL,"[336, 925, 338, 939]",MISC
581,-,"[336, 925, 338, 939]",MISC
582,D,"[72, 939, 125, 952]",MISC
583,.,"[72, 939, 125, 952]",MISC
584,L,"[72, 939, 125, 952]",MISC
585,.,"[72, 939, 125, 952]",MISC
586,W,"[72, 939, 125, 952]",MISC
587,V,"[125, 939, 209, 952]",MISC
588,##aran,"[125, 939, 209, 952]",MISC
589,##asi,"[125, 939, 209, 952]",MISC
590,-,"[209, 939, 211, 952]",MISC
591,NL,"[209, 939, 211, 952]",MISC
592,-,"[209, 939, 211, 952]",MISC
593,M,"[447, 939, 479, 955]",B-others_heading
594,##Y,"[447, 939, 479, 955]",I-others_heading
595,H,"[481, 939, 597, 955]",I-others_heading
596,##O,"[481, 939, 597, 955]",I-others_heading
597,##BB,"[481, 939, 597, 955]",I-others_heading
598,##IE,"[481, 939, 597, 955]",I-others_heading
599,##S,"[481, 939, 597, 955]",I-others_heading
600,-,"[597, 939, 599, 955]",MISC
601,NL,"[597, 939, 599, 955]",MISC
602,-,"[597, 939, 599, 955]",MISC
603,Playing,"[489, 958, 560, 968]",MISC
604,Cricket,"[560, 958, 631, 968]",MISC
605,-,"[631, 958, 633, 968]",MISC
606,NL,"[631, 958, 633, 968]",MISC
607,-,"[631, 958, 633, 968]",MISC
608,Listen,"[490, 968, 581, 983]",MISC
609,##ing,"[490, 968, 581, 983]",MISC
610,Music,"[583, 968, 634, 983]",MISC
611,-,"[634, 968, 636, 983]",MISC
612,NL,"[634, 968, 636, 983]",MISC
613,-,"[634, 968, 636, 983]",MISC
614,Watching,"[490, 983, 575, 998]",MISC
615,Animation,"[576, 983, 673, 998]",MISC
616,-,"[673, 983, 675, 998]",MISC
617,NL,"[673, 983, 675, 998]",MISC
618,-,"[673, 983, 675, 998]",MISC
619,Language,"[716, 983, 828, 1000]",MISC
620,:,"[716, 983, 828, 1000]",MISC
621,Hindi,"[829, 983, 903, 1000]",MISC
622,",","[829, 983, 903, 1000]",MISC
623,English,"[904, 983, 991, 1000]",MISC
624,-,"[992, 983, 994, 1000]",MISC
625,NL,"[992, 983, 994, 1000]",MISC
626,-,"[992, 983, 994, 1000]",MISC
627,Date,"[716, 48, 768, 67]",MISC
628,of,"[769, 48, 796, 67]",MISC
629,Birth,"[796, 48, 875, 67]",MISC
630,:,"[796, 48, 875, 67]",MISC
631,-,"[876, 48, 878, 67]",MISC
632,NL,"[876, 48, 878, 67]",MISC
633,-,"[876, 48, 878, 67]",MISC
634,05,"[716, 70, 835, 89]",MISC
635,/,"[716, 70, 835, 89]",MISC
636,06,"[716, 70, 835, 89]",MISC
637,/,"[716, 70, 835, 89]",MISC
638,1998,"[716, 70, 835, 89]",MISC
639,-,"[835, 70, 837, 89]",MISC
640,NL,"[835, 70, 837, 89]",MISC
641,-,"[835, 70, 837, 89]",MISC
