,token,box,label
0,Name,"[86, 198, 130, 218]",MISC
1,:,"[131, 198, 141, 218]",MISC
2,Ash,"[142, 198, 209, 218]",B-name
3,##ish,"[142, 198, 209, 218]",I-name
4,B,"[210, 198, 299, 218]",I-name
5,##hard,"[210, 198, 299, 218]",I-name
6,##wa,"[210, 198, 299, 218]",I-name
7,##j,"[210, 198, 299, 218]",I-name
8,-,"[300, 198, 302, 218]",MISC
9,NL,"[300, 198, 302, 218]",MISC
10,-,"[300, 198, 302, 218]",MISC
11,Contact,"[86, 218, 154, 237]",MISC
12,no,"[155, 218, 194, 237]",MISC
13,.,"[155, 218, 194, 237]",MISC
14,:,"[155, 218, 194, 237]",MISC
15,+,"[195, 218, 225, 237]",B-phones_phone
16,91,"[195, 218, 225, 237]",I-phones_phone
17,77,"[225, 218, 323, 237]",I-phones_phone
18,##7,"[225, 218, 323, 237]",I-phones_phone
19,##4,"[225, 218, 323, 237]",I-phones_phone
20,##9,"[225, 218, 323, 237]",I-phones_phone
21,##6,"[225, 218, 323, 237]",I-phones_phone
22,##6,"[225, 218, 323, 237]",I-phones_phone
23,##36,"[225, 218, 323, 237]",I-phones_phone
24,##6,"[225, 218, 323, 237]",I-phones_phone
25,-,"[325, 218, 326, 237]",MISC
26,NL,"[325, 218, 326, 237]",MISC
27,-,"[325, 218, 326, 237]",MISC
28,Em,"[86, 236, 135, 255]",MISC
29,##ail,"[86, 236, 135, 255]",MISC
30,ID,"[136, 236, 166, 255]",MISC
31,:,"[136, 236, 166, 255]",MISC
32,direct,"[166, 236, 377, 255]",B-emails_email
33,##2,"[166, 236, 377, 255]",I-emails_email
34,##ab,"[166, 236, 377, 255]",I-emails_email
35,@,"[166, 236, 377, 255]",I-emails_email
36,hot,"[166, 236, 377, 255]",I-emails_email
37,##mail,"[166, 236, 377, 255]",I-emails_email
38,.,"[166, 236, 377, 255]",I-emails_email
39,com,"[166, 236, 377, 255]",I-emails_email
40,-,"[377, 236, 379, 255]",MISC
41,NL,"[377, 236, 379, 255]",MISC
42,-,"[377, 236, 379, 255]",MISC
43,Ad,"[86, 255, 154, 274]",MISC
44,##dress,"[86, 255, 154, 274]",MISC
45,for,"[155, 255, 183, 274]",MISC
46,Co,"[185, 255, 333, 274]",MISC
47,##rre,"[185, 255, 333, 274]",MISC
48,##sp,"[185, 255, 333, 274]",MISC
49,##ond,"[185, 255, 333, 274]",MISC
50,##ence,"[185, 255, 333, 274]",MISC
51,:,"[185, 255, 333, 274]",MISC
52,77,"[334, 255, 362, 274]",MISC
53,",","[334, 255, 362, 274]",MISC
54,D,"[364, 255, 452, 274]",MISC
55,##han,"[364, 255, 452, 274]",MISC
56,##lax,"[364, 255, 452, 274]",MISC
57,##mi,"[364, 255, 452, 274]",MISC
58,Society,"[454, 255, 533, 274]",MISC
59,",","[454, 255, 533, 274]",MISC
60,B,"[533, 255, 602, 274]",MISC
61,##haw,"[533, 255, 602, 274]",MISC
62,##ani,"[533, 255, 602, 274]",MISC
63,Nagar,"[603, 255, 661, 274]",MISC
64,",","[603, 255, 661, 274]",MISC
65,par,"[662, 255, 720, 274]",MISC
66,##di,"[662, 255, 720, 274]",MISC
67,",","[662, 255, 720, 274]",MISC
68,Na,"[722, 255, 810, 274]",MISC
69,##g,"[722, 255, 810, 274]",MISC
70,##pur,"[722, 255, 810, 274]",MISC
71,-,"[722, 255, 810, 274]",MISC
72,35,"[722, 255, 810, 274]",MISC
73,-,"[811, 255, 813, 274]",MISC
74,NL,"[811, 255, 813, 274]",MISC
75,-,"[811, 255, 813, 274]",MISC
76,CA,"[86, 327, 161, 347]",B-summary_heading
77,##RE,"[86, 327, 161, 347]",I-summary_heading
78,##ER,"[86, 327, 161, 347]",I-summary_heading
79,O,"[162, 327, 289, 347]",I-summary_heading
80,##B,"[162, 327, 289, 347]",I-summary_heading
81,##J,"[162, 327, 289, 347]",I-summary_heading
82,##EC,"[162, 327, 289, 347]",I-summary_heading
83,##TI,"[162, 327, 289, 347]",I-summary_heading
84,##VE,"[162, 327, 289, 347]",I-summary_heading
85,:,"[162, 327, 289, 347]",I-summary_heading
86,-,"[289, 327, 291, 347]",MISC
87,NL,"[289, 327, 291, 347]",MISC
88,-,"[289, 327, 291, 347]",MISC
89,•,"[117, 345, 128, 364]",MISC
90,To,"[128, 345, 149, 364]",MISC
91,be,"[150, 345, 171, 364]",MISC
92,involved,"[172, 345, 260, 364]",MISC
93,in,"[260, 345, 282, 364]",MISC
94,work,"[282, 345, 326, 364]",MISC
95,where,"[327, 345, 381, 364]",MISC
96,I,"[382, 345, 392, 364]",MISC
97,can,"[393, 345, 424, 364]",MISC
98,utilize,"[426, 345, 501, 364]",MISC
99,skill,"[503, 345, 557, 364]",MISC
100,and,"[558, 345, 589, 364]",MISC
101,creative,"[591, 345, 700, 364]",MISC
102,##ly,"[591, 345, 700, 364]",MISC
103,involved,"[701, 345, 789, 364]",MISC
104,with,"[789, 345, 833, 364]",MISC
105,system,"[833, 345, 898, 364]",MISC
106,that,"[899, 345, 943, 364]",MISC
107,-,"[943, 345, 945, 364]",MISC
108,NL,"[943, 345, 945, 364]",MISC
109,-,"[943, 345, 945, 364]",MISC
110,effectively,"[149, 368, 253, 383]",MISC
111,contributes,"[253, 368, 356, 383]",MISC
112,to,"[357, 368, 374, 383]",MISC
113,the,"[376, 368, 404, 383]",MISC
114,growth,"[404, 368, 460, 383]",MISC
115,of,"[461, 368, 478, 383]",MISC
116,organization,"[480, 368, 601, 383]",MISC
117,.,"[480, 368, 601, 383]",MISC
118,-,"[602, 368, 604, 383]",MISC
119,NL,"[602, 368, 604, 383]",MISC
120,-,"[602, 368, 604, 383]",MISC
121,•,"[117, 383, 128, 402]",MISC
122,To,"[128, 383, 149, 402]",MISC
123,work,"[150, 383, 192, 402]",MISC
124,hard,"[193, 383, 235, 402]",MISC
125,with,"[237, 383, 279, 402]",MISC
126,full,"[280, 383, 322, 402]",MISC
127,determination,"[323, 383, 464, 402]",MISC
128,and,"[464, 383, 496, 402]",MISC
129,dedication,"[497, 383, 604, 402]",MISC
130,to,"[605, 383, 626, 402]",MISC
131,achieve,"[627, 383, 703, 402]",MISC
132,organizational,"[703, 383, 854, 402]",MISC
133,as,"[855, 383, 876, 402]",MISC
134,well,"[876, 383, 919, 402]",MISC
135,as,"[920, 383, 941, 402]",MISC
136,-,"[942, 383, 943, 402]",MISC
137,NL,"[942, 383, 943, 402]",MISC
138,-,"[942, 383, 943, 402]",MISC
139,personal,"[149, 406, 223, 421]",MISC
140,goal,"[224, 406, 269, 421]",MISC
141,.,"[224, 406, 269, 421]",MISC
142,-,"[270, 406, 272, 421]",MISC
143,NL,"[270, 406, 272, 421]",MISC
144,-,"[270, 406, 272, 421]",MISC
145,E,"[86, 507, 235, 529]",B-education_heading
146,##D,"[86, 507, 235, 529]",I-education_heading
147,##UC,"[86, 507, 235, 529]",I-education_heading
148,##AT,"[86, 507, 235, 529]",I-education_heading
149,##ION,"[86, 507, 235, 529]",I-education_heading
150,##AL,"[86, 507, 235, 529]",I-education_heading
151,Q,"[236, 507, 440, 529]",I-education_heading
152,##U,"[236, 507, 440, 529]",I-education_heading
153,##AL,"[236, 507, 440, 529]",I-education_heading
154,##IF,"[236, 507, 440, 529]",I-education_heading
155,##IC,"[236, 507, 440, 529]",I-education_heading
156,##AT,"[236, 507, 440, 529]",I-education_heading
157,##ION,"[236, 507, 440, 529]",I-education_heading
158,##S,"[236, 507, 440, 529]",I-education_heading
159,:,"[236, 507, 440, 529]",I-education_heading
160,-,"[441, 507, 442, 529]",MISC
161,NL,"[441, 507, 442, 529]",MISC
162,-,"[441, 507, 442, 529]",MISC
163,CO,"[126, 542, 202, 578]",MISC
164,##UR,"[126, 542, 202, 578]",MISC
165,##SE,"[126, 542, 202, 578]",MISC
166,-,"[202, 542, 214, 578]",MISC
167,Y,"[215, 542, 264, 578]",MISC
168,##EA,"[215, 542, 264, 578]",MISC
169,##R,"[215, 542, 264, 578]",MISC
170,OF,"[265, 542, 290, 578]",MISC
171,PA,"[291, 542, 378, 578]",MISC
172,##SS,"[291, 542, 378, 578]",MISC
173,##ING,"[291, 542, 378, 578]",MISC
174,-,"[379, 542, 392, 578]",MISC
175,N,"[392, 542, 441, 578]",MISC
176,##AM,"[392, 542, 441, 578]",MISC
177,##E,"[392, 542, 441, 578]",MISC
178,OF,"[443, 542, 467, 578]",MISC
179,IN,"[468, 542, 580, 578]",MISC
180,##ST,"[468, 542, 580, 578]",MISC
181,##IT,"[468, 542, 580, 578]",MISC
182,##UT,"[468, 542, 580, 578]",MISC
183,##E,"[468, 542, 580, 578]",MISC
184,-,"[582, 542, 594, 578]",MISC
185,UN,"[594, 542, 733, 578]",MISC
186,##IVE,"[594, 542, 733, 578]",MISC
187,##RS,"[594, 542, 733, 578]",MISC
188,##IT,"[594, 542, 733, 578]",MISC
189,##Y,"[594, 542, 733, 578]",MISC
190,/,"[594, 542, 733, 578]",MISC
191,B,"[734, 542, 797, 578]",MISC
192,##OA,"[734, 542, 797, 578]",MISC
193,##RD,"[734, 542, 797, 578]",MISC
194,-,"[797, 542, 809, 578]",MISC
195,P,"[810, 542, 936, 578]",MISC
196,##ER,"[810, 542, 936, 578]",MISC
197,##CE,"[810, 542, 936, 578]",MISC
198,##NT,"[810, 542, 936, 578]",MISC
199,##AG,"[810, 542, 936, 578]",MISC
200,##E,"[810, 542, 936, 578]",MISC
201,/,"[936, 542, 949, 578]",MISC
202,C,"[949, 542, 998, 578]",MISC
203,##GP,"[949, 542, 998, 578]",MISC
204,##A,"[949, 542, 998, 578]",MISC
205,-,"[1000, 542, 1001, 578]",MISC
206,NL,"[1000, 542, 1001, 578]",MISC
207,-,"[1000, 542, 1001, 578]",MISC
208,MBA,"[110, 606, 123, 654]",B-education_degree
209,(,"[123, 606, 188, 654]",MISC
210,S,"[123, 606, 188, 654]",MISC
211,##pec,"[123, 606, 188, 654]",MISC
212,##ilization,"[123, 606, 188, 654]",MISC
213,-,"[123, 606, 188, 654]",MISC
214,Marketing,"[189, 606, 228, 654]",MISC
215,&,"[229, 606, 232, 654]",MISC
216,Operation,"[233, 606, 275, 654]",MISC
217,),"[233, 606, 275, 654]",MISC
218,-,"[277, 606, 280, 654]",MISC
219,2018,"[281, 606, 320, 654]",MISC
220,-,"[281, 606, 320, 654]",MISC
221,2020,"[281, 606, 320, 654]",MISC
222,-,"[321, 606, 324, 654]",MISC
223,Department,"[325, 606, 367, 654]",B-education_institute
224,Of,"[369, 606, 376, 654]",I-education_institute
225,Management,"[378, 606, 420, 654]",I-education_institute
226,Technology,"[422, 606, 469, 654]",I-education_institute
227,",","[422, 606, 469, 654]",I-education_institute
228,Shri,"[470, 606, 486, 654]",I-education_institute
229,Ram,"[487, 606, 529, 654]",I-education_institute
230,##de,"[487, 606, 529, 654]",I-education_institute
231,##ob,"[487, 606, 529, 654]",I-education_institute
232,##aba,"[487, 606, 529, 654]",I-education_institute
233,College,"[531, 606, 561, 654]",I-education_institute
234,of,"[562, 606, 569, 654]",I-education_institute
235,Engineering,"[571, 606, 618, 654]",I-education_institute
236,&,"[619, 606, 622, 654]",I-education_institute
237,Management,"[623, 606, 671, 654]",I-education_institute
238,.,"[623, 606, 671, 654]",I-education_institute
239,Na,"[671, 606, 696, 654]",I-education_institute
240,##g,"[671, 606, 696, 654]",I-education_institute
241,##pur,"[671, 606, 696, 654]",I-education_institute
242,-,"[698, 606, 701, 654]",MISC
243,Ra,"[702, 606, 750, 654]",MISC
244,##sh,"[702, 606, 750, 654]",MISC
245,##tras,"[702, 606, 750, 654]",MISC
246,##ant,"[702, 606, 750, 654]",MISC
247,Ma,"[750, 606, 780, 654]",MISC
248,##hara,"[750, 606, 780, 654]",MISC
249,##j,"[750, 606, 780, 654]",MISC
250,University,"[781, 606, 823, 654]",MISC
251,-,"[825, 606, 828, 654]",MISC
252,Tu,"[829, 606, 863, 654]",MISC
253,##ka,"[829, 606, 863, 654]",MISC
254,##do,"[829, 606, 863, 654]",MISC
255,##ji,"[829, 606, 863, 654]",MISC
256,Na,"[864, 606, 889, 654]",MISC
257,##g,"[864, 606, 889, 654]",MISC
258,##pur,"[864, 606, 889, 654]",MISC
259,-,"[891, 606, 894, 654]",MISC
260,Currently,"[895, 606, 934, 654]",MISC
261,P,"[935, 606, 968, 654]",MISC
262,##urs,"[935, 606, 968, 654]",MISC
263,##uing,"[935, 606, 968, 654]",MISC
264,-,"[970, 606, 971, 654]",MISC
265,NL,"[970, 606, 971, 654]",MISC
266,-,"[970, 606, 971, 654]",MISC
267,B,"[147, 698, 181, 717]",B-education_degree
268,##BA,"[147, 698, 181, 717]",I-education_degree
269,-,"[182, 698, 192, 717]",MISC
270,2015,"[193, 698, 295, 717]",MISC
271,-,"[193, 698, 295, 717]",MISC
272,2018,"[193, 698, 295, 717]",MISC
273,-,"[296, 698, 307, 717]",MISC
274,Computer,"[308, 698, 399, 717]",MISC
275,&,"[400, 698, 410, 717]",MISC
276,Management,"[411, 698, 536, 717]",MISC
277,.,"[411, 698, 536, 717]",MISC
278,Na,"[538, 698, 606, 717]",MISC
279,##g,"[538, 698, 606, 717]",MISC
280,##pur,"[538, 698, 606, 717]",MISC
281,-,"[607, 698, 617, 717]",MISC
282,Ma,"[618, 698, 697, 717]",MISC
283,##hara,"[618, 698, 697, 717]",MISC
284,##j,"[618, 698, 697, 717]",MISC
285,Na,"[698, 698, 767, 717]",MISC
286,##g,"[698, 698, 767, 717]",MISC
287,##pur,"[698, 698, 767, 717]",MISC
288,University,"[767, 698, 882, 717]",MISC
289,-,"[882, 698, 893, 717]",MISC
290,57,"[894, 698, 962, 717]",MISC
291,.,"[894, 698, 962, 717]",MISC
292,28,"[894, 698, 962, 717]",MISC
293,%,"[894, 698, 962, 717]",MISC
294,-,"[963, 698, 964, 717]",MISC
295,NL,"[963, 698, 964, 717]",MISC
296,-,"[963, 698, 964, 717]",MISC
297,H,"[147, 754, 165, 773]",B-education_degree
298,##SC,"[147, 754, 165, 773]",I-education_degree
299,-,"[165, 754, 171, 773]",MISC
300,2014,"[172, 754, 226, 773]",MISC
301,-,"[172, 754, 226, 773]",MISC
302,2015,"[172, 754, 226, 773]",MISC
303,-,"[227, 754, 232, 773]",MISC
304,V,"[233, 754, 243, 773]",B-education_institute
305,.,"[233, 754, 243, 773]",I-education_institute
306,M,"[245, 754, 255, 773]",I-education_institute
307,.,"[245, 754, 255, 773]",I-education_institute
308,V,"[257, 754, 268, 773]",I-education_institute
309,.,"[257, 754, 268, 773]",I-education_institute
310,Commerce,"[269, 754, 324, 773]",I-education_institute
311,",","[269, 754, 324, 773]",I-education_institute
312,J,"[324, 754, 354, 773]",I-education_institute
313,.,"[324, 754, 354, 773]",I-education_institute
314,M,"[324, 754, 354, 773]",I-education_institute
315,.,"[324, 754, 354, 773]",I-education_institute
316,T,"[324, 754, 354, 773]",I-education_institute
317,Arts,"[355, 754, 378, 773]",I-education_institute
318,&,"[379, 754, 385, 773]",I-education_institute
319,J,"[385, 754, 421, 773]",I-education_institute
320,.,"[385, 754, 421, 773]",I-education_institute
321,J,"[385, 754, 421, 773]",I-education_institute
322,.,"[385, 754, 421, 773]",I-education_institute
323,P,"[385, 754, 421, 773]",I-education_institute
324,.,"[385, 754, 421, 773]",I-education_institute
325,Science,"[422, 754, 464, 773]",I-education_institute
326,College,"[465, 754, 512, 773]",I-education_institute
327,.,"[465, 754, 512, 773]",I-education_institute
328,Na,"[514, 754, 549, 773]",I-education_institute
329,##g,"[514, 754, 549, 773]",I-education_institute
330,##pur,"[514, 754, 549, 773]",I-education_institute
331,-,"[550, 754, 556, 773]",MISC
332,Maharashtra,"[557, 754, 623, 773]",MISC
333,State,"[624, 754, 654, 773]",MISC
334,Board,"[654, 754, 684, 773]",MISC
335,of,"[685, 754, 695, 773]",MISC
336,Secondary,"[697, 754, 752, 773]",MISC
337,and,"[752, 754, 770, 773]",MISC
338,Higher,"[770, 754, 806, 773]",MISC
339,Secondary,"[807, 754, 862, 773]",MISC
340,Education,"[862, 754, 917, 773]",MISC
341,-,"[917, 754, 922, 773]",MISC
342,55,"[923, 754, 953, 773]",MISC
343,.,"[923, 754, 953, 773]",MISC
344,28,"[923, 754, 953, 773]",MISC
345,-,"[954, 754, 956, 773]",MISC
346,NL,"[954, 754, 956, 773]",MISC
347,-,"[954, 754, 956, 773]",MISC
348,SS,"[149, 829, 165, 849]",B-education_degree
349,##C,"[149, 829, 165, 849]",I-education_degree
350,-,"[166, 829, 172, 849]",MISC
351,2012,"[172, 829, 223, 849]",MISC
352,-,"[172, 829, 223, 849]",MISC
353,2013,"[172, 829, 223, 849]",MISC
354,-,"[225, 829, 230, 849]",MISC
355,SM,"[231, 829, 254, 849]",B-education_institute
356,##T,"[231, 829, 254, 849]",I-education_institute
357,.,"[231, 829, 254, 849]",I-education_institute
358,God,"[254, 829, 323, 849]",I-education_institute
359,##ava,"[254, 829, 323, 849]",I-education_institute
360,##ride,"[254, 829, 323, 849]",I-education_institute
361,##vi,"[254, 829, 323, 849]",I-education_institute
362,G,"[325, 829, 388, 849]",I-education_institute
363,##ir,"[325, 829, 388, 849]",I-education_institute
364,##dha,"[325, 829, 388, 849]",I-education_institute
365,##ril,"[325, 829, 388, 849]",I-education_institute
366,##al,"[325, 829, 388, 849]",I-education_institute
367,Sa,"[389, 829, 417, 849]",I-education_institute
368,##rda,"[389, 829, 417, 849]",I-education_institute
369,Higher,"[418, 829, 452, 849]",I-education_institute
370,English,"[453, 829, 494, 849]",I-education_institute
371,School,"[494, 829, 535, 849]",I-education_institute
372,.,"[494, 829, 535, 849]",I-education_institute
373,Na,"[535, 829, 569, 849]",I-education_institute
374,##g,"[535, 829, 569, 849]",I-education_institute
375,##pur,"[535, 829, 569, 849]",I-education_institute
376,-,"[570, 829, 576, 849]",MISC
377,Maharashtra,"[576, 829, 639, 849]",MISC
378,State,"[641, 829, 669, 849]",MISC
379,Board,"[670, 829, 698, 849]",MISC
380,of,"[699, 829, 710, 849]",MISC
381,Secondary,"[711, 829, 762, 849]",MISC
382,and,"[764, 829, 779, 849]",MISC
383,Higher,"[781, 829, 815, 849]",MISC
384,Secondary,"[816, 829, 867, 849]",MISC
385,Education,"[869, 829, 920, 849]",MISC
386,-,"[922, 829, 927, 849]",MISC
387,79,"[927, 829, 961, 849]",MISC
388,.,"[927, 829, 961, 849]",MISC
389,08,"[927, 829, 961, 849]",MISC
390,%,"[927, 829, 961, 849]",MISC
391,-,"[963, 829, 964, 849]",MISC
392,NL,"[963, 829, 964, 849]",MISC
393,-,"[963, 829, 964, 849]",MISC
394,S,"[86, 70, 123, 90]",B-work_experience_heading
395,##IP,"[86, 70, 123, 90]",I-work_experience_heading
396,PR,"[123, 70, 221, 90]",I-work_experience_heading
397,##O,"[123, 70, 221, 90]",I-work_experience_heading
398,##FI,"[123, 70, 221, 90]",I-work_experience_heading
399,##LE,"[123, 70, 221, 90]",I-work_experience_heading
400,:,"[123, 70, 221, 90]",I-work_experience_heading
401,-,"[223, 70, 224, 90]",MISC
402,NL,"[223, 70, 224, 90]",MISC
403,-,"[223, 70, 224, 90]",MISC
404,Company,"[86, 86, 165, 107]",MISC
405,:,"[86, 86, 165, 107]",MISC
406,Hal,"[166, 86, 245, 107]",B-employer_company_name
407,##dira,"[166, 86, 245, 107]",I-employer_company_name
408,##m,"[166, 86, 245, 107]",I-employer_company_name
409,Foods,"[246, 86, 296, 107]",I-employer_company_name
410,International,"[297, 86, 427, 107]",I-employer_company_name
411,P,"[427, 86, 466, 107]",I-employer_company_name
412,##v,"[427, 86, 466, 107]",I-employer_company_name
413,##t,"[427, 86, 466, 107]",I-employer_company_name
414,.,"[427, 86, 466, 107]",I-employer_company_name
415,Ltd,"[467, 86, 506, 107]",I-employer_company_name
416,.,"[467, 86, 506, 107]",MISC
417,-,"[507, 86, 509, 107]",MISC
418,NL,"[507, 86, 509, 107]",MISC
419,-,"[507, 86, 509, 107]",MISC
420,Du,"[86, 122, 179, 143]",MISC
421,##ration,"[86, 122, 179, 143]",MISC
422,:,"[86, 122, 179, 143]",MISC
423,45,"[179, 122, 199, 143]",MISC
424,Days,"[200, 122, 241, 143]",MISC
425,-,"[242, 122, 244, 143]",MISC
426,NL,"[242, 122, 244, 143]",MISC
427,-,"[242, 122, 244, 143]",MISC
428,Place,"[86, 158, 140, 179]",MISC
429,:,"[142, 158, 152, 179]",MISC
430,Na,"[153, 158, 230, 179]",MISC
431,##g,"[153, 158, 230, 179]",MISC
432,##pur,"[153, 158, 230, 179]",MISC
433,",","[153, 158, 230, 179]",MISC
434,Maharashtra,"[231, 158, 364, 179]",MISC
435,.,"[231, 158, 364, 179]",MISC
436,-,"[365, 158, 367, 179]",MISC
437,NL,"[365, 158, 367, 179]",MISC
438,-,"[365, 158, 367, 179]",MISC
439,Re,"[86, 193, 258, 213]",MISC
440,##sp,"[86, 193, 258, 213]",MISC
441,##ons,"[86, 193, 258, 213]",MISC
442,##ibi,"[86, 193, 258, 213]",MISC
443,##lities,"[86, 193, 258, 213]",MISC
444,:,"[86, 193, 258, 213]",MISC
445,Ben,"[259, 193, 391, 213]",MISC
446,##ch,"[259, 193, 391, 213]",MISC
447,##mark,"[259, 193, 391, 213]",MISC
448,##ing,"[259, 193, 391, 213]",MISC
449,",","[259, 193, 391, 213]",MISC
450,Food,"[392, 193, 432, 213]",MISC
451,A,"[433, 193, 544, 213]",MISC
452,##gg,"[433, 193, 544, 213]",MISC
453,##re,"[433, 193, 544, 213]",MISC
454,##gat,"[433, 193, 544, 213]",MISC
455,##ors,"[433, 193, 544, 213]",MISC
456,review,"[545, 193, 605, 213]",MISC
457,&,"[607, 193, 615, 213]",MISC
458,Custom,"[617, 193, 698, 213]",MISC
459,##er,"[617, 193, 698, 213]",MISC
460,Hand,"[698, 193, 790, 213]",MISC
461,##ling,"[698, 193, 790, 213]",MISC
462,.,"[698, 193, 790, 213]",MISC
463,-,"[790, 193, 792, 213]",MISC
464,NL,"[790, 193, 792, 213]",MISC
465,-,"[790, 193, 792, 213]",MISC
466,PR,"[86, 260, 198, 282]",MISC
467,##O,"[86, 260, 198, 282]",MISC
468,##J,"[86, 260, 198, 282]",MISC
469,##EC,"[86, 260, 198, 282]",MISC
470,##TS,"[86, 260, 198, 282]",MISC
471,UN,"[200, 260, 356, 282]",MISC
472,##DE,"[200, 260, 356, 282]",MISC
473,##RT,"[200, 260, 356, 282]",MISC
474,##A,"[200, 260, 356, 282]",MISC
475,##KE,"[200, 260, 356, 282]",MISC
476,##N,"[200, 260, 356, 282]",MISC
477,:,"[200, 260, 356, 282]",MISC
478,-,"[356, 260, 358, 282]",MISC
479,NL,"[356, 260, 358, 282]",MISC
480,-,"[356, 260, 358, 282]",MISC
481,4,"[86, 299, 96, 317]",MISC
482,Days,"[96, 299, 138, 317]",MISC
483,Project,"[139, 299, 213, 317]",MISC
484,Complete,"[214, 299, 308, 317]",MISC
485,##d,"[214, 299, 308, 317]",MISC
486,Under,"[309, 299, 362, 317]",MISC
487,Hit,"[363, 299, 458, 317]",MISC
488,##va,"[363, 299, 458, 317]",MISC
489,##da,"[363, 299, 458, 317]",MISC
490,’,"[363, 299, 458, 317]",MISC
491,s,"[363, 299, 458, 317]",MISC
492,“,"[459, 299, 543, 317]",MISC
493,Student,"[459, 299, 543, 317]",MISC
494,Of,"[544, 299, 565, 317]",MISC
495,The,"[565, 299, 597, 317]",MISC
496,Week,"[597, 299, 639, 317]",MISC
497,Contest,"[640, 299, 735, 317]",MISC
498,.,"[640, 299, 735, 317]",MISC
499,”,"[640, 299, 735, 317]",MISC
500,-,"[736, 299, 738, 317]",MISC
501,NL,"[736, 299, 738, 317]",MISC
502,-,"[736, 299, 738, 317]",MISC
503,CO,"[86, 364, 200, 386]",MISC
504,##MP,"[86, 364, 200, 386]",MISC
505,##UT,"[86, 364, 200, 386]",MISC
506,##ER,"[86, 364, 200, 386]",MISC
507,L,"[201, 364, 331, 386]",MISC
508,##IT,"[201, 364, 331, 386]",MISC
509,##ER,"[201, 364, 331, 386]",MISC
510,##AC,"[201, 364, 331, 386]",MISC
511,##Y,"[201, 364, 331, 386]",MISC
512,:,"[201, 364, 331, 386]",MISC
513,-,"[332, 364, 333, 386]",MISC
514,NL,"[332, 364, 333, 386]",MISC
515,-,"[332, 364, 333, 386]",MISC
516,•,"[117, 387, 128, 406]",MISC
517,A,"[129, 387, 140, 406]",MISC
518,Good,"[141, 387, 189, 406]",MISC
519,Knowledge,"[190, 387, 297, 406]",MISC
520,About,"[299, 387, 359, 406]",MISC
521,Computer,"[359, 387, 456, 406]",MISC
522,With,"[456, 387, 504, 406]",MISC
523,Good,"[505, 387, 552, 406]",MISC
524,Hands,"[553, 387, 613, 406]",MISC
525,On,"[613, 387, 636, 406]",MISC
526,MS,"[638, 387, 757, 406]",MISC
527,-,"[638, 387, 757, 406]",MISC
528,Office,"[638, 387, 757, 406]",MISC
529,.,"[638, 387, 757, 406]",MISC
530,-,"[759, 387, 760, 406]",MISC
531,NL,"[759, 387, 760, 406]",MISC
532,-,"[759, 387, 760, 406]",MISC
533,•,"[117, 407, 128, 428]",MISC
534,Digital,"[128, 407, 202, 428]",MISC
535,Marketing,"[203, 407, 300, 428]",MISC
536,-,"[300, 407, 302, 428]",MISC
537,NL,"[300, 407, 302, 428]",MISC
538,-,"[300, 407, 302, 428]",MISC
539,O,"[91, 482, 163, 502]",B-others_heading
540,##TH,"[91, 482, 163, 502]",I-others_heading
541,##ER,"[91, 482, 163, 502]",I-others_heading
542,AC,"[164, 482, 352, 502]",I-others_heading
543,##H,"[164, 482, 352, 502]",I-others_heading
544,##IE,"[164, 482, 352, 502]",I-others_heading
545,##VE,"[164, 482, 352, 502]",I-others_heading
546,##ME,"[164, 482, 352, 502]",I-others_heading
547,##NT,"[164, 482, 352, 502]",I-others_heading
548,##S,"[164, 482, 352, 502]",I-others_heading
549,:,"[164, 482, 352, 502]",I-others_heading
550,-,"[353, 482, 355, 502]",MISC
551,NL,"[353, 482, 355, 502]",MISC
552,-,"[353, 482, 355, 502]",MISC
553,•,"[117, 503, 128, 523]",MISC
554,University,"[129, 503, 241, 523]",MISC
555,Representative,"[242, 503, 400, 523]",MISC
556,Of,"[401, 503, 422, 523]",MISC
557,S,"[424, 503, 445, 523]",MISC
558,.,"[424, 503, 445, 523]",MISC
559,Man,"[447, 503, 513, 523]",MISC
560,##iar,"[447, 503, 513, 523]",MISC
561,College,"[515, 503, 594, 523]",MISC
562,Of,"[594, 503, 615, 523]",MISC
563,Computer,"[617, 503, 707, 523]",MISC
564,&,"[708, 503, 719, 523]",MISC
565,Management,"[719, 503, 832, 523]",MISC
566,Na,"[833, 503, 900, 523]",MISC
567,##g,"[833, 503, 900, 523]",MISC
568,##pur,"[833, 503, 900, 523]",MISC
569,-,"[901, 503, 903, 523]",MISC
570,NL,"[901, 503, 903, 523]",MISC
571,-,"[901, 503, 903, 523]",MISC
572,•,"[117, 524, 128, 542]",MISC
573,Record,"[128, 524, 193, 542]",MISC
574,Hold,"[193, 524, 258, 542]",MISC
575,##er,"[193, 524, 258, 542]",MISC
576,Of,"[258, 524, 280, 542]",MISC
577,“,"[280, 524, 366, 542]",MISC
578,Long,"[280, 524, 366, 542]",MISC
579,##est,"[280, 524, 366, 542]",MISC
580,Walk,"[367, 524, 464, 542]",MISC
581,##ath,"[367, 524, 464, 542]",MISC
582,##on,"[367, 524, 464, 542]",MISC
583,For,"[465, 524, 496, 542]",MISC
584,Tree,"[497, 524, 540, 542]",MISC
585,Plantation,"[541, 524, 659, 542]",MISC
586,”,"[541, 524, 659, 542]",MISC
587,-,"[660, 524, 662, 542]",MISC
588,NL,"[660, 524, 662, 542]",MISC
589,-,"[660, 524, 662, 542]",MISC
590,H,"[86, 560, 188, 580]",B-others_heading
591,##O,"[86, 560, 188, 580]",I-others_heading
592,##BB,"[86, 560, 188, 580]",I-others_heading
593,##IE,"[86, 560, 188, 580]",I-others_heading
594,##S,"[86, 560, 188, 580]",I-others_heading
595,:,"[86, 560, 188, 580]",I-others_heading
596,-,"[188, 560, 189, 580]",MISC
597,NL,"[188, 560, 189, 580]",MISC
598,-,"[188, 560, 189, 580]",MISC
599,•,"[117, 581, 128, 601]",MISC
600,Travel,"[128, 581, 235, 601]",MISC
601,##ling,"[128, 581, 235, 601]",MISC
602,-,"[237, 581, 239, 601]",MISC
603,NL,"[237, 581, 239, 601]",MISC
604,-,"[237, 581, 239, 601]",MISC
605,•,"[117, 603, 128, 622]",MISC
606,Photography,"[129, 603, 263, 622]",MISC
607,-,"[263, 603, 265, 622]",MISC
608,NL,"[263, 603, 265, 622]",MISC
609,-,"[263, 603, 265, 622]",MISC
610,P,"[86, 658, 195, 680]",B-personal_details_heading
611,##ER,"[86, 658, 195, 680]",I-personal_details_heading
612,##SO,"[86, 658, 195, 680]",I-personal_details_heading
613,##NA,"[86, 658, 195, 680]",I-personal_details_heading
614,##L,"[86, 658, 195, 680]",I-personal_details_heading
615,DE,"[195, 658, 304, 680]",I-personal_details_heading
616,##TA,"[195, 658, 304, 680]",I-personal_details_heading
617,##IL,"[195, 658, 304, 680]",I-personal_details_heading
618,##S,"[195, 658, 304, 680]",I-personal_details_heading
619,:,"[195, 658, 304, 680]",I-personal_details_heading
620,-,"[304, 658, 305, 680]",MISC
621,NL,"[304, 658, 305, 680]",MISC
622,-,"[304, 658, 305, 680]",MISC
623,Fathers,"[86, 679, 161, 699]",MISC
624,Name,"[163, 679, 217, 699]",MISC
625,:,"[163, 679, 217, 699]",MISC
626,Um,"[218, 679, 273, 699]",MISC
627,##esh,"[218, 679, 273, 699]",MISC
628,B,"[273, 679, 361, 699]",MISC
629,##hard,"[273, 679, 361, 699]",MISC
630,##wa,"[273, 679, 361, 699]",MISC
631,##j,"[273, 679, 361, 699]",MISC
632,-,"[362, 679, 363, 699]",MISC
633,NL,"[362, 679, 363, 699]",MISC
634,-,"[362, 679, 363, 699]",MISC
635,Mother,"[667, 679, 743, 699]",MISC
636,##s,"[667, 679, 743, 699]",MISC
637,Name,"[743, 679, 796, 699]",MISC
638,:,"[743, 679, 796, 699]",MISC
639,Raj,"[797, 679, 850, 699]",MISC
640,##ni,"[797, 679, 850, 699]",MISC
641,B,"[851, 679, 937, 699]",MISC
642,##hard,"[851, 679, 937, 699]",MISC
643,##wa,"[851, 679, 937, 699]",MISC
644,##j,"[851, 679, 937, 699]",MISC
645,-,"[938, 679, 940, 699]",MISC
646,NL,"[938, 679, 940, 699]",MISC
647,-,"[938, 679, 940, 699]",MISC
648,Date,"[86, 705, 126, 726]",MISC
649,of,"[128, 705, 147, 726]",MISC
650,Birth,"[148, 705, 210, 726]",MISC
651,:,"[148, 705, 210, 726]",MISC
652,27th,"[211, 705, 252, 726]",MISC
653,Dec,"[253, 705, 294, 726]",MISC
654,",","[253, 705, 294, 726]",MISC
655,1998,"[295, 705, 335, 726]",MISC
656,-,"[337, 705, 339, 726]",MISC
657,NL,"[337, 705, 339, 726]",MISC
658,-,"[337, 705, 339, 726]",MISC
659,National,"[666, 705, 771, 726]",MISC
660,##ity,"[666, 705, 771, 726]",MISC
661,:,"[666, 705, 771, 726]",MISC
662,Indian,"[772, 705, 825, 726]",MISC
663,-,"[826, 705, 827, 726]",MISC
664,NL,"[826, 705, 827, 726]",MISC
665,-,"[826, 705, 827, 726]",MISC
666,Languages,"[86, 731, 177, 751]",MISC
667,Known,"[177, 731, 237, 751]",MISC
668,:,"[177, 731, 237, 751]",MISC
669,English,"[238, 731, 319, 751]",MISC
670,",","[238, 731, 319, 751]",MISC
671,Hindi,"[319, 731, 379, 751]",MISC
672,",","[319, 731, 379, 751]",MISC
673,Marathi,"[380, 731, 461, 751]",MISC
674,.,"[380, 731, 461, 751]",MISC
675,-,"[462, 731, 463, 751]",MISC
676,NL,"[462, 731, 463, 751]",MISC
677,-,"[462, 731, 463, 751]",MISC
678,Gender,"[666, 731, 739, 751]",MISC
679,:,"[666, 731, 739, 751]",MISC
680,Male,"[739, 731, 782, 751]",MISC
681,-,"[782, 731, 783, 751]",MISC
682,NL,"[782, 731, 783, 751]",MISC
683,-,"[782, 731, 783, 751]",MISC
684,Permanent,"[86, 763, 172, 782]",MISC
685,Ad,"[173, 763, 251, 782]",MISC
686,##dress,"[173, 763, 251, 782]",MISC
687,:,"[173, 763, 251, 782]",MISC
688,:,"[251, 763, 260, 782]",MISC
689,77,"[261, 763, 289, 782]",MISC
690,",","[261, 763, 289, 782]",MISC
691,D,"[290, 763, 376, 782]",MISC
692,##han,"[290, 763, 376, 782]",MISC
693,##lax,"[290, 763, 376, 782]",MISC
694,##mi,"[290, 763, 376, 782]",MISC
695,Society,"[378, 763, 455, 782]",MISC
696,",","[378, 763, 455, 782]",MISC
697,Behind,"[456, 763, 514, 782]",MISC
698,B,"[514, 763, 581, 782]",MISC
699,##hu,"[514, 763, 581, 782]",MISC
700,##ja,"[514, 763, 581, 782]",MISC
701,##de,"[514, 763, 581, 782]",MISC
702,Cycle,"[582, 763, 630, 782]",MISC
703,Store,"[631, 763, 689, 782]",MISC
704,",","[631, 763, 689, 782]",MISC
705,B,"[689, 763, 756, 782]",MISC
706,##haw,"[689, 763, 756, 782]",MISC
707,##ani,"[689, 763, 756, 782]",MISC
708,Nagar,"[757, 763, 815, 782]",MISC
709,",","[757, 763, 815, 782]",MISC
710,par,"[816, 763, 874, 782]",MISC
711,##di,"[816, 763, 874, 782]",MISC
712,",","[816, 763, 874, 782]",MISC
713,Na,"[874, 763, 932, 782]",MISC
714,##g,"[874, 763, 932, 782]",MISC
715,##pur,"[874, 763, 932, 782]",MISC
716,-,"[933, 763, 934, 782]",MISC
717,NL,"[933, 763, 934, 782]",MISC
718,-,"[933, 763, 934, 782]",MISC
719,DE,"[86, 842, 249, 864]",B-others_heading
720,##CL,"[86, 842, 249, 864]",I-others_heading
721,##AR,"[86, 842, 249, 864]",I-others_heading
722,##AT,"[86, 842, 249, 864]",I-others_heading
723,##ION,"[86, 842, 249, 864]",I-others_heading
724,:,"[86, 842, 249, 864]",I-others_heading
725,-,"[249, 842, 251, 864]",MISC
726,NL,"[249, 842, 251, 864]",MISC
727,-,"[249, 842, 251, 864]",MISC
728,I,"[144, 869, 163, 890]",MISC
729,",","[144, 869, 163, 890]",MISC
730,the,"[164, 869, 194, 890]",MISC
731,under,"[194, 869, 305, 890]",MISC
732,##signed,"[194, 869, 305, 890]",MISC
733,here,"[305, 869, 365, 890]",MISC
734,##by,"[305, 869, 365, 890]",MISC
735,declare,"[365, 869, 436, 890]",MISC
736,that,"[436, 869, 475, 890]",MISC
737,the,"[476, 869, 506, 890]",MISC
738,above,"[507, 869, 556, 890]",MISC
739,given,"[557, 869, 606, 890]",MISC
740,information,"[607, 869, 718, 890]",MISC
741,is,"[718, 869, 738, 890]",MISC
742,true,"[738, 869, 777, 890]",MISC
743,to,"[779, 869, 798, 890]",MISC
744,the,"[799, 869, 829, 890]",MISC
745,best,"[829, 869, 868, 890]",MISC
746,of,"[870, 869, 889, 890]",MISC
747,my,"[890, 869, 909, 890]",MISC
748,-,"[910, 869, 912, 890]",MISC
749,NL,"[910, 869, 912, 890]",MISC
750,-,"[910, 869, 912, 890]",MISC
751,knowledge,"[86, 896, 184, 916]",MISC
752,.,"[86, 896, 184, 916]",MISC
753,-,"[184, 896, 186, 916]",MISC
754,NL,"[184, 896, 186, 916]",MISC
755,-,"[184, 896, 186, 916]",MISC
756,Date,"[86, 934, 152, 955]",MISC
757,:,"[86, 934, 152, 955]",MISC
758,/,"[153, 934, 165, 955]",MISC
759,/,"[166, 934, 233, 955]",MISC
760,2019,"[166, 934, 233, 955]",MISC
761,-,"[233, 934, 235, 955]",MISC
762,NL,"[233, 934, 235, 955]",MISC
763,-,"[233, 934, 235, 955]",MISC
764,Place,"[86, 978, 145, 998]",MISC
765,:,"[86, 978, 145, 998]",MISC
766,Na,"[145, 978, 205, 998]",MISC
767,##g,"[145, 978, 205, 998]",MISC
768,##pur,"[145, 978, 205, 998]",MISC
769,-,"[205, 978, 207, 998]",MISC
770,NL,"[205, 978, 207, 998]",MISC
771,-,"[205, 978, 207, 998]",MISC
772,Ash,"[650, 978, 732, 1000]",MISC
773,##ish,"[650, 978, 732, 1000]",MISC
774,Um,"[732, 978, 801, 1000]",MISC
775,##esh,"[732, 978, 801, 1000]",MISC
776,B,"[801, 978, 910, 1000]",MISC
777,##hard,"[801, 978, 910, 1000]",MISC
778,##wa,"[801, 978, 910, 1000]",MISC
779,##j,"[801, 978, 910, 1000]",MISC
780,-,"[912, 978, 913, 1000]",MISC
781,NL,"[912, 978, 913, 1000]",MISC
782,-,"[912, 978, 913, 1000]",MISC
