,token,box,label
0,Front,"[98, 34, 164, 52]",MISC
1,End,"[165, 34, 204, 52]",MISC
2,Dev,"[205, 34, 323, 52]",MISC
3,##elo,"[205, 34, 323, 52]",MISC
4,##per,"[205, 34, 323, 52]",MISC
5,at,"[324, 34, 351, 52]",MISC
6,Mind,"[351, 34, 404, 52]",B-employer_company_name
7,Tree,"[404, 34, 457, 52]",I-employer_company_name
8,-,"[457, 34, 459, 52]",MISC
9,NL,"[457, 34, 459, 52]",MISC
10,-,"[457, 34, 459, 52]",MISC
11,3,"[98, 75, 113, 93]",MISC
12,Year,"[113, 75, 214, 93]",MISC
13,(,"[113, 75, 214, 93]",MISC
14,s,"[113, 75, 214, 93]",MISC
15,),"[113, 75, 214, 93]",MISC
16,9,"[215, 75, 229, 93]",MISC
17,Month,"[229, 75, 344, 93]",MISC
18,(,"[229, 75, 344, 93]",MISC
19,s,"[229, 75, 344, 93]",MISC
20,),"[229, 75, 344, 93]",MISC
21,|,"[345, 75, 359, 93]",MISC
22,Bengal,"[360, 75, 489, 93]",MISC
23,##uru,"[360, 75, 489, 93]",MISC
24,/,"[490, 75, 504, 93]",MISC
25,Bangalore,"[505, 75, 634, 93]",MISC
26,|,"[636, 75, 650, 93]",MISC
27,IN,"[650, 75, 692, 93]",MISC
28,##R,"[650, 75, 692, 93]",MISC
29,6,"[694, 75, 750, 93]",MISC
30,.,"[694, 75, 750, 93]",MISC
31,30,"[694, 75, 750, 93]",MISC
32,Lac,"[752, 75, 838, 93]",MISC
33,(,"[752, 75, 838, 93]",MISC
34,s,"[752, 75, 838, 93]",MISC
35,),"[752, 75, 838, 93]",MISC
36,-,"[839, 75, 840, 93]",MISC
37,NL,"[839, 75, 840, 93]",MISC
38,-,"[839, 75, 840, 93]",MISC
39,77,"[865, 115, 999, 133]",B-phones_phone
40,##9,"[865, 115, 999, 133]",I-phones_phone
41,##5,"[865, 115, 999, 133]",I-phones_phone
42,##28,"[865, 115, 999, 133]",I-phones_phone
43,##7,"[865, 115, 999, 133]",I-phones_phone
44,##8,"[865, 115, 999, 133]",I-phones_phone
45,##23,"[865, 115, 999, 133]",I-phones_phone
46,-,"[999, 115, 1001, 133]",MISC
47,NL,"[999, 115, 1001, 133]",MISC
48,-,"[999, 115, 1001, 133]",MISC
49,sa,"[660, 156, 999, 174]",B-emails_email
50,##by,"[660, 156, 999, 174]",I-emails_email
51,##asa,"[660, 156, 999, 174]",I-emails_email
52,##chi,"[660, 156, 999, 174]",I-emails_email
53,##sa,"[660, 156, 999, 174]",I-emails_email
54,##ho,"[660, 156, 999, 174]",I-emails_email
55,##o,"[660, 156, 999, 174]",I-emails_email
56,##7,"[660, 156, 999, 174]",I-emails_email
57,##7,"[660, 156, 999, 174]",I-emails_email
58,@,"[660, 156, 999, 174]",I-emails_email
59,g,"[660, 156, 999, 174]",I-emails_email
60,##mail,"[660, 156, 999, 174]",I-emails_email
61,.,"[660, 156, 999, 174]",I-emails_email
62,com,"[660, 156, 999, 174]",I-emails_email
63,-,"[999, 156, 1001, 174]",MISC
64,NL,"[999, 156, 1001, 174]",MISC
65,-,"[999, 156, 1001, 174]",MISC
66,“,"[98, 197, 111, 215]",MISC
67,With,"[111, 197, 163, 215]",MISC
68,3,"[163, 197, 202, 215]",MISC
69,.,"[163, 197, 202, 215]",MISC
70,9,"[163, 197, 202, 215]",MISC
71,years,"[202, 197, 266, 215]",MISC
72,of,"[267, 197, 292, 215]",MISC
73,experience,"[293, 197, 422, 215]",MISC
74,in,"[423, 197, 448, 215]",MISC
75,the,"[449, 197, 488, 215]",MISC
76,developing,"[488, 197, 617, 215]",MISC
77,Web,"[617, 197, 656, 215]",MISC
78,Based,"[656, 197, 720, 215]",MISC
79,application,"[721, 197, 863, 215]",MISC
80,which,"[864, 197, 928, 215]",MISC
81,-,"[929, 197, 931, 215]",MISC
82,NL,"[929, 197, 931, 215]",MISC
83,-,"[929, 197, 931, 215]",MISC
84,In,"[98, 215, 197, 232]",MISC
85,##vo,"[98, 215, 197, 232]",MISC
86,##lves,"[98, 215, 197, 232]",MISC
87,Java,"[198, 215, 334, 232]",MISC
88,##Script,"[198, 215, 334, 232]",MISC
89,",","[198, 215, 334, 232]",MISC
90,Ang,"[335, 215, 422, 232]",MISC
91,##ular,"[335, 215, 422, 232]",MISC
92,6,"[422, 215, 472, 232]",MISC
93,",","[422, 215, 472, 232]",MISC
94,7,"[422, 215, 472, 232]",MISC
95,",","[422, 215, 472, 232]",MISC
96,Re,"[472, 215, 571, 232]",MISC
97,##act,"[472, 215, 571, 232]",MISC
98,##j,"[472, 215, 571, 232]",MISC
99,##s,"[472, 215, 571, 232]",MISC
100,",","[472, 215, 571, 232]",MISC
101,H,"[571, 215, 646, 232]",MISC
102,##TM,"[571, 215, 646, 232]",MISC
103,##L,"[571, 215, 646, 232]",MISC
104,##5,"[571, 215, 646, 232]",MISC
105,",","[571, 215, 646, 232]",MISC
106,CS,"[646, 215, 708, 232]",MISC
107,##S,"[646, 215, 708, 232]",MISC
108,##3,"[646, 215, 708, 232]",MISC
109,",","[646, 215, 708, 232]",MISC
110,Boots,"[708, 215, 832, 232]",MISC
111,##tra,"[708, 215, 832, 232]",MISC
112,##p,"[708, 215, 832, 232]",MISC
113,",","[708, 215, 832, 232]",MISC
114,R,"[833, 215, 882, 232]",MISC
115,##ES,"[833, 215, 882, 232]",MISC
116,##T,"[833, 215, 882, 232]",MISC
117,Web,"[883, 215, 920, 232]",MISC
118,-,"[920, 215, 922, 232]",MISC
119,NL,"[920, 215, 922, 232]",MISC
120,-,"[920, 215, 922, 232]",MISC
121,Services,"[98, 232, 197, 249]",MISC
122,",","[98, 232, 197, 249]",MISC
123,etc,"[198, 232, 240, 249]",MISC
124,.,"[198, 232, 240, 249]",MISC
125,-,"[242, 232, 243, 249]",MISC
126,NL,"[242, 232, 243, 249]",MISC
127,-,"[242, 232, 243, 249]",MISC
128,W,"[98, 278, 173, 294]",B-summary_heading
129,##OR,"[98, 278, 173, 294]",I-summary_heading
130,##K,"[98, 278, 173, 294]",I-summary_heading
131,S,"[173, 278, 302, 294]",I-summary_heading
132,##UM,"[173, 278, 302, 294]",I-summary_heading
133,##MA,"[173, 278, 302, 294]",I-summary_heading
134,##R,"[173, 278, 302, 294]",I-summary_heading
135,##Y,"[173, 278, 302, 294]",I-summary_heading
136,-,"[303, 278, 305, 294]",MISC
137,NL,"[303, 278, 305, 294]",MISC
138,-,"[303, 278, 305, 294]",MISC
139,With,"[98, 304, 150, 322]",MISC
140,3,"[150, 304, 189, 322]",MISC
141,.,"[150, 304, 189, 322]",MISC
142,9,"[150, 304, 189, 322]",MISC
143,years,"[189, 304, 253, 322]",MISC
144,of,"[254, 304, 279, 322]",MISC
145,experience,"[280, 304, 409, 322]",MISC
146,in,"[409, 304, 434, 322]",MISC
147,the,"[435, 304, 474, 322]",MISC
148,developing,"[474, 304, 603, 322]",MISC
149,Web,"[604, 304, 643, 322]",MISC
150,Based,"[643, 304, 706, 322]",MISC
151,application,"[707, 304, 849, 322]",MISC
152,which,"[850, 304, 914, 322]",MISC
153,-,"[915, 304, 916, 322]",MISC
154,NL,"[915, 304, 916, 322]",MISC
155,-,"[915, 304, 916, 322]",MISC
156,In,"[98, 322, 197, 339]",MISC
157,##vo,"[98, 322, 197, 339]",MISC
158,##lves,"[98, 322, 197, 339]",MISC
159,Java,"[199, 322, 335, 339]",MISC
160,##Script,"[199, 322, 335, 339]",MISC
161,",","[199, 322, 335, 339]",MISC
162,Ang,"[336, 322, 423, 339]",MISC
163,##ular,"[336, 322, 423, 339]",MISC
164,6,"[424, 322, 473, 339]",MISC
165,",","[424, 322, 473, 339]",MISC
166,7,"[424, 322, 473, 339]",MISC
167,",","[424, 322, 473, 339]",MISC
168,H,"[474, 322, 548, 339]",MISC
169,##TM,"[474, 322, 548, 339]",MISC
170,##L,"[474, 322, 548, 339]",MISC
171,##5,"[474, 322, 548, 339]",MISC
172,",","[474, 322, 548, 339]",MISC
173,CS,"[549, 322, 611, 339]",MISC
174,##S,"[549, 322, 611, 339]",MISC
175,##3,"[549, 322, 611, 339]",MISC
176,",","[549, 322, 611, 339]",MISC
177,R,"[611, 322, 661, 339]",MISC
178,##ES,"[611, 322, 661, 339]",MISC
179,##T,"[611, 322, 661, 339]",MISC
180,Web,"[661, 322, 699, 339]",MISC
181,Services,"[699, 322, 810, 339]",MISC
182,",","[699, 322, 810, 339]",MISC
183,etc,"[812, 322, 861, 339]",MISC
184,.,"[812, 322, 861, 339]",MISC
185,-,"[862, 322, 863, 339]",MISC
186,NL,"[862, 322, 863, 339]",MISC
187,-,"[862, 322, 863, 339]",MISC
188,Industry,"[98, 353, 194, 370]",MISC
189,:,"[194, 353, 205, 370]",MISC
190,IT,"[206, 353, 444, 370]",MISC
191,-,"[206, 353, 444, 370]",MISC
192,Software,"[206, 353, 444, 370]",MISC
193,/,"[206, 353, 444, 370]",MISC
194,Software,"[206, 353, 444, 370]",MISC
195,Services,"[445, 353, 540, 370]",MISC
196,-,"[540, 353, 542, 370]",MISC
197,NL,"[540, 353, 542, 370]",MISC
198,-,"[540, 353, 542, 370]",MISC
199,Fun,"[98, 399, 227, 416]",MISC
200,##ctional,"[98, 399, 227, 416]",MISC
201,Area,"[228, 399, 279, 416]",MISC
202,:,"[279, 399, 292, 416]",MISC
203,IT,"[292, 399, 317, 416]",MISC
204,Software,"[318, 399, 421, 416]",MISC
205,-,"[422, 399, 434, 416]",MISC
206,C,"[435, 399, 510, 416]",MISC
207,##lient,"[435, 399, 510, 416]",MISC
208,Server,"[512, 399, 588, 416]",MISC
209,-,"[590, 399, 591, 416]",MISC
210,NL,"[590, 399, 591, 416]",MISC
211,-,"[590, 399, 591, 416]",MISC
212,Role,"[98, 444, 150, 461]",MISC
213,:,"[150, 444, 163, 461]",MISC
214,Software,"[163, 444, 266, 461]",MISC
215,Dev,"[268, 444, 384, 461]",MISC
216,##elo,"[268, 444, 384, 461]",MISC
217,##per,"[268, 444, 384, 461]",MISC
218,-,"[385, 444, 386, 461]",MISC
219,NL,"[385, 444, 386, 461]",MISC
220,-,"[385, 444, 386, 461]",MISC
221,W,"[98, 490, 164, 507]",B-work_experience_heading
222,##OR,"[98, 490, 164, 507]",I-work_experience_heading
223,##K,"[98, 490, 164, 507]",I-work_experience_heading
224,E,"[164, 490, 327, 507]",I-work_experience_heading
225,##X,"[164, 490, 327, 507]",I-work_experience_heading
226,##P,"[164, 490, 327, 507]",I-work_experience_heading
227,##ER,"[164, 490, 327, 507]",I-work_experience_heading
228,##IE,"[164, 490, 327, 507]",I-work_experience_heading
229,##NC,"[164, 490, 327, 507]",I-work_experience_heading
230,##E,"[164, 490, 327, 507]",I-work_experience_heading
231,-,"[328, 490, 330, 507]",MISC
232,NL,"[328, 490, 330, 507]",MISC
233,-,"[328, 490, 330, 507]",MISC
234,Front,"[98, 516, 166, 533]",MISC
235,End,"[166, 516, 207, 533]",MISC
236,Dev,"[207, 516, 329, 533]",MISC
237,##elo,"[207, 516, 329, 533]",MISC
238,##per,"[207, 516, 329, 533]",MISC
239,Jul,"[330, 516, 370, 533]",MISC
240,2018,"[370, 516, 423, 533]",MISC
241,-,"[425, 516, 437, 533]",MISC
242,Till,"[438, 516, 491, 533]",MISC
243,Date,"[493, 516, 546, 533]",MISC
244,-,"[547, 516, 549, 533]",MISC
245,NL,"[547, 516, 549, 533]",MISC
246,-,"[547, 516, 549, 533]",MISC
247,Mind,"[98, 537, 159, 553]",B-employer_company_name
248,Tree,"[159, 537, 219, 553]",I-employer_company_name
249,-,"[219, 537, 220, 553]",MISC
250,NL,"[219, 537, 220, 553]",MISC
251,-,"[219, 537, 220, 553]",MISC
252,As,"[98, 557, 125, 574]",MISC
253,a,"[125, 557, 137, 574]",MISC
254,Front,"[138, 557, 204, 574]",MISC
255,end,"[205, 557, 244, 574]",MISC
256,Dev,"[245, 557, 363, 574]",MISC
257,##elo,"[245, 557, 363, 574]",MISC
258,##per,"[245, 557, 363, 574]",MISC
259,with,"[364, 557, 417, 574]",MISC
260,more,"[417, 557, 470, 574]",MISC
261,than,"[471, 557, 524, 574]",MISC
262,3,"[524, 557, 536, 574]",MISC
263,years,"[537, 557, 602, 574]",MISC
264,of,"[603, 557, 630, 574]",MISC
265,experience,"[630, 557, 763, 574]",MISC
266,in,"[763, 557, 789, 574]",MISC
267,IT,"[790, 557, 816, 574]",MISC
268,industry,"[816, 557, 934, 574]",MISC
269,.,"[816, 557, 934, 574]",MISC
270,Have,"[936, 557, 989, 574]",MISC
271,-,"[989, 557, 991, 574]",MISC
272,NL,"[989, 557, 991, 574]",MISC
273,-,"[989, 557, 991, 574]",MISC
274,worked,"[98, 574, 174, 592]",MISC
275,in,"[176, 574, 201, 592]",MISC
276,many,"[202, 574, 253, 592]",MISC
277,modules,"[253, 574, 344, 592]",MISC
278,of,"[344, 574, 369, 592]",MISC
279,project,"[370, 574, 460, 592]",MISC
280,independently,"[460, 574, 640, 592]",MISC
281,.,"[460, 574, 640, 592]",MISC
282,-,"[641, 574, 643, 592]",MISC
283,NL,"[641, 574, 643, 592]",MISC
284,-,"[641, 574, 643, 592]",MISC
285,Associate,"[98, 605, 227, 623]",B-employer_role
286,Software,"[228, 605, 343, 623]",I-employer_role
287,Engineer,"[344, 605, 459, 623]",I-employer_role
288,Nov,"[460, 605, 502, 623]",MISC
289,2015,"[503, 605, 559, 623]",MISC
290,-,"[561, 605, 575, 623]",MISC
291,May,"[575, 605, 617, 623]",MISC
292,2018,"[618, 605, 675, 623]",MISC
293,-,"[676, 605, 678, 623]",MISC
294,NL,"[676, 605, 678, 623]",MISC
295,-,"[676, 605, 678, 623]",MISC
296,C,"[98, 625, 137, 643]",B-project_company_name
297,##GI,"[98, 625, 137, 643]",I-project_company_name
298,India,"[139, 625, 206, 643]",MISC
299,-,"[206, 625, 208, 643]",MISC
300,NL,"[206, 625, 208, 643]",MISC
301,-,"[206, 625, 208, 643]",MISC
302,Work,"[98, 646, 176, 662]",MISC
303,##ed,"[98, 646, 176, 662]",MISC
304,as,"[178, 646, 202, 662]",MISC
305,Front,"[204, 646, 270, 662]",MISC
306,End,"[270, 646, 309, 662]",MISC
307,Dev,"[310, 646, 428, 662]",MISC
308,##elo,"[310, 646, 428, 662]",MISC
309,##per,"[310, 646, 428, 662]",MISC
310,in,"[429, 646, 453, 662]",MISC
311,many,"[455, 646, 506, 662]",MISC
312,modules,"[508, 646, 600, 662]",MISC
313,of,"[600, 646, 625, 662]",MISC
314,the,"[627, 646, 666, 662]",MISC
315,project,"[667, 646, 771, 662]",MISC
316,.,"[667, 646, 771, 662]",MISC
317,Have,"[772, 646, 823, 662]",MISC
318,gained,"[825, 646, 903, 662]",MISC
319,retail,"[904, 646, 982, 662]",MISC
320,-,"[984, 646, 985, 662]",MISC
321,NL,"[984, 646, 985, 662]",MISC
322,-,"[984, 646, 985, 662]",MISC
323,domain,"[98, 664, 176, 680]",MISC
324,knowledge,"[177, 664, 308, 680]",MISC
325,.,"[177, 664, 308, 680]",MISC
326,Was,"[308, 664, 346, 680]",MISC
327,part,"[347, 664, 398, 680]",MISC
328,of,"[399, 664, 424, 680]",MISC
329,unity,"[425, 664, 491, 680]",MISC
330,conversion,"[491, 664, 621, 680]",MISC
331,team,"[621, 664, 687, 680]",MISC
332,.,"[621, 664, 687, 680]",MISC
333,-,"[687, 664, 689, 680]",MISC
334,NL,"[687, 664, 689, 680]",MISC
335,-,"[687, 664, 689, 680]",MISC
336,PR,"[98, 695, 203, 712]",MISC
337,##O,"[98, 695, 203, 712]",MISC
338,##J,"[98, 695, 203, 712]",MISC
339,##EC,"[98, 695, 203, 712]",MISC
340,##T,"[98, 695, 203, 712]",MISC
341,DE,"[204, 695, 308, 712]",MISC
342,##TA,"[204, 695, 308, 712]",MISC
343,##IL,"[204, 695, 308, 712]",MISC
344,##S,"[204, 695, 308, 712]",MISC
345,-,"[309, 695, 310, 712]",MISC
346,NL,"[309, 695, 310, 712]",MISC
347,-,"[309, 695, 310, 712]",MISC
348,Project,"[98, 721, 192, 738]",MISC
349,2,"[193, 721, 205, 738]",MISC
350,-,"[206, 721, 208, 738]",MISC
351,NL,"[206, 721, 208, 738]",MISC
352,-,"[206, 721, 208, 738]",MISC
353,Jan,"[98, 753, 136, 769]",MISC
354,2019,"[137, 753, 186, 769]",MISC
355,to,"[188, 753, 213, 769]",MISC
356,Till,"[213, 753, 263, 769]",MISC
357,Date,"[265, 753, 314, 769]",MISC
358,-,"[316, 753, 318, 769]",MISC
359,NL,"[316, 753, 318, 769]",MISC
360,-,"[316, 753, 318, 769]",MISC
361,C,"[98, 784, 178, 802]",MISC
362,##lient,"[98, 784, 178, 802]",MISC
363,:,"[178, 784, 191, 802]",MISC
364,Mind,"[192, 784, 245, 802]",B-project_company_name
365,Tree,"[245, 784, 298, 802]",I-project_company_name
366,-,"[298, 784, 300, 802]",MISC
367,NL,"[298, 784, 300, 802]",MISC
368,-,"[298, 784, 300, 802]",MISC
369,Nature,"[98, 815, 185, 833]",MISC
370,of,"[185, 815, 213, 833]",MISC
371,Employment,"[214, 815, 357, 833]",MISC
372,:,"[359, 815, 373, 833]",MISC
373,Full,"[373, 815, 430, 833]",MISC
374,Time,"[431, 815, 488, 833]",MISC
375,-,"[489, 815, 491, 833]",MISC
376,NL,"[489, 815, 491, 833]",MISC
377,-,"[489, 815, 491, 833]",MISC
378,Project,"[98, 847, 185, 864]",MISC
379,Det,"[185, 847, 284, 864]",MISC
380,##ails,"[185, 847, 284, 864]",MISC
381,:,"[185, 847, 284, 864]",MISC
382,-,"[284, 847, 286, 864]",MISC
383,NL,"[284, 847, 286, 864]",MISC
384,-,"[284, 847, 286, 864]",MISC
385,Currently,"[98, 883, 217, 900]",MISC
386,working,"[218, 883, 310, 900]",MISC
387,as,"[311, 883, 338, 900]",MISC
388,Ang,"[338, 883, 430, 900]",MISC
389,##ular,"[338, 883, 430, 900]",MISC
390,Dev,"[431, 883, 549, 900]",MISC
391,##elo,"[431, 883, 549, 900]",MISC
392,##per,"[431, 883, 549, 900]",MISC
393,in,"[551, 883, 577, 900]",MISC
394,a,"[577, 883, 590, 900]",MISC
395,CR,"[591, 883, 630, 900]",MISC
396,##M,"[591, 883, 630, 900]",MISC
397,project,"[631, 883, 737, 900]",MISC
398,.,"[631, 883, 737, 900]",MISC
399,Have,"[737, 883, 790, 900]",MISC
400,worked,"[790, 883, 870, 900]",MISC
401,in,"[870, 883, 897, 900]",MISC
402,many,"[897, 883, 950, 900]",MISC
403,-,"[950, 883, 952, 900]",MISC
404,NL,"[950, 883, 952, 900]",MISC
405,-,"[950, 883, 952, 900]",MISC
406,modules,"[98, 900, 183, 917]",MISC
407,of,"[183, 900, 206, 917]",MISC
408,project,"[208, 900, 292, 917]",MISC
409,independently,"[293, 900, 462, 917]",MISC
410,.,"[293, 900, 462, 917]",MISC
411,-,"[462, 900, 464, 917]",MISC
412,NL,"[462, 900, 464, 917]",MISC
413,-,"[462, 900, 464, 917]",MISC
414,Project,"[98, 936, 192, 953]",MISC
415,1,"[193, 936, 205, 953]",MISC
416,-,"[206, 936, 208, 953]",MISC
417,NL,"[206, 936, 208, 953]",MISC
418,-,"[206, 936, 208, 953]",MISC
419,Aug,"[98, 968, 143, 985]",MISC
420,2018,"[143, 968, 201, 985]",MISC
421,to,"[203, 968, 231, 985]",MISC
422,Dec,"[233, 968, 277, 985]",MISC
423,2018,"[277, 968, 336, 985]",MISC
424,-,"[337, 968, 339, 985]",MISC
425,NL,"[337, 968, 339, 985]",MISC
426,-,"[337, 968, 339, 985]",MISC
427,C,"[98, 34, 178, 52]",MISC
428,##lient,"[98, 34, 178, 52]",MISC
429,:,"[178, 34, 191, 52]",MISC
430,Mind,"[192, 34, 245, 52]",B-employer_company_name
431,Tree,"[245, 34, 298, 52]",I-employer_company_name
432,-,"[298, 34, 300, 52]",MISC
433,NL,"[298, 34, 300, 52]",MISC
434,-,"[298, 34, 300, 52]",MISC
435,Nature,"[98, 65, 185, 83]",MISC
436,of,"[185, 65, 213, 83]",MISC
437,Employment,"[214, 65, 357, 83]",MISC
438,:,"[359, 65, 373, 83]",MISC
439,Full,"[373, 65, 430, 83]",MISC
440,Time,"[431, 65, 488, 83]",MISC
441,-,"[489, 65, 491, 83]",MISC
442,NL,"[489, 65, 491, 83]",MISC
443,-,"[489, 65, 491, 83]",MISC
444,Project,"[98, 97, 185, 114]",MISC
445,Det,"[185, 97, 284, 114]",MISC
446,##ails,"[185, 97, 284, 114]",MISC
447,:,"[185, 97, 284, 114]",MISC
448,-,"[284, 97, 286, 114]",MISC
449,NL,"[284, 97, 286, 114]",MISC
450,-,"[284, 97, 286, 114]",MISC
451,Working,"[98, 133, 190, 150]",MISC
452,as,"[191, 133, 218, 150]",MISC
453,a,"[218, 133, 230, 150]",MISC
454,Senior,"[231, 133, 311, 150]",MISC
455,Dev,"[311, 133, 429, 150]",MISC
456,##elo,"[311, 133, 429, 150]",MISC
457,##per,"[311, 133, 429, 150]",MISC
458,have,"[430, 133, 483, 150]",MISC
459,gained,"[483, 133, 563, 150]",MISC
460,Insurance,"[563, 133, 681, 150]",MISC
461,domain,"[682, 133, 762, 150]",MISC
462,knowledge,"[762, 133, 880, 150]",MISC
463,with,"[881, 133, 934, 150]",MISC
464,-,"[934, 133, 936, 150]",MISC
465,NL,"[934, 133, 936, 150]",MISC
466,-,"[934, 133, 936, 150]",MISC
467,exposure,"[98, 150, 199, 167]",MISC
468,to,"[200, 150, 225, 167]",MISC
469,build,"[225, 150, 287, 167]",MISC
470,&,"[289, 150, 301, 167]",MISC
471,deployment,"[301, 150, 427, 167]",MISC
472,of,"[428, 150, 453, 167]",MISC
473,application,"[454, 150, 593, 167]",MISC
474,in,"[593, 150, 618, 167]",MISC
475,Q,"[619, 150, 644, 167]",MISC
476,##A,"[619, 150, 644, 167]",MISC
477,&,"[644, 150, 657, 167]",MISC
478,integration,"[657, 150, 796, 167]",MISC
479,server,"[796, 150, 872, 167]",MISC
480,in,"[873, 150, 897, 167]",MISC
481,previous,"[898, 150, 999, 167]",MISC
482,-,"[999, 150, 1001, 167]",MISC
483,NL,"[999, 150, 1001, 167]",MISC
484,-,"[999, 150, 1001, 167]",MISC
485,project,"[98, 167, 180, 185]",MISC
486,.,"[98, 167, 180, 185]",MISC
487,-,"[180, 167, 181, 185]",MISC
488,NL,"[180, 167, 181, 185]",MISC
489,-,"[180, 167, 181, 185]",MISC
490,Product,"[98, 203, 204, 221]",B-project_title
491,Management,"[206, 203, 358, 221]",I-project_title
492,System,"[360, 203, 451, 221]",I-project_title
493,-,"[452, 203, 454, 221]",MISC
494,NL,"[452, 203, 454, 221]",MISC
495,-,"[452, 203, 454, 221]",MISC
496,Jan,"[98, 236, 141, 253]",MISC
497,2017,"[142, 236, 200, 253]",MISC
498,to,"[200, 236, 229, 253]",MISC
499,May,"[230, 236, 272, 253]",MISC
500,2018,"[273, 236, 332, 253]",MISC
501,-,"[332, 236, 333, 253]",MISC
502,NL,"[332, 236, 333, 253]",MISC
503,-,"[332, 236, 333, 253]",MISC
504,C,"[98, 267, 176, 284]",MISC
505,##lient,"[98, 267, 176, 284]",MISC
506,:,"[177, 267, 189, 284]",MISC
507,C,"[190, 267, 229, 284]",B-project_company_name
508,##GI,"[190, 267, 229, 284]",I-project_company_name
509,-,"[229, 267, 231, 284]",MISC
510,NL,"[229, 267, 231, 284]",MISC
511,-,"[229, 267, 231, 284]",MISC
512,Role,"[98, 298, 157, 315]",MISC
513,:,"[157, 298, 171, 315]",MISC
514,10,"[172, 298, 200, 315]",MISC
515,-,"[201, 298, 203, 315]",MISC
516,NL,"[201, 298, 203, 315]",MISC
517,-,"[201, 298, 203, 315]",MISC
518,Nature,"[98, 329, 185, 347]",MISC
519,of,"[185, 329, 213, 347]",MISC
520,Employment,"[214, 329, 357, 347]",MISC
521,:,"[359, 329, 373, 347]",MISC
522,Full,"[373, 329, 430, 347]",MISC
523,Time,"[431, 329, 488, 347]",MISC
524,-,"[489, 329, 491, 347]",MISC
525,NL,"[489, 329, 491, 347]",MISC
526,-,"[489, 329, 491, 347]",MISC
527,Team,"[98, 361, 162, 379]",MISC
528,Si,"[162, 361, 226, 379]",MISC
529,##ze,"[162, 361, 226, 379]",MISC
530,:,"[226, 361, 242, 379]",MISC
531,3,"[242, 361, 257, 379]",MISC
532,-,"[257, 361, 259, 379]",MISC
533,NL,"[257, 361, 259, 379]",MISC
534,-,"[257, 361, 259, 379]",MISC
535,Ski,"[98, 393, 167, 410]",MISC
536,##ll,"[98, 393, 167, 410]",MISC
537,Used,"[167, 393, 222, 410]",MISC
538,:,"[223, 393, 235, 410]",MISC
539,Ang,"[237, 393, 332, 410]",MISC
540,##ular,"[237, 393, 332, 410]",MISC
541,5,"[333, 393, 360, 410]",MISC
542,",","[333, 393, 360, 410]",MISC
543,H,"[361, 393, 430, 410]",MISC
544,##TM,"[361, 393, 430, 410]",MISC
545,##L,"[361, 393, 430, 410]",MISC
546,",","[361, 393, 430, 410]",MISC
547,CS,"[430, 393, 470, 410]",MISC
548,##S,"[430, 393, 470, 410]",MISC
549,-,"[471, 393, 473, 410]",MISC
550,NL,"[471, 393, 473, 410]",MISC
551,-,"[471, 393, 473, 410]",MISC
552,Project,"[98, 424, 185, 441]",MISC
553,Det,"[185, 424, 284, 441]",MISC
554,##ails,"[185, 424, 284, 441]",MISC
555,:,"[185, 424, 284, 441]",MISC
556,-,"[284, 424, 286, 441]",MISC
557,NL,"[284, 424, 286, 441]",MISC
558,-,"[284, 424, 286, 441]",MISC
559,This,"[98, 460, 148, 477]",MISC
560,Application,"[149, 460, 287, 477]",MISC
561,keeps,"[288, 460, 350, 477]",MISC
562,track,"[352, 460, 414, 477]",MISC
563,of,"[415, 460, 440, 477]",MISC
564,all,"[440, 460, 478, 477]",MISC
565,products,"[478, 460, 579, 477]",MISC
566,which,"[580, 460, 642, 477]",MISC
567,are,"[643, 460, 680, 477]",MISC
568,present,"[681, 460, 769, 477]",MISC
569,in,"[770, 460, 794, 477]",MISC
570,stores,"[795, 460, 871, 477]",MISC
571,&,"[871, 460, 883, 477]",MISC
572,warehouse,"[884, 460, 997, 477]",MISC
573,-,"[998, 460, 999, 477]",MISC
574,NL,"[998, 460, 999, 477]",MISC
575,-,"[998, 460, 999, 477]",MISC
576,with,"[98, 477, 148, 495]",MISC
577,buy,"[149, 477, 186, 495]",MISC
578,&,"[186, 477, 199, 495]",MISC
579,sale,"[199, 477, 248, 495]",MISC
580,info,"[249, 477, 311, 495]",MISC
581,.,"[249, 477, 311, 495]",MISC
582,It,"[312, 477, 336, 495]",MISC
583,also,"[337, 477, 386, 495]",MISC
584,keeps,"[387, 477, 449, 495]",MISC
585,records,"[450, 477, 536, 495]",MISC
586,of,"[537, 477, 562, 495]",MISC
587,stocks,"[563, 477, 637, 495]",MISC
588,and,"[638, 477, 675, 495]",MISC
589,not,"[675, 477, 774, 495]",MISC
590,##ifies,"[675, 477, 774, 495]",MISC
591,the,"[776, 477, 813, 495]",MISC
592,user,"[813, 477, 863, 495]",MISC
593,if,"[864, 477, 888, 495]",MISC
594,stock,"[889, 477, 951, 495]",MISC
595,is,"[951, 477, 976, 495]",MISC
596,-,"[977, 477, 978, 495]",MISC
597,NL,"[977, 477, 978, 495]",MISC
598,-,"[977, 477, 978, 495]",MISC
599,less,"[98, 495, 146, 512]",MISC
600,for,"[147, 495, 182, 512]",MISC
601,a,"[183, 495, 193, 512]",MISC
602,product,"[195, 495, 290, 512]",MISC
603,.,"[195, 495, 290, 512]",MISC
604,-,"[291, 495, 293, 512]",MISC
605,NL,"[291, 495, 293, 512]",MISC
606,-,"[291, 495, 293, 512]",MISC
607,Arrow,"[98, 531, 164, 548]",B-project_company_name
608,Electronics,"[164, 531, 307, 548]",I-project_company_name
609,-,"[309, 531, 310, 548]",MISC
610,NL,"[309, 531, 310, 548]",MISC
611,-,"[309, 531, 310, 548]",MISC
612,Jan,"[98, 562, 141, 579]",MISC
613,2016,"[142, 562, 198, 579]",MISC
614,to,"[199, 562, 227, 579]",MISC
615,Dec,"[228, 562, 270, 579]",MISC
616,2017,"[271, 562, 327, 579]",MISC
617,-,"[328, 562, 330, 579]",MISC
618,NL,"[328, 562, 330, 579]",MISC
619,-,"[328, 562, 330, 579]",MISC
620,C,"[98, 594, 169, 611]",MISC
621,##lient,"[98, 594, 169, 611]",MISC
622,:,"[171, 594, 181, 611]",MISC
623,Arrow,"[183, 594, 243, 611]",B-project_company_name
624,Electronics,"[243, 594, 376, 611]",I-project_company_name
625,-,"[376, 594, 378, 611]",MISC
626,NL,"[376, 594, 378, 611]",MISC
627,-,"[376, 594, 378, 611]",MISC
628,Role,"[98, 625, 157, 643]",MISC
629,:,"[157, 625, 171, 643]",MISC
630,10,"[172, 625, 200, 643]",MISC
631,-,"[201, 625, 203, 643]",MISC
632,NL,"[201, 625, 203, 643]",MISC
633,-,"[201, 625, 203, 643]",MISC
634,Nature,"[98, 656, 185, 674]",MISC
635,of,"[185, 656, 213, 674]",MISC
636,Employment,"[214, 656, 357, 674]",MISC
637,:,"[359, 656, 373, 674]",MISC
638,Full,"[373, 656, 430, 674]",MISC
639,Time,"[431, 656, 488, 674]",MISC
640,-,"[489, 656, 491, 674]",MISC
641,NL,"[489, 656, 491, 674]",MISC
642,-,"[489, 656, 491, 674]",MISC
643,Role,"[98, 687, 148, 705]",MISC
644,Des,"[149, 687, 289, 705]",MISC
645,##cription,"[149, 687, 289, 705]",MISC
646,:,"[289, 687, 302, 705]",MISC
647,As,"[302, 687, 327, 705]",MISC
648,a,"[327, 687, 340, 705]",MISC
649,Dev,"[340, 687, 465, 705]",MISC
650,##elo,"[340, 687, 465, 705]",MISC
651,##per,"[340, 687, 465, 705]",MISC
652,",","[340, 687, 465, 705]",MISC
653,responsibilities,"[467, 687, 670, 705]",MISC
654,were,"[671, 687, 720, 705]",MISC
655,Part,"[721, 687, 771, 705]",MISC
656,of,"[772, 687, 797, 705]",MISC
657,unity,"[798, 687, 860, 705]",MISC
658,team,"[861, 687, 911, 705]",MISC
659,to,"[912, 687, 937, 705]",MISC
660,-,"[938, 687, 939, 705]",MISC
661,NL,"[938, 687, 939, 705]",MISC
662,-,"[938, 687, 939, 705]",MISC
663,deploy,"[98, 705, 173, 722]",MISC
664,the,"[173, 705, 210, 722]",MISC
665,resources,"[211, 705, 322, 722]",MISC
666,-,"[323, 705, 325, 722]",MISC
667,NL,"[323, 705, 325, 722]",MISC
668,-,"[323, 705, 325, 722]",MISC
669,Team,"[98, 737, 160, 754]",MISC
670,Si,"[161, 737, 223, 754]",MISC
671,##ze,"[161, 737, 223, 754]",MISC
672,:,"[224, 737, 238, 754]",MISC
673,14,"[240, 737, 270, 754]",MISC
674,-,"[272, 737, 273, 754]",MISC
675,NL,"[272, 737, 273, 754]",MISC
676,-,"[272, 737, 273, 754]",MISC
677,Ski,"[98, 768, 166, 786]",MISC
678,##ll,"[98, 768, 166, 786]",MISC
679,Used,"[166, 768, 219, 786]",MISC
680,:,"[220, 768, 233, 786]",MISC
681,Ang,"[234, 768, 328, 786]",MISC
682,##ular,"[234, 768, 328, 786]",MISC
683,5,"[329, 768, 341, 786]",MISC
684,-,"[342, 768, 344, 786]",MISC
685,NL,"[342, 768, 344, 786]",MISC
686,-,"[342, 768, 344, 786]",MISC
687,Project,"[98, 799, 185, 817]",MISC
688,Det,"[185, 799, 284, 817]",MISC
689,##ails,"[185, 799, 284, 817]",MISC
690,:,"[185, 799, 284, 817]",MISC
691,-,"[284, 799, 286, 817]",MISC
692,NL,"[284, 799, 286, 817]",MISC
693,-,"[284, 799, 286, 817]",MISC
694,Arrow,"[98, 835, 160, 853]",MISC
695,brings,"[162, 835, 236, 853]",MISC
696,the,"[237, 835, 274, 853]",MISC
697,technology,"[275, 835, 401, 853]",MISC
698,solution,"[401, 835, 502, 853]",MISC
699,of,"[502, 835, 527, 853]",MISC
700,its,"[528, 835, 565, 853]",MISC
701,customers,"[565, 835, 678, 853]",MISC
702,and,"[679, 835, 716, 853]",MISC
703,suppliers,"[717, 835, 830, 853]",MISC
704,to,"[830, 835, 855, 853]",MISC
705,a,"[856, 835, 868, 853]",MISC
706,bread,"[868, 835, 957, 853]",MISC
707,##th,"[868, 835, 957, 853]",MISC
708,of,"[957, 835, 981, 853]",MISC
709,-,"[982, 835, 984, 853]",MISC
710,NL,"[982, 835, 984, 853]",MISC
711,-,"[982, 835, 984, 853]",MISC
712,markets,"[98, 853, 196, 870]",MISC
713,",","[98, 853, 196, 870]",MISC
714,including,"[196, 853, 306, 870]",MISC
715,telecommunications,"[306, 853, 537, 870]",MISC
716,",","[306, 853, 537, 870]",MISC
717,information,"[538, 853, 672, 870]",MISC
718,systems,"[672, 853, 770, 870]",MISC
719,",","[672, 853, 770, 870]",MISC
720,automotive,"[770, 853, 892, 870]",MISC
721,and,"[892, 853, 928, 870]",MISC
722,-,"[929, 853, 931, 870]",MISC
723,NL,"[929, 853, 931, 870]",MISC
724,-,"[929, 853, 931, 870]",MISC
725,transportation,"[98, 870, 279, 888]",MISC
726,",","[98, 870, 279, 888]",MISC
727,medical,"[279, 870, 362, 888]",MISC
728,and,"[363, 870, 399, 888]",MISC
729,life,"[399, 870, 447, 888]",MISC
730,sciences,"[447, 870, 555, 888]",MISC
731,",","[447, 870, 555, 888]",MISC
732,industrial,"[556, 870, 676, 888]",MISC
733,equipment,"[676, 870, 796, 888]",MISC
734,",","[676, 870, 796, 888]",MISC
735,and,"[796, 870, 832, 888]",MISC
736,consumer,"[833, 870, 928, 888]",MISC
737,-,"[929, 870, 931, 888]",MISC
738,NL,"[929, 870, 931, 888]",MISC
739,-,"[929, 870, 931, 888]",MISC
740,electronics,"[98, 888, 215, 905]",MISC
741,-,"[215, 888, 217, 905]",MISC
742,NL,"[215, 888, 217, 905]",MISC
743,-,"[215, 888, 217, 905]",MISC
744,E,"[98, 924, 236, 941]",B-education_heading
745,##D,"[98, 924, 236, 941]",I-education_heading
746,##UC,"[98, 924, 236, 941]",I-education_heading
747,##AT,"[98, 924, 236, 941]",I-education_heading
748,##ION,"[98, 924, 236, 941]",I-education_heading
749,DE,"[238, 924, 345, 941]",I-education_heading
750,##TA,"[238, 924, 345, 941]",I-education_heading
751,##IL,"[238, 924, 345, 941]",I-education_heading
752,##S,"[238, 924, 345, 941]",I-education_heading
753,-,"[346, 924, 348, 941]",MISC
754,NL,"[346, 924, 348, 941]",MISC
755,-,"[346, 924, 348, 941]",MISC
756,U,"[98, 951, 144, 968]",MISC
757,.,"[98, 951, 144, 968]",MISC
758,G,"[98, 951, 144, 968]",MISC
759,.,"[98, 951, 144, 968]",MISC
760,-,"[144, 951, 146, 968]",MISC
761,NL,"[144, 951, 146, 968]",MISC
762,-,"[144, 951, 146, 968]",MISC
763,B,"[98, 982, 226, 999]",B-education_degree
764,.,"[98, 982, 226, 999]",I-education_degree
765,Tech,"[98, 982, 226, 999]",I-education_degree
766,/,"[98, 982, 226, 999]",MISC
767,B,"[98, 982, 226, 999]",MISC
768,.,"[98, 982, 226, 999]",MISC
769,E,"[98, 982, 226, 999]",MISC
770,.,"[98, 982, 226, 999]",MISC
771,(,"[227, 982, 587, 999]",MISC
772,Electronics,"[227, 982, 587, 999]",B-education_course
773,/,"[227, 982, 587, 999]",I-education_course
774,Telecom,"[227, 982, 587, 999]",I-education_course
775,##munication,"[227, 982, 587, 999]",I-education_course
776,),"[227, 982, 587, 999]",MISC
777,2015,"[589, 982, 635, 999]",MISC
778,-,"[636, 982, 637, 999]",MISC
779,NL,"[636, 982, 637, 999]",MISC
780,-,"[636, 982, 637, 999]",MISC
781,B,"[98, 34, 146, 52]",B-education_institute
782,##i,"[98, 34, 146, 52]",I-education_institute
783,##ju,"[98, 34, 146, 52]",I-education_institute
784,Pat,"[147, 34, 232, 52]",I-education_institute
785,##nai,"[147, 34, 232, 52]",I-education_institute
786,##k,"[147, 34, 232, 52]",I-education_institute
787,University,"[232, 34, 352, 52]",I-education_institute
788,of,"[353, 34, 376, 52]",I-education_institute
789,Technology,"[378, 34, 498, 52]",I-education_institute
790,(,"[499, 34, 572, 52]",MISC
791,BP,"[499, 34, 572, 52]",MISC
792,##UT,"[499, 34, 572, 52]",MISC
793,),"[499, 34, 572, 52]",MISC
794,-,"[572, 34, 574, 52]",MISC
795,NL,"[572, 34, 574, 52]",MISC
796,-,"[572, 34, 574, 52]",MISC
797,Other,"[98, 65, 151, 83]",MISC
798,Qualification,"[152, 65, 573, 83]",MISC
799,##s,"[152, 65, 573, 83]",MISC
800,/,"[152, 65, 573, 83]",MISC
801,Ce,"[152, 65, 573, 83]",MISC
802,##rt,"[152, 65, 573, 83]",MISC
803,##ifications,"[152, 65, 573, 83]",MISC
804,/,"[152, 65, 573, 83]",MISC
805,Programs,"[152, 65, 573, 83]",MISC
806,:,"[152, 65, 573, 83]",MISC
807,-,"[574, 65, 575, 83]",MISC
808,NL,"[574, 65, 575, 83]",MISC
809,-,"[574, 65, 575, 83]",MISC
810,Re,"[98, 111, 162, 129]",MISC
811,##act,"[98, 111, 162, 129]",MISC
812,the,"[164, 111, 203, 129]",MISC
813,complete,"[203, 111, 307, 129]",MISC
814,guide,"[307, 111, 371, 129]",MISC
815,-,"[372, 111, 374, 129]",MISC
816,NL,"[372, 111, 374, 129]",MISC
817,-,"[372, 111, 374, 129]",MISC
818,Ang,"[98, 156, 187, 174]",MISC
819,##ular,"[98, 156, 187, 174]",MISC
820,5,"[188, 156, 201, 174]",MISC
821,from,"[201, 156, 252, 174]",MISC
822,scratch,"[252, 156, 341, 174]",MISC
823,-,"[342, 156, 344, 174]",MISC
824,NL,"[342, 156, 344, 174]",MISC
825,-,"[342, 156, 344, 174]",MISC
826,Java,"[98, 202, 150, 220]",MISC
827,&,"[150, 202, 162, 220]",MISC
828,Web,"[163, 202, 200, 220]",MISC
829,Applications,"[202, 202, 355, 220]",MISC
830,-,"[356, 202, 358, 220]",MISC
831,NL,"[356, 202, 358, 220]",MISC
832,-,"[356, 202, 358, 220]",MISC
833,IT,"[98, 247, 125, 264]",MISC
834,SK,"[126, 247, 209, 264]",MISC
835,##IL,"[126, 247, 209, 264]",MISC
836,##LS,"[126, 247, 209, 264]",MISC
837,-,"[210, 247, 212, 264]",MISC
838,NL,"[210, 247, 212, 264]",MISC
839,-,"[210, 247, 212, 264]",MISC
840,Ski,"[109, 282, 201, 299]",MISC
841,##ll,"[109, 282, 201, 299]",MISC
842,Name,"[203, 282, 277, 299]",MISC
843,-,"[278, 282, 295, 299]",MISC
844,Version,"[296, 282, 427, 299]",MISC
845,-,"[427, 282, 445, 299]",MISC
846,Last,"[446, 282, 520, 299]",MISC
847,Used,"[521, 282, 595, 299]",MISC
848,-,"[596, 282, 613, 299]",MISC
849,Experience,"[614, 282, 800, 299]",MISC
850,-,"[802, 282, 803, 299]",MISC
851,NL,"[802, 282, 803, 299]",MISC
852,-,"[802, 282, 803, 299]",MISC
853,Ang,"[109, 332, 247, 349]",MISC
854,##ular,"[109, 332, 247, 349]",MISC
855,7,"[247, 332, 267, 349]",MISC
856,-,"[267, 332, 286, 349]",MISC
857,4,"[287, 332, 425, 349]",MISC
858,",","[287, 332, 425, 349]",MISC
859,5,"[287, 332, 425, 349]",MISC
860,",","[287, 332, 425, 349]",MISC
861,6,"[287, 332, 425, 349]",MISC
862,",","[287, 332, 425, 349]",MISC
863,7,"[287, 332, 425, 349]",MISC
864,-,"[425, 332, 445, 349]",MISC
865,2019,"[445, 332, 523, 349]",MISC
866,-,"[524, 332, 543, 349]",MISC
867,3,"[544, 332, 563, 349]",MISC
868,Year,"[563, 332, 701, 349]",MISC
869,(,"[563, 332, 701, 349]",MISC
870,s,"[563, 332, 701, 349]",MISC
871,),"[563, 332, 701, 349]",MISC
872,1,"[702, 332, 721, 349]",MISC
873,Month,"[721, 332, 879, 349]",MISC
874,(,"[721, 332, 879, 349]",MISC
875,s,"[721, 332, 879, 349]",MISC
876,),"[721, 332, 879, 349]",MISC
877,-,"[879, 332, 881, 349]",MISC
878,NL,"[879, 332, 881, 349]",MISC
879,-,"[879, 332, 881, 349]",MISC
880,R,"[109, 381, 189, 399]",MISC
881,##ES,"[109, 381, 189, 399]",MISC
882,##T,"[109, 381, 189, 399]",MISC
883,Web,"[190, 381, 250, 399]",MISC
884,Services,"[251, 381, 412, 399]",MISC
885,-,"[413, 381, 433, 399]",MISC
886,2019,"[433, 381, 513, 399]",MISC
887,-,"[514, 381, 534, 399]",MISC
888,3,"[535, 381, 554, 399]",MISC
889,Year,"[555, 381, 696, 399]",MISC
890,(,"[555, 381, 696, 399]",MISC
891,s,"[555, 381, 696, 399]",MISC
892,),"[555, 381, 696, 399]",MISC
893,0,"[697, 381, 716, 399]",MISC
894,Month,"[717, 381, 878, 399]",MISC
895,(,"[717, 381, 878, 399]",MISC
896,s,"[717, 381, 878, 399]",MISC
897,),"[717, 381, 878, 399]",MISC
898,-,"[879, 381, 881, 399]",MISC
899,NL,"[879, 381, 881, 399]",MISC
900,-,"[879, 381, 881, 399]",MISC
901,Java,"[109, 431, 342, 449]",MISC
902,##Script,"[109, 431, 342, 449]",MISC
903,-,"[342, 431, 365, 449]",MISC
904,2019,"[366, 431, 458, 449]",MISC
905,-,"[459, 431, 482, 449]",MISC
906,3,"[483, 431, 505, 449]",MISC
907,Year,"[506, 431, 668, 449]",MISC
908,(,"[506, 431, 668, 449]",MISC
909,s,"[506, 431, 668, 449]",MISC
910,),"[506, 431, 668, 449]",MISC
911,2,"[669, 431, 692, 449]",MISC
912,Month,"[693, 431, 878, 449]",MISC
913,(,"[693, 431, 878, 449]",MISC
914,s,"[693, 431, 878, 449]",MISC
915,),"[693, 431, 878, 449]",MISC
916,-,"[879, 431, 881, 449]",MISC
917,NL,"[879, 431, 881, 449]",MISC
918,-,"[879, 431, 881, 449]",MISC
919,Re,"[109, 481, 279, 498]",MISC
920,##act,"[109, 481, 279, 498]",MISC
921,.,"[109, 481, 279, 498]",MISC
922,j,"[109, 481, 279, 498]",MISC
923,##s,"[109, 481, 279, 498]",MISC
924,-,"[280, 481, 301, 498]",MISC
925,16,"[302, 481, 386, 498]",MISC
926,.,"[302, 481, 386, 498]",MISC
927,0,"[302, 481, 386, 498]",MISC
928,-,"[387, 481, 408, 498]",MISC
929,2019,"[409, 481, 493, 498]",MISC
930,-,"[494, 481, 515, 498]",MISC
931,0,"[516, 481, 537, 498]",MISC
932,Year,"[537, 481, 685, 498]",MISC
933,(,"[537, 481, 685, 498]",MISC
934,s,"[537, 481, 685, 498]",MISC
935,),"[537, 481, 685, 498]",MISC
936,5,"[687, 481, 708, 498]",MISC
937,Month,"[708, 481, 878, 498]",MISC
938,(,"[708, 481, 878, 498]",MISC
939,s,"[708, 481, 878, 498]",MISC
940,),"[708, 481, 878, 498]",MISC
941,-,"[879, 481, 881, 498]",MISC
942,NL,"[879, 481, 881, 498]",MISC
943,-,"[879, 481, 881, 498]",MISC
944,H,"[109, 531, 236, 548]",MISC
945,##TM,"[109, 531, 236, 548]",MISC
946,##L,"[109, 531, 236, 548]",MISC
947,##5,"[109, 531, 236, 548]",MISC
948,-,"[237, 531, 262, 548]",MISC
949,5,"[263, 531, 288, 548]",MISC
950,-,"[289, 531, 314, 548]",MISC
951,2019,"[314, 531, 417, 548]",MISC
952,-,"[417, 531, 442, 548]",MISC
953,2,"[443, 531, 468, 548]",MISC
954,Year,"[469, 531, 647, 548]",MISC
955,(,"[469, 531, 647, 548]",MISC
956,s,"[469, 531, 647, 548]",MISC
957,),"[469, 531, 647, 548]",MISC
958,0,"[648, 531, 673, 548]",MISC
959,Month,"[674, 531, 879, 548]",MISC
960,(,"[674, 531, 879, 548]",MISC
961,s,"[674, 531, 879, 548]",MISC
962,),"[674, 531, 879, 548]",MISC
963,-,"[879, 531, 881, 548]",MISC
964,NL,"[879, 531, 881, 548]",MISC
965,-,"[879, 531, 881, 548]",MISC
966,CS,"[109, 580, 190, 598]",MISC
967,##S,"[109, 580, 190, 598]",MISC
968,-,"[192, 580, 218, 598]",MISC
969,3,"[219, 580, 246, 598]",MISC
970,-,"[247, 580, 273, 598]",MISC
971,2019,"[274, 580, 384, 598]",MISC
972,-,"[384, 580, 411, 598]",MISC
973,1,"[412, 580, 438, 598]",MISC
974,Year,"[439, 580, 632, 598]",MISC
975,(,"[439, 580, 632, 598]",MISC
976,s,"[439, 580, 632, 598]",MISC
977,),"[439, 580, 632, 598]",MISC
978,6,"[632, 580, 658, 598]",MISC
979,Month,"[659, 580, 878, 598]",MISC
980,(,"[659, 580, 878, 598]",MISC
981,s,"[659, 580, 878, 598]",MISC
982,),"[659, 580, 878, 598]",MISC
983,-,"[879, 580, 881, 598]",MISC
984,NL,"[879, 580, 881, 598]",MISC
985,-,"[879, 580, 881, 598]",MISC
986,DE,"[98, 623, 204, 640]",MISC
987,##SI,"[98, 623, 204, 640]",MISC
988,##RE,"[98, 623, 204, 640]",MISC
989,##D,"[98, 623, 204, 640]",MISC
990,J,"[205, 623, 250, 640]",MISC
991,##O,"[205, 623, 250, 640]",MISC
992,##B,"[205, 623, 250, 640]",MISC
993,DE,"[251, 623, 357, 640]",MISC
994,##TA,"[251, 623, 357, 640]",MISC
995,##IL,"[251, 623, 357, 640]",MISC
996,##S,"[251, 623, 357, 640]",MISC
997,-,"[358, 623, 360, 640]",MISC
998,NL,"[358, 623, 360, 640]",MISC
999,-,"[358, 623, 360, 640]",MISC
1000,Job,"[98, 667, 141, 685]",MISC
1001,Type,"[141, 667, 198, 685]",MISC
1002,:,"[199, 667, 213, 685]",MISC
1003,Permanent,"[213, 667, 342, 685]",MISC
1004,-,"[342, 667, 344, 685]",MISC
1005,NL,"[342, 667, 344, 685]",MISC
1006,-,"[342, 667, 344, 685]",MISC
1007,Employment,"[98, 713, 238, 731]",MISC
1008,Status,"[238, 713, 321, 731]",MISC
1009,:,"[322, 713, 335, 731]",MISC
1010,Full,"[336, 713, 391, 731]",MISC
1011,time,"[392, 713, 447, 731]",MISC
1012,-,"[448, 713, 450, 731]",MISC
1013,NL,"[448, 713, 450, 731]",MISC
1014,-,"[448, 713, 450, 731]",MISC
1015,US,"[98, 758, 127, 776]",MISC
1016,Work,"[128, 758, 186, 776]",MISC
1017,Status,"[187, 758, 273, 776]",MISC
1018,:,"[275, 758, 289, 776]",MISC
1019,Not,"[290, 758, 332, 776]",MISC
1020,Mention,"[334, 758, 464, 776]",MISC
1021,##ed,"[334, 758, 464, 776]",MISC
1022,-,"[466, 758, 468, 776]",MISC
1023,NL,"[466, 758, 468, 776]",MISC
1024,-,"[466, 758, 468, 776]",MISC
1025,Pre,"[98, 804, 215, 822]",MISC
1026,##ferred,"[98, 804, 215, 822]",MISC
1027,Location,"[217, 804, 321, 822]",MISC
1028,:,"[322, 804, 334, 822]",MISC
1029,Bengal,"[335, 804, 451, 822]",MISC
1030,##uru,"[335, 804, 451, 822]",MISC
1031,/,"[453, 804, 465, 822]",MISC
1032,Bangalore,"[466, 804, 583, 822]",MISC
1033,-,"[584, 804, 586, 822]",MISC
1034,NL,"[584, 804, 586, 822]",MISC
1035,-,"[584, 804, 586, 822]",MISC
1036,P,"[98, 849, 222, 866]",B-personal_details_heading
1037,##ER,"[98, 849, 222, 866]",I-personal_details_heading
1038,##SO,"[98, 849, 222, 866]",I-personal_details_heading
1039,##NA,"[98, 849, 222, 866]",I-personal_details_heading
1040,##L,"[98, 849, 222, 866]",I-personal_details_heading
1041,DE,"[224, 849, 333, 866]",I-personal_details_heading
1042,##TA,"[224, 849, 333, 866]",I-personal_details_heading
1043,##IL,"[224, 849, 333, 866]",I-personal_details_heading
1044,##S,"[224, 849, 333, 866]",I-personal_details_heading
1045,-,"[333, 849, 335, 866]",MISC
1046,NL,"[333, 849, 335, 866]",MISC
1047,-,"[333, 849, 335, 866]",MISC
1048,Name,"[98, 876, 160, 894]",MISC
1049,:,"[161, 876, 175, 894]",MISC
1050,SA,"[176, 876, 332, 894]",B-name
1051,##B,"[176, 876, 332, 894]",I-name
1052,##Y,"[176, 876, 332, 894]",I-name
1053,##AS,"[176, 876, 332, 894]",I-name
1054,##AC,"[176, 876, 332, 894]",I-name
1055,##H,"[176, 876, 332, 894]",I-name
1056,##I,"[176, 876, 332, 894]",I-name
1057,SA,"[332, 876, 409, 894]",I-name
1058,##H,"[332, 876, 409, 894]",I-name
1059,##O,"[332, 876, 409, 894]",I-name
1060,##O,"[332, 876, 409, 894]",I-name
1061,-,"[409, 876, 411, 894]",MISC
1062,NL,"[409, 876, 411, 894]",MISC
1063,-,"[409, 876, 411, 894]",MISC
1064,Gender,"[98, 921, 185, 939]",MISC
1065,:,"[186, 921, 200, 939]",MISC
1066,Male,"[201, 921, 259, 939]",MISC
1067,-,"[259, 921, 261, 939]",MISC
1068,NL,"[259, 921, 261, 939]",MISC
1069,-,"[259, 921, 261, 939]",MISC
1070,Mari,"[98, 967, 185, 985]",MISC
1071,##tal,"[98, 967, 185, 985]",MISC
1072,Status,"[186, 967, 260, 985]",MISC
1073,:,"[262, 967, 274, 985]",MISC
1074,Single,"[274, 967, 474, 985]",MISC
1075,/,"[274, 967, 474, 985]",MISC
1076,unmarried,"[274, 967, 474, 985]",MISC
1077,-,"[475, 967, 477, 985]",MISC
1078,NL,"[475, 967, 477, 985]",MISC
1079,-,"[475, 967, 477, 985]",MISC
1080,Date,"[98, 34, 157, 52]",MISC
1081,of,"[158, 34, 186, 52]",MISC
1082,Birth,"[188, 34, 262, 52]",MISC
1083,:,"[262, 34, 276, 52]",MISC
1084,09,"[277, 34, 305, 52]",MISC
1085,Dec,"[307, 34, 351, 52]",MISC
1086,1992,"[352, 34, 410, 52]",MISC
1087,-,"[411, 34, 413, 52]",MISC
1088,NL,"[411, 34, 413, 52]",MISC
1089,-,"[411, 34, 413, 52]",MISC
1090,Mobile,"[98, 79, 180, 97]",MISC
1091,:,"[181, 79, 193, 97]",MISC
1092,77,"[194, 79, 371, 97]",B-phones_phone
1093,##9,"[194, 79, 371, 97]",I-phones_phone
1094,##5,"[194, 79, 371, 97]",I-phones_phone
1095,##28,"[194, 79, 371, 97]",I-phones_phone
1096,##7,"[194, 79, 371, 97]",I-phones_phone
1097,##8,"[194, 79, 371, 97]",I-phones_phone
1098,##23,"[194, 79, 371, 97]",I-phones_phone
1099,(,"[194, 79, 371, 97]",MISC
1100,M,"[194, 79, 371, 97]",MISC
1101,),"[194, 79, 371, 97]",MISC
1102,-,"[372, 79, 374, 97]",MISC
1103,NL,"[372, 79, 374, 97]",MISC
1104,-,"[372, 79, 374, 97]",MISC
1105,Em,"[98, 125, 164, 143]",MISC
1106,##ail,"[98, 125, 164, 143]",MISC
1107,ID,"[165, 125, 189, 143]",MISC
1108,:,"[191, 125, 203, 143]",MISC
1109,sa,"[204, 125, 561, 143]",B-emails_email
1110,##by,"[204, 125, 561, 143]",I-emails_email
1111,##asa,"[204, 125, 561, 143]",I-emails_email
1112,##chi,"[204, 125, 561, 143]",I-emails_email
1113,##sa,"[204, 125, 561, 143]",I-emails_email
1114,##ho,"[204, 125, 561, 143]",I-emails_email
1115,##o,"[204, 125, 561, 143]",I-emails_email
1116,##7,"[204, 125, 561, 143]",I-emails_email
1117,##7,"[204, 125, 561, 143]",I-emails_email
1118,@,"[204, 125, 561, 143]",I-emails_email
1119,g,"[204, 125, 561, 143]",I-emails_email
1120,##mail,"[204, 125, 561, 143]",I-emails_email
1121,.,"[204, 125, 561, 143]",I-emails_email
1122,com,"[204, 125, 561, 143]",I-emails_email
1123,-,"[561, 125, 563, 143]",MISC
1124,NL,"[561, 125, 563, 143]",MISC
1125,-,"[561, 125, 563, 143]",MISC
