,token,box,label
0,B,"[73, 45, 187, 68]",B-name
1,##ha,"[73, 45, 187, 68]",I-name
2,##vy,"[73, 45, 187, 68]",I-name
3,##a,"[73, 45, 187, 68]",I-name
4,Lakshmi,"[188, 45, 417, 68]",I-name
5,##path,"[188, 45, 417, 68]",I-name
6,##i,"[188, 45, 417, 68]",I-name
7,-,"[418, 45, 420, 68]",MISC
8,NL,"[418, 45, 420, 68]",MISC
9,-,"[418, 45, 420, 68]",MISC
10,E,"[901, 45, 976, 63]",MISC
11,-,"[901, 45, 976, 63]",MISC
12,mail,"[901, 45, 976, 63]",MISC
13,:,"[978, 45, 990, 63]",MISC
14,-,"[991, 45, 992, 63]",MISC
15,NL,"[991, 45, 992, 63]",MISC
16,-,"[991, 45, 992, 63]",MISC
17,B,"[631, 63, 989, 81]",B-emails_email
18,##ha,"[631, 63, 989, 81]",I-emails_email
19,##vy,"[631, 63, 989, 81]",I-emails_email
20,##a,"[631, 63, 989, 81]",I-emails_email
21,.,"[631, 63, 989, 81]",I-emails_email
22,la,"[631, 63, 989, 81]",I-emails_email
23,##ks,"[631, 63, 989, 81]",I-emails_email
24,##hm,"[631, 63, 989, 81]",I-emails_email
25,##ip,"[631, 63, 989, 81]",I-emails_email
26,##ath,"[631, 63, 989, 81]",I-emails_email
27,##i,"[631, 63, 989, 81]",I-emails_email
28,@,"[631, 63, 989, 81]",I-emails_email
29,g,"[631, 63, 989, 81]",I-emails_email
30,##mail,"[631, 63, 989, 81]",I-emails_email
31,.,"[631, 63, 989, 81]",I-emails_email
32,com,"[631, 63, 989, 81]",I-emails_email
33,-,"[989, 63, 991, 81]",MISC
34,NL,"[989, 63, 991, 81]",MISC
35,-,"[989, 63, 991, 81]",MISC
36,Product,"[73, 81, 177, 99]",MISC
37,Support,"[177, 81, 281, 99]",MISC
38,Manager,"[282, 81, 385, 99]",MISC
39,-,"[386, 81, 388, 99]",MISC
40,NL,"[386, 81, 388, 99]",MISC
41,-,"[386, 81, 388, 99]",MISC
42,Mobile,"[717, 81, 812, 99]",MISC
43,:,"[717, 81, 812, 99]",MISC
44,+,"[812, 81, 851, 99]",MISC
45,91,"[812, 81, 851, 99]",MISC
46,88,"[853, 81, 989, 99]",B-phones_phone
47,##8,"[853, 81, 989, 99]",I-phones_phone
48,##45,"[853, 81, 989, 99]",I-phones_phone
49,##42,"[853, 81, 989, 99]",I-phones_phone
50,##00,"[853, 81, 989, 99]",I-phones_phone
51,##0,"[853, 81, 989, 99]",I-phones_phone
52,-,"[989, 81, 991, 99]",MISC
53,NL,"[989, 81, 991, 99]",MISC
54,-,"[989, 81, 991, 99]",MISC
55,See,"[169, 133, 268, 151]",MISC
56,##king,"[169, 133, 268, 151]",MISC
57,assignments,"[268, 133, 422, 151]",MISC
58,in,"[424, 133, 451, 151]",MISC
59,Ana,"[452, 133, 579, 151]",MISC
60,##ly,"[452, 133, 579, 151]",MISC
61,##tics,"[452, 133, 579, 151]",MISC
62,in,"[579, 133, 606, 151]",MISC
63,a,"[608, 133, 620, 151]",MISC
64,reputed,"[622, 133, 720, 151]",MISC
65,organization,"[721, 133, 889, 151]",MISC
66,-,"[890, 133, 892, 151]",MISC
67,NL,"[890, 133, 892, 151]",MISC
68,-,"[890, 133, 892, 151]",MISC
69,PR,"[64, 168, 268, 189]",B-summary_heading
70,##O,"[64, 168, 268, 189]",I-summary_heading
71,##F,"[64, 168, 268, 189]",I-summary_heading
72,##ES,"[64, 168, 268, 189]",I-summary_heading
73,##SI,"[64, 168, 268, 189]",I-summary_heading
74,##ON,"[64, 168, 268, 189]",I-summary_heading
75,##AL,"[64, 168, 268, 189]",I-summary_heading
76,S,"[268, 168, 404, 189]",I-summary_heading
77,##Y,"[268, 168, 404, 189]",I-summary_heading
78,##N,"[268, 168, 404, 189]",I-summary_heading
79,##OP,"[268, 168, 404, 189]",I-summary_heading
80,##SI,"[268, 168, 404, 189]",I-summary_heading
81,##S,"[268, 168, 404, 189]",I-summary_heading
82,-,"[404, 168, 406, 189]",MISC
83,NL,"[404, 168, 406, 189]",MISC
84,-,"[404, 168, 406, 189]",MISC
85,A,"[83, 227, 96, 241]",MISC
86,result,"[97, 227, 181, 241]",MISC
87,-,"[182, 227, 194, 241]",MISC
88,oriented,"[196, 227, 307, 241]",MISC
89,professional,"[308, 227, 477, 241]",MISC
90,with,"[477, 227, 533, 241]",MISC
91,14,"[533, 227, 560, 241]",MISC
92,years,"[562, 227, 631, 241]",MISC
93,of,"[632, 227, 659, 241]",MISC
94,experience,"[660, 227, 800, 241]",MISC
95,in,"[801, 227, 828, 241]",MISC
96,IT,"[829, 227, 856, 241]",MISC
97,industries,"[857, 227, 997, 241]",MISC
98,-,"[998, 227, 999, 241]",MISC
99,NL,"[998, 227, 999, 241]",MISC
100,-,"[998, 227, 999, 241]",MISC
101,divers,"[101, 241, 250, 259]",MISC
102,##ified,"[101, 241, 250, 259]",MISC
103,fields,"[251, 241, 331, 259]",MISC
104,of,"[332, 241, 359, 259]",MISC
105,Business,"[359, 241, 467, 259]",B-employer_role
106,Ana,"[468, 241, 575, 259]",I-employer_role
107,##ly,"[468, 241, 575, 259]",I-employer_role
108,##st,"[468, 241, 575, 259]",I-employer_role
109,",","[468, 241, 575, 259]",MISC
110,Production,"[577, 241, 711, 259]",MISC
111,and,"[713, 241, 752, 259]",MISC
112,support,"[753, 241, 848, 259]",MISC
113,on,"[848, 241, 875, 259]",MISC
114,Main,"[875, 241, 997, 259]",MISC
115,##frame,"[875, 241, 997, 259]",MISC
116,-,"[998, 241, 1000, 259]",MISC
117,NL,"[998, 241, 1000, 259]",MISC
118,-,"[998, 241, 1000, 259]",MISC
119,Technology,"[101, 259, 232, 277]",MISC
120,.,"[101, 259, 232, 277]",MISC
121,-,"[232, 259, 234, 277]",MISC
122,NL,"[232, 259, 234, 277]",MISC
123,-,"[232, 259, 234, 277]",MISC
124,G,"[85, 280, 178, 294]",MISC
125,##aine,"[85, 280, 178, 294]",MISC
126,##d,"[85, 280, 178, 294]",MISC
127,knowledge,"[178, 280, 317, 294]",MISC
128,on,"[317, 280, 348, 294]",MISC
129,Domain,"[348, 280, 441, 294]",MISC
130,Experience,"[441, 280, 595, 294]",MISC
131,in,"[596, 280, 627, 294]",MISC
132,CP,"[627, 280, 674, 294]",MISC
133,##G,"[627, 280, 674, 294]",MISC
134,Industry,"[674, 280, 813, 294]",MISC
135,-,"[674, 280, 813, 294]",MISC
136,Re,"[813, 280, 906, 294]",MISC
137,##tail,"[813, 280, 906, 294]",MISC
138,Domain,"[906, 280, 1000, 294]",MISC
139,-,"[1000, 280, 1001, 294]",MISC
140,NL,"[1000, 280, 1001, 294]",MISC
141,-,"[1000, 280, 1001, 294]",MISC
142,(,"[101, 294, 227, 312]",MISC
143,Consumer,"[101, 294, 227, 312]",MISC
144,Pack,"[228, 294, 338, 312]",MISC
145,##aged,"[228, 294, 338, 312]",MISC
146,Good,"[340, 294, 436, 312]",MISC
147,##s,"[340, 294, 436, 312]",MISC
148,),"[340, 294, 436, 312]",MISC
149,",","[340, 294, 436, 312]",MISC
150,Healthcare,"[438, 294, 577, 312]",MISC
151,domain,"[578, 294, 674, 312]",MISC
152,.,"[578, 294, 674, 312]",MISC
153,-,"[676, 294, 677, 312]",MISC
154,NL,"[676, 294, 677, 312]",MISC
155,-,"[676, 294, 677, 312]",MISC
156,Prof,"[85, 316, 239, 330]",MISC
157,##icient,"[85, 316, 239, 330]",MISC
158,on,"[240, 316, 270, 330]",MISC
159,MS,"[271, 316, 301, 330]",MISC
160,Ex,"[302, 316, 395, 330]",MISC
161,##cel,"[302, 316, 395, 330]",MISC
162,",","[302, 316, 395, 330]",MISC
163,MS,"[395, 316, 425, 330]",MISC
164,Access,"[426, 316, 519, 330]",MISC
165,and,"[519, 316, 565, 330]",MISC
166,MS,"[565, 316, 596, 330]",MISC
167,Power,"[596, 316, 766, 330]",MISC
168,##P,"[596, 316, 766, 330]",MISC
169,##oint,"[596, 316, 766, 330]",MISC
170,",","[596, 316, 766, 330]",MISC
171,Main,"[767, 316, 906, 330]",MISC
172,##frame,"[767, 316, 906, 330]",MISC
173,-,"[906, 316, 908, 330]",MISC
174,NL,"[906, 316, 908, 330]",MISC
175,-,"[906, 316, 908, 330]",MISC
176,Strong,"[82, 334, 157, 348]",MISC
177,analytical,"[158, 334, 298, 348]",MISC
178,",","[158, 334, 298, 348]",MISC
179,problem,"[299, 334, 386, 348]",MISC
180,solving,"[388, 334, 488, 348]",MISC
181,",","[388, 334, 488, 348]",MISC
182,multi,"[490, 334, 642, 348]",MISC
183,##tas,"[490, 334, 642, 348]",MISC
184,##king,"[490, 334, 642, 348]",MISC
185,and,"[643, 334, 680, 348]",MISC
186,strategic,"[681, 334, 795, 348]",MISC
187,planning,"[796, 334, 896, 348]",MISC
188,skills,"[898, 334, 973, 348]",MISC
189,at,"[974, 334, 999, 348]",MISC
190,-,"[1000, 334, 1001, 348]",MISC
191,NL,"[1000, 334, 1001, 348]",MISC
192,-,"[1000, 334, 1001, 348]",MISC
193,production,"[101, 348, 225, 365]",MISC
194,environment,"[225, 348, 359, 365]",MISC
195,-,"[361, 348, 363, 365]",MISC
196,NL,"[361, 348, 363, 365]",MISC
197,-,"[361, 348, 363, 365]",MISC
198,Working,"[83, 369, 180, 383]",MISC
199,in,"[180, 369, 207, 383]",MISC
200,24,"[208, 369, 261, 383]",MISC
201,##x,"[208, 369, 261, 383]",MISC
202,##7,"[208, 369, 261, 383]",MISC
203,Production,"[263, 369, 401, 383]",MISC
204,Environment,"[402, 369, 554, 383]",MISC
205,to,"[554, 369, 581, 383]",MISC
206,support,"[582, 369, 678, 383]",MISC
207,multiple,"[679, 369, 788, 383]",MISC
208,system,"[789, 369, 872, 383]",MISC
209,-,"[872, 369, 874, 383]",MISC
210,NL,"[872, 369, 874, 383]",MISC
211,-,"[872, 369, 874, 383]",MISC
212,Demons,"[85, 387, 273, 401]",MISC
213,##trate,"[85, 387, 273, 401]",MISC
214,##d,"[85, 387, 273, 401]",MISC
215,ability,"[274, 387, 383, 401]",MISC
216,to,"[384, 387, 414, 401]",MISC
217,work,"[415, 387, 478, 401]",MISC
218,both,"[478, 387, 541, 401]",MISC
219,in,"[541, 387, 572, 401]",MISC
220,independent,"[573, 387, 745, 401]",MISC
221,and,"[746, 387, 792, 401]",MISC
222,team,"[793, 387, 997, 401]",MISC
223,-,"[793, 387, 997, 401]",MISC
224,oriented,"[793, 387, 997, 401]",MISC
225,-,"[998, 387, 1000, 401]",MISC
226,NL,"[998, 387, 1000, 401]",MISC
227,-,"[998, 387, 1000, 401]",MISC
228,environments,"[101, 401, 248, 419]",MISC
229,with,"[248, 401, 297, 419]",MISC
230,excellent,"[297, 401, 406, 419]",MISC
231,-,"[407, 401, 409, 419]",MISC
232,NL,"[407, 401, 409, 419]",MISC
233,-,"[407, 401, 409, 419]",MISC
234,communication,"[101, 419, 257, 437]",MISC
235,and,"[258, 419, 294, 437]",MISC
236,inter,"[294, 419, 450, 437]",MISC
237,##person,"[294, 419, 450, 437]",MISC
238,##al,"[294, 419, 450, 437]",MISC
239,skills,"[451, 419, 523, 437]",MISC
240,-,"[524, 419, 525, 437]",MISC
241,NL,"[524, 419, 525, 437]",MISC
242,-,"[524, 419, 525, 437]",MISC
243,E,"[64, 470, 239, 489]",B-work_experience_heading
244,##MP,"[64, 470, 239, 489]",I-work_experience_heading
245,##L,"[64, 470, 239, 489]",I-work_experience_heading
246,##O,"[64, 470, 239, 489]",I-work_experience_heading
247,##Y,"[64, 470, 239, 489]",I-work_experience_heading
248,##ME,"[64, 470, 239, 489]",I-work_experience_heading
249,##NT,"[64, 470, 239, 489]",I-work_experience_heading
250,DE,"[240, 470, 361, 489]",I-work_experience_heading
251,##TA,"[240, 470, 361, 489]",I-work_experience_heading
252,##IL,"[240, 470, 361, 489]",I-work_experience_heading
253,##S,"[240, 470, 361, 489]",I-work_experience_heading
254,-,"[363, 470, 364, 489]",MISC
255,NL,"[363, 470, 364, 489]",MISC
256,-,"[363, 470, 364, 489]",MISC
257,Mar,"[168, 508, 225, 524]",MISC
258,’,"[168, 508, 225, 524]",MISC
259,07,"[226, 508, 254, 524]",MISC
260,–,"[255, 508, 269, 524]",MISC
261,Nov,"[269, 508, 327, 524]",MISC
262,’,"[269, 508, 327, 524]",MISC
263,11,"[327, 508, 356, 524]",MISC
264,with,"[356, 508, 414, 524]",MISC
265,Symphony,"[415, 508, 529, 524]",B-employer_company_name
266,Services,"[531, 508, 645, 524]",I-employer_company_name
267,(,"[647, 508, 778, 524]",MISC
268,Business,"[647, 508, 778, 524]",B-employer_role
269,Ana,"[778, 508, 892, 524]",I-employer_role
270,##ly,"[778, 508, 892, 524]",I-employer_role
271,##st,"[778, 508, 892, 524]",I-employer_role
272,),"[778, 508, 892, 524]",MISC
273,-,"[894, 508, 896, 524]",MISC
274,NL,"[894, 508, 896, 524]",MISC
275,-,"[894, 508, 896, 524]",MISC
276,C,"[415, 524, 499, 542]",MISC
277,##lient,"[415, 524, 499, 542]",MISC
278,:,"[415, 524, 499, 542]",MISC
279,P,"[500, 524, 597, 542]",MISC
280,##ep,"[500, 524, 597, 542]",MISC
281,##si,"[500, 524, 597, 542]",MISC
282,##C,"[500, 524, 597, 542]",MISC
283,##o,"[500, 524, 597, 542]",MISC
284,",","[500, 524, 597, 542]",MISC
285,Data,"[598, 524, 646, 542]",MISC
286,-,"[647, 524, 649, 542]",MISC
287,NL,"[647, 524, 649, 542]",MISC
288,-,"[647, 524, 649, 542]",MISC
289,In,"[80, 542, 180, 560]",MISC
290,##volved,"[80, 542, 180, 560]",MISC
291,in,"[181, 542, 206, 560]",MISC
292,providing,"[207, 542, 319, 560]",MISC
293,insights,"[321, 542, 421, 560]",MISC
294,to,"[422, 542, 447, 560]",MISC
295,P,"[448, 542, 510, 560]",MISC
296,##ep,"[448, 542, 510, 560]",MISC
297,##si,"[448, 542, 510, 560]",MISC
298,home,"[511, 542, 561, 560]",MISC
299,town,"[562, 542, 612, 560]",MISC
300,Consumer,"[612, 542, 712, 560]",MISC
301,portfolio,"[714, 542, 826, 560]",MISC
302,mix,"[828, 542, 865, 560]",MISC
303,decisions,"[866, 542, 978, 560]",MISC
304,-,"[980, 542, 982, 560]",MISC
305,NL,"[980, 542, 982, 560]",MISC
306,-,"[980, 542, 982, 560]",MISC
307,and,"[166, 560, 203, 578]",MISC
308,recommend,"[204, 560, 354, 578]",MISC
309,##ing,"[204, 560, 354, 578]",MISC
310,in,"[354, 560, 454, 578]",MISC
311,-,"[354, 560, 454, 578]",MISC
312,depth,"[354, 560, 454, 578]",MISC
313,strategies,"[455, 560, 580, 578]",MISC
314,for,"[580, 560, 618, 578]",MISC
315,their,"[618, 560, 680, 578]",MISC
316,business,"[681, 560, 781, 578]",MISC
317,processes,"[781, 560, 894, 578]",MISC
318,-,"[894, 560, 896, 578]",MISC
319,NL,"[894, 560, 896, 578]",MISC
320,-,"[894, 560, 896, 578]",MISC
321,Nov,"[271, 578, 332, 595]",MISC
322,’,"[271, 578, 332, 595]",MISC
323,11,"[332, 578, 363, 595]",MISC
324,–,"[363, 578, 377, 595]",MISC
325,Dec,"[378, 578, 469, 595]",MISC
326,’,"[378, 578, 469, 595]",MISC
327,12,"[378, 578, 469, 595]",MISC
328,with,"[469, 578, 530, 595]",MISC
329,Gen,"[530, 578, 636, 595]",B-employer_company_name
330,##pa,"[530, 578, 636, 595]",I-employer_company_name
331,##ct,"[530, 578, 636, 595]",I-employer_company_name
332,–,"[637, 578, 651, 595]",MISC
333,Jan,"[652, 578, 743, 595]",MISC
334,’,"[652, 578, 743, 595]",MISC
335,13,"[652, 578, 743, 595]",MISC
336,–,"[743, 578, 758, 595]",MISC
337,Dec,"[759, 578, 850, 595]",MISC
338,’,"[759, 578, 850, 595]",MISC
339,19,"[759, 578, 850, 595]",MISC
340,with,"[850, 578, 911, 595]",MISC
341,I,"[911, 578, 986, 595]",B-employer_company_name
342,##Q,"[911, 578, 986, 595]",I-employer_company_name
343,##VI,"[911, 578, 986, 595]",I-employer_company_name
344,##A,"[911, 578, 986, 595]",I-employer_company_name
345,-,"[987, 578, 989, 595]",MISC
346,NL,"[987, 578, 989, 595]",MISC
347,-,"[987, 578, 989, 595]",MISC
348,(,"[73, 595, 186, 613]",MISC
349,Product,"[73, 595, 186, 613]",B-employer_role
350,Support,"[186, 595, 285, 613]",I-employer_role
351,Advisor,"[285, 595, 384, 613]",I-employer_role
352,2,"[384, 595, 411, 613]",I-employer_role
353,),"[384, 595, 411, 613]",MISC
354,-,"[413, 595, 415, 613]",MISC
355,NL,"[413, 595, 415, 613]",MISC
356,-,"[413, 595, 415, 613]",MISC
357,In,"[76, 613, 178, 631]",MISC
358,##volved,"[76, 613, 178, 631]",MISC
359,in,"[179, 613, 204, 631]",MISC
360,providing,"[204, 613, 319, 631]",MISC
361,the,"[320, 613, 357, 631]",MISC
362,maintenance,"[358, 613, 510, 631]",MISC
363,##s,"[358, 613, 510, 631]",MISC
364,of,"[512, 613, 537, 631]",MISC
365,application,"[537, 613, 677, 631]",MISC
366,running,"[678, 613, 767, 631]",MISC
367,on,"[768, 613, 793, 631]",MISC
368,Main,"[793, 613, 908, 631]",MISC
369,##frame,"[793, 613, 908, 631]",MISC
370,system,"[908, 613, 984, 631]",MISC
371,-,"[985, 613, 987, 631]",MISC
372,NL,"[985, 613, 987, 631]",MISC
373,-,"[985, 613, 987, 631]",MISC
374,Key,"[64, 667, 110, 686]",MISC
375,Achievement,"[111, 667, 311, 686]",MISC
376,##s,"[111, 667, 311, 686]",MISC
377,:,"[111, 667, 311, 686]",MISC
378,-,"[313, 667, 314, 686]",MISC
379,NL,"[313, 667, 314, 686]",MISC
380,-,"[313, 667, 314, 686]",MISC
381,Pro,"[83, 707, 209, 721]",MISC
382,##vid,"[83, 707, 209, 721]",MISC
383,##ing,"[83, 707, 209, 721]",MISC
384,overall,"[210, 707, 308, 721]",MISC
385,leadership,"[308, 707, 448, 721]",MISC
386,to,"[449, 707, 476, 721]",MISC
387,the,"[477, 707, 518, 721]",MISC
388,entire,"[519, 707, 604, 721]",MISC
389,project,"[604, 707, 702, 721]",MISC
390,team,"[702, 707, 758, 721]",MISC
391,including,"[759, 707, 884, 721]",MISC
392,managing,"[885, 707, 996, 721]",MISC
393,-,"[998, 707, 1000, 721]",MISC
394,NL,"[998, 707, 1000, 721]",MISC
395,-,"[998, 707, 1000, 721]",MISC
396,deliver,"[101, 721, 250, 739]",MISC
397,##ables,"[101, 721, 250, 739]",MISC
398,of,"[251, 721, 274, 739]",MISC
399,other,"[276, 721, 337, 739]",MISC
400,functional,"[338, 721, 462, 739]",MISC
401,team,"[463, 721, 511, 739]",MISC
402,leaders,"[513, 721, 599, 739]",MISC
403,in,"[600, 721, 623, 739]",MISC
404,an,"[625, 721, 648, 739]",MISC
405,effective,"[650, 721, 761, 739]",MISC
406,manner,"[762, 721, 835, 739]",MISC
407,-,"[837, 721, 838, 739]",MISC
408,NL,"[837, 721, 838, 739]",MISC
409,-,"[837, 721, 838, 739]",MISC
410,Co,"[82, 743, 247, 757]",MISC
411,##mm,"[82, 743, 247, 757]",MISC
412,##uni,"[82, 743, 247, 757]",MISC
413,##cating,"[82, 743, 247, 757]",MISC
414,with,"[247, 743, 297, 757]",MISC
415,external,"[298, 743, 513, 757]",MISC
416,/,"[298, 743, 513, 757]",MISC
417,internal,"[298, 743, 513, 757]",MISC
418,clients,"[514, 743, 602, 757]",MISC
419,to,"[603, 743, 628, 757]",MISC
420,determine,"[629, 743, 742, 757]",MISC
421,specific,"[743, 743, 844, 757]",MISC
422,requirements,"[845, 743, 997, 757]",MISC
423,-,"[998, 743, 1000, 757]",MISC
424,NL,"[998, 743, 1000, 757]",MISC
425,-,"[998, 743, 1000, 757]",MISC
426,and,"[101, 757, 137, 775]",MISC
427,expectations,"[139, 757, 298, 775]",MISC
428,;,"[139, 757, 298, 775]",MISC
429,managing,"[300, 757, 398, 775]",MISC
430,client,"[399, 757, 472, 775]",MISC
431,expectations,"[473, 757, 621, 775]",MISC
432,as,"[622, 757, 645, 775]",MISC
433,an,"[646, 757, 670, 775]",MISC
434,indicator,"[671, 757, 782, 775]",MISC
435,of,"[783, 757, 806, 775]",MISC
436,quality,"[807, 757, 893, 775]",MISC
437,-,"[894, 757, 896, 775]",MISC
438,NL,"[894, 757, 896, 775]",MISC
439,-,"[894, 757, 896, 775]",MISC
440,Managing,"[83, 778, 192, 792]",MISC
441,large,"[192, 778, 260, 792]",MISC
442,and,"[260, 778, 300, 792]",MISC
443,complex,"[301, 778, 396, 792]",MISC
444,projects,"[397, 778, 506, 792]",MISC
445,or,"[506, 778, 533, 792]",MISC
446,multiple,"[533, 778, 643, 792]",MISC
447,components,"[643, 778, 779, 792]",MISC
448,of,"[779, 778, 806, 792]",MISC
449,a,"[807, 778, 819, 792]",MISC
450,large,"[820, 778, 888, 792]",MISC
451,projects,"[888, 778, 998, 792]",MISC
452,-,"[998, 778, 1000, 792]",MISC
453,NL,"[998, 778, 1000, 792]",MISC
454,-,"[998, 778, 1000, 792]",MISC
455,involving,"[101, 792, 214, 810]",MISC
456,more,"[216, 792, 266, 810]",MISC
457,than,"[266, 792, 316, 810]",MISC
458,one,"[317, 792, 355, 810]",MISC
459,company,"[355, 792, 468, 810]",MISC
460,’,"[355, 792, 468, 810]",MISC
461,s,"[355, 792, 468, 810]",MISC
462,products,"[469, 792, 684, 810]",MISC
463,/,"[469, 792, 684, 810]",MISC
464,services,"[469, 792, 684, 810]",MISC
465,-,"[685, 792, 686, 810]",MISC
466,NL,"[685, 792, 686, 810]",MISC
467,-,"[685, 792, 686, 810]",MISC
468,Created,"[84, 814, 186, 828]",MISC
469,useful,"[187, 814, 275, 828]",MISC
470,key,"[276, 814, 319, 828]",MISC
471,insights,"[320, 814, 438, 828]",MISC
472,on,"[438, 814, 467, 828]",MISC
473,the,"[468, 814, 511, 828]",MISC
474,“,"[512, 814, 659, 828]",MISC
475,G,"[512, 814, 659, 828]",MISC
476,##ator,"[512, 814, 659, 828]",MISC
477,##ade,"[512, 814, 659, 828]",MISC
478,”,"[512, 814, 659, 828]",MISC
479,brand,"[660, 814, 733, 828]",MISC
480,(,"[734, 814, 895, 828]",MISC
481,dominating,"[734, 814, 895, 828]",MISC
482,brand,"[896, 814, 969, 828]",MISC
483,in,"[970, 814, 999, 828]",MISC
484,-,"[999, 814, 1001, 828]",MISC
485,NL,"[999, 814, 1001, 828]",MISC
486,-,"[999, 814, 1001, 828]",MISC
487,Sports,"[101, 828, 177, 846]",MISC
488,Dr,"[178, 828, 241, 846]",MISC
489,##ink,"[178, 828, 241, 846]",MISC
490,category,"[242, 828, 357, 846]",MISC
491,),"[242, 828, 357, 846]",MISC
492,for,"[358, 828, 395, 846]",MISC
493,the,"[396, 828, 434, 846]",MISC
494,end,"[434, 828, 472, 846]",MISC
495,client,"[473, 828, 562, 846]",MISC
496,",","[473, 828, 562, 846]",MISC
497,Quaker,"[562, 828, 652, 846]",MISC
498,",","[562, 828, 652, 846]",MISC
499,which,"[652, 828, 715, 846]",MISC
500,tracks,"[716, 828, 791, 846]",MISC
501,the,"[793, 828, 830, 846]",MISC
502,performance,"[831, 828, 971, 846]",MISC
503,of,"[972, 828, 997, 846]",MISC
504,-,"[998, 828, 1000, 846]",MISC
505,NL,"[998, 828, 1000, 846]",MISC
506,-,"[998, 828, 1000, 846]",MISC
507,this,"[101, 846, 155, 864]",MISC
508,brand,"[156, 846, 224, 864]",MISC
509,compared,"[224, 846, 331, 864]",MISC
510,to,"[333, 846, 360, 864]",MISC
511,its,"[360, 846, 399, 864]",MISC
512,competitors,"[401, 846, 549, 864]",MISC
513,in,"[550, 846, 577, 864]",MISC
514,its,"[578, 846, 617, 864]",MISC
515,own,"[619, 846, 658, 864]",MISC
516,category,"[659, 846, 767, 864]",MISC
517,and,"[768, 846, 808, 864]",MISC
518,also,"[809, 846, 863, 864]",MISC
519,won,"[863, 846, 903, 864]",MISC
520,a,"[904, 846, 917, 864]",MISC
521,C,"[918, 846, 998, 864]",MISC
522,##lient,"[918, 846, 998, 864]",MISC
523,-,"[1000, 846, 1001, 864]",MISC
524,NL,"[1000, 846, 1001, 864]",MISC
525,-,"[1000, 846, 1001, 864]",MISC
526,A,"[101, 864, 262, 881]",MISC
527,##pp,"[101, 864, 262, 881]",MISC
528,##re,"[101, 864, 262, 881]",MISC
529,##ciation,"[101, 864, 262, 881]",MISC
530,Award,"[263, 864, 330, 881]",MISC
531,for,"[331, 864, 370, 881]",MISC
532,it,"[371, 864, 398, 881]",MISC
533,-,"[398, 864, 400, 881]",MISC
534,NL,"[398, 864, 400, 881]",MISC
535,-,"[398, 864, 400, 881]",MISC
536,Was,"[84, 885, 125, 899]",MISC
537,the,"[126, 885, 168, 899]",MISC
538,key,"[169, 885, 210, 899]",MISC
539,member,"[212, 885, 296, 899]",MISC
540,of,"[298, 885, 325, 899]",MISC
541,the,"[326, 885, 368, 899]",MISC
542,team,"[369, 885, 425, 899]",MISC
543,for,"[426, 885, 468, 899]",MISC
544,the,"[469, 885, 510, 899]",MISC
545,successful,"[512, 885, 653, 899]",MISC
546,and,"[655, 885, 696, 899]",MISC
547,accurate,"[698, 885, 810, 899]",MISC
548,delivery,"[812, 885, 925, 899]",MISC
549,of,"[926, 885, 953, 899]",MISC
550,the,"[955, 885, 996, 899]",MISC
551,-,"[998, 885, 1000, 899]",MISC
552,NL,"[998, 885, 1000, 899]",MISC
553,-,"[998, 885, 1000, 899]",MISC
554,rest,"[101, 899, 252, 917]",MISC
555,##ate,"[101, 899, 252, 917]",MISC
556,##ment,"[101, 899, 252, 917]",MISC
557,(,"[253, 899, 321, 917]",MISC
558,Q,"[253, 899, 321, 917]",MISC
559,##T,"[253, 899, 321, 917]",MISC
560,##G,"[253, 899, 321, 917]",MISC
561,",","[253, 899, 321, 917]",MISC
562,database,"[322, 899, 431, 917]",MISC
563,up,"[432, 899, 556, 917]",MISC
564,##dation,"[432, 899, 556, 917]",MISC
565,),"[432, 899, 556, 917]",MISC
566,during,"[556, 899, 639, 917]",MISC
567,the,"[639, 899, 680, 917]",MISC
568,resource,"[681, 899, 790, 917]",MISC
569,c,"[791, 899, 873, 917]",MISC
570,##runch,"[791, 899, 873, 917]",MISC
571,phase,"[874, 899, 956, 917]",MISC
572,",","[874, 899, 956, 917]",MISC
573,for,"[956, 899, 997, 917]",MISC
574,-,"[998, 899, 1000, 917]",MISC
575,NL,"[998, 899, 1000, 917]",MISC
576,-,"[998, 899, 1000, 917]",MISC
577,which,"[101, 917, 177, 935]",MISC
578,the,"[177, 917, 222, 935]",MISC
579,team,"[223, 917, 284, 935]",MISC
580,won,"[284, 917, 329, 935]",MISC
581,Spot,"[330, 917, 390, 935]",MISC
582,Award,"[390, 917, 466, 935]",MISC
583,-,"[466, 917, 468, 935]",MISC
584,NL,"[466, 917, 468, 935]",MISC
585,-,"[466, 917, 468, 935]",MISC
586,In,"[86, 939, 232, 952]",MISC
587,##iti,"[86, 939, 232, 952]",MISC
588,##ated,"[86, 939, 232, 952]",MISC
589,and,"[232, 939, 281, 952]",MISC
590,leading,"[281, 939, 394, 952]",MISC
591,Knowledge,"[396, 939, 542, 952]",MISC
592,Management,"[543, 939, 721, 952]",MISC
593,",","[543, 939, 721, 952]",MISC
594,under,"[722, 939, 803, 952]",MISC
595,BC,"[804, 939, 852, 952]",MISC
596,##P,"[804, 939, 852, 952]",MISC
597,(,"[853, 939, 999, 952]",MISC
598,Business,"[853, 939, 999, 952]",MISC
599,-,"[1000, 939, 1001, 952]",MISC
600,NL,"[1000, 939, 1001, 952]",MISC
601,-,"[1000, 939, 1001, 952]",MISC
602,Con,"[101, 952, 227, 970]",MISC
603,##tin,"[101, 952, 227, 970]",MISC
604,##uity,"[101, 952, 227, 970]",MISC
605,Plan,"[228, 952, 291, 970]",MISC
606,),"[228, 952, 291, 970]",MISC
607,for,"[291, 952, 329, 970]",MISC
608,P,"[329, 952, 392, 970]",MISC
609,##EP,"[329, 952, 392, 970]",MISC
610,##SI,"[329, 952, 392, 970]",MISC
611,Team,"[393, 952, 443, 970]",MISC
612,-,"[443, 952, 445, 970]",MISC
613,NL,"[443, 952, 445, 970]",MISC
614,-,"[443, 952, 445, 970]",MISC
615,T,"[64, 45, 209, 64]",B-skills_heading
616,##EC,"[64, 45, 209, 64]",I-skills_heading
617,##H,"[64, 45, 209, 64]",I-skills_heading
618,##NI,"[64, 45, 209, 64]",I-skills_heading
619,##CA,"[64, 45, 209, 64]",I-skills_heading
620,##L,"[64, 45, 209, 64]",I-skills_heading
621,SK,"[210, 45, 306, 64]",I-skills_heading
622,##IL,"[210, 45, 306, 64]",I-skills_heading
623,##LS,"[210, 45, 306, 64]",I-skills_heading
624,-,"[307, 45, 309, 64]",MISC
625,NL,"[307, 45, 309, 64]",MISC
626,-,"[307, 45, 309, 64]",MISC
627,Op,"[113, 87, 267, 101]",MISC
628,##ert,"[113, 87, 267, 101]",MISC
629,##ain,"[113, 87, 267, 101]",MISC
630,##g,"[113, 87, 267, 101]",MISC
631,system,"[268, 87, 370, 101]",MISC
632,:,"[371, 87, 387, 101]",MISC
633,z,"[388, 87, 474, 101]",MISC
634,/,"[388, 87, 474, 101]",MISC
635,OS,"[388, 87, 474, 101]",MISC
636,",","[388, 87, 474, 101]",MISC
637,OS,"[474, 87, 594, 101]",MISC
638,/,"[474, 87, 594, 101]",MISC
639,390,"[474, 87, 594, 101]",MISC
640,",","[474, 87, 594, 101]",MISC
641,Windows,"[595, 87, 731, 101]",MISC
642,",","[595, 87, 731, 101]",MISC
643,Unix,"[732, 87, 800, 101]",MISC
644,-,"[801, 87, 803, 101]",MISC
645,NL,"[801, 87, 803, 101]",MISC
646,-,"[801, 87, 803, 101]",MISC
647,Pack,"[113, 108, 243, 121]",MISC
648,##ages,"[113, 108, 243, 121]",MISC
649,:,"[245, 108, 261, 121]",MISC
650,MS,"[261, 108, 294, 121]",MISC
651,Ex,"[295, 108, 393, 121]",MISC
652,##cel,"[295, 108, 393, 121]",MISC
653,",","[295, 108, 393, 121]",MISC
654,Access,"[394, 108, 508, 121]",MISC
655,",","[394, 108, 508, 121]",MISC
656,Power,"[510, 108, 690, 121]",MISC
657,##P,"[510, 108, 690, 121]",MISC
658,##oint,"[510, 108, 690, 121]",MISC
659,",","[510, 108, 690, 121]",MISC
660,Main,"[691, 108, 856, 121]",MISC
661,##frame,"[691, 108, 856, 121]",MISC
662,",","[691, 108, 856, 121]",MISC
663,J,"[857, 108, 905, 121]",MISC
664,##CL,"[857, 108, 905, 121]",MISC
665,-,"[906, 108, 908, 121]",MISC
666,NL,"[906, 108, 908, 121]",MISC
667,-,"[906, 108, 908, 121]",MISC
668,Too,"[113, 129, 199, 142]",MISC
669,##ls,"[113, 129, 199, 142]",MISC
670,:,"[200, 129, 216, 142]",MISC
671,Audi,"[218, 129, 303, 142]",MISC
672,##t,"[218, 129, 303, 142]",MISC
673,Information,"[304, 129, 494, 142]",MISC
674,System,"[495, 129, 599, 142]",MISC
675,(,"[599, 129, 703, 142]",MISC
676,AI,"[599, 129, 703, 142]",MISC
677,##S,"[599, 129, 703, 142]",MISC
678,),"[599, 129, 703, 142]",MISC
679,",","[599, 129, 703, 142]",MISC
680,Beta,"[703, 129, 771, 142]",MISC
681,92,"[773, 129, 824, 142]",MISC
682,",","[773, 129, 824, 142]",MISC
683,J,"[825, 129, 893, 142]",MISC
684,##SS,"[825, 129, 893, 142]",MISC
685,",","[825, 129, 893, 142]",MISC
686,-,"[894, 129, 896, 142]",MISC
687,NL,"[894, 129, 896, 142]",MISC
688,-,"[894, 129, 896, 142]",MISC
689,Management,"[450, 144, 590, 161]",MISC
690,System,"[591, 144, 675, 161]",MISC
691,(,"[676, 144, 760, 161]",MISC
692,Q,"[676, 144, 760, 161]",MISC
693,##MS,"[676, 144, 760, 161]",MISC
694,),"[676, 144, 760, 161]",MISC
695,",","[676, 144, 760, 161]",MISC
696,X,"[760, 144, 858, 161]",MISC
697,##ler,"[760, 144, 858, 161]",MISC
698,##ate,"[760, 144, 858, 161]",MISC
699,1,"[859, 144, 914, 161]",MISC
700,.,"[859, 144, 914, 161]",MISC
701,1,"[859, 144, 914, 161]",MISC
702,",","[859, 144, 914, 161]",MISC
703,Panel,"[915, 144, 999, 161]",MISC
704,",","[915, 144, 999, 161]",MISC
705,-,"[1000, 144, 1001, 161]",MISC
706,NL,"[1000, 144, 1001, 161]",MISC
707,-,"[1000, 144, 1001, 161]",MISC
708,E,"[386, 163, 540, 180]",MISC
709,##SP,"[386, 163, 540, 180]",MISC
710,##Works,"[386, 163, 540, 180]",MISC
711,##tation,"[386, 163, 540, 180]",MISC
712,-,"[540, 163, 542, 180]",MISC
713,NL,"[540, 163, 542, 180]",MISC
714,-,"[540, 163, 542, 180]",MISC
715,Database,"[118, 185, 291, 200]",MISC
716,:,"[292, 185, 314, 200]",MISC
717,Oracle,"[314, 185, 444, 200]",MISC
718,Express,"[445, 185, 597, 200]",MISC
719,-,"[597, 185, 599, 200]",MISC
720,NL,"[597, 185, 599, 200]",MISC
721,-,"[597, 185, 599, 200]",MISC
722,Project,"[64, 246, 164, 266]",MISC
723,Hand,"[166, 246, 282, 266]",MISC
724,##led,"[166, 246, 282, 266]",MISC
725,:,"[166, 246, 282, 266]",MISC
726,-,"[282, 246, 284, 266]",MISC
727,NL,"[282, 246, 284, 266]",MISC
728,-,"[282, 246, 284, 266]",MISC
729,P,"[83, 288, 180, 302]",B-project_title
730,##ep,"[83, 288, 180, 302]",I-project_title
731,##si,"[83, 288, 180, 302]",I-project_title
732,##C,"[83, 288, 180, 302]",I-project_title
733,##o,"[83, 288, 180, 302]",I-project_title
734,(,"[180, 288, 262, 302]",I-project_title
735,I,"[180, 288, 262, 302]",I-project_title
736,##RI,"[180, 288, 262, 302]",I-project_title
737,),"[180, 288, 262, 302]",I-project_title
738,:,"[180, 288, 262, 302]",MISC
739,-,"[262, 288, 264, 302]",MISC
740,NL,"[262, 288, 264, 302]",MISC
741,-,"[262, 288, 264, 302]",MISC
742,Des,"[78, 306, 225, 324]",MISC
743,##cription,"[78, 306, 225, 324]",MISC
744,:,"[78, 306, 225, 324]",MISC
745,-,"[225, 306, 227, 324]",MISC
746,NL,"[225, 306, 227, 324]",MISC
747,-,"[225, 306, 227, 324]",MISC
748,The,"[64, 337, 101, 355]",MISC
749,P,"[103, 337, 194, 355]",MISC
750,##ep,"[103, 337, 194, 355]",MISC
751,##si,"[103, 337, 194, 355]",MISC
752,##C,"[103, 337, 194, 355]",MISC
753,##o,"[103, 337, 194, 355]",MISC
754,is,"[194, 337, 220, 355]",MISC
755,a,"[221, 337, 233, 355]",MISC
756,CP,"[234, 337, 271, 355]",MISC
757,##G,"[234, 337, 271, 355]",MISC
758,industry,"[273, 337, 377, 355]",MISC
759,which,"[377, 337, 442, 355]",MISC
760,is,"[443, 337, 468, 355]",MISC
761,providing,"[469, 337, 585, 355]",MISC
762,business,"[586, 337, 690, 355]",MISC
763,insights,"[691, 337, 794, 355]",MISC
764,to,"[795, 337, 820, 355]",MISC
765,P,"[821, 337, 886, 355]",MISC
766,##ep,"[821, 337, 886, 355]",MISC
767,##si,"[821, 337, 886, 355]",MISC
768,Home,"[886, 337, 938, 355]",MISC
769,-,"[939, 337, 940, 355]",MISC
770,NL,"[939, 337, 940, 355]",MISC
771,-,"[939, 337, 940, 355]",MISC
772,Team,"[64, 355, 116, 373]",MISC
773,on,"[116, 355, 141, 373]",MISC
774,Consumer,"[142, 355, 246, 373]",MISC
775,portfolio,"[246, 355, 362, 373]",MISC
776,mix,"[362, 355, 400, 373]",MISC
777,decisions,"[401, 355, 518, 373]",MISC
778,and,"[518, 355, 556, 373]",MISC
779,recommend,"[557, 355, 713, 373]",MISC
780,##ing,"[557, 355, 713, 373]",MISC
781,in,"[713, 355, 816, 373]",MISC
782,-,"[713, 355, 816, 373]",MISC
783,depth,"[713, 355, 816, 373]",MISC
784,strategies,"[817, 355, 945, 373]",MISC
785,for,"[946, 355, 984, 373]",MISC
786,-,"[985, 355, 987, 373]",MISC
787,NL,"[985, 355, 987, 373]",MISC
788,-,"[985, 355, 987, 373]",MISC
789,their,"[64, 373, 127, 391]",MISC
790,business,"[128, 373, 230, 391]",MISC
791,processes,"[230, 373, 357, 391]",MISC
792,.,"[230, 373, 357, 391]",MISC
793,P,"[358, 373, 445, 391]",MISC
794,##ep,"[358, 373, 445, 391]",MISC
795,##si,"[358, 373, 445, 391]",MISC
796,##C,"[358, 373, 445, 391]",MISC
797,##o,"[358, 373, 445, 391]",MISC
798,provide,"[447, 373, 535, 391]",MISC
799,service,"[536, 373, 624, 391]",MISC
800,to,"[626, 373, 651, 391]",MISC
801,the,"[651, 373, 689, 391]",MISC
802,most,"[690, 373, 740, 391]",MISC
803,top,"[741, 373, 778, 391]",MISC
804,most,"[779, 373, 829, 391]",MISC
805,C,"[830, 373, 918, 391]",MISC
806,##lient,"[830, 373, 918, 391]",MISC
807,##s,"[830, 373, 918, 391]",MISC
808,in,"[919, 373, 944, 391]",MISC
809,USA,"[945, 373, 995, 391]",MISC
810,.,"[945, 373, 995, 391]",MISC
811,-,"[996, 373, 998, 391]",MISC
812,NL,"[996, 373, 998, 391]",MISC
813,-,"[996, 373, 998, 391]",MISC
814,J,"[64, 409, 110, 426]",MISC
815,##O,"[64, 409, 110, 426]",MISC
816,##B,"[64, 409, 110, 426]",MISC
817,R,"[112, 409, 350, 426]",MISC
818,##ES,"[112, 409, 350, 426]",MISC
819,##PO,"[112, 409, 350, 426]",MISC
820,##NS,"[112, 409, 350, 426]",MISC
821,##IB,"[112, 409, 350, 426]",MISC
822,##IL,"[112, 409, 350, 426]",MISC
823,##IT,"[112, 409, 350, 426]",MISC
824,##ES,"[112, 409, 350, 426]",MISC
825,-,"[350, 409, 352, 426]",MISC
826,NL,"[350, 409, 352, 426]",MISC
827,-,"[350, 409, 352, 426]",MISC
828,Direct,"[109, 453, 186, 467]",MISC
829,interaction,"[186, 453, 328, 467]",MISC
830,with,"[328, 453, 378, 467]",MISC
831,end,"[379, 453, 417, 467]",MISC
832,clients,"[418, 453, 508, 467]",MISC
833,to,"[508, 453, 533, 467]",MISC
834,help,"[534, 453, 584, 467]",MISC
835,them,"[586, 453, 636, 467]",MISC
836,identify,"[637, 453, 739, 467]",MISC
837,their,"[740, 453, 805, 467]",MISC
838,Business,"[805, 453, 906, 467]",MISC
839,Sc,"[908, 453, 997, 467]",MISC
840,##oping,"[908, 453, 997, 467]",MISC
841,-,"[998, 453, 1000, 467]",MISC
842,NL,"[998, 453, 1000, 467]",MISC
843,-,"[998, 453, 1000, 467]",MISC
844,and,"[128, 467, 164, 485]",MISC
845,Sc,"[165, 467, 299, 485]",MISC
846,##hed,"[165, 467, 299, 485]",MISC
847,##ulin,"[165, 467, 299, 485]",MISC
848,##g,"[165, 467, 299, 485]",MISC
849,.,"[165, 467, 299, 485]",MISC
850,-,"[300, 467, 302, 485]",MISC
851,NL,"[300, 467, 302, 485]",MISC
852,-,"[300, 467, 302, 485]",MISC
853,Work,"[109, 489, 186, 503]",MISC
854,##ed,"[109, 489, 186, 503]",MISC
855,on,"[188, 489, 213, 503]",MISC
856,Shop,"[214, 489, 305, 503]",MISC
857,##per,"[214, 489, 305, 503]",MISC
858,In,"[305, 489, 421, 503]",MISC
859,##sight,"[305, 489, 421, 503]",MISC
860,##s,"[305, 489, 421, 503]",MISC
861,",","[305, 489, 421, 503]",MISC
862,which,"[423, 489, 487, 503]",MISC
863,involves,"[488, 489, 592, 503]",MISC
864,Consumer,"[593, 489, 696, 503]",MISC
865,Buy,"[697, 489, 774, 503]",MISC
866,##ing,"[697, 489, 774, 503]",MISC
867,behavior,"[776, 489, 892, 503]",MISC
868,",","[776, 489, 892, 503]",MISC
869,Re,"[893, 489, 997, 503]",MISC
870,##tail,"[893, 489, 997, 503]",MISC
871,##er,"[893, 489, 997, 503]",MISC
872,-,"[998, 489, 1000, 503]",MISC
873,NL,"[998, 489, 1000, 503]",MISC
874,-,"[998, 489, 1000, 503]",MISC
875,strategy,"[128, 503, 225, 520]",MISC
876,and,"[226, 503, 262, 520]",MISC
877,She,"[263, 503, 324, 520]",MISC
878,##lf,"[263, 503, 324, 520]",MISC
879,space,"[324, 503, 385, 520]",MISC
880,analysis,"[385, 503, 494, 520]",MISC
881,.,"[385, 503, 494, 520]",MISC
882,-,"[495, 503, 497, 520]",MISC
883,NL,"[495, 503, 497, 520]",MISC
884,-,"[495, 503, 497, 520]",MISC
885,Main,"[110, 524, 223, 538]",MISC
886,##tain,"[110, 524, 223, 538]",MISC
887,Work,"[223, 524, 336, 538]",MISC
888,##load,"[223, 524, 336, 538]",MISC
889,Project,"[336, 524, 475, 538]",MISC
890,##ion,"[336, 524, 475, 538]",MISC
891,Track,"[476, 524, 589, 538]",MISC
892,##er,"[476, 524, 589, 538]",MISC
893,",","[476, 524, 589, 538]",MISC
894,which,"[589, 524, 659, 538]",MISC
895,leads,"[660, 524, 729, 538]",MISC
896,to,"[730, 524, 757, 538]",MISC
897,resource,"[758, 524, 871, 538]",MISC
898,bandwidth,"[871, 524, 996, 538]",MISC
899,-,"[998, 524, 1000, 538]",MISC
900,NL,"[998, 524, 1000, 538]",MISC
901,-,"[998, 524, 1000, 538]",MISC
902,optimization,"[128, 538, 268, 556]",MISC
903,.,"[128, 538, 268, 556]",MISC
904,-,"[268, 538, 270, 556]",MISC
905,NL,"[268, 538, 270, 556]",MISC
906,-,"[268, 538, 270, 556]",MISC
907,F,"[109, 560, 267, 574]",MISC
908,##ac,"[109, 560, 267, 574]",MISC
909,##ilitating,"[109, 560, 267, 574]",MISC
910,sharing,"[268, 560, 360, 574]",MISC
911,of,"[361, 560, 386, 574]",MISC
912,best,"[388, 560, 440, 574]",MISC
913,practices,"[441, 560, 559, 574]",MISC
914,for,"[560, 560, 600, 574]",MISC
915,key,"[600, 560, 639, 574]",MISC
916,completed,"[640, 560, 758, 574]",MISC
917,projects,"[759, 560, 877, 574]",MISC
918,",","[759, 560, 877, 574]",MISC
919,direct,"[878, 560, 957, 574]",MISC
920,end,"[958, 560, 997, 574]",MISC
921,-,"[998, 560, 1000, 574]",MISC
922,NL,"[998, 560, 1000, 574]",MISC
923,-,"[998, 560, 1000, 574]",MISC
924,client,"[128, 574, 209, 592]",MISC
925,communication,"[209, 574, 397, 592]",MISC
926,",","[209, 574, 397, 592]",MISC
927,organization,"[397, 574, 558, 592]",MISC
928,announcement,"[558, 574, 719, 592]",MISC
929,with,"[719, 574, 773, 592]",MISC
930,GO,"[773, 574, 812, 592]",MISC
931,##C,"[773, 574, 812, 592]",MISC
932,and,"[813, 574, 853, 592]",MISC
933,Home,"[854, 574, 907, 592]",MISC
934,Team,"[907, 574, 973, 592]",MISC
935,.,"[907, 574, 973, 592]",MISC
936,-,"[974, 574, 976, 592]",MISC
937,NL,"[974, 574, 976, 592]",MISC
938,-,"[974, 574, 976, 592]",MISC
939,Men,"[109, 595, 265, 609]",MISC
940,##tor,"[109, 595, 265, 609]",MISC
941,/,"[109, 595, 265, 609]",MISC
942,coach,"[109, 595, 265, 609]",MISC
943,for,"[267, 595, 304, 609]",MISC
944,the,"[306, 595, 343, 609]",MISC
945,entry,"[345, 595, 488, 609]",MISC
946,-,"[345, 595, 488, 609]",MISC
947,level,"[345, 595, 488, 609]",MISC
948,professionals,"[489, 595, 659, 609]",MISC
949,and,"[660, 595, 697, 609]",MISC
950,other,"[699, 595, 764, 609]",MISC
951,members,"[765, 595, 856, 609]",MISC
952,of,"[856, 595, 882, 609]",MISC
953,the,"[883, 595, 920, 609]",MISC
954,team,"[922, 595, 974, 609]",MISC
955,-,"[974, 595, 976, 609]",MISC
956,NL,"[974, 595, 976, 609]",MISC
957,-,"[974, 595, 976, 609]",MISC
958,Per,"[109, 613, 203, 627]",MISC
959,##form,"[109, 613, 203, 627]",MISC
960,the,"[203, 613, 243, 627]",MISC
961,new,"[243, 613, 283, 627]",MISC
962,join,"[284, 613, 362, 627]",MISC
963,##er,"[284, 613, 362, 627]",MISC
964,induction,"[364, 613, 484, 627]",MISC
965,training,"[484, 613, 590, 627]",MISC
966,and,"[591, 613, 631, 627]",MISC
967,buddy,"[632, 613, 698, 627]",MISC
968,program,"[699, 613, 792, 627]",MISC
969,for,"[792, 613, 832, 627]",MISC
970,P,"[832, 613, 899, 627]",MISC
971,##ep,"[832, 613, 899, 627]",MISC
972,##si,"[832, 613, 899, 627]",MISC
973,GO,"[899, 613, 951, 627]",MISC
974,##C,"[899, 613, 951, 627]",MISC
975,.,"[899, 613, 951, 627]",MISC
976,-,"[953, 613, 955, 627]",MISC
977,NL,"[953, 613, 955, 627]",MISC
978,-,"[953, 613, 955, 627]",MISC
979,Study,"[110, 631, 178, 645]",MISC
980,on,"[178, 631, 205, 645]",MISC
981,Consumer,"[205, 631, 315, 645]",MISC
982,Be,"[315, 631, 436, 645]",MISC
983,##ha,"[315, 631, 436, 645]",MISC
984,##vior,"[315, 631, 436, 645]",MISC
985,",","[315, 631, 436, 645]",MISC
986,Source,"[438, 631, 518, 645]",MISC
987,of,"[520, 631, 546, 645]",MISC
988,Volume,"[547, 631, 627, 645]",MISC
989,analysis,"[629, 631, 751, 645]",MISC
990,",","[629, 631, 751, 645]",MISC
991,De,"[752, 631, 929, 645]",MISC
992,##mo,"[752, 631, 929, 645]",MISC
993,##graphic,"[752, 631, 929, 645]",MISC
994,##s,"[752, 631, 929, 645]",MISC
995,",","[752, 631, 929, 645]",MISC
996,Buy,"[929, 631, 997, 645]",MISC
997,##er,"[929, 631, 997, 645]",MISC
998,-,"[998, 631, 1000, 645]",MISC
999,NL,"[998, 631, 1000, 645]",MISC
1000,-,"[998, 631, 1000, 645]",MISC
1001,Flow,"[128, 645, 194, 663]",MISC
1002,",","[128, 645, 194, 663]",MISC
1003,Buy,"[195, 645, 261, 663]",MISC
1004,##er,"[195, 645, 261, 663]",MISC
1005,P,"[262, 645, 368, 663]",MISC
1006,##ur,"[262, 645, 368, 663]",MISC
1007,##chase,"[262, 645, 368, 663]",MISC
1008,trends,"[369, 645, 448, 663]",MISC
1009,with,"[449, 645, 501, 663]",MISC
1010,a,"[503, 645, 515, 663]",MISC
1011,view,"[516, 645, 568, 663]",MISC
1012,of,"[570, 645, 595, 663]",MISC
1013,identifying,"[596, 645, 743, 663]",MISC
1014,the,"[744, 645, 783, 663]",MISC
1015,impact,"[784, 645, 862, 663]",MISC
1016,of,"[864, 645, 889, 663]",MISC
1017,patterns,"[891, 645, 996, 663]",MISC
1018,-,"[998, 645, 1000, 663]",MISC
1019,NL,"[998, 645, 1000, 663]",MISC
1020,-,"[998, 645, 1000, 663]",MISC
1021,and,"[128, 663, 218, 681]",MISC
1022,/,"[128, 663, 218, 681]",MISC
1023,or,"[128, 663, 218, 681]",MISC
1024,trends,"[218, 663, 308, 681]",MISC
1025,in,"[308, 663, 337, 681]",MISC
1026,order,"[338, 663, 412, 681]",MISC
1027,to,"[413, 663, 442, 681]",MISC
1028,improve,"[443, 663, 547, 681]",MISC
1029,execution,"[548, 663, 682, 681]",MISC
1030,of,"[683, 663, 712, 681]",MISC
1031,new,"[713, 663, 758, 681]",MISC
1032,product,"[758, 663, 862, 681]",MISC
1033,launches,"[863, 663, 997, 681]",MISC
1034,",","[863, 663, 997, 681]",MISC
1035,-,"[998, 663, 1000, 681]",MISC
1036,NL,"[998, 663, 1000, 681]",MISC
1037,-,"[998, 663, 1000, 681]",MISC
1038,Promotion,"[128, 681, 264, 698]",MISC
1039,##s,"[128, 681, 264, 698]",MISC
1040,",","[128, 681, 264, 698]",MISC
1041,Distribution,"[266, 681, 414, 698]",MISC
1042,drivers,"[416, 681, 501, 698]",MISC
1043,as,"[503, 681, 526, 698]",MISC
1044,well,"[528, 681, 576, 698]",MISC
1045,as,"[578, 681, 601, 698]",MISC
1046,Category,"[603, 681, 701, 698]",MISC
1047,Management,"[703, 681, 839, 698]",MISC
1048,.,"[703, 681, 839, 698]",MISC
1049,-,"[840, 681, 842, 698]",MISC
1050,NL,"[840, 681, 842, 698]",MISC
1051,-,"[840, 681, 842, 698]",MISC
1052,I,"[110, 702, 262, 716]",MISC
1053,##dent,"[110, 702, 262, 716]",MISC
1054,##ifying,"[110, 702, 262, 716]",MISC
1055,research,"[263, 702, 373, 716]",MISC
1056,problems,"[374, 702, 497, 716]",MISC
1057,",","[374, 702, 497, 716]",MISC
1058,designing,"[498, 702, 622, 716]",MISC
1059,the,"[623, 702, 664, 716]",MISC
1060,methodology,"[665, 702, 817, 716]",MISC
1061,of,"[817, 702, 844, 716]",MISC
1062,approach,"[845, 702, 956, 716]",MISC
1063,and,"[956, 702, 997, 716]",MISC
1064,-,"[998, 702, 1000, 716]",MISC
1065,NL,"[998, 702, 1000, 716]",MISC
1066,-,"[998, 702, 1000, 716]",MISC
1067,collecting,"[128, 716, 246, 734]",MISC
1068,the,"[248, 716, 284, 734]",MISC
1069,required,"[284, 716, 379, 734]",MISC
1070,data,"[380, 716, 426, 734]",MISC
1071,from,"[428, 716, 474, 734]",MISC
1072,all,"[476, 716, 511, 734]",MISC
1073,available,"[512, 716, 619, 734]",MISC
1074,sources,"[619, 716, 702, 734]",MISC
1075,for,"[703, 716, 739, 734]",MISC
1076,the,"[739, 716, 775, 734]",MISC
1077,possible,"[775, 716, 870, 734]",MISC
1078,solutions,"[871, 716, 989, 734]",MISC
1079,.,"[871, 716, 989, 734]",MISC
1080,-,"[991, 716, 992, 734]",MISC
1081,NL,"[991, 716, 992, 734]",MISC
1082,-,"[991, 716, 992, 734]",MISC
1083,Ex,"[109, 738, 225, 752]",MISC
1084,##pert,"[109, 738, 225, 752]",MISC
1085,##ise,"[109, 738, 225, 752]",MISC
1086,on,"[226, 738, 251, 752]",MISC
1087,custom,"[252, 738, 380, 752]",MISC
1088,##ized,"[252, 738, 380, 752]",MISC
1089,tools,"[381, 738, 446, 752]",MISC
1090,for,"[446, 738, 484, 752]",MISC
1091,I,"[485, 738, 523, 752]",MISC
1092,##RI,"[485, 738, 523, 752]",MISC
1093,both,"[524, 738, 574, 752]",MISC
1094,in,"[576, 738, 601, 752]",MISC
1095,Store,"[602, 738, 666, 752]",MISC
1096,(,"[666, 738, 731, 752]",MISC
1097,P,"[666, 738, 731, 752]",MISC
1098,##OS,"[666, 738, 731, 752]",MISC
1099,),"[666, 738, 731, 752]",MISC
1100,and,"[731, 738, 769, 752]",MISC
1101,Panel,"[770, 738, 835, 752]",MISC
1102,(,"[835, 738, 989, 752]",MISC
1103,Household,"[835, 738, 989, 752]",MISC
1104,),"[835, 738, 989, 752]",MISC
1105,.,"[835, 738, 989, 752]",MISC
1106,-,"[991, 738, 992, 752]",MISC
1107,NL,"[991, 738, 992, 752]",MISC
1108,-,"[991, 738, 992, 752]",MISC
1109,Ex,"[111, 756, 211, 770]",MISC
1110,##ec,"[111, 756, 211, 770]",MISC
1111,##ute,"[111, 756, 211, 770]",MISC
1112,high,"[212, 756, 270, 770]",MISC
1113,quality,"[271, 756, 371, 770]",MISC
1114,weekly,"[372, 756, 458, 770]",MISC
1115,and,"[460, 756, 503, 770]",MISC
1116,monthly,"[503, 756, 603, 770]",MISC
1117,reports,"[605, 756, 705, 770]",MISC
1118,highlighting,"[707, 756, 880, 770]",MISC
1119,pricing,"[881, 756, 998, 770]",MISC
1120,",","[881, 756, 998, 770]",MISC
1121,-,"[998, 756, 1000, 770]",MISC
1122,NL,"[998, 756, 1000, 770]",MISC
1123,-,"[998, 756, 1000, 770]",MISC
1124,promotional,"[128, 770, 271, 787]",MISC
1125,",","[128, 770, 271, 787]",MISC
1126,and,"[272, 770, 308, 787]",MISC
1127,competitor,"[308, 770, 428, 787]",MISC
1128,analysis,"[428, 770, 536, 787]",MISC
1129,.,"[428, 770, 536, 787]",MISC
1130,-,"[536, 770, 538, 787]",MISC
1131,NL,"[536, 770, 538, 787]",MISC
1132,-,"[536, 770, 538, 787]",MISC
1133,Work,"[110, 791, 168, 805]",MISC
1134,very,"[168, 791, 225, 805]",MISC
1135,closely,"[225, 791, 325, 805]",MISC
1136,with,"[325, 791, 382, 805]",MISC
1137,counterparts,"[382, 791, 554, 805]",MISC
1138,in,"[554, 791, 583, 805]",MISC
1139,home,"[583, 791, 711, 805]",MISC
1140,-,"[583, 791, 711, 805]",MISC
1141,team,"[583, 791, 711, 805]",MISC
1142,(,"[711, 791, 783, 805]",MISC
1143,I,"[711, 791, 783, 805]",MISC
1144,##RI,"[711, 791, 783, 805]",MISC
1145,),"[711, 791, 783, 805]",MISC
1146,to,"[783, 791, 812, 805]",MISC
1147,understand,"[812, 791, 955, 805]",MISC
1148,the,"[955, 791, 998, 805]",MISC
1149,-,"[998, 791, 1000, 805]",MISC
1150,NL,"[998, 791, 1000, 805]",MISC
1151,-,"[998, 791, 1000, 805]",MISC
1152,business,"[128, 805, 243, 823]",MISC
1153,needs,"[244, 805, 316, 823]",MISC
1154,(,"[317, 805, 445, 823]",MISC
1155,consumer,"[317, 805, 445, 823]",MISC
1156,behaviors,"[447, 805, 592, 823]",MISC
1157,",","[447, 805, 592, 823]",MISC
1158,demographic,"[592, 805, 780, 823]",MISC
1159,##s,"[592, 805, 780, 823]",MISC
1160,",","[592, 805, 780, 823]",MISC
1161,new,"[780, 805, 823, 823]",MISC
1162,products,"[824, 805, 953, 823]",MISC
1163,",","[824, 805, 953, 823]",MISC
1164,and,"[954, 805, 997, 823]",MISC
1165,-,"[998, 805, 1000, 823]",MISC
1166,NL,"[998, 805, 1000, 823]",MISC
1167,-,"[998, 805, 1000, 823]",MISC
1168,competition,"[128, 823, 261, 841]",MISC
1169,etc,"[261, 823, 309, 841]",MISC
1170,),"[261, 823, 309, 841]",MISC
1171,and,"[309, 823, 345, 841]",MISC
1172,produce,"[346, 823, 430, 841]",MISC
1173,strategic,"[430, 823, 538, 841]",MISC
1174,and,"[539, 823, 575, 841]",MISC
1175,tactical,"[575, 823, 672, 841]",MISC
1176,top,"[672, 823, 768, 841]",MISC
1177,-,"[672, 823, 768, 841]",MISC
1178,line,"[672, 823, 768, 841]",MISC
1179,(,"[768, 823, 901, 841]",MISC
1180,concurrent,"[768, 823, 901, 841]",MISC
1181,reports,"[901, 823, 998, 841]",MISC
1182,),"[901, 823, 998, 841]",MISC
1183,-,"[998, 823, 1000, 841]",MISC
1184,NL,"[998, 823, 1000, 841]",MISC
1185,-,"[998, 823, 1000, 841]",MISC
1186,requests,"[128, 841, 228, 858]",MISC
1187,.,"[128, 841, 228, 858]",MISC
1188,-,"[228, 841, 230, 858]",MISC
1189,NL,"[228, 841, 230, 858]",MISC
1190,-,"[228, 841, 230, 858]",MISC
1191,Use,"[109, 862, 147, 876]",MISC
1192,strong,"[148, 862, 225, 876]",MISC
1193,analytical,"[227, 862, 357, 876]",MISC
1194,skills,"[357, 862, 434, 876]",MISC
1195,to,"[436, 862, 461, 876]",MISC
1196,deliver,"[462, 862, 553, 876]",MISC
1197,insights,"[553, 862, 657, 876]",MISC
1198,using,"[658, 862, 722, 876]",MISC
1199,ad,"[723, 862, 748, 876]",MISC
1200,ho,"[749, 862, 787, 876]",MISC
1201,##c,"[749, 862, 787, 876]",MISC
1202,reports,"[789, 862, 880, 876]",MISC
1203,(,"[880, 862, 996, 876]",MISC
1204,Business,"[880, 862, 996, 876]",MISC
1205,-,"[998, 862, 1000, 876]",MISC
1206,NL,"[998, 862, 1000, 876]",MISC
1207,-,"[998, 862, 1000, 876]",MISC
1208,Intelligence,"[128, 876, 293, 894]",MISC
1209,Reports,"[294, 876, 403, 894]",MISC
1210,),"[294, 876, 403, 894]",MISC
1211,and,"[404, 876, 445, 894]",MISC
1212,presentation,"[446, 876, 610, 894]",MISC
1213,to,"[611, 876, 638, 894]",MISC
1214,support,"[639, 876, 736, 894]",MISC
1215,the,"[736, 876, 777, 894]",MISC
1216,home,"[777, 876, 831, 894]",MISC
1217,team,"[832, 876, 886, 894]",MISC
1218,to,"[887, 876, 914, 894]",MISC
1219,enable,"[915, 876, 997, 894]",MISC
1220,-,"[998, 876, 1000, 894]",MISC
1221,NL,"[998, 876, 1000, 894]",MISC
1222,-,"[998, 876, 1000, 894]",MISC
1223,them,"[128, 894, 178, 912]",MISC
1224,to,"[179, 894, 204, 912]",MISC
1225,respond,"[204, 894, 292, 912]",MISC
1226,to,"[293, 894, 318, 912]",MISC
1227,client,"[319, 894, 406, 912]",MISC
1228,.,"[319, 894, 406, 912]",MISC
1229,-,"[407, 894, 409, 912]",MISC
1230,NL,"[407, 894, 409, 912]",MISC
1231,-,"[407, 894, 409, 912]",MISC
1232,Re,"[109, 916, 252, 930]",MISC
1233,##sponsible,"[109, 916, 252, 930]",MISC
1234,for,"[252, 916, 290, 930]",MISC
1235,database,"[291, 916, 395, 930]",MISC
1236,updates,"[396, 916, 499, 930]",MISC
1237,",","[396, 916, 499, 930]",MISC
1238,rest,"[500, 916, 668, 930]",MISC
1239,##ate,"[500, 916, 668, 930]",MISC
1240,##ments,"[500, 916, 668, 930]",MISC
1241,",","[500, 916, 668, 930]",MISC
1242,CD,"[669, 916, 706, 930]",MISC
1243,##M,"[669, 916, 706, 930]",MISC
1244,&,"[708, 916, 720, 930]",MISC
1245,T,"[721, 916, 759, 930]",MISC
1246,##MC,"[721, 916, 759, 930]",MISC
1247,relationships,"[760, 916, 941, 930]",MISC
1248,.,"[760, 916, 941, 930]",MISC
1249,-,"[942, 916, 944, 930]",MISC
1250,NL,"[942, 916, 944, 930]",MISC
1251,-,"[942, 916, 944, 930]",MISC
1252,Dev,"[109, 933, 194, 947]",MISC
1253,##elo,"[109, 933, 194, 947]",MISC
1254,##p,"[109, 933, 194, 947]",MISC
1255,pro,"[195, 933, 331, 947]",MISC
1256,##ficiency,"[195, 933, 331, 947]",MISC
1257,in,"[332, 933, 355, 947]",MISC
1258,in,"[357, 933, 455, 947]",MISC
1259,-,"[357, 933, 455, 947]",MISC
1260,house,"[357, 933, 455, 947]",MISC
1261,tools,"[456, 933, 530, 947]",MISC
1262,.,"[456, 933, 530, 947]",MISC
1263,-,"[531, 933, 533, 947]",MISC
1264,NL,"[531, 933, 533, 947]",MISC
1265,-,"[531, 933, 533, 947]",MISC
1266,Project,"[64, 980, 164, 1000]",MISC
1267,Hand,"[166, 980, 282, 1000]",MISC
1268,##led,"[166, 980, 282, 1000]",MISC
1269,:,"[166, 980, 282, 1000]",MISC
1270,-,"[282, 980, 284, 1000]",MISC
1271,NL,"[282, 980, 284, 1000]",MISC
1272,-,"[282, 980, 284, 1000]",MISC
1273,International,"[110, 63, 289, 81]",B-project_title
1274,Production,"[289, 63, 427, 81]",I-project_title
1275,:,"[428, 63, 440, 81]",MISC
1276,-,"[441, 63, 443, 81]",MISC
1277,NL,"[441, 63, 443, 81]",MISC
1278,-,"[441, 63, 443, 81]",MISC
1279,Des,"[64, 96, 211, 114]",MISC
1280,##cription,"[64, 96, 211, 114]",MISC
1281,:,"[64, 96, 211, 114]",MISC
1282,-,"[211, 96, 212, 114]",MISC
1283,NL,"[211, 96, 212, 114]",MISC
1284,-,"[211, 96, 212, 114]",MISC
1285,The,"[64, 132, 103, 149]",MISC
1286,International,"[103, 132, 273, 149]",B-project_title
1287,Production,"[274, 132, 405, 149]",I-project_title
1288,(,"[406, 132, 458, 149]",MISC
1289,IP,"[406, 132, 458, 149]",MISC
1290,),"[406, 132, 458, 149]",MISC
1291,is,"[458, 132, 484, 149]",MISC
1292,a,"[485, 132, 497, 149]",MISC
1293,pharmaceutical,"[498, 132, 680, 149]",MISC
1294,project,"[682, 132, 773, 149]",MISC
1295,which,"[774, 132, 839, 149]",MISC
1296,is,"[840, 132, 865, 149]",MISC
1297,supporting,"[866, 132, 997, 149]",MISC
1298,-,"[998, 132, 1000, 149]",MISC
1299,NL,"[998, 132, 1000, 149]",MISC
1300,-,"[998, 132, 1000, 149]",MISC
1301,around,"[64, 149, 143, 167]",MISC
1302,100,"[143, 149, 182, 167]",MISC
1303,countries,"[182, 149, 300, 167]",MISC
1304,all,"[301, 149, 340, 167]",MISC
1305,over,"[340, 149, 392, 167]",MISC
1306,the,"[393, 149, 432, 167]",MISC
1307,world,"[432, 149, 511, 167]",MISC
1308,.,"[432, 149, 511, 167]",MISC
1309,It,"[511, 149, 536, 167]",MISC
1310,is,"[537, 149, 562, 167]",MISC
1311,a,"[564, 149, 576, 167]",MISC
1312,24,"[577, 149, 629, 167]",MISC
1313,##X,"[577, 149, 629, 167]",MISC
1314,##7,"[577, 149, 629, 167]",MISC
1315,production,"[629, 149, 760, 167]",MISC
1316,Environment,"[761, 149, 904, 167]",MISC
1317,based,"[906, 149, 970, 167]",MISC
1318,on,"[971, 149, 996, 167]",MISC
1319,-,"[998, 149, 1000, 167]",MISC
1320,NL,"[998, 149, 1000, 167]",MISC
1321,-,"[998, 149, 1000, 167]",MISC
1322,On,"[64, 167, 150, 185]",MISC
1323,##site,"[64, 167, 150, 185]",MISC
1324,–,"[150, 167, 164, 185]",MISC
1325,Off,"[164, 167, 279, 185]",MISC
1326,##shore,"[164, 167, 279, 185]",MISC
1327,methodology,"[279, 167, 437, 185]",MISC
1328,and,"[437, 167, 480, 185]",MISC
1329,maintenance,"[481, 167, 638, 185]",MISC
1330,of,"[639, 167, 667, 185]",MISC
1331,application,"[667, 167, 825, 185]",MISC
1332,running,"[825, 167, 925, 185]",MISC
1333,on,"[926, 167, 955, 185]",MISC
1334,I,"[955, 167, 998, 185]",MISC
1335,##MS,"[955, 167, 998, 185]",MISC
1336,-,"[998, 167, 1000, 185]",MISC
1337,NL,"[998, 167, 1000, 185]",MISC
1338,-,"[998, 167, 1000, 185]",MISC
1339,Main,"[64, 185, 207, 203]",MISC
1340,##frame,"[64, 185, 207, 203]",MISC
1341,.,"[64, 185, 207, 203]",MISC
1342,The,"[208, 185, 250, 203]",MISC
1343,main,"[251, 185, 308, 203]",MISC
1344,objective,"[308, 185, 437, 203]",MISC
1345,of,"[437, 185, 466, 203]",MISC
1346,the,"[466, 185, 509, 203]",MISC
1347,project,"[509, 185, 609, 203]",MISC
1348,is,"[610, 185, 638, 203]",MISC
1349,to,"[639, 185, 667, 203]",MISC
1350,provide,"[667, 185, 767, 203]",MISC
1351,maintenance,"[768, 185, 925, 203]",MISC
1352,to,"[926, 185, 955, 203]",MISC
1353,I,"[955, 185, 998, 203]",MISC
1354,##MS,"[955, 185, 998, 203]",MISC
1355,-,"[998, 185, 1000, 203]",MISC
1356,NL,"[998, 185, 1000, 203]",MISC
1357,-,"[998, 185, 1000, 203]",MISC
1358,Corporation,"[64, 203, 221, 221]",MISC
1359,’,"[64, 203, 221, 221]",MISC
1360,s,"[64, 203, 221, 221]",MISC
1361,MV,"[222, 203, 257, 221]",MISC
1362,##S,"[222, 203, 257, 221]",MISC
1363,applications,"[258, 203, 403, 221]",MISC
1364,which,"[403, 203, 463, 221]",MISC
1365,includes,"[464, 203, 561, 221]",MISC
1366,First,"[561, 203, 620, 221]",MISC
1367,call,"[622, 203, 670, 221]",MISC
1368,production,"[670, 203, 790, 221]",MISC
1369,Support,"[792, 203, 888, 221]",MISC
1370,",","[792, 203, 888, 221]",MISC
1371,Re,"[889, 203, 998, 221]",MISC
1372,##sol,"[889, 203, 998, 221]",MISC
1373,##ving,"[889, 203, 998, 221]",MISC
1374,-,"[998, 203, 1000, 221]",MISC
1375,NL,"[998, 203, 1000, 221]",MISC
1376,-,"[998, 203, 1000, 221]",MISC
1377,C,"[64, 221, 139, 238]",MISC
1378,##lient,"[64, 221, 139, 238]",MISC
1379,issues,"[141, 221, 230, 238]",MISC
1380,",","[141, 221, 230, 238]",MISC
1381,providing,"[230, 221, 345, 238]",MISC
1382,permanent,"[345, 221, 460, 238]",MISC
1383,Fi,"[460, 221, 523, 238]",MISC
1384,##xes,"[460, 221, 523, 238]",MISC
1385,for,"[524, 221, 562, 238]",MISC
1386,production,"[563, 221, 690, 238]",MISC
1387,problems,"[691, 221, 793, 238]",MISC
1388,and,"[793, 221, 831, 238]",MISC
1389,carry,"[831, 221, 894, 238]",MISC
1390,out,"[895, 221, 933, 238]",MISC
1391,minor,"[934, 221, 996, 238]",MISC
1392,-,"[998, 221, 1000, 238]",MISC
1393,NL,"[998, 221, 1000, 238]",MISC
1394,-,"[998, 221, 1000, 238]",MISC
1395,enhance,"[64, 238, 239, 256]",MISC
1396,##ments,"[64, 238, 239, 256]",MISC
1397,.,"[64, 238, 239, 256]",MISC
1398,As,"[240, 238, 267, 256]",MISC
1399,IP,"[267, 238, 294, 256]",MISC
1400,is,"[294, 238, 321, 256]",MISC
1401,Ph,"[321, 238, 509, 256]",MISC
1402,##arma,"[321, 238, 509, 256]",MISC
1403,##ce,"[321, 238, 509, 256]",MISC
1404,##utical,"[321, 238, 509, 256]",MISC
1405,Project,"[511, 238, 618, 256]",MISC
1406,",","[511, 238, 618, 256]",MISC
1407,Data,"[619, 238, 672, 256]",MISC
1408,A,"[673, 238, 780, 256]",MISC
1409,##cc,"[673, 238, 780, 256]",MISC
1410,##ura,"[673, 238, 780, 256]",MISC
1411,##cy,"[673, 238, 780, 256]",MISC
1412,is,"[781, 238, 808, 256]",MISC
1413,primary,"[808, 238, 901, 256]",MISC
1414,concern,"[903, 238, 996, 256]",MISC
1415,-,"[998, 238, 1000, 256]",MISC
1416,NL,"[998, 238, 1000, 256]",MISC
1417,-,"[998, 238, 1000, 256]",MISC
1418,which,"[64, 256, 125, 274]",MISC
1419,includes,"[125, 256, 222, 274]",MISC
1420,Hospital,"[224, 256, 320, 274]",MISC
1421,information,"[322, 256, 469, 274]",MISC
1422,",","[322, 256, 469, 274]",MISC
1423,Drug,"[469, 256, 518, 274]",MISC
1424,Price,"[518, 256, 579, 274]",MISC
1425,up,"[580, 256, 677, 274]",MISC
1426,##dating,"[580, 256, 677, 274]",MISC
1427,etc,"[678, 256, 714, 274]",MISC
1428,-,"[715, 256, 717, 274]",MISC
1429,NL,"[715, 256, 717, 274]",MISC
1430,-,"[715, 256, 717, 274]",MISC
1431,J,"[64, 321, 107, 339]",MISC
1432,##O,"[64, 321, 107, 339]",MISC
1433,##B,"[64, 321, 107, 339]",MISC
1434,R,"[107, 321, 324, 339]",MISC
1435,##ES,"[107, 321, 324, 339]",MISC
1436,##PO,"[107, 321, 324, 339]",MISC
1437,##NS,"[107, 321, 324, 339]",MISC
1438,##IB,"[107, 321, 324, 339]",MISC
1439,##IL,"[107, 321, 324, 339]",MISC
1440,##IT,"[107, 321, 324, 339]",MISC
1441,##ES,"[107, 321, 324, 339]",MISC
1442,-,"[325, 321, 327, 339]",MISC
1443,NL,"[325, 321, 327, 339]",MISC
1444,-,"[325, 321, 327, 339]",MISC
1445,B,"[110, 360, 176, 374]",MISC
1446,##uild,"[110, 360, 176, 374]",MISC
1447,the,"[177, 360, 217, 374]",MISC
1448,M,"[218, 360, 298, 374]",MISC
1449,##MI,"[218, 360, 298, 374]",MISC
1450,##DA,"[218, 360, 298, 374]",MISC
1451,##S,"[218, 360, 298, 374]",MISC
1452,&,"[299, 360, 311, 374]",MISC
1453,MI,"[312, 360, 393, 374]",MISC
1454,##DA,"[312, 360, 393, 374]",MISC
1455,##S,"[312, 360, 393, 374]",MISC
1456,",","[312, 360, 393, 374]",MISC
1457,N,"[393, 360, 433, 374]",MISC
1458,##D,"[393, 360, 433, 374]",MISC
1459,##B,"[393, 360, 433, 374]",MISC
1460,(,"[434, 360, 622, 374]",MISC
1461,international,"[434, 360, 622, 374]",MISC
1462,&,"[623, 360, 636, 374]",MISC
1463,National,"[637, 360, 758, 374]",MISC
1464,),"[637, 360, 758, 374]",MISC
1465,databases,"[758, 360, 880, 374]",MISC
1466,to,"[880, 360, 907, 374]",MISC
1467,the,"[907, 360, 946, 374]",MISC
1468,-,"[948, 360, 949, 374]",MISC
1469,NL,"[948, 360, 949, 374]",MISC
1470,-,"[948, 360, 949, 374]",MISC
1471,client,"[128, 374, 203, 392]",MISC
1472,to,"[204, 374, 229, 392]",MISC
1473,set,"[229, 374, 267, 392]",MISC
1474,up,"[267, 374, 292, 392]",MISC
1475,their,"[293, 374, 355, 392]",MISC
1476,own,"[356, 374, 393, 392]",MISC
1477,que,"[394, 374, 481, 392]",MISC
1478,##ries,"[394, 374, 481, 392]",MISC
1479,and,"[482, 374, 520, 392]",MISC
1480,create,"[520, 374, 595, 392]",MISC
1481,custom,"[596, 374, 721, 392]",MISC
1482,##ized,"[596, 374, 721, 392]",MISC
1483,reports,"[722, 374, 937, 392]",MISC
1484,/,"[722, 374, 937, 392]",MISC
1485,databases,"[722, 374, 937, 392]",MISC
1486,-,"[937, 374, 939, 392]",MISC
1487,NL,"[937, 374, 939, 392]",MISC
1488,-,"[937, 374, 939, 392]",MISC
1489,online,"[128, 392, 202, 410]",MISC
1490,which,"[202, 392, 263, 410]",MISC
1491,involves,"[264, 392, 362, 410]",MISC
1492,in,"[362, 392, 385, 410]",MISC
1493,checking,"[387, 392, 485, 410]",MISC
1494,licensing,"[485, 392, 594, 410]",MISC
1495,agreements,"[596, 392, 730, 410]",MISC
1496,",","[596, 392, 730, 410]",MISC
1497,monitoring,"[731, 392, 853, 410]",MISC
1498,-,"[855, 392, 856, 410]",MISC
1499,NL,"[855, 392, 856, 410]",MISC
1500,-,"[855, 392, 856, 410]",MISC
1501,international,"[128, 410, 295, 428]",MISC
1502,&,"[296, 410, 309, 428]",MISC
1503,national,"[309, 410, 411, 428]",MISC
1504,markets,"[413, 410, 502, 428]",MISC
1505,and,"[503, 410, 541, 428]",MISC
1506,analyze,"[542, 410, 631, 428]",MISC
1507,how,"[632, 410, 670, 428]",MISC
1508,sales,"[671, 410, 736, 428]",MISC
1509,of,"[736, 410, 761, 428]",MISC
1510,new,"[762, 410, 799, 428]",MISC
1511,products,"[800, 410, 902, 428]",MISC
1512,is,"[904, 410, 929, 428]",MISC
1513,-,"[930, 410, 932, 428]",MISC
1514,NL,"[930, 410, 932, 428]",MISC
1515,-,"[930, 410, 932, 428]",MISC
1516,developing,"[128, 428, 254, 445]",MISC
1517,.,"[128, 428, 254, 445]",MISC
1518,-,"[254, 428, 255, 445]",MISC
1519,NL,"[254, 428, 255, 445]",MISC
1520,-,"[254, 428, 255, 445]",MISC
1521,Schedule,"[109, 449, 215, 463]",MISC
1522,&,"[216, 449, 229, 463]",MISC
1523,create,"[229, 449, 308, 463]",MISC
1524,the,"[309, 449, 349, 463]",MISC
1525,quality,"[349, 449, 442, 463]",MISC
1526,databases,"[443, 449, 563, 463]",MISC
1527,(,"[563, 449, 629, 463]",MISC
1528,Q,"[563, 449, 629, 463]",MISC
1529,##D,"[563, 449, 629, 463]",MISC
1530,##B,"[563, 449, 629, 463]",MISC
1531,),"[563, 449, 629, 463]",MISC
1532,for,"[629, 449, 669, 463]",MISC
1533,UK,"[669, 449, 694, 463]",MISC
1534,&,"[696, 449, 709, 463]",MISC
1535,Ireland,"[709, 449, 802, 463]",MISC
1536,to,"[803, 449, 828, 463]",MISC
1537,valid,"[829, 449, 949, 463]",MISC
1538,##ated,"[829, 449, 949, 463]",MISC
1539,-,"[949, 449, 951, 463]",MISC
1540,NL,"[949, 449, 951, 463]",MISC
1541,-,"[949, 449, 951, 463]",MISC
1542,wholesale,"[128, 463, 254, 481]",MISC
1543,##r,"[128, 463, 254, 481]",MISC
1544,and,"[254, 463, 291, 481]",MISC
1545,manufacture,"[291, 463, 429, 481]",MISC
1546,sell,"[429, 463, 479, 481]",MISC
1547,in,"[479, 463, 504, 481]",MISC
1548,data,"[504, 463, 567, 481]",MISC
1549,.,"[504, 463, 567, 481]",MISC
1550,-,"[567, 463, 568, 481]",MISC
1551,NL,"[567, 463, 568, 481]",MISC
1552,-,"[567, 463, 568, 481]",MISC
1553,Re,"[109, 485, 246, 499]",MISC
1554,##sponsible,"[109, 485, 246, 499]",MISC
1555,to,"[248, 485, 273, 499]",MISC
1556,(,"[273, 485, 348, 499]",MISC
1557,early,"[273, 485, 348, 499]",MISC
1558,In,"[349, 485, 461, 499]",MISC
1559,##sight,"[349, 485, 461, 499]",MISC
1560,##s,"[349, 485, 461, 499]",MISC
1561,),"[349, 485, 461, 499]",MISC
1562,provide,"[462, 485, 550, 499]",MISC
1563,preview,"[551, 485, 639, 499]",MISC
1564,of,"[639, 485, 664, 499]",MISC
1565,future,"[665, 485, 740, 499]",MISC
1566,performance,"[740, 485, 878, 499]",MISC
1567,of,"[879, 485, 904, 499]",MISC
1568,-,"[905, 485, 906, 499]",MISC
1569,NL,"[905, 485, 906, 499]",MISC
1570,-,"[905, 485, 906, 499]",MISC
1571,pharmaceutical,"[128, 499, 298, 517]",MISC
1572,products,"[299, 499, 395, 517]",MISC
1573,sales,"[396, 499, 457, 517]",MISC
1574,based,"[457, 499, 518, 517]",MISC
1575,on,"[518, 499, 541, 517]",MISC
1576,historical,"[542, 499, 664, 517]",MISC
1577,sales,"[664, 499, 725, 517]",MISC
1578,data,"[725, 499, 774, 517]",MISC
1579,to,"[774, 499, 797, 517]",MISC
1580,clients,"[798, 499, 895, 517]",MISC
1581,.,"[798, 499, 895, 517]",MISC
1582,-,"[896, 499, 898, 517]",MISC
1583,NL,"[896, 499, 898, 517]",MISC
1584,-,"[896, 499, 898, 517]",MISC
1585,Working,"[110, 520, 205, 534]",MISC
1586,on,"[206, 520, 233, 534]",MISC
1587,B,"[234, 520, 260, 534]",MISC
1588,##I,"[234, 520, 260, 534]",MISC
1589,MI,"[261, 520, 329, 534]",MISC
1590,##DA,"[261, 520, 329, 534]",MISC
1591,##S,"[261, 520, 329, 534]",MISC
1592,databases,"[330, 520, 453, 534]",MISC
1593,creations,"[453, 520, 577, 534]",MISC
1594,to,"[577, 520, 604, 534]",MISC
1595,build,"[605, 520, 673, 534]",MISC
1596,the,"[673, 520, 715, 534]",MISC
1597,cube,"[715, 520, 768, 534]",MISC
1598,by,"[770, 520, 796, 534]",MISC
1599,using,"[797, 520, 865, 534]",MISC
1600,SS,"[866, 520, 919, 534]",MISC
1601,##IG,"[866, 520, 919, 534]",MISC
1602,-,"[921, 520, 923, 534]",MISC
1603,NL,"[921, 520, 923, 534]",MISC
1604,-,"[921, 520, 923, 534]",MISC
1605,packages,"[128, 534, 230, 552]",MISC
1606,which,"[231, 534, 294, 552]",MISC
1607,provides,"[295, 534, 397, 552]",MISC
1608,chemical,"[398, 534, 500, 552]",MISC
1609,and,"[501, 534, 538, 552]",MISC
1610,sales,"[539, 534, 602, 552]",MISC
1611,data,"[604, 534, 654, 552]",MISC
1612,to,"[655, 534, 680, 552]",MISC
1613,clients,"[681, 534, 770, 552]",MISC
1614,-,"[771, 534, 772, 552]",MISC
1615,NL,"[771, 534, 772, 552]",MISC
1616,-,"[771, 534, 772, 552]",MISC
1617,Gathering,"[109, 556, 227, 570]",MISC
1618,the,"[227, 556, 267, 570]",MISC
1619,business,"[267, 556, 371, 570]",MISC
1620,requirements,"[372, 556, 529, 570]",MISC
1621,from,"[529, 556, 581, 570]",MISC
1622,the,"[582, 556, 621, 570]",MISC
1623,clients,"[621, 556, 712, 570]",MISC
1624,and,"[713, 556, 752, 570]",MISC
1625,preparing,"[752, 556, 871, 570]",MISC
1626,the,"[871, 556, 910, 570]",MISC
1627,system,"[910, 556, 989, 570]",MISC
1628,-,"[989, 556, 991, 570]",MISC
1629,NL,"[989, 556, 991, 570]",MISC
1630,-,"[989, 556, 991, 570]",MISC
1631,requirements,"[128, 570, 270, 588]",MISC
1632,accordingly,"[271, 570, 402, 588]",MISC
1633,-,"[402, 570, 404, 588]",MISC
1634,NL,"[402, 570, 404, 588]",MISC
1635,-,"[402, 570, 404, 588]",MISC
1636,E,"[109, 592, 232, 606]",MISC
1637,##sca,"[109, 592, 232, 606]",MISC
1638,##lation,"[109, 592, 232, 606]",MISC
1639,of,"[233, 592, 256, 606]",MISC
1640,issues,"[258, 592, 331, 606]",MISC
1641,within,"[333, 592, 406, 606]",MISC
1642,Q,"[408, 592, 444, 606]",MISC
1643,##MS,"[408, 592, 444, 606]",MISC
1644,(,"[445, 592, 556, 606]",MISC
1645,incident,"[445, 592, 556, 606]",MISC
1646,tracking,"[557, 592, 656, 606]",MISC
1647,tool,"[657, 592, 718, 606]",MISC
1648,),"[657, 592, 718, 606]",MISC
1649,as,"[719, 592, 743, 606]",MISC
1650,appropriate,"[744, 592, 880, 606]",MISC
1651,-,"[881, 592, 883, 606]",MISC
1652,NL,"[881, 592, 883, 606]",MISC
1653,-,"[881, 592, 883, 606]",MISC
1654,Working,"[109, 614, 202, 628]",MISC
1655,directly,"[203, 614, 309, 628]",MISC
1656,with,"[310, 614, 362, 628]",MISC
1657,client,"[363, 614, 442, 628]",MISC
1658,and,"[444, 614, 483, 628]",MISC
1659,other,"[484, 614, 550, 628]",MISC
1660,teams,"[551, 614, 617, 628]",MISC
1661,to,"[617, 614, 642, 628]",MISC
1662,meet,"[644, 614, 696, 628]",MISC
1663,the,"[698, 614, 737, 628]",MISC
1664,SL,"[738, 614, 804, 628]",MISC
1665,##A,"[738, 614, 804, 628]",MISC
1666,’,"[738, 614, 804, 628]",MISC
1667,s,"[738, 614, 804, 628]",MISC
1668,-,"[805, 614, 806, 628]",MISC
1669,NL,"[805, 614, 806, 628]",MISC
1670,-,"[805, 614, 806, 628]",MISC
1671,Doc,"[109, 636, 246, 650]",MISC
1672,##ume,"[109, 636, 246, 650]",MISC
1673,##ntin,"[109, 636, 246, 650]",MISC
1674,##g,"[109, 636, 246, 650]",MISC
1675,and,"[247, 636, 285, 650]",MISC
1676,coordinating,"[285, 636, 435, 650]",MISC
1677,project,"[436, 636, 524, 650]",MISC
1678,activities,"[525, 636, 650, 650]",MISC
1679,for,"[651, 636, 688, 650]",MISC
1680,internal,"[688, 636, 789, 650]",MISC
1681,knowledge,"[789, 636, 902, 650]",MISC
1682,base,"[903, 636, 953, 650]",MISC
1683,-,"[953, 636, 955, 650]",MISC
1684,NL,"[953, 636, 955, 650]",MISC
1685,-,"[953, 636, 955, 650]",MISC
1686,Application,"[109, 654, 252, 668]",MISC
1687,maintenance,"[254, 654, 397, 668]",MISC
1688,and,"[399, 654, 438, 668]",MISC
1689,support,"[438, 654, 530, 668]",MISC
1690,of,"[531, 654, 556, 668]",MISC
1691,the,"[557, 654, 596, 668]",MISC
1692,live,"[596, 654, 648, 668]",MISC
1693,production,"[649, 654, 780, 668]",MISC
1694,system,"[781, 654, 860, 668]",MISC
1695,and,"[860, 654, 899, 668]",MISC
1696,-,"[899, 654, 901, 668]",MISC
1697,NL,"[899, 654, 901, 668]",MISC
1698,-,"[899, 654, 901, 668]",MISC
1699,handling,"[128, 669, 228, 686]",MISC
1700,Ad,"[228, 669, 304, 686]",MISC
1701,-,"[228, 669, 304, 686]",MISC
1702,Ho,"[228, 669, 304, 686]",MISC
1703,##c,"[228, 669, 304, 686]",MISC
1704,requests,"[304, 669, 404, 686]",MISC
1705,-,"[404, 669, 406, 686]",MISC
1706,NL,"[404, 669, 406, 686]",MISC
1707,-,"[404, 669, 406, 686]",MISC
1708,Pre,"[109, 689, 225, 703]",MISC
1709,##par,"[109, 689, 225, 703]",MISC
1710,##ing,"[109, 689, 225, 703]",MISC
1711,Process,"[227, 689, 318, 703]",MISC
1712,Development,"[318, 689, 461, 703]",MISC
1713,Doc,"[462, 689, 565, 703]",MISC
1714,##ume,"[462, 689, 565, 703]",MISC
1715,##nt,"[462, 689, 565, 703]",MISC
1716,for,"[566, 689, 604, 703]",MISC
1717,review,"[605, 689, 682, 703]",MISC
1718,in,"[684, 689, 709, 703]",MISC
1719,client,"[710, 689, 787, 703]",MISC
1720,call,"[788, 689, 840, 703]",MISC
1721,-,"[840, 689, 842, 703]",MISC
1722,NL,"[840, 689, 842, 703]",MISC
1723,-,"[840, 689, 842, 703]",MISC
1724,Working,"[111, 707, 213, 721]",MISC
1725,with,"[213, 707, 271, 721]",MISC
1726,SD,"[272, 707, 329, 721]",MISC
1727,##SF,"[272, 707, 329, 721]",MISC
1728,and,"[331, 707, 374, 721]",MISC
1729,T,"[375, 707, 491, 721]",MISC
1730,##SO,"[375, 707, 491, 721]",MISC
1731,/,"[375, 707, 491, 721]",MISC
1732,IS,"[375, 707, 491, 721]",MISC
1733,##P,"[375, 707, 491, 721]",MISC
1734,##F,"[375, 707, 491, 721]",MISC
1735,Command,"[492, 707, 608, 721]",MISC
1736,##s,"[492, 707, 608, 721]",MISC
1737,-,"[610, 707, 611, 721]",MISC
1738,NL,"[610, 707, 611, 721]",MISC
1739,-,"[610, 707, 611, 721]",MISC
1740,Inter,"[109, 725, 250, 739]",MISC
1741,##act,"[109, 725, 250, 739]",MISC
1742,##ing,"[109, 725, 250, 739]",MISC
1743,with,"[251, 725, 301, 739]",MISC
1744,92,"[303, 725, 328, 739]",MISC
1745,countries,"[329, 725, 443, 739]",MISC
1746,by,"[445, 725, 470, 739]",MISC
1747,providing,"[471, 725, 585, 739]",MISC
1748,18,"[587, 725, 637, 739]",MISC
1749,/,"[587, 725, 637, 739]",MISC
1750,5,"[587, 725, 637, 739]",MISC
1751,support,"[639, 725, 728, 739]",MISC
1752,and,"[729, 725, 767, 739]",MISC
1753,presenting,"[768, 725, 897, 739]",MISC
1754,weekly,"[897, 725, 974, 739]",MISC
1755,-,"[974, 725, 976, 739]",MISC
1756,NL,"[974, 725, 976, 739]",MISC
1757,-,"[974, 725, 976, 739]",MISC
1758,and,"[128, 740, 164, 757]",MISC
1759,monthly,"[165, 740, 249, 757]",MISC
1760,reports,"[250, 740, 334, 757]",MISC
1761,highlighting,"[335, 740, 479, 757]",MISC
1762,issues,"[480, 740, 564, 757]",MISC
1763,",","[480, 740, 564, 757]",MISC
1764,automation,"[565, 740, 697, 757]",MISC
1765,##s,"[565, 740, 697, 757]",MISC
1766,and,"[699, 740, 734, 757]",MISC
1767,productivity,"[735, 740, 880, 757]",MISC
1768,status,"[881, 740, 965, 757]",MISC
1769,.,"[881, 740, 965, 757]",MISC
1770,-,"[966, 740, 967, 757]",MISC
1771,NL,"[966, 740, 967, 757]",MISC
1772,-,"[966, 740, 967, 757]",MISC
1773,Working,"[109, 761, 202, 775]",MISC
1774,on,"[203, 761, 228, 775]",MISC
1775,Status,"[229, 761, 308, 775]",MISC
1776,reporting,"[309, 761, 427, 775]",MISC
1777,tools,"[429, 761, 495, 775]",MISC
1778,like,"[495, 761, 547, 775]",MISC
1779,AI,"[548, 761, 588, 775]",MISC
1780,##S,"[548, 761, 588, 775]",MISC
1781,(,"[588, 761, 654, 775]",MISC
1782,S,"[588, 761, 654, 775]",MISC
1783,##q,"[588, 761, 654, 775]",MISC
1784,##l,"[588, 761, 654, 775]",MISC
1785,),"[588, 761, 654, 775]",MISC
1786,&,"[655, 761, 667, 775]",MISC
1787,Q,"[668, 761, 707, 775]",MISC
1788,##MS,"[668, 761, 707, 775]",MISC
1789,for,"[708, 761, 747, 775]",MISC
1790,weekly,"[748, 761, 827, 775]",MISC
1791,call,"[828, 761, 880, 775]",MISC
1792,and,"[881, 761, 920, 775]",MISC
1793,-,"[921, 761, 923, 775]",MISC
1794,NL,"[921, 761, 923, 775]",MISC
1795,-,"[921, 761, 923, 775]",MISC
1796,presenting,"[128, 776, 250, 792]",MISC
1797,to,"[251, 776, 275, 792]",MISC
1798,stakeholders,"[276, 776, 423, 792]",MISC
1799,in,"[423, 776, 447, 792]",MISC
1800,the,"[448, 776, 484, 792]",MISC
1801,form,"[485, 776, 533, 792]",MISC
1802,of,"[534, 776, 557, 792]",MISC
1803,presentation,"[559, 776, 718, 792]",MISC
1804,.,"[559, 776, 718, 792]",MISC
1805,-,"[719, 776, 720, 792]",MISC
1806,NL,"[719, 776, 720, 792]",MISC
1807,-,"[719, 776, 720, 792]",MISC
1808,Col,"[110, 796, 229, 810]",MISC
1809,##lating,"[110, 796, 229, 810]",MISC
1810,On,"[231, 796, 258, 810]",MISC
1811,call,"[258, 796, 312, 810]",MISC
1812,allowance,"[312, 796, 432, 810]",MISC
1813,data,"[433, 796, 487, 810]",MISC
1814,from,"[487, 796, 541, 810]",MISC
1815,leads,"[541, 796, 607, 810]",MISC
1816,and,"[609, 796, 648, 810]",MISC
1817,Manager,"[649, 796, 756, 810]",MISC
1818,##s,"[649, 796, 756, 810]",MISC
1819,and,"[757, 796, 796, 810]",MISC
1820,con,"[797, 796, 973, 810]",MISC
1821,##sol,"[797, 796, 973, 810]",MISC
1822,##ida,"[797, 796, 973, 810]",MISC
1823,##ting,"[797, 796, 973, 810]",MISC
1824,-,"[973, 796, 974, 810]",MISC
1825,NL,"[973, 796, 974, 810]",MISC
1826,-,"[973, 796, 974, 810]",MISC
1827,the,"[128, 814, 166, 832]",MISC
1828,report,"[167, 814, 244, 832]",MISC
1829,of,"[245, 814, 271, 832]",MISC
1830,entire,"[271, 814, 348, 832]",MISC
1831,production,"[350, 814, 478, 832]",MISC
1832,support,"[480, 814, 569, 832]",MISC
1833,team,"[571, 814, 623, 832]",MISC
1834,on,"[623, 814, 648, 832]",MISC
1835,monthly,"[649, 814, 738, 832]",MISC
1836,basis,"[740, 814, 805, 832]",MISC
1837,and,"[805, 814, 843, 832]",MISC
1838,sharing,"[844, 814, 934, 832]",MISC
1839,the,"[935, 814, 973, 832]",MISC
1840,-,"[974, 814, 976, 832]",MISC
1841,NL,"[974, 814, 976, 832]",MISC
1842,-,"[974, 814, 976, 832]",MISC
1843,report,"[128, 834, 200, 852]",MISC
1844,to,"[201, 834, 225, 852]",MISC
1845,pay,"[226, 834, 310, 852]",MISC
1846,##roll,"[226, 834, 310, 852]",MISC
1847,team,"[311, 834, 372, 852]",MISC
1848,.,"[311, 834, 372, 852]",MISC
1849,-,"[372, 834, 373, 852]",MISC
1850,NL,"[372, 834, 373, 852]",MISC
1851,-,"[372, 834, 373, 852]",MISC
1852,Other,"[64, 885, 132, 903]",MISC
1853,technologies,"[133, 885, 298, 903]",MISC
1854,used,"[299, 885, 367, 903]",MISC
1855,:,"[299, 885, 367, 903]",MISC
1856,-,"[368, 885, 370, 903]",MISC
1857,NL,"[368, 885, 370, 903]",MISC
1858,-,"[368, 885, 370, 903]",MISC
1859,SAS,"[69, 914, 119, 932]",MISC
1860,",","[69, 914, 119, 932]",MISC
1861,Table,"[120, 914, 220, 932]",MISC
1862,##au,"[120, 914, 220, 932]",MISC
1863,",","[120, 914, 220, 932]",MISC
1864,S,"[220, 914, 270, 932]",MISC
1865,##QL,"[220, 914, 270, 932]",MISC
1866,",","[220, 914, 270, 932]",MISC
1867,Big,"[270, 914, 308, 932]",MISC
1868,Data,"[308, 914, 358, 932]",MISC
1869,(,"[359, 914, 484, 932]",MISC
1870,learning,"[359, 914, 484, 932]",MISC
1871,),"[359, 914, 484, 932]",MISC
1872,-,"[484, 914, 486, 932]",MISC
1873,NL,"[484, 914, 486, 932]",MISC
1874,-,"[484, 914, 486, 932]",MISC
1875,E,"[64, 944, 216, 964]",B-education_heading
1876,##D,"[64, 944, 216, 964]",I-education_heading
1877,##UC,"[64, 944, 216, 964]",I-education_heading
1878,##AT,"[64, 944, 216, 964]",I-education_heading
1879,##ION,"[64, 944, 216, 964]",I-education_heading
1880,-,"[216, 944, 218, 964]",MISC
1881,NL,"[216, 944, 218, 964]",MISC
1882,-,"[216, 944, 218, 964]",MISC
1883,Diploma,"[85, 984, 190, 998]",B-education_degree
1884,(,"[191, 984, 267, 998]",MISC
1885,EC,"[191, 984, 267, 998]",B-education_course
1886,##E,"[191, 984, 267, 998]",I-education_course
1887,),"[191, 984, 267, 998]",MISC
1888,–,"[268, 984, 282, 998]",MISC
1889,G,"[283, 984, 297, 998]",B-education_institute
1890,T,"[298, 984, 313, 998]",I-education_institute
1891,&,"[314, 984, 328, 998]",I-education_institute
1892,T,"[329, 984, 374, 998]",I-education_institute
1893,##C,"[329, 984, 374, 998]",I-education_institute
1894,",","[329, 984, 374, 998]",MISC
1895,Bangalore,"[375, 984, 527, 998]",MISC
1896,",","[375, 984, 527, 998]",MISC
1897,in,"[527, 984, 558, 998]",MISC
1898,2005,"[558, 984, 619, 998]",MISC
1899,with,"[619, 984, 680, 998]",MISC
1900,66,"[680, 984, 725, 998]",MISC
1901,%,"[680, 984, 725, 998]",MISC
1902,-,"[726, 984, 728, 998]",MISC
1903,NL,"[726, 984, 728, 998]",MISC
1904,-,"[726, 984, 728, 998]",MISC
1905,SS,"[84, 45, 143, 63]",B-education_degree
1906,##LC,"[84, 45, 143, 63]",I-education_degree
1907,–,"[144, 45, 158, 63]",MISC
1908,Ba,"[159, 45, 218, 63]",B-education_institute
1909,##pu,"[159, 45, 218, 63]",I-education_institute
1910,high,"[219, 45, 278, 63]",I-education_institute
1911,School,"[279, 45, 383, 63]",I-education_institute
1912,",","[279, 45, 383, 63]",MISC
1913,Bangalore,"[384, 45, 518, 63]",MISC
1914,at,"[519, 45, 547, 63]",MISC
1915,2002,"[549, 45, 608, 63]",MISC
1916,with,"[608, 45, 667, 63]",MISC
1917,76,"[668, 45, 713, 63]",MISC
1918,%,"[668, 45, 713, 63]",MISC
1919,-,"[713, 45, 715, 63]",MISC
1920,NL,"[713, 45, 715, 63]",MISC
1921,-,"[713, 45, 715, 63]",MISC
1922,P,"[64, 99, 187, 116]",B-personal_details_heading
1923,##ER,"[64, 99, 187, 116]",I-personal_details_heading
1924,##SO,"[64, 99, 187, 116]",I-personal_details_heading
1925,##NA,"[64, 99, 187, 116]",I-personal_details_heading
1926,##L,"[64, 99, 187, 116]",I-personal_details_heading
1927,PR,"[189, 99, 298, 116]",I-personal_details_heading
1928,##O,"[189, 99, 298, 116]",I-personal_details_heading
1929,##FI,"[189, 99, 298, 116]",I-personal_details_heading
1930,##LE,"[189, 99, 298, 116]",I-personal_details_heading
1931,-,"[298, 99, 300, 116]",MISC
1932,NL,"[298, 99, 300, 116]",MISC
1933,-,"[298, 99, 300, 116]",MISC
1934,Date,"[73, 134, 132, 152]",MISC
1935,of,"[132, 134, 161, 152]",MISC
1936,Birth,"[162, 134, 235, 152]",MISC
1937,:,"[236, 134, 251, 152]",MISC
1938,10th,"[251, 134, 310, 152]",MISC
1939,Jan,"[311, 134, 353, 152]",MISC
1940,1986,"[355, 134, 414, 152]",MISC
1941,-,"[415, 134, 416, 152]",MISC
1942,NL,"[415, 134, 416, 152]",MISC
1943,-,"[415, 134, 416, 152]",MISC
1944,Ad,"[73, 152, 169, 170]",MISC
1945,##dress,"[73, 152, 169, 170]",MISC
1946,:,"[170, 152, 183, 170]",MISC
1947,136,"[184, 152, 239, 170]",MISC
1948,",","[184, 152, 239, 170]",MISC
1949,5th,"[240, 152, 281, 170]",MISC
1950,Main,"[281, 152, 349, 170]",MISC
1951,",","[281, 152, 349, 170]",MISC
1952,Ka,"[351, 152, 503, 170]",MISC
1953,##shin,"[351, 152, 503, 170]",MISC
1954,##aga,"[351, 152, 503, 170]",MISC
1955,##r,"[351, 152, 503, 170]",MISC
1956,",","[351, 152, 503, 170]",MISC
1957,Ye,"[504, 152, 697, 170]",MISC
1958,##l,"[504, 152, 697, 170]",MISC
1959,##chen,"[504, 152, 697, 170]",MISC
1960,##ah,"[504, 152, 697, 170]",MISC
1961,##all,"[504, 152, 697, 170]",MISC
1962,##i,"[504, 152, 697, 170]",MISC
1963,",","[504, 152, 697, 170]",MISC
1964,B,"[698, 152, 781, 170]",MISC
1965,’,"[698, 152, 781, 170]",MISC
1966,lo,"[698, 152, 781, 170]",MISC
1967,##re,"[698, 152, 781, 170]",MISC
1968,-,"[782, 152, 794, 170]",MISC
1969,-,"[796, 152, 797, 170]",MISC
1970,NL,"[796, 152, 797, 170]",MISC
1971,-,"[796, 152, 797, 170]",MISC
1972,560,"[275, 170, 364, 188]",MISC
1973,##0,"[275, 170, 364, 188]",MISC
1974,##7,"[275, 170, 364, 188]",MISC
1975,##8,"[275, 170, 364, 188]",MISC
1976,.,"[275, 170, 364, 188]",MISC
1977,-,"[364, 170, 366, 188]",MISC
1978,NL,"[364, 170, 366, 188]",MISC
1979,-,"[364, 170, 366, 188]",MISC
