,token,box,label
0,1,"[133, 49, 155, 68]",MISC
1,!,"[133, 49, 155, 68]",MISC
2,of,"[155, 49, 177, 68]",MISC
3,3,"[177, 49, 200, 68]",MISC
4,!,"[177, 49, 200, 68]",MISC
5,-,"[200, 49, 201, 68]",MISC
6,NL,"[200, 49, 201, 68]",MISC
7,-,"[200, 49, 201, 68]",MISC
8,F,"[505, 103, 561, 120]",B-name
9,##OA,"[505, 103, 561, 120]",I-name
10,##D,"[505, 103, 561, 120]",I-name
11,VA,"[561, 103, 645, 120]",I-name
12,##FA,"[561, 103, 645, 120]",I-name
13,##EI,"[561, 103, 645, 120]",I-name
14,-,"[646, 103, 648, 120]",MISC
15,NL,"[646, 103, 648, 120]",MISC
16,-,"[646, 103, 648, 120]",MISC
17,Man,"[133, 122, 238, 139]",MISC
18,##te,"[133, 122, 238, 139]",MISC
19,##uff,"[133, 122, 238, 139]",MISC
20,##el,"[133, 122, 238, 139]",MISC
21,St,"[239, 122, 270, 139]",MISC
22,##r,"[239, 122, 270, 139]",MISC
23,34,"[270, 122, 302, 139]",MISC
24,",","[270, 122, 302, 139]",MISC
25,Berlin,"[302, 122, 376, 139]",MISC
26,",","[302, 122, 376, 139]",MISC
27,109,"[376, 122, 428, 139]",MISC
28,##9,"[376, 122, 428, 139]",MISC
29,##7,"[376, 122, 428, 139]",MISC
30,-,"[429, 122, 431, 139]",MISC
31,NL,"[429, 122, 431, 139]",MISC
32,-,"[429, 122, 431, 139]",MISC
33,f,"[812, 122, 1000, 139]",B-emails_email
34,##oa,"[812, 122, 1000, 139]",I-emails_email
35,##dt,"[812, 122, 1000, 139]",I-emails_email
36,##ab,"[812, 122, 1000, 139]",I-emails_email
37,@,"[812, 122, 1000, 139]",I-emails_email
38,g,"[812, 122, 1000, 139]",I-emails_email
39,##mail,"[812, 122, 1000, 139]",I-emails_email
40,.,"[812, 122, 1000, 139]",I-emails_email
41,com,"[812, 122, 1000, 139]",I-emails_email
42,-,"[1000, 122, 1001, 139]",MISC
43,NL,"[1000, 122, 1001, 139]",MISC
44,-,"[1000, 122, 1001, 139]",MISC
45,P,"[133, 155, 157, 172]",MISC
46,##O,"[133, 155, 157, 172]",MISC
47,Box,"[157, 155, 192, 172]",MISC
48,53,"[193, 155, 252, 172]",MISC
49,##33,"[193, 155, 252, 172]",MISC
50,",","[193, 155, 252, 172]",MISC
51,Berkeley,"[253, 155, 361, 172]",MISC
52,",","[253, 155, 361, 172]",MISC
53,CA,"[362, 155, 386, 172]",MISC
54,94,"[386, 155, 445, 172]",MISC
55,##70,"[386, 155, 445, 172]",MISC
56,##5,"[386, 155, 445, 172]",MISC
57,-,"[446, 155, 448, 172]",MISC
58,NL,"[446, 155, 448, 172]",MISC
59,-,"[446, 155, 448, 172]",MISC
60,+,"[818, 155, 870, 172]",B-phones_phone
61,49,"[818, 155, 870, 172]",I-phones_phone
62,/,"[818, 155, 870, 172]",I-phones_phone
63,30,"[870, 155, 896, 172]",I-phones_phone
64,62,"[896, 155, 935, 172]",I-phones_phone
65,##7,"[896, 155, 935, 172]",I-phones_phone
66,35,"[935, 155, 1000, 172]",I-phones_phone
67,##6,"[935, 155, 1000, 172]",I-phones_phone
68,##9,"[935, 155, 1000, 172]",I-phones_phone
69,##3,"[935, 155, 1000, 172]",I-phones_phone
70,-,"[1000, 155, 1001, 172]",MISC
71,NL,"[1000, 155, 1001, 172]",MISC
72,-,"[1000, 155, 1001, 172]",MISC
73,Sky,"[133, 172, 200, 190]",MISC
74,##pe,"[133, 172, 200, 190]",MISC
75,:,"[133, 172, 200, 190]",MISC
76,f,"[200, 172, 300, 190]",MISC
77,##oa,"[200, 172, 300, 190]",MISC
78,##d,"[200, 172, 300, 190]",MISC
79,##v,"[200, 172, 300, 190]",MISC
80,##20,"[200, 172, 300, 190]",MISC
81,##0,"[200, 172, 300, 190]",MISC
82,##5,"[200, 172, 300, 190]",MISC
83,-,"[300, 172, 301, 190]",MISC
84,NL,"[300, 172, 301, 190]",MISC
85,-,"[300, 172, 301, 190]",MISC
86,+,"[812, 172, 861, 190]",B-phones_phone
87,49,"[812, 172, 861, 190]",I-phones_phone
88,/,"[812, 172, 861, 190]",I-phones_phone
89,176,"[862, 172, 899, 190]",I-phones_phone
90,43,"[900, 172, 998, 190]",I-phones_phone
91,##45,"[900, 172, 998, 190]",I-phones_phone
92,##51,"[900, 172, 998, 190]",I-phones_phone
93,##9,"[900, 172, 998, 190]",I-phones_phone
94,##2,"[900, 172, 998, 190]",I-phones_phone
95,-,"[1000, 172, 1001, 190]",MISC
96,NL,"[1000, 172, 1001, 190]",MISC
97,-,"[1000, 172, 1001, 190]",MISC
98,E,"[133, 191, 261, 209]",B-work_experience_heading
99,##X,"[133, 191, 261, 209]",I-work_experience_heading
100,##P,"[133, 191, 261, 209]",I-work_experience_heading
101,##ER,"[133, 191, 261, 209]",I-work_experience_heading
102,##IE,"[133, 191, 261, 209]",I-work_experience_heading
103,##NC,"[133, 191, 261, 209]",I-work_experience_heading
104,##E,"[133, 191, 261, 209]",I-work_experience_heading
105,-,"[261, 191, 262, 209]",MISC
106,NL,"[261, 191, 262, 209]",MISC
107,-,"[261, 191, 262, 209]",MISC
108,_,"[374, 191, 448, 209]",MISC
109,_,"[374, 191, 448, 209]",MISC
110,_,"[374, 191, 448, 209]",MISC
111,_,"[374, 191, 448, 209]",MISC
112,_,"[374, 191, 448, 209]",MISC
113,_,"[374, 191, 448, 209]",MISC
114,_,"[374, 191, 448, 209]",MISC
115,_,"[374, 191, 448, 209]",MISC
116,-,"[448, 191, 450, 209]",MISC
117,NL,"[448, 191, 450, 209]",MISC
118,-,"[448, 191, 450, 209]",MISC
119,Cloud,"[133, 225, 251, 242]",B-employer_company_name
120,##ten,"[133, 225, 251, 242]",I-employer_company_name
121,##na,"[133, 225, 251, 242]",I-employer_company_name
122,-,"[251, 225, 253, 242]",MISC
123,NL,"[251, 225, 253, 242]",MISC
124,-,"[251, 225, 253, 242]",MISC
125,Sunny,"[864, 225, 975, 242]",MISC
126,##vale,"[864, 225, 975, 242]",MISC
127,",","[864, 225, 975, 242]",MISC
128,CA,"[977, 225, 999, 242]",MISC
129,-,"[1000, 225, 1001, 242]",MISC
130,NL,"[1000, 225, 1001, 242]",MISC
131,-,"[1000, 225, 1001, 242]",MISC
132,Program,"[133, 258, 225, 276]",B-employer_role
133,Manager,"[226, 258, 319, 276]",I-employer_role
134,-,"[320, 258, 322, 276]",MISC
135,NL,"[320, 258, 322, 276]",MISC
136,-,"[320, 258, 322, 276]",MISC
137,2016,"[883, 258, 935, 276]",MISC
138,to,"[935, 258, 961, 276]",MISC
139,now,"[961, 258, 1000, 276]",MISC
140,-,"[1000, 258, 1001, 276]",MISC
141,NL,"[1000, 258, 1001, 276]",MISC
142,-,"[1000, 258, 1001, 276]",MISC
143,•,"[133, 276, 144, 293]",MISC
144,Man,"[144, 276, 213, 293]",MISC
145,##age,"[144, 276, 213, 293]",MISC
146,business,"[213, 276, 304, 293]",MISC
147,development,"[305, 276, 431, 293]",MISC
148,and,"[431, 276, 464, 293]",MISC
149,partnerships,"[465, 276, 602, 293]",MISC
150,operations,"[602, 276, 715, 293]",MISC
151,for,"[717, 276, 750, 293]",MISC
152,the,"[751, 276, 785, 293]",MISC
153,German,"[786, 276, 854, 293]",MISC
154,market,"[855, 276, 934, 293]",MISC
155,.,"[855, 276, 934, 293]",MISC
156,-,"[935, 276, 937, 293]",MISC
157,NL,"[935, 276, 937, 293]",MISC
158,-,"[935, 276, 937, 293]",MISC
159,•,"[133, 293, 142, 311]",MISC
160,Dev,"[143, 293, 218, 311]",MISC
161,##elo,"[143, 293, 218, 311]",MISC
162,##p,"[143, 293, 218, 311]",MISC
163,online,"[218, 293, 281, 311]",MISC
164,advertising,"[282, 293, 398, 311]",MISC
165,and,"[399, 293, 430, 311]",MISC
166,partnership,"[431, 293, 547, 311]",MISC
167,strategies,"[548, 293, 653, 311]",MISC
168,across,"[654, 293, 717, 311]",MISC
169,social,"[718, 293, 781, 311]",MISC
170,media,"[782, 293, 845, 311]",MISC
171,.,"[782, 293, 845, 311]",MISC
172,-,"[846, 293, 848, 311]",MISC
173,NL,"[846, 293, 848, 311]",MISC
174,-,"[846, 293, 848, 311]",MISC
175,G,"[133, 327, 212, 343]",B-employer_company_name
176,##esta,"[133, 327, 212, 343]",I-employer_company_name
177,##lt,"[133, 327, 212, 343]",I-employer_company_name
178,Pro,"[213, 327, 339, 343]",I-employer_company_name
179,##du,"[213, 327, 339, 343]",I-employer_company_name
180,##kt,"[213, 327, 339, 343]",I-employer_company_name
181,##ions,"[213, 327, 339, 343]",I-employer_company_name
182,-,"[340, 327, 342, 343]",MISC
183,NL,"[340, 327, 342, 343]",MISC
184,-,"[340, 327, 342, 343]",MISC
185,Berlin,"[842, 327, 912, 343]",MISC
186,",","[842, 327, 912, 343]",MISC
187,Germany,"[913, 327, 984, 343]",MISC
188,-,"[985, 327, 987, 343]",MISC
189,NL,"[985, 327, 987, 343]",MISC
190,-,"[985, 327, 987, 343]",MISC
191,Program,"[133, 343, 225, 359]",B-employer_role
192,Manager,"[226, 343, 319, 359]",I-employer_role
193,-,"[320, 343, 322, 359]",MISC
194,NL,"[320, 343, 322, 359]",MISC
195,-,"[320, 343, 322, 359]",MISC
196,2011,"[877, 343, 925, 359]",MISC
197,to,"[926, 343, 950, 359]",MISC
198,now,"[950, 343, 985, 359]",MISC
199,-,"[987, 343, 988, 359]",MISC
200,NL,"[987, 343, 988, 359]",MISC
201,-,"[987, 343, 988, 359]",MISC
202,•,"[133, 361, 144, 379]",MISC
203,C,"[145, 361, 213, 379]",MISC
204,##reate,"[145, 361, 213, 379]",MISC
205,digital,"[215, 361, 296, 379]",MISC
206,media,"[296, 361, 354, 379]",MISC
207,from,"[355, 361, 401, 379]",MISC
208,concept,"[402, 361, 483, 379]",MISC
209,to,"[483, 361, 506, 379]",MISC
210,development,"[507, 361, 635, 379]",MISC
211,and,"[635, 361, 669, 379]",MISC
212,release,"[670, 361, 763, 379]",MISC
213,",","[670, 361, 763, 379]",MISC
214,with,"[764, 361, 810, 379]",MISC
215,Apple,"[811, 361, 868, 379]",MISC
216,Final,"[869, 361, 927, 379]",MISC
217,Cut,"[928, 361, 961, 379]",MISC
218,Pro,"[963, 361, 996, 379]",MISC
219,-,"[998, 361, 1000, 379]",MISC
220,NL,"[998, 361, 1000, 379]",MISC
221,-,"[998, 361, 1000, 379]",MISC
222,and,"[155, 377, 187, 395]",MISC
223,Adobe,"[188, 377, 241, 395]",MISC
224,After,"[242, 377, 296, 395]",MISC
225,Effects,"[296, 377, 382, 395]",MISC
226,.,"[296, 377, 382, 395]",MISC
227,Designed,"[383, 377, 469, 395]",MISC
228,digital,"[470, 377, 546, 395]",MISC
229,video,"[546, 377, 600, 395]",MISC
230,work,"[601, 377, 686, 395]",MISC
231,##flow,"[601, 377, 686, 395]",MISC
232,from,"[688, 377, 730, 395]",MISC
233,camera,"[731, 377, 796, 395]",MISC
234,to,"[797, 377, 817, 395]",MISC
235,delivery,"[818, 377, 915, 395]",MISC
236,.,"[818, 377, 915, 395]",MISC
237,-,"[916, 377, 918, 395]",MISC
238,NL,"[916, 377, 918, 395]",MISC
239,-,"[916, 377, 918, 395]",MISC
240,Z,"[133, 411, 201, 427]",B-employer_company_name
241,##hibit,"[133, 411, 201, 427]",I-employer_company_name
242,LLC,"[202, 411, 235, 427]",I-employer_company_name
243,-,"[237, 411, 238, 427]",MISC
244,NL,"[237, 411, 238, 427]",MISC
245,-,"[237, 411, 238, 427]",MISC
246,Los,"[851, 411, 885, 427]",MISC
247,Angeles,"[886, 411, 976, 427]",MISC
248,",","[886, 411, 976, 427]",MISC
249,CA,"[977, 411, 999, 427]",MISC
250,-,"[1000, 411, 1001, 427]",MISC
251,NL,"[1000, 411, 1001, 427]",MISC
252,-,"[1000, 411, 1001, 427]",MISC
253,Marketing,"[133, 427, 246, 444]",B-employer_role
254,Manager,"[247, 427, 336, 444]",I-employer_role
255,-,"[337, 427, 338, 444]",MISC
256,NL,"[337, 427, 338, 444]",MISC
257,-,"[337, 427, 338, 444]",MISC
258,2010,"[874, 427, 924, 444]",MISC
259,to,"[924, 427, 948, 444]",MISC
260,2011,"[949, 427, 999, 444]",MISC
261,-,"[1000, 427, 1001, 444]",MISC
262,NL,"[1000, 427, 1001, 444]",MISC
263,-,"[1000, 427, 1001, 444]",MISC
264,•,"[133, 446, 144, 465]",MISC
265,Con,"[144, 446, 244, 465]",MISC
266,##ducted,"[144, 446, 244, 465]",MISC
267,competitive,"[246, 446, 370, 465]",MISC
268,study,"[370, 446, 426, 465]",MISC
269,of,"[427, 446, 449, 465]",MISC
270,the,"[449, 446, 482, 465]",MISC
271,online,"[483, 446, 550, 465]",MISC
272,market,"[551, 446, 617, 465]",MISC
273,for,"[619, 446, 652, 465]",MISC
274,artists,"[652, 446, 730, 465]",MISC
275,in,"[732, 446, 754, 465]",MISC
276,the,"[754, 446, 787, 465]",MISC
277,US,"[788, 446, 810, 465]",MISC
278,and,"[811, 446, 844, 465]",MISC
279,Europe,"[844, 446, 922, 465]",MISC
280,.,"[844, 446, 922, 465]",MISC
281,-,"[924, 446, 925, 465]",MISC
282,NL,"[924, 446, 925, 465]",MISC
283,-,"[924, 446, 925, 465]",MISC
284,SA,"[133, 468, 172, 484]",B-employer_company_name
285,##P,"[133, 468, 172, 484]",I-employer_company_name
286,Labs,"[172, 468, 224, 484]",I-employer_company_name
287,–,"[225, 468, 238, 484]",MISC
288,SA,"[238, 468, 277, 484]",MISC
289,##P,"[238, 468, 277, 484]",MISC
290,Business,"[278, 468, 382, 484]",MISC
291,Suite,"[383, 468, 448, 484]",MISC
292,Sol,"[449, 468, 553, 484]",MISC
293,##ution,"[449, 468, 553, 484]",MISC
294,Management,"[555, 468, 686, 484]",MISC
295,-,"[687, 468, 688, 484]",MISC
296,NL,"[687, 468, 688, 484]",MISC
297,-,"[687, 468, 688, 484]",MISC
298,Pa,"[881, 468, 924, 484]",MISC
299,##lo,"[881, 468, 924, 484]",MISC
300,Alto,"[924, 468, 978, 484]",MISC
301,",","[924, 468, 978, 484]",MISC
302,CA,"[978, 468, 998, 484]",MISC
303,-,"[1000, 468, 1001, 484]",MISC
304,NL,"[1000, 468, 1001, 484]",MISC
305,-,"[1000, 468, 1001, 484]",MISC
306,Program,"[133, 497, 225, 514]",B-employer_role
307,Manager,"[226, 497, 319, 514]",I-employer_role
308,-,"[320, 497, 322, 514]",MISC
309,NL,"[320, 497, 322, 514]",MISC
310,-,"[320, 497, 322, 514]",MISC
311,2004,"[874, 497, 924, 514]",MISC
312,to,"[924, 497, 948, 514]",MISC
313,2009,"[949, 497, 999, 514]",MISC
314,-,"[1000, 497, 1001, 514]",MISC
315,NL,"[1000, 497, 1001, 514]",MISC
316,-,"[1000, 497, 1001, 514]",MISC
317,•,"[133, 533, 144, 550]",MISC
318,Led,"[145, 533, 180, 550]",MISC
319,team,"[180, 533, 227, 550]",MISC
320,of,"[228, 533, 250, 550]",MISC
321,two,"[251, 533, 286, 550]",MISC
322,to,"[287, 533, 309, 550]",MISC
323,develop,"[311, 533, 392, 550]",MISC
324,proof,"[393, 533, 582, 550]",MISC
325,-,"[393, 533, 582, 550]",MISC
326,of,"[393, 533, 582, 550]",MISC
327,-,"[393, 533, 582, 550]",MISC
328,concept,"[393, 533, 582, 550]",MISC
329,prototypes,"[583, 533, 700, 550]",MISC
330,such,"[701, 533, 748, 550]",MISC
331,as,"[749, 533, 771, 550]",MISC
332,a,"[773, 533, 784, 550]",MISC
333,location,"[784, 533, 949, 550]",MISC
334,-,"[784, 533, 949, 550]",MISC
335,based,"[784, 533, 949, 550]",MISC
336,J,"[950, 533, 997, 550]",MISC
337,##2,"[950, 533, 997, 550]",MISC
338,##ME,"[950, 533, 997, 550]",MISC
339,-,"[998, 533, 1000, 550]",MISC
340,NL,"[998, 533, 1000, 550]",MISC
341,-,"[998, 533, 1000, 550]",MISC
342,mobile,"[155, 549, 220, 566]",MISC
343,SA,"[221, 549, 252, 566]",MISC
344,##P,"[221, 549, 252, 566]",MISC
345,Enterprise,"[253, 549, 361, 566]",MISC
346,Search,"[362, 549, 427, 566]",MISC
347,client,"[428, 549, 504, 566]",MISC
348,",","[428, 549, 504, 566]",MISC
349,with,"[504, 549, 547, 566]",MISC
350,Google,"[548, 549, 613, 566]",MISC
351,Map,"[613, 549, 667, 566]",MISC
352,##s,"[613, 549, 667, 566]",MISC
353,.,"[613, 549, 667, 566]",MISC
354,-,"[668, 549, 670, 566]",MISC
355,NL,"[668, 549, 670, 566]",MISC
356,-,"[668, 549, 670, 566]",MISC
357,•,"[133, 566, 142, 584]",MISC
358,Work,"[144, 566, 208, 584]",MISC
359,##ed,"[144, 566, 208, 584]",MISC
360,with,"[209, 566, 251, 584]",MISC
361,Microsoft,"[252, 566, 348, 584]",MISC
362,to,"[349, 566, 369, 584]",MISC
363,create,"[371, 566, 435, 584]",MISC
364,solution,"[436, 566, 521, 584]",MISC
365,offerings,"[522, 566, 618, 584]",MISC
366,for,"[619, 566, 651, 584]",MISC
367,Due,"[652, 566, 694, 584]",MISC
368,##t,"[652, 566, 694, 584]",MISC
369,Enterprise,"[695, 566, 802, 584]",MISC
370,Online,"[803, 566, 868, 584]",MISC
371,for,"[868, 566, 899, 584]",MISC
372,Microsoft,"[900, 566, 997, 584]",MISC
373,-,"[998, 566, 1000, 584]",MISC
374,NL,"[998, 566, 1000, 584]",MISC
375,-,"[998, 566, 1000, 584]",MISC
376,Office,"[155, 582, 216, 600]",MISC
377,integration,"[217, 582, 330, 600]",MISC
378,with,"[331, 582, 372, 600]",MISC
379,SA,"[372, 582, 413, 600]",MISC
380,##P,"[372, 582, 413, 600]",MISC
381,.,"[372, 582, 413, 600]",MISC
382,Help,"[414, 582, 475, 600]",MISC
383,##ed,"[414, 582, 475, 600]",MISC
384,negotiate,"[476, 582, 568, 600]",MISC
385,joint,"[569, 582, 619, 600]",MISC
386,enterprise,"[621, 582, 722, 600]",MISC
387,licensing,"[724, 582, 817, 600]",MISC
388,agreements,"[817, 582, 930, 600]",MISC
389,.,"[817, 582, 930, 600]",MISC
390,-,"[931, 582, 933, 600]",MISC
391,NL,"[931, 582, 933, 600]",MISC
392,-,"[931, 582, 933, 600]",MISC
393,•,"[133, 600, 144, 617]",MISC
394,Con,"[145, 600, 248, 617]",MISC
395,##ducted,"[145, 600, 248, 617]",MISC
396,comprehensive,"[250, 600, 401, 617]",MISC
397,review,"[401, 600, 470, 617]",MISC
398,of,"[472, 600, 494, 617]",MISC
399,SA,"[495, 600, 528, 617]",MISC
400,##P,"[495, 600, 528, 617]",MISC
401,mobile,"[530, 600, 599, 617]",MISC
402,strategy,"[600, 600, 693, 617]",MISC
403,for,"[694, 600, 727, 617]",MISC
404,top,"[729, 600, 762, 617]",MISC
405,management,"[764, 600, 891, 617]",MISC
406,.,"[764, 600, 891, 617]",MISC
407,-,"[892, 600, 894, 617]",MISC
408,NL,"[892, 600, 894, 617]",MISC
409,-,"[892, 600, 894, 617]",MISC
410,•,"[133, 617, 144, 635]",MISC
411,Organ,"[144, 617, 244, 635]",MISC
412,##ized,"[144, 617, 244, 635]",MISC
413,and,"[245, 617, 278, 635]",MISC
414,managed,"[279, 617, 357, 635]",MISC
415,regular,"[357, 617, 435, 635]",MISC
416,info,"[436, 617, 481, 635]",MISC
417,sessions,"[481, 617, 570, 635]",MISC
418,communications,"[571, 617, 738, 635]",MISC
419,",","[571, 617, 738, 635]",MISC
420,to,"[739, 617, 762, 635]",MISC
421,track,"[762, 617, 817, 635]",MISC
422,and,"[818, 617, 851, 635]",MISC
423,present,"[852, 617, 929, 635]",MISC
424,latest,"[930, 617, 997, 635]",MISC
425,-,"[998, 617, 1000, 635]",MISC
426,NL,"[998, 617, 1000, 635]",MISC
427,-,"[998, 617, 1000, 635]",MISC
428,product,"[155, 633, 229, 649]",MISC
429,developments,"[230, 633, 358, 649]",MISC
430,within,"[359, 633, 422, 649]",MISC
431,Em,"[423, 633, 508, 649]",MISC
432,##erging,"[423, 633, 508, 649]",MISC
433,Solutions,"[509, 633, 614, 649]",MISC
434,.,"[509, 633, 614, 649]",MISC
435,-,"[616, 633, 618, 649]",MISC
436,NL,"[616, 633, 618, 649]",MISC
437,-,"[616, 633, 618, 649]",MISC
438,•,"[133, 651, 144, 668]",MISC
439,Evan,"[144, 651, 270, 668]",MISC
440,##gel,"[144, 651, 270, 668]",MISC
441,##ized,"[144, 651, 270, 668]",MISC
442,business,"[271, 651, 362, 668]",MISC
443,value,"[363, 651, 421, 668]",MISC
444,of,"[421, 651, 443, 668]",MISC
445,SA,"[444, 651, 478, 668]",MISC
446,##P,"[444, 651, 478, 668]",MISC
447,Business,"[479, 651, 569, 668]",MISC
448,Suite,"[571, 651, 628, 668]",MISC
449,Enterprise,"[629, 651, 743, 668]",MISC
450,Search,"[744, 651, 812, 668]",MISC
451,and,"[813, 651, 846, 668]",MISC
452,SA,"[848, 651, 881, 668]",MISC
453,##P,"[848, 651, 881, 668]",MISC
454,HC,"[882, 651, 916, 668]",MISC
455,##M,"[882, 651, 916, 668]",MISC
456,Pay,"[917, 651, 997, 668]",MISC
457,##roll,"[917, 651, 997, 668]",MISC
458,-,"[998, 651, 1000, 668]",MISC
459,NL,"[998, 651, 1000, 668]",MISC
460,-,"[998, 651, 1000, 668]",MISC
461,Con,"[155, 665, 296, 683]",MISC
462,##fi,"[155, 665, 296, 683]",MISC
463,##gu,"[155, 665, 296, 683]",MISC
464,##ration,"[155, 665, 296, 683]",MISC
465,Ad,"[297, 665, 362, 683]",MISC
466,##d,"[297, 665, 362, 683]",MISC
467,-,"[297, 665, 362, 683]",MISC
468,on,"[297, 665, 362, 683]",MISC
469,to,"[363, 665, 383, 683]",MISC
470,key,"[385, 665, 416, 683]",MISC
471,customers,"[418, 665, 516, 683]",MISC
472,and,"[516, 665, 548, 683]",MISC
473,partners,"[549, 665, 647, 683]",MISC
474,.,"[549, 665, 647, 683]",MISC
475,-,"[648, 665, 650, 683]",MISC
476,NL,"[648, 665, 650, 683]",MISC
477,-,"[648, 665, 650, 683]",MISC
478,•,"[133, 683, 142, 700]",MISC
479,Work,"[144, 683, 209, 700]",MISC
480,##ed,"[144, 683, 209, 700]",MISC
481,with,"[210, 683, 253, 700]",MISC
482,Has,"[255, 683, 308, 700]",MISC
483,##so,"[255, 683, 308, 700]",MISC
484,P,"[310, 683, 397, 700]",MISC
485,##latt,"[310, 683, 397, 700]",MISC
486,##ner,"[310, 683, 397, 700]",MISC
487,Institute,"[399, 683, 497, 700]",MISC
488,to,"[499, 683, 519, 700]",MISC
489,identify,"[521, 683, 608, 700]",MISC
490,and,"[610, 683, 641, 700]",MISC
491,recruit,"[643, 683, 719, 700]",MISC
492,top,"[720, 683, 752, 700]",MISC
493,graduate,"[754, 683, 841, 700]",MISC
494,students,"[842, 683, 929, 700]",MISC
495,for,"[931, 683, 963, 700]",MISC
496,SA,"[964, 683, 996, 700]",MISC
497,##P,"[964, 683, 996, 700]",MISC
498,-,"[998, 683, 1000, 700]",MISC
499,NL,"[998, 683, 1000, 700]",MISC
500,-,"[998, 683, 1000, 700]",MISC
501,Corporate,"[155, 699, 255, 716]",MISC
502,Research,"[255, 699, 344, 716]",MISC
503,and,"[344, 699, 377, 716]",MISC
504,Advanced,"[377, 699, 466, 716]",MISC
505,Technologies,"[466, 699, 611, 716]",MISC
506,.,"[466, 699, 611, 716]",MISC
507,-,"[611, 699, 612, 716]",MISC
508,NL,"[611, 699, 612, 716]",MISC
509,-,"[611, 699, 612, 716]",MISC
510,•,"[133, 716, 142, 734]",MISC
511,Man,"[144, 716, 220, 734]",MISC
512,##aged,"[144, 716, 220, 734]",MISC
513,negotiations,"[222, 716, 353, 734]",MISC
514,with,"[355, 716, 397, 734]",MISC
515,Nokia,"[399, 716, 453, 734]",MISC
516,for,"[454, 716, 486, 734]",MISC
517,co,"[488, 716, 630, 734]",MISC
518,-,"[488, 716, 630, 734]",MISC
519,innovation,"[488, 716, 630, 734]",MISC
520,partnership,"[632, 716, 763, 734]",MISC
521,",","[632, 716, 763, 734]",MISC
522,towards,"[765, 716, 841, 734]",MISC
523,the,"[842, 716, 874, 734]",MISC
524,creation,"[876, 716, 963, 734]",MISC
525,of,"[964, 716, 985, 734]",MISC
526,a,"[987, 716, 996, 734]",MISC
527,-,"[998, 716, 1000, 734]",MISC
528,NL,"[998, 716, 1000, 734]",MISC
529,-,"[998, 716, 1000, 734]",MISC
530,joint,"[155, 732, 209, 750]",MISC
531,development,"[210, 732, 328, 750]",MISC
532,team,"[330, 732, 372, 750]",MISC
533,to,"[374, 732, 394, 750]",MISC
534,build,"[395, 732, 449, 750]",MISC
535,SA,"[450, 732, 482, 750]",MISC
536,##P,"[450, 732, 482, 750]",MISC
537,mobile,"[483, 732, 548, 750]",MISC
538,solutions,"[548, 732, 647, 750]",MISC
539,op,"[647, 732, 745, 750]",MISC
540,##ti,"[647, 732, 745, 750]",MISC
541,##mized,"[647, 732, 745, 750]",MISC
542,for,"[745, 732, 777, 750]",MISC
543,Nokia,"[778, 732, 832, 750]",MISC
544,devices,"[832, 732, 919, 750]",MISC
545,.,"[832, 732, 919, 750]",MISC
546,-,"[920, 732, 922, 750]",MISC
547,NL,"[920, 732, 922, 750]",MISC
548,-,"[920, 732, 922, 750]",MISC
549,Microsoft,"[133, 765, 244, 781]",B-employer_company_name
550,Corporation,"[245, 765, 382, 781]",I-employer_company_name
551,–,"[383, 765, 394, 781]",MISC
552,Information,"[396, 765, 533, 781]",MISC
553,Worker,"[533, 765, 607, 781]",MISC
554,PM,"[608, 765, 632, 781]",MISC
555,Group,"[633, 765, 694, 781]",MISC
556,-,"[696, 765, 698, 781]",MISC
557,NL,"[696, 765, 698, 781]",MISC
558,-,"[696, 765, 698, 781]",MISC
559,Red,"[861, 765, 959, 781]",MISC
560,##mond,"[861, 765, 959, 781]",MISC
561,",","[861, 765, 959, 781]",MISC
562,WA,"[960, 765, 984, 781]",MISC
563,-,"[985, 765, 987, 781]",MISC
564,NL,"[985, 765, 987, 781]",MISC
565,-,"[985, 765, 987, 781]",MISC
566,Senior,"[133, 783, 209, 799]",B-employer_role
567,Product,"[210, 783, 299, 799]",I-employer_role
568,Manager,"[299, 783, 401, 799]",I-employer_role
569,",","[299, 783, 401, 799]",I-employer_role
570,Office,"[402, 783, 478, 799]",I-employer_role
571,System,"[479, 783, 555, 799]",I-employer_role
572,Product,"[556, 783, 645, 799]",I-employer_role
573,Management,"[645, 783, 773, 799]",I-employer_role
574,-,"[774, 783, 775, 799]",MISC
575,NL,"[774, 783, 775, 799]",MISC
576,-,"[774, 783, 775, 799]",MISC
577,2003,"[870, 783, 918, 799]",MISC
578,to,"[920, 783, 944, 799]",MISC
579,2004,"[944, 783, 992, 799]",MISC
580,-,"[994, 783, 996, 799]",MISC
581,NL,"[994, 783, 996, 799]",MISC
582,-,"[994, 783, 996, 799]",MISC
583,•,"[133, 818, 144, 835]",MISC
584,Dr,"[145, 818, 202, 835]",MISC
585,##ove,"[145, 818, 202, 835]",MISC
586,enterprise,"[203, 818, 377, 835]",MISC
587,-,"[203, 818, 377, 835]",MISC
588,wide,"[203, 818, 377, 835]",MISC
589,adoption,"[378, 818, 471, 835]",MISC
590,of,"[472, 818, 494, 835]",MISC
591,Microsoft,"[495, 818, 599, 835]",MISC
592,Office,"[600, 818, 669, 835]",MISC
593,2003,"[670, 818, 717, 835]",MISC
594,in,"[717, 818, 739, 835]",MISC
595,the,"[741, 818, 774, 835]",MISC
596,context,"[776, 818, 857, 835]",MISC
597,of,"[857, 818, 880, 835]",MISC
598,enterprise,"[881, 818, 997, 835]",MISC
599,-,"[998, 818, 1000, 835]",MISC
600,NL,"[998, 818, 1000, 835]",MISC
601,-,"[998, 818, 1000, 835]",MISC
602,business,"[153, 834, 244, 850]",MISC
603,processes,"[246, 834, 361, 850]",MISC
604,.,"[246, 834, 361, 850]",MISC
605,Lai,"[361, 834, 406, 850]",MISC
606,##d,"[361, 834, 406, 850]",MISC
607,the,"[408, 834, 441, 850]",MISC
608,ground,"[442, 834, 511, 850]",MISC
609,work,"[512, 834, 556, 850]",MISC
610,and,"[558, 834, 591, 850]",MISC
611,orchestrated,"[593, 834, 730, 850]",MISC
612,a,"[732, 834, 743, 850]",MISC
613,high,"[743, 834, 788, 850]",MISC
614,impact,"[789, 834, 858, 850]",MISC
615,Go,"[859, 834, 996, 850]",MISC
616,-,"[859, 834, 996, 850]",MISC
617,To,"[859, 834, 996, 850]",MISC
618,-,"[859, 834, 996, 850]",MISC
619,Market,"[859, 834, 996, 850]",MISC
620,-,"[998, 834, 1000, 850]",MISC
621,NL,"[998, 834, 1000, 850]",MISC
622,-,"[998, 834, 1000, 850]",MISC
623,campaign,"[153, 848, 248, 866]",MISC
624,",","[153, 848, 248, 866]",MISC
625,to,"[248, 848, 268, 866]",MISC
626,drive,"[269, 848, 321, 866]",MISC
627,business,"[322, 848, 405, 866]",MISC
628,process,"[406, 848, 478, 866]",MISC
629,collaboration,"[480, 848, 615, 866]",MISC
630,solutions,"[617, 848, 711, 866]",MISC
631,deployment,"[711, 848, 826, 866]",MISC
632,.,"[711, 848, 826, 866]",MISC
633,-,"[827, 848, 829, 866]",MISC
634,NL,"[827, 848, 829, 866]",MISC
635,-,"[827, 848, 829, 866]",MISC
636,•,"[133, 867, 144, 885]",MISC
637,Work,"[145, 867, 217, 885]",MISC
638,##ed,"[145, 867, 217, 885]",MISC
639,with,"[218, 867, 266, 885]",MISC
640,corporate,"[267, 867, 376, 885]",MISC
641,sales,"[376, 867, 436, 885]",MISC
642,and,"[437, 867, 473, 885]",MISC
643,marketing,"[474, 867, 583, 885]",MISC
644,teams,"[584, 867, 643, 885]",MISC
645,and,"[644, 867, 680, 885]",MISC
646,key,"[681, 867, 716, 885]",MISC
647,partners,"[717, 867, 814, 885]",MISC
648,to,"[815, 867, 839, 885]",MISC
649,create,"[839, 867, 912, 885]",MISC
650,content,"[912, 867, 998, 885]",MISC
651,-,"[998, 867, 1000, 885]",MISC
652,NL,"[998, 867, 1000, 885]",MISC
653,-,"[998, 867, 1000, 885]",MISC
654,(,"[153, 883, 220, 901]",MISC
655,white,"[153, 883, 220, 901]",MISC
656,papers,"[220, 883, 298, 901]",MISC
657,",","[220, 883, 298, 901]",MISC
658,customer,"[298, 883, 387, 901]",MISC
659,references,"[387, 883, 509, 901]",MISC
660,",","[387, 883, 509, 901]",MISC
661,presentations,"[509, 883, 664, 901]",MISC
662,",","[509, 883, 664, 901]",MISC
663,and,"[664, 883, 698, 901]",MISC
664,product,"[698, 883, 775, 901]",MISC
665,data,"[775, 883, 820, 901]",MISC
666,sheets,"[820, 883, 898, 901]",MISC
667,),"[820, 883, 898, 901]",MISC
668,for,"[898, 883, 931, 901]",MISC
669,global,"[931, 883, 998, 901]",MISC
670,-,"[998, 883, 1000, 901]",MISC
671,NL,"[998, 883, 1000, 901]",MISC
672,-,"[998, 883, 1000, 901]",MISC
673,field,"[146, 899, 209, 915]",MISC
674,.,"[146, 899, 209, 915]",MISC
675,Evan,"[210, 899, 326, 915]",MISC
676,##gel,"[210, 899, 326, 915]",MISC
677,##ized,"[210, 899, 326, 915]",MISC
678,business,"[327, 899, 410, 915]",MISC
679,value,"[412, 899, 464, 915]",MISC
680,of,"[465, 899, 485, 915]",MISC
681,Microsoft,"[486, 899, 581, 915]",MISC
682,Office,"[582, 899, 645, 915]",MISC
683,to,"[646, 899, 666, 915]",MISC
684,key,"[667, 899, 699, 915]",MISC
685,decision,"[699, 899, 782, 915]",MISC
686,makers,"[784, 899, 858, 915]",MISC
687,.,"[784, 899, 858, 915]",MISC
688,-,"[859, 899, 861, 915]",MISC
689,NL,"[859, 899, 861, 915]",MISC
690,-,"[859, 899, 861, 915]",MISC
691,•,"[133, 917, 144, 934]",MISC
692,Support,"[144, 917, 248, 934]",MISC
693,##ed,"[144, 917, 248, 934]",MISC
694,product,"[248, 917, 328, 934]",MISC
695,planning,"[329, 917, 420, 934]",MISC
696,for,"[421, 917, 454, 934]",MISC
697,future,"[456, 917, 524, 934]",MISC
698,XML,"[525, 917, 629, 934]",MISC
699,-,"[525, 917, 629, 934]",MISC
700,based,"[525, 917, 629, 934]",MISC
701,solutions,"[629, 917, 732, 934]",MISC
702,enable,"[732, 917, 823, 934]",MISC
703,##rs,"[732, 917, 823, 934]",MISC
704,such,"[825, 917, 869, 934]",MISC
705,as,"[871, 917, 893, 934]",MISC
706,Microsoft,"[894, 917, 998, 934]",MISC
707,-,"[998, 917, 1000, 934]",MISC
708,NL,"[998, 917, 1000, 934]",MISC
709,-,"[998, 917, 1000, 934]",MISC
710,Office,"[153, 931, 218, 949]",MISC
711,In,"[219, 931, 317, 949]",MISC
712,##fo,"[219, 931, 317, 949]",MISC
713,##P,"[219, 931, 317, 949]",MISC
714,##ath,"[219, 931, 317, 949]",MISC
715,",","[219, 931, 317, 949]",MISC
716,Word,"[318, 931, 371, 949]",MISC
717,",","[318, 931, 371, 949]",MISC
718,and,"[373, 931, 404, 949]",MISC
719,Ex,"[405, 931, 459, 949]",MISC
720,##cel,"[405, 931, 459, 949]",MISC
721,Smart,"[460, 931, 514, 949]",MISC
722,Doc,"[515, 931, 569, 949]",MISC
723,##s,"[515, 931, 569, 949]",MISC
724,.,"[515, 931, 569, 949]",MISC
725,-,"[570, 931, 572, 949]",MISC
726,NL,"[570, 931, 572, 949]",MISC
727,-,"[570, 931, 572, 949]",MISC
728,•,"[133, 949, 142, 965]",MISC
729,Work,"[143, 949, 206, 965]",MISC
730,##ed,"[143, 949, 206, 965]",MISC
731,as,"[206, 949, 227, 965]",MISC
732,liaison,"[228, 949, 300, 965]",MISC
733,with,"[301, 949, 342, 965]",MISC
734,Microsoft,"[343, 949, 438, 965]",MISC
735,Research,"[438, 949, 521, 965]",MISC
736,to,"[522, 949, 542, 965]",MISC
737,product,"[543, 949, 647, 965]",MISC
738,##ize,"[543, 949, 647, 965]",MISC
739,Microsoft,"[648, 949, 743, 965]",MISC
740,office,"[743, 949, 806, 965]",MISC
741,translator,"[806, 949, 921, 965]",MISC
742,.,"[806, 949, 921, 965]",MISC
743,-,"[922, 949, 924, 965]",MISC
744,NL,"[922, 949, 924, 965]",MISC
745,-,"[922, 949, 924, 965]",MISC
746,•,"[133, 966, 144, 984]",MISC
747,De,"[145, 966, 226, 984]",MISC
748,##fine,"[145, 966, 226, 984]",MISC
749,##d,"[145, 966, 226, 984]",MISC
750,the,"[228, 966, 263, 984]",MISC
751,scope,"[263, 966, 321, 984]",MISC
752,of,"[322, 966, 345, 984]",MISC
753,the,"[346, 966, 381, 984]",MISC
754,program,"[382, 966, 463, 984]",MISC
755,and,"[465, 966, 500, 984]",MISC
756,produced,"[500, 966, 595, 984]",MISC
757,computer,"[595, 966, 689, 984]",MISC
758,animation,"[690, 966, 795, 984]",MISC
759,to,"[796, 966, 818, 984]",MISC
760,showcase,"[820, 966, 914, 984]",MISC
761,value,"[915, 966, 972, 984]",MISC
762,of,"[974, 966, 996, 984]",MISC
763,-,"[998, 966, 1000, 984]",MISC
764,NL,"[998, 966, 1000, 984]",MISC
765,-,"[998, 966, 1000, 984]",MISC
766,Microsoft,"[153, 982, 251, 1000]",MISC
767,Office,"[253, 982, 318, 1000]",MISC
768,XML,"[319, 982, 351, 1000]",MISC
769,Web,"[352, 982, 384, 1000]",MISC
770,Services,"[385, 982, 472, 1000]",MISC
771,in,"[474, 982, 494, 1000]",MISC
772,enterprise,"[496, 982, 605, 1000]",MISC
773,Business,"[606, 982, 694, 1000]",MISC
774,Process,"[695, 982, 771, 1000]",MISC
775,Management,"[772, 982, 893, 1000]",MISC
776,.,"[772, 982, 893, 1000]",MISC
777,-,"[894, 982, 896, 1000]",MISC
778,NL,"[894, 982, 896, 1000]",MISC
779,-,"[894, 982, 896, 1000]",MISC
780,!,"[133, 49, 155, 68]",MISC
781,2,"[133, 49, 155, 68]",MISC
782,of,"[155, 49, 177, 68]",MISC
783,!,"[177, 49, 200, 68]",MISC
784,3,"[177, 49, 200, 68]",MISC
785,-,"[200, 49, 201, 68]",MISC
786,NL,"[200, 49, 201, 68]",MISC
787,-,"[200, 49, 201, 68]",MISC
788,N,"[133, 120, 209, 138]",B-employer_company_name
789,##uan,"[133, 120, 209, 138]",I-employer_company_name
790,##ce,"[133, 120, 209, 138]",I-employer_company_name
791,Communications,"[210, 120, 387, 138]",I-employer_company_name
792,-,"[388, 120, 390, 138]",MISC
793,NL,"[388, 120, 390, 138]",MISC
794,-,"[388, 120, 390, 138]",MISC
795,Men,"[855, 120, 909, 136]",MISC
796,##lo,"[855, 120, 909, 136]",MISC
797,Park,"[910, 120, 964, 136]",MISC
798,",","[910, 120, 964, 136]",MISC
799,CA,"[965, 120, 985, 136]",MISC
800,-,"[987, 120, 988, 136]",MISC
801,NL,"[987, 120, 988, 136]",MISC
802,-,"[987, 120, 988, 136]",MISC
803,Senior,"[133, 138, 203, 155]",B-employer_role
804,Product,"[205, 138, 288, 155]",I-employer_role
805,Manager,"[288, 138, 383, 155]",I-employer_role
806,",","[288, 138, 383, 155]",I-employer_role
807,International,"[384, 138, 537, 155]",I-employer_role
808,Products,"[539, 138, 634, 155]",I-employer_role
809,-,"[635, 138, 637, 155]",MISC
810,NL,"[635, 138, 637, 155]",MISC
811,-,"[635, 138, 637, 155]",MISC
812,2000,"[870, 138, 918, 155]",MISC
813,to,"[920, 138, 944, 155]",MISC
814,2001,"[944, 138, 992, 155]",MISC
815,-,"[994, 138, 996, 155]",MISC
816,NL,"[994, 138, 996, 155]",MISC
817,-,"[994, 138, 996, 155]",MISC
818,•,"[133, 172, 142, 190]",MISC
819,Evan,"[144, 172, 264, 190]",MISC
820,##gel,"[144, 172, 264, 190]",MISC
821,##ized,"[144, 172, 264, 190]",MISC
822,and,"[266, 172, 297, 190]",MISC
823,worked,"[299, 172, 364, 190]",MISC
824,with,"[366, 172, 408, 190]",MISC
825,key,"[410, 172, 441, 190]",MISC
826,global,"[443, 172, 508, 190]",MISC
827,partners,"[510, 172, 597, 190]",MISC
828,to,"[599, 172, 619, 190]",MISC
829,drive,"[621, 172, 674, 190]",MISC
830,the,"[676, 172, 708, 190]",MISC
831,tight,"[709, 172, 763, 190]",MISC
832,integration,"[765, 172, 885, 190]",MISC
833,of,"[887, 172, 907, 190]",MISC
834,N,"[909, 172, 996, 190]",MISC
835,##uan,"[909, 172, 996, 190]",MISC
836,##ce,"[909, 172, 996, 190]",MISC
837,’,"[909, 172, 996, 190]",MISC
838,s,"[909, 172, 996, 190]",MISC
839,-,"[998, 172, 1000, 190]",MISC
840,NL,"[998, 172, 1000, 190]",MISC
841,-,"[998, 172, 1000, 190]",MISC
842,speech,"[153, 188, 218, 204]",MISC
843,recognition,"[219, 188, 339, 204]",MISC
844,engine,"[339, 188, 404, 204]",MISC
845,with,"[405, 188, 448, 204]",MISC
846,Voice,"[449, 188, 503, 204]",MISC
847,XML,"[504, 188, 535, 204]",MISC
848,and,"[537, 188, 568, 204]",MISC
849,Interactive,"[570, 188, 690, 204]",MISC
850,Voice,"[690, 188, 744, 204]",MISC
851,Response,"[745, 188, 832, 204]",MISC
852,platforms,"[833, 188, 942, 204]",MISC
853,.,"[833, 188, 942, 204]",MISC
854,-,"[942, 188, 944, 204]",MISC
855,NL,"[942, 188, 944, 204]",MISC
856,-,"[942, 188, 944, 204]",MISC
857,•,"[133, 206, 144, 223]",MISC
858,N,"[144, 206, 255, 223]",MISC
859,##ego,"[144, 206, 255, 223]",MISC
860,##tia,"[144, 206, 255, 223]",MISC
861,##ted,"[144, 206, 255, 223]",MISC
862,O,"[256, 206, 290, 223]",MISC
863,##EM,"[256, 206, 290, 223]",MISC
864,contracts,"[290, 206, 390, 223]",MISC
865,and,"[391, 206, 424, 223]",MISC
866,wrote,"[425, 206, 480, 223]",MISC
867,Marketing,"[481, 206, 581, 223]",MISC
868,Re,"[582, 206, 715, 223]",MISC
869,##quire,"[582, 206, 715, 223]",MISC
870,##ments,"[582, 206, 715, 223]",MISC
871,Doc,"[717, 206, 817, 223]",MISC
872,##ume,"[717, 206, 817, 223]",MISC
873,##nts,"[717, 206, 817, 223]",MISC
874,for,"[818, 206, 851, 223]",MISC
875,international,"[852, 206, 996, 223]",MISC
876,-,"[998, 206, 1000, 223]",MISC
877,NL,"[998, 206, 1000, 223]",MISC
878,-,"[998, 206, 1000, 223]",MISC
879,products,"[153, 220, 240, 238]",MISC
880,.,"[153, 220, 240, 238]",MISC
881,-,"[240, 220, 242, 238]",MISC
882,NL,"[240, 220, 242, 238]",MISC
883,-,"[240, 220, 242, 238]",MISC
884,•,"[133, 238, 144, 255]",MISC
885,Man,"[144, 238, 224, 255]",MISC
886,##aged,"[144, 238, 224, 255]",MISC
887,expansion,"[224, 238, 326, 255]",MISC
888,of,"[326, 238, 349, 255]",MISC
889,N,"[349, 238, 416, 255]",MISC
890,##uan,"[349, 238, 416, 255]",MISC
891,##ce,"[349, 238, 416, 255]",MISC
892,international,"[417, 238, 564, 255]",MISC
893,coverage,"[565, 238, 656, 255]",MISC
894,from,"[656, 238, 701, 255]",MISC
895,14,"[702, 238, 724, 255]",MISC
896,to,"[725, 238, 747, 255]",MISC
897,25,"[747, 238, 770, 255]",MISC
898,languages,"[770, 238, 883, 255]",MISC
899,",","[770, 238, 883, 255]",MISC
900,increasing,"[884, 238, 997, 255]",MISC
901,-,"[998, 238, 1000, 255]",MISC
902,NL,"[998, 238, 1000, 255]",MISC
903,-,"[998, 238, 1000, 255]",MISC
904,international,"[153, 254, 296, 270]",MISC
905,sales,"[297, 254, 351, 270]",MISC
906,from,"[352, 254, 395, 270]",MISC
907,21,"[397, 254, 428, 270]",MISC
908,%,"[397, 254, 428, 270]",MISC
909,to,"[430, 254, 450, 270]",MISC
910,47,"[452, 254, 484, 270]",MISC
911,%,"[452, 254, 484, 270]",MISC
912,of,"[485, 254, 506, 270]",MISC
913,total,"[507, 254, 561, 270]",MISC
914,revenue,"[563, 254, 650, 270]",MISC
915,.,"[563, 254, 650, 270]",MISC
916,-,"[651, 254, 653, 270]",MISC
917,NL,"[651, 254, 653, 270]",MISC
918,-,"[651, 254, 653, 270]",MISC
919,•,"[133, 271, 144, 289]",MISC
920,Created,"[144, 271, 222, 289]",MISC
921,and,"[223, 271, 256, 289]",MISC
922,managed,"[256, 271, 334, 289]",MISC
923,cross,"[335, 271, 515, 289]",MISC
924,-,"[335, 271, 515, 289]",MISC
925,functional,"[335, 271, 515, 289]",MISC
926,“,"[515, 271, 761, 289]",MISC
927,international,"[515, 271, 761, 289]",MISC
928,##ization,"[515, 271, 761, 289]",MISC
929,”,"[515, 271, 761, 289]",MISC
930,teams,"[762, 271, 817, 289]",MISC
931,of,"[818, 271, 840, 289]",MISC
932,development,"[840, 271, 974, 289]",MISC
933,",","[840, 271, 974, 289]",MISC
934,to,"[975, 271, 997, 289]",MISC
935,-,"[998, 271, 1000, 289]",MISC
936,NL,"[998, 271, 1000, 289]",MISC
937,-,"[998, 271, 1000, 289]",MISC
938,ensure,"[153, 287, 218, 305]",MISC
939,that,"[219, 287, 262, 305]",MISC
940,all,"[263, 287, 295, 305]",MISC
941,new,"[296, 287, 328, 305]",MISC
942,releases,"[329, 287, 416, 305]",MISC
943,are,"[417, 287, 449, 305]",MISC
944,ready,"[450, 287, 504, 305]",MISC
945,for,"[505, 287, 537, 305]",MISC
946,global,"[538, 287, 603, 305]",MISC
947,deployment,"[604, 287, 725, 305]",MISC
948,.,"[604, 287, 725, 305]",MISC
949,-,"[725, 287, 727, 305]",MISC
950,NL,"[725, 287, 727, 305]",MISC
951,-,"[725, 287, 727, 305]",MISC
952,SA,"[133, 321, 174, 337]",B-employer_company_name
953,##P,"[133, 321, 174, 337]",I-employer_company_name
954,Labs,"[174, 321, 228, 337]",I-employer_company_name
955,-,"[229, 321, 231, 337]",MISC
956,NL,"[229, 321, 231, 337]",MISC
957,-,"[229, 321, 231, 337]",MISC
958,Pa,"[877, 321, 916, 337]",MISC
959,##lo,"[877, 321, 916, 337]",MISC
960,Alto,"[918, 321, 968, 337]",MISC
961,",","[918, 321, 968, 337]",MISC
962,CA,"[968, 321, 987, 337]",MISC
963,-,"[988, 321, 990, 337]",MISC
964,NL,"[988, 321, 990, 337]",MISC
965,-,"[988, 321, 990, 337]",MISC
966,Product,"[133, 338, 220, 354]",B-employer_role
967,Manager,"[220, 338, 320, 354]",I-employer_role
968,",","[220, 338, 320, 354]",I-employer_role
969,Internet,"[320, 338, 420, 354]",I-employer_role
970,Business,"[420, 338, 520, 354]",I-employer_role
971,Framework,"[520, 338, 631, 354]",I-employer_role
972,-,"[633, 338, 635, 354]",MISC
973,NL,"[633, 338, 635, 354]",MISC
974,-,"[633, 338, 635, 354]",MISC
975,1998,"[870, 338, 918, 354]",MISC
976,to,"[920, 338, 944, 354]",MISC
977,2000,"[944, 338, 992, 354]",MISC
978,-,"[994, 338, 996, 354]",MISC
979,NL,"[994, 338, 996, 354]",MISC
980,-,"[994, 338, 996, 354]",MISC
981,•,"[133, 372, 144, 389]",MISC
982,Created,"[144, 372, 222, 389]",MISC
983,partnership,"[223, 372, 345, 389]",MISC
984,strategies,"[346, 372, 457, 389]",MISC
985,around,"[459, 372, 525, 389]",MISC
986,SA,"[526, 372, 559, 389]",MISC
987,##P,"[526, 372, 559, 389]",MISC
988,Internet,"[560, 372, 649, 389]",MISC
989,Business,"[649, 372, 738, 389]",MISC
990,Framework,"[739, 372, 850, 389]",MISC
991,",","[739, 372, 850, 389]",MISC
992,the,"[852, 372, 885, 389]",MISC
993,SA,"[885, 372, 919, 389]",MISC
994,##P,"[885, 372, 919, 389]",MISC
995,array,"[919, 372, 975, 389]",MISC
996,of,"[975, 372, 997, 389]",MISC
997,-,"[998, 372, 1000, 389]",MISC
998,NL,"[998, 372, 1000, 389]",MISC
999,-,"[998, 372, 1000, 389]",MISC
1000,API,"[153, 388, 205, 405]",MISC
1001,’,"[153, 388, 205, 405]",MISC
1002,s,"[153, 388, 205, 405]",MISC
1003,and,"[206, 388, 237, 405]",MISC
1004,enabling,"[238, 388, 321, 405]",MISC
1005,technologies,"[322, 388, 448, 405]",MISC
1006,for,"[449, 388, 480, 405]",MISC
1007,e,"[480, 388, 584, 405]",MISC
1008,-,"[480, 388, 584, 405]",MISC
1009,business,"[480, 388, 584, 405]",MISC
1010,and,"[586, 388, 617, 405]",MISC
1011,Enterprise,"[617, 388, 721, 405]",MISC
1012,A,"[723, 388, 754, 405]",MISC
1013,##pp,"[723, 388, 754, 405]",MISC
1014,Integration,"[754, 388, 880, 405]",MISC
1015,.,"[754, 388, 880, 405]",MISC
1016,-,"[881, 388, 883, 405]",MISC
1017,NL,"[881, 388, 883, 405]",MISC
1018,-,"[881, 388, 883, 405]",MISC
1019,•,"[133, 406, 144, 422]",MISC
1020,Work,"[145, 406, 213, 422]",MISC
1021,##ed,"[145, 406, 213, 422]",MISC
1022,with,"[215, 406, 261, 422]",MISC
1023,key,"[261, 406, 295, 422]",MISC
1024,pilot,"[296, 406, 354, 422]",MISC
1025,customers,"[355, 406, 472, 422]",MISC
1026,",","[355, 406, 472, 422]",MISC
1027,partners,"[472, 406, 575, 422]",MISC
1028,",","[472, 406, 575, 422]",MISC
1029,SA,"[577, 406, 610, 422]",MISC
1030,##P,"[577, 406, 610, 422]",MISC
1031,development,"[612, 406, 740, 422]",MISC
1032,groups,"[741, 406, 822, 422]",MISC
1033,",","[741, 406, 822, 422]",MISC
1034,and,"[822, 406, 856, 422]",MISC
1035,professional,"[857, 406, 996, 422]",MISC
1036,-,"[998, 406, 1000, 422]",MISC
1037,NL,"[998, 406, 1000, 422]",MISC
1038,-,"[998, 406, 1000, 422]",MISC
1039,services,"[153, 421, 242, 438]",MISC
1040,to,"[242, 421, 264, 438]",MISC
1041,define,"[264, 421, 331, 438]",MISC
1042,e,"[331, 421, 442, 438]",MISC
1043,-,"[331, 421, 442, 438]",MISC
1044,business,"[331, 421, 442, 438]",MISC
1045,deployment,"[442, 421, 553, 438]",MISC
1046,projects,"[553, 421, 642, 438]",MISC
1047,for,"[642, 421, 675, 438]",MISC
1048,XML,"[675, 421, 709, 438]",MISC
1049,connectivity,"[709, 421, 842, 438]",MISC
1050,and,"[842, 421, 875, 438]",MISC
1051,integration,"[875, 421, 998, 438]",MISC
1052,-,"[998, 421, 1000, 438]",MISC
1053,NL,"[998, 421, 1000, 438]",MISC
1054,-,"[998, 421, 1000, 438]",MISC
1055,with,"[153, 437, 198, 454]",MISC
1056,the,"[198, 437, 231, 454]",MISC
1057,My,"[231, 437, 331, 454]",MISC
1058,##SA,"[231, 437, 331, 454]",MISC
1059,##P,"[231, 437, 331, 454]",MISC
1060,.,"[231, 437, 331, 454]",MISC
1061,com,"[231, 437, 331, 454]",MISC
1062,global,"[332, 437, 398, 454]",MISC
1063,e,"[399, 437, 510, 454]",MISC
1064,-,"[399, 437, 510, 454]",MISC
1065,business,"[399, 437, 510, 454]",MISC
1066,hub,"[510, 437, 555, 454]",MISC
1067,.,"[510, 437, 555, 454]",MISC
1068,-,"[555, 437, 557, 454]",MISC
1069,NL,"[555, 437, 557, 454]",MISC
1070,-,"[555, 437, 557, 454]",MISC
1071,•,"[133, 454, 144, 472]",MISC
1072,Created,"[144, 454, 224, 472]",MISC
1073,training,"[224, 454, 315, 472]",MISC
1074,workshops,"[315, 454, 417, 472]",MISC
1075,and,"[417, 454, 451, 472]",MISC
1076,promoted,"[451, 454, 542, 472]",MISC
1077,product,"[542, 454, 622, 472]",MISC
1078,positioning,"[622, 454, 746, 472]",MISC
1079,to,"[747, 454, 770, 472]",MISC
1080,Sales,"[770, 454, 837, 472]",MISC
1081,",","[770, 454, 837, 472]",MISC
1082,Consul,"[838, 454, 962, 472]",MISC
1083,##ting,"[838, 454, 962, 472]",MISC
1084,",","[838, 454, 962, 472]",MISC
1085,and,"[964, 454, 997, 472]",MISC
1086,-,"[998, 454, 1000, 472]",MISC
1087,NL,"[998, 454, 1000, 472]",MISC
1088,-,"[998, 454, 1000, 472]",MISC
1089,key,"[153, 470, 185, 486]",MISC
1090,customers,"[186, 470, 293, 486]",MISC
1091,.,"[186, 470, 293, 486]",MISC
1092,-,"[294, 470, 296, 486]",MISC
1093,NL,"[294, 470, 296, 486]",MISC
1094,-,"[294, 470, 296, 486]",MISC
1095,•,"[133, 488, 142, 505]",MISC
1096,Man,"[144, 488, 220, 505]",MISC
1097,##aged,"[144, 488, 220, 505]",MISC
1098,creation,"[220, 488, 307, 505]",MISC
1099,of,"[308, 488, 328, 505]",MISC
1100,co,"[330, 488, 450, 505]",MISC
1101,##lla,"[330, 488, 450, 505]",MISC
1102,##teral,"[330, 488, 450, 505]",MISC
1103,",","[330, 488, 450, 505]",MISC
1104,including,"[450, 488, 548, 505]",MISC
1105,white,"[549, 488, 603, 505]",MISC
1106,papers,"[604, 488, 679, 505]",MISC
1107,",","[604, 488, 679, 505]",MISC
1108,customer,"[680, 488, 767, 505]",MISC
1109,references,"[768, 488, 888, 505]",MISC
1110,",","[768, 488, 888, 505]",MISC
1111,and,"[888, 488, 920, 505]",MISC
1112,product,"[921, 488, 997, 505]",MISC
1113,-,"[998, 488, 1000, 505]",MISC
1114,NL,"[998, 488, 1000, 505]",MISC
1115,-,"[998, 488, 1000, 505]",MISC
1116,data,"[153, 502, 194, 520]",MISC
1117,sheets,"[194, 502, 265, 520]",MISC
1118,.,"[194, 502, 265, 520]",MISC
1119,-,"[266, 502, 268, 520]",MISC
1120,NL,"[266, 502, 268, 520]",MISC
1121,-,"[266, 502, 268, 520]",MISC
1122,•,"[133, 521, 144, 537]",MISC
1123,Man,"[145, 521, 226, 537]",MISC
1124,##aged,"[145, 521, 226, 537]",MISC
1125,monthly,"[228, 521, 309, 537]",MISC
1126,conference,"[311, 521, 427, 537]",MISC
1127,calls,"[429, 521, 486, 537]",MISC
1128,for,"[488, 521, 523, 537]",MISC
1129,SA,"[524, 521, 559, 537]",MISC
1130,##P,"[524, 521, 559, 537]",MISC
1131,AL,"[559, 521, 595, 537]",MISC
1132,##E,"[559, 521, 595, 537]",MISC
1133,Use,"[595, 521, 641, 537]",MISC
1134,##r,"[595, 521, 641, 537]",MISC
1135,Group,"[642, 521, 700, 537]",MISC
1136,in,"[701, 521, 724, 537]",MISC
1137,North,"[725, 521, 783, 537]",MISC
1138,America,"[784, 521, 866, 537]",MISC
1139,to,"[867, 521, 890, 537]",MISC
1140,track,"[891, 521, 948, 537]",MISC
1141,open,"[950, 521, 997, 537]",MISC
1142,-,"[998, 521, 999, 537]",MISC
1143,NL,"[998, 521, 999, 537]",MISC
1144,-,"[998, 521, 999, 537]",MISC
1145,tech,"[153, 536, 196, 553]",MISC
1146,support,"[197, 536, 273, 553]",MISC
1147,issues,"[273, 536, 349, 553]",MISC
1148,.,"[273, 536, 349, 553]",MISC
1149,Man,"[349, 536, 425, 553]",MISC
1150,##aged,"[349, 536, 425, 553]",MISC
1151,communications,"[425, 536, 577, 553]",MISC
1152,for,"[578, 536, 609, 553]",MISC
1153,product,"[611, 536, 687, 553]",MISC
1154,release,"[687, 536, 763, 553]",MISC
1155,milestone,"[763, 536, 882, 553]",MISC
1156,##s,"[763, 536, 882, 553]",MISC
1157,.,"[763, 536, 882, 553]",MISC
1158,-,"[883, 536, 885, 553]",MISC
1159,NL,"[883, 536, 885, 553]",MISC
1160,-,"[883, 536, 885, 553]",MISC
1161,•,"[133, 553, 144, 571]",MISC
1162,Pro,"[144, 553, 237, 571]",MISC
1163,##vide,"[144, 553, 237, 571]",MISC
1164,##d,"[144, 553, 237, 571]",MISC
1165,support,"[237, 553, 317, 571]",MISC
1166,for,"[318, 553, 352, 571]",MISC
1167,SA,"[353, 553, 386, 571]",MISC
1168,##P,"[353, 553, 386, 571]",MISC
1169,e,"[388, 553, 503, 571]",MISC
1170,##co,"[388, 553, 503, 571]",MISC
1171,-,"[388, 553, 503, 571]",MISC
1172,system,"[388, 553, 503, 571]",MISC
1173,at,"[504, 553, 526, 571]",MISC
1174,SA,"[527, 553, 560, 571]",MISC
1175,##P,"[527, 553, 560, 571]",MISC
1176,Tech,"[562, 553, 630, 571]",MISC
1177,##E,"[562, 553, 630, 571]",MISC
1178,##d,"[562, 553, 630, 571]",MISC
1179,and,"[631, 553, 664, 571]",MISC
1180,SA,"[666, 553, 758, 571]",MISC
1181,##PP,"[666, 553, 758, 571]",MISC
1182,##H,"[666, 553, 758, 571]",MISC
1183,##IR,"[666, 553, 758, 571]",MISC
1184,##E,"[666, 553, 758, 571]",MISC
1185,conferences,"[759, 553, 897, 571]",MISC
1186,.,"[759, 553, 897, 571]",MISC
1187,-,"[898, 553, 900, 571]",MISC
1188,NL,"[898, 553, 900, 571]",MISC
1189,-,"[898, 553, 900, 571]",MISC
1190,Oracle,"[133, 587, 203, 603]",B-employer_company_name
1191,Corporation,"[205, 587, 336, 603]",I-employer_company_name
1192,–,"[337, 587, 348, 603]",MISC
1193,Server,"[349, 587, 419, 603]",MISC
1194,Technologies,"[420, 587, 563, 603]",MISC
1195,-,"[564, 587, 566, 603]",MISC
1196,NL,"[564, 587, 566, 603]",MISC
1197,-,"[564, 587, 566, 603]",MISC
1198,Red,"[803, 587, 881, 603]",MISC
1199,##wood,"[803, 587, 881, 603]",MISC
1200,Shore,"[883, 587, 960, 603]",MISC
1201,##s,"[883, 587, 960, 603]",MISC
1202,",","[883, 587, 960, 603]",MISC
1203,CA,"[962, 587, 984, 603]",MISC
1204,-,"[985, 587, 987, 603]",MISC
1205,NL,"[985, 587, 987, 603]",MISC
1206,-,"[985, 587, 987, 603]",MISC
1207,Senior,"[133, 604, 203, 620]",B-employer_role
1208,Product,"[205, 604, 288, 620]",I-employer_role
1209,Manager,"[289, 604, 383, 620]",I-employer_role
1210,",","[289, 604, 383, 620]",I-employer_role
1211,Real,"[385, 604, 431, 620]",I-employer_role
1212,Application,"[433, 604, 565, 620]",I-employer_role
1213,C,"[565, 604, 649, 620]",I-employer_role
1214,##luster,"[565, 604, 649, 620]",I-employer_role
1215,-,"[650, 604, 651, 620]",MISC
1216,NL,"[650, 604, 651, 620]",MISC
1217,-,"[650, 604, 651, 620]",MISC
1218,1994,"[872, 604, 918, 620]",MISC
1219,to,"[918, 604, 941, 620]",MISC
1220,1998,"[942, 604, 988, 620]",MISC
1221,-,"[988, 604, 990, 620]",MISC
1222,NL,"[988, 604, 990, 620]",MISC
1223,-,"[988, 604, 990, 620]",MISC
1224,•,"[133, 638, 144, 655]",MISC
1225,Dev,"[144, 638, 244, 655]",MISC
1226,##elo,"[144, 638, 244, 655]",MISC
1227,##ped,"[144, 638, 244, 655]",MISC
1228,presentations,"[245, 638, 390, 655]",MISC
1229,and,"[391, 638, 424, 655]",MISC
1230,white,"[425, 638, 480, 655]",MISC
1231,papers,"[481, 638, 548, 655]",MISC
1232,on,"[548, 638, 571, 655]",MISC
1233,Oracle,"[571, 638, 649, 655]",MISC
1234,##8,"[571, 638, 649, 655]",MISC
1235,Para,"[649, 638, 738, 655]",MISC
1236,##lle,"[649, 638, 738, 655]",MISC
1237,##l,"[649, 638, 738, 655]",MISC
1238,Server,"[739, 638, 817, 655]",MISC
1239,",","[739, 638, 817, 655]",MISC
1240,Oracle,"[818, 638, 907, 655]",MISC
1241,’,"[818, 638, 907, 655]",MISC
1242,s,"[818, 638, 907, 655]",MISC
1243,s,"[908, 638, 997, 655]",MISC
1244,##cal,"[908, 638, 997, 655]",MISC
1245,##able,"[908, 638, 997, 655]",MISC
1246,-,"[998, 638, 1000, 655]",MISC
1247,NL,"[998, 638, 1000, 655]",MISC
1248,-,"[998, 638, 1000, 655]",MISC
1249,cluster,"[153, 654, 222, 671]",MISC
1250,platform,"[223, 654, 303, 671]",MISC
1251,for,"[303, 654, 332, 671]",MISC
1252,business,"[332, 654, 501, 671]",MISC
1253,-,"[332, 654, 501, 671]",MISC
1254,critical,"[332, 654, 501, 671]",MISC
1255,O,"[502, 654, 541, 671]",MISC
1256,##LT,"[502, 654, 541, 671]",MISC
1257,##P,"[502, 654, 541, 671]",MISC
1258,applications,"[542, 654, 669, 671]",MISC
1259,",","[542, 654, 669, 671]",MISC
1260,prior,"[671, 654, 719, 671]",MISC
1261,to,"[721, 654, 739, 671]",MISC
1262,Real,"[741, 654, 780, 671]",MISC
1263,Application,"[781, 654, 890, 671]",MISC
1264,C,"[890, 654, 970, 671]",MISC
1265,##luster,"[890, 654, 970, 671]",MISC
1266,.,"[890, 654, 970, 671]",MISC
1267,-,"[970, 654, 972, 671]",MISC
1268,NL,"[970, 654, 972, 671]",MISC
1269,-,"[970, 654, 972, 671]",MISC
1270,•,"[133, 671, 144, 688]",MISC
1271,Led,"[144, 671, 178, 688]",MISC
1272,team,"[179, 671, 223, 688]",MISC
1273,of,"[225, 671, 247, 688]",MISC
1274,four,"[248, 671, 293, 688]",MISC
1275,(,"[294, 671, 339, 688]",MISC
1276,two,"[294, 671, 339, 688]",MISC
1277,engineers,"[340, 671, 455, 688]",MISC
1278,",","[340, 671, 455, 688]",MISC
1279,one,"[456, 671, 489, 688]",MISC
1280,Q,"[490, 671, 513, 688]",MISC
1281,##A,"[490, 671, 513, 688]",MISC
1282,test,"[513, 671, 593, 688]",MISC
1283,##er,"[513, 671, 593, 688]",MISC
1284,",","[513, 671, 593, 688]",MISC
1285,one,"[594, 671, 627, 688]",MISC
1286,tech,"[629, 671, 673, 688]",MISC
1287,writer,"[675, 671, 754, 688]",MISC
1288,),"[675, 671, 754, 688]",MISC
1289,to,"[756, 671, 778, 688]",MISC
1290,release,"[779, 671, 858, 688]",MISC
1291,Oracle,"[859, 671, 939, 688]",MISC
1292,##8,"[859, 671, 939, 688]",MISC
1293,PS,"[940, 671, 997, 688]",MISC
1294,/,"[940, 671, 997, 688]",MISC
1295,N,"[940, 671, 997, 688]",MISC
1296,##T,"[940, 671, 997, 688]",MISC
1297,-,"[998, 671, 1000, 688]",MISC
1298,NL,"[998, 671, 1000, 688]",MISC
1299,-,"[998, 671, 1000, 688]",MISC
1300,installation,"[153, 687, 270, 703]",MISC
1301,utility,"[270, 687, 337, 703]",MISC
1302,and,"[339, 687, 367, 703]",MISC
1303,documentation,"[368, 687, 503, 703]",MISC
1304,.,"[368, 687, 503, 703]",MISC
1305,-,"[505, 687, 507, 703]",MISC
1306,NL,"[505, 687, 507, 703]",MISC
1307,-,"[505, 687, 507, 703]",MISC
1308,•,"[133, 704, 144, 722]",MISC
1309,Created,"[144, 704, 222, 722]",MISC
1310,Product,"[223, 704, 300, 722]",MISC
1311,S,"[301, 704, 346, 722]",MISC
1312,##pec,"[301, 704, 346, 722]",MISC
1313,and,"[346, 704, 380, 722]",MISC
1314,prior,"[380, 704, 502, 722]",MISC
1315,##iti,"[380, 704, 502, 722]",MISC
1316,##zed,"[380, 704, 502, 722]",MISC
1317,product,"[503, 704, 581, 722]",MISC
1318,features,"[582, 704, 682, 722]",MISC
1319,.,"[582, 704, 682, 722]",MISC
1320,Work,"[683, 704, 750, 722]",MISC
1321,##ed,"[683, 704, 750, 722]",MISC
1322,with,"[751, 704, 795, 722]",MISC
1323,engineering,"[795, 704, 918, 722]",MISC
1324,and,"[919, 704, 952, 722]",MISC
1325,Q,"[953, 704, 975, 722]",MISC
1326,##A,"[953, 704, 975, 722]",MISC
1327,to,"[975, 704, 997, 722]",MISC
1328,-,"[998, 704, 1000, 722]",MISC
1329,NL,"[998, 704, 1000, 722]",MISC
1330,-,"[998, 704, 1000, 722]",MISC
1331,resolve,"[153, 720, 238, 738]",MISC
1332,open,"[239, 720, 287, 738]",MISC
1333,issues,"[288, 720, 373, 738]",MISC
1334,",","[288, 720, 373, 738]",MISC
1335,created,"[373, 720, 459, 738]",MISC
1336,new,"[459, 720, 494, 738]",MISC
1337,project,"[496, 720, 581, 738]",MISC
1338,plan,"[582, 720, 630, 738]",MISC
1339,and,"[630, 720, 666, 738]",MISC
1340,released,"[667, 720, 764, 738]",MISC
1341,product,"[765, 720, 850, 738]",MISC
1342,on,"[851, 720, 875, 738]",MISC
1343,time,"[875, 720, 923, 738]",MISC
1344,to,"[924, 720, 948, 738]",MISC
1345,Beta,"[949, 720, 997, 738]",MISC
1346,-,"[998, 720, 1000, 738]",MISC
1347,NL,"[998, 720, 1000, 738]",MISC
1348,-,"[998, 720, 1000, 738]",MISC
1349,customers,"[153, 736, 259, 752]",MISC
1350,.,"[153, 736, 259, 752]",MISC
1351,Dev,"[260, 736, 355, 752]",MISC
1352,##elo,"[260, 736, 355, 752]",MISC
1353,##ped,"[260, 736, 355, 752]",MISC
1354,and,"[356, 736, 388, 752]",MISC
1355,conducted,"[389, 736, 483, 752]",MISC
1356,technical,"[485, 736, 579, 752]",MISC
1357,training,"[581, 736, 675, 752]",MISC
1358,.,"[581, 736, 675, 752]",MISC
1359,-,"[677, 736, 679, 752]",MISC
1360,NL,"[677, 736, 679, 752]",MISC
1361,-,"[677, 736, 679, 752]",MISC
1362,•,"[133, 754, 144, 771]",MISC
1363,Man,"[144, 754, 224, 771]",MISC
1364,##aged,"[144, 754, 224, 771]",MISC
1365,joint,"[225, 754, 282, 771]",MISC
1366,projects,"[283, 754, 373, 771]",MISC
1367,with,"[375, 754, 419, 771]",MISC
1368,key,"[421, 754, 454, 771]",MISC
1369,platform,"[456, 754, 546, 771]",MISC
1370,partners,"[548, 754, 639, 771]",MISC
1371,to,"[640, 754, 662, 771]",MISC
1372,complete,"[663, 754, 754, 771]",MISC
1373,O,"[756, 754, 881, 771]",MISC
1374,##PS,"[756, 754, 881, 771]",MISC
1375,/,"[756, 754, 881, 771]",MISC
1376,Windows,"[756, 754, 881, 771]",MISC
1377,N,"[882, 754, 905, 771]",MISC
1378,##T,"[882, 754, 905, 771]",MISC
1379,platform,"[905, 754, 996, 771]",MISC
1380,-,"[998, 754, 1000, 771]",MISC
1381,NL,"[998, 754, 1000, 771]",MISC
1382,-,"[998, 754, 1000, 771]",MISC
1383,certification,"[153, 768, 268, 786]",MISC
1384,.,"[153, 768, 268, 786]",MISC
1385,-,"[268, 768, 270, 786]",MISC
1386,NL,"[268, 768, 270, 786]",MISC
1387,-,"[268, 768, 270, 786]",MISC
1388,•,"[133, 786, 142, 803]",MISC
1389,N,"[144, 786, 251, 803]",MISC
1390,##ego,"[144, 786, 251, 803]",MISC
1391,##tia,"[144, 786, 251, 803]",MISC
1392,##ted,"[144, 786, 251, 803]",MISC
1393,joint,"[252, 786, 305, 803]",MISC
1394,enterprise,"[306, 786, 413, 803]",MISC
1395,technical,"[414, 786, 510, 803]",MISC
1396,support,"[511, 786, 585, 803]",MISC
1397,agreements,"[587, 786, 705, 803]",MISC
1398,.,"[587, 786, 705, 803]",MISC
1399,Led,"[706, 786, 737, 803]",MISC
1400,large,"[738, 786, 792, 803]",MISC
1401,deployment,"[792, 786, 900, 803]",MISC
1402,project,"[900, 786, 974, 803]",MISC
1403,at,"[976, 786, 996, 803]",MISC
1404,-,"[998, 786, 1000, 803]",MISC
1405,NL,"[998, 786, 1000, 803]",MISC
1406,-,"[998, 786, 1000, 803]",MISC
1407,Deutsche,"[153, 802, 242, 819]",MISC
1408,Bank,"[243, 802, 288, 819]",MISC
1409,with,"[289, 802, 333, 819]",MISC
1410,Professional,"[334, 802, 469, 819]",MISC
1411,Services,"[469, 802, 558, 819]",MISC
1412,from,"[559, 802, 604, 819]",MISC
1413,Oracle,"[604, 802, 671, 819]",MISC
1414,and,"[672, 802, 705, 819]",MISC
1415,Co,"[706, 802, 784, 819]",MISC
1416,##mp,"[706, 802, 784, 819]",MISC
1417,##aq,"[706, 802, 784, 819]",MISC
1418,.,"[706, 802, 784, 819]",MISC
1419,-,"[785, 802, 787, 819]",MISC
1420,NL,"[785, 802, 787, 819]",MISC
1421,-,"[785, 802, 787, 819]",MISC
1422,•,"[133, 819, 144, 837]",MISC
1423,Concept,"[144, 819, 315, 837]",MISC
1424,##ual,"[144, 819, 315, 837]",MISC
1425,##ized,"[144, 819, 315, 837]",MISC
1426,",","[144, 819, 315, 837]",MISC
1427,designed,"[315, 819, 417, 837]",MISC
1428,",","[315, 819, 417, 837]",MISC
1429,developed,"[417, 819, 519, 837]",MISC
1430,and,"[520, 819, 553, 837]",MISC
1431,delivered,"[554, 819, 656, 837]",MISC
1432,infrastructure,"[656, 819, 816, 837]",MISC
1433,for,"[816, 819, 849, 837]",MISC
1434,building,"[850, 819, 940, 837]",MISC
1435,fault,"[941, 819, 996, 837]",MISC
1436,-,"[998, 819, 1000, 837]",MISC
1437,NL,"[998, 819, 1000, 837]",MISC
1438,-,"[998, 819, 1000, 837]",MISC
1439,tolerant,"[153, 834, 246, 851]",MISC
1440,",","[153, 834, 246, 851]",MISC
1441,load,"[247, 834, 288, 851]",MISC
1442,balanced,"[289, 834, 373, 851]",MISC
1443,back,"[373, 834, 445, 851]",MISC
1444,##end,"[373, 834, 445, 851]",MISC
1445,services,"[446, 834, 539, 851]",MISC
1446,.,"[446, 834, 539, 851]",MISC
1447,-,"[540, 834, 542, 851]",MISC
1448,NL,"[540, 834, 542, 851]",MISC
1449,-,"[540, 834, 542, 851]",MISC
1450,•,"[133, 853, 144, 869]",MISC
1451,Work,"[145, 853, 213, 869]",MISC
1452,##ed,"[145, 853, 213, 869]",MISC
1453,with,"[215, 853, 261, 869]",MISC
1454,Oracle,"[261, 853, 330, 869]",MISC
1455,account,"[332, 853, 413, 869]",MISC
1456,managers,"[413, 853, 506, 869]",MISC
1457,to,"[507, 853, 529, 869]",MISC
1458,complete,"[530, 853, 623, 869]",MISC
1459,sales,"[624, 853, 681, 869]",MISC
1460,cycles,"[682, 853, 751, 869]",MISC
1461,for,"[752, 853, 786, 869]",MISC
1462,large,"[787, 853, 845, 869]",MISC
1463,multi,"[846, 853, 998, 869]",MISC
1464,-,"[846, 853, 998, 869]",MISC
1465,million,"[846, 853, 998, 869]",MISC
1466,-,"[998, 853, 1000, 869]",MISC
1467,NL,"[998, 853, 1000, 869]",MISC
1468,-,"[998, 853, 1000, 869]",MISC
1469,dollar,"[153, 867, 220, 885]",MISC
1470,deployment,"[220, 867, 342, 885]",MISC
1471,##s,"[220, 867, 342, 885]",MISC
1472,(,"[342, 867, 387, 885]",MISC
1473,Ex,"[342, 867, 387, 885]",MISC
1474,:,"[342, 867, 387, 885]",MISC
1475,N,"[387, 867, 420, 885]",MISC
1476,##TT,"[387, 867, 420, 885]",MISC
1477,Do,"[420, 867, 509, 885]",MISC
1478,##C,"[420, 867, 509, 885]",MISC
1479,##o,"[420, 867, 509, 885]",MISC
1480,##M,"[420, 867, 509, 885]",MISC
1481,##o,"[420, 867, 509, 885]",MISC
1482,),"[420, 867, 509, 885]",MISC
1483,.,"[420, 867, 509, 885]",MISC
1484,G,"[509, 867, 553, 885]",MISC
1485,##ave,"[509, 867, 553, 885]",MISC
1486,presentations,"[553, 867, 698, 885]",MISC
1487,to,"[698, 867, 720, 885]",MISC
1488,top,"[720, 867, 753, 885]",MISC
1489,customer,"[753, 867, 842, 885]",MISC
1490,executives,"[842, 867, 964, 885]",MISC
1491,.,"[842, 867, 964, 885]",MISC
1492,-,"[964, 867, 966, 885]",MISC
1493,NL,"[964, 867, 966, 885]",MISC
1494,-,"[964, 867, 966, 885]",MISC
1495,•,"[133, 886, 142, 902]",MISC
1496,Led,"[144, 886, 175, 902]",MISC
1497,Co,"[176, 886, 283, 902]",MISC
1498,##mp,"[176, 886, 283, 902]",MISC
1499,##ete,"[176, 886, 283, 902]",MISC
1500,##ncy,"[176, 886, 283, 902]",MISC
1501,Center,"[284, 886, 349, 902]",MISC
1502,with,"[349, 886, 392, 902]",MISC
1503,large,"[392, 886, 446, 902]",MISC
1504,clusters,"[446, 886, 532, 902]",MISC
1505,for,"[533, 886, 564, 902]",MISC
1506,proof,"[565, 886, 737, 902]",MISC
1507,-,"[565, 886, 737, 902]",MISC
1508,of,"[565, 886, 737, 902]",MISC
1509,-,"[565, 886, 737, 902]",MISC
1510,concept,"[565, 886, 737, 902]",MISC
1511,testing,"[738, 886, 812, 902]",MISC
1512,of,"[814, 886, 834, 902]",MISC
1513,large,"[835, 886, 889, 902]",MISC
1514,enterprise,"[890, 886, 997, 902]",MISC
1515,-,"[998, 886, 1000, 902]",MISC
1516,NL,"[998, 886, 1000, 902]",MISC
1517,-,"[998, 886, 1000, 902]",MISC
1518,deployment,"[153, 902, 279, 918]",MISC
1519,##s,"[153, 902, 279, 918]",MISC
1520,.,"[153, 902, 279, 918]",MISC
1521,Established,"[280, 902, 395, 918]",MISC
1522,problem,"[396, 902, 469, 918]",MISC
1523,es,"[470, 902, 576, 918]",MISC
1524,##cal,"[470, 902, 576, 918]",MISC
1525,##ation,"[470, 902, 576, 918]",MISC
1526,process,"[576, 902, 648, 918]",MISC
1527,to,"[650, 902, 671, 918]",MISC
1528,ensure,"[671, 902, 734, 918]",MISC
1529,customer,"[735, 902, 818, 918]",MISC
1530,satisfaction,"[819, 902, 956, 918]",MISC
1531,.,"[819, 902, 956, 918]",MISC
1532,-,"[957, 902, 959, 918]",MISC
1533,NL,"[957, 902, 959, 918]",MISC
1534,-,"[957, 902, 959, 918]",MISC
1535,Prior,"[133, 63, 183, 79]",MISC
1536,to,"[184, 63, 204, 79]",MISC
1537,joining,"[205, 63, 275, 79]",MISC
1538,the,"[276, 63, 306, 79]",MISC
1539,software,"[307, 63, 388, 79]",MISC
1540,industry,"[389, 63, 480, 79]",MISC
1541,",","[389, 63, 480, 79]",MISC
1542,I,"[481, 63, 490, 79]",MISC
1543,worked,"[491, 63, 552, 79]",MISC
1544,at,"[553, 63, 573, 79]",MISC
1545,a,"[573, 63, 582, 79]",MISC
1546,number,"[583, 63, 644, 79]",MISC
1547,of,"[645, 63, 665, 79]",MISC
1548,IT,"[665, 63, 686, 79]",MISC
1549,organizations,"[686, 63, 828, 79]",MISC
1550,:,"[686, 63, 828, 79]",MISC
1551,-,"[829, 63, 831, 79]",MISC
1552,NL,"[829, 63, 831, 79]",MISC
1553,-,"[829, 63, 831, 79]",MISC
1554,3,"[133, 49, 155, 68]",MISC
1555,!,"[133, 49, 155, 68]",MISC
1556,of,"[155, 49, 177, 68]",MISC
1557,3,"[177, 49, 200, 68]",MISC
1558,!,"[177, 49, 200, 68]",MISC
1559,-,"[200, 49, 201, 68]",MISC
1560,NL,"[200, 49, 201, 68]",MISC
1561,-,"[200, 49, 201, 68]",MISC
1562,Wells,"[133, 103, 196, 120]",B-employer_company_name
1563,Fargo,"[197, 103, 260, 120]",I-employer_company_name
1564,Bank,"[262, 103, 312, 120]",I-employer_company_name
1565,-,"[313, 103, 324, 120]",I-employer_company_name
1566,Custom,"[326, 103, 428, 120]",I-employer_company_name
1567,##er,"[326, 103, 428, 120]",I-employer_company_name
1568,Information,"[429, 103, 570, 120]",I-employer_company_name
1569,Group,"[570, 103, 633, 120]",I-employer_company_name
1570,-,"[635, 103, 637, 120]",MISC
1571,NL,"[635, 103, 637, 120]",MISC
1572,-,"[635, 103, 637, 120]",MISC
1573,San,"[831, 103, 864, 120]",MISC
1574,Francisco,"[864, 103, 975, 120]",MISC
1575,",","[864, 103, 975, 120]",MISC
1576,CA,"[975, 103, 998, 120]",MISC
1577,-,"[998, 103, 1000, 120]",MISC
1578,NL,"[998, 103, 1000, 120]",MISC
1579,-,"[998, 103, 1000, 120]",MISC
1580,Senior,"[133, 120, 203, 138]",B-employer_role
1581,Technical,"[205, 120, 312, 138]",I-employer_role
1582,Lead,"[313, 120, 359, 138]",I-employer_role
1583,-,"[361, 120, 362, 138]",MISC
1584,NL,"[361, 120, 362, 138]",MISC
1585,-,"[361, 120, 362, 138]",MISC
1586,1991,"[872, 120, 922, 138]",MISC
1587,to,"[922, 120, 946, 138]",MISC
1588,1994,"[947, 120, 997, 138]",MISC
1589,-,"[998, 120, 1000, 138]",MISC
1590,NL,"[998, 120, 1000, 138]",MISC
1591,-,"[998, 120, 1000, 138]",MISC
1592,Franklin,"[133, 139, 227, 156]",B-employer_company_name
1593,Temple,"[228, 139, 333, 156]",I-employer_company_name
1594,##ton,"[228, 139, 333, 156]",I-employer_company_name
1595,-,"[335, 139, 337, 156]",MISC
1596,NL,"[335, 139, 337, 156]",MISC
1597,-,"[335, 139, 337, 156]",MISC
1598,Foster,"[861, 139, 924, 156]",MISC
1599,City,"[924, 139, 976, 156]",MISC
1600,",","[924, 139, 976, 156]",MISC
1601,CA,"[977, 139, 997, 156]",MISC
1602,-,"[998, 139, 1000, 156]",MISC
1603,NL,"[998, 139, 1000, 156]",MISC
1604,-,"[998, 139, 1000, 156]",MISC
1605,Programme,"[133, 172, 348, 190]",B-employer_role
1606,##r,"[133, 172, 348, 190]",I-employer_role
1607,/,"[133, 172, 348, 190]",I-employer_role
1608,Ana,"[133, 172, 348, 190]",I-employer_role
1609,##ly,"[133, 172, 348, 190]",I-employer_role
1610,##st,"[133, 172, 348, 190]",I-employer_role
1611,-,"[348, 172, 350, 190]",MISC
1612,NL,"[348, 172, 350, 190]",MISC
1613,-,"[348, 172, 350, 190]",MISC
1614,1990,"[872, 172, 922, 190]",MISC
1615,to,"[922, 172, 946, 190]",MISC
1616,1991,"[947, 172, 997, 190]",MISC
1617,-,"[998, 172, 1000, 190]",MISC
1618,NL,"[998, 172, 1000, 190]",MISC
1619,-,"[998, 172, 1000, 190]",MISC
1620,San,"[133, 191, 170, 209]",B-employer_company_name
1621,Francisco,"[170, 191, 281, 209]",I-employer_company_name
1622,Convention,"[282, 191, 406, 209]",I-employer_company_name
1623,&,"[406, 191, 417, 209]",I-employer_company_name
1624,Visitors,"[418, 191, 516, 209]",I-employer_company_name
1625,Bureau,"[518, 191, 592, 209]",I-employer_company_name
1626,-,"[592, 191, 594, 209]",MISC
1627,NL,"[592, 191, 594, 209]",MISC
1628,-,"[592, 191, 594, 209]",MISC
1629,San,"[831, 191, 864, 209]",MISC
1630,Francisco,"[864, 191, 975, 209]",MISC
1631,",","[864, 191, 975, 209]",MISC
1632,CA,"[975, 191, 998, 209]",MISC
1633,-,"[998, 191, 1000, 209]",MISC
1634,NL,"[998, 191, 1000, 209]",MISC
1635,-,"[998, 191, 1000, 209]",MISC
1636,MI,"[133, 225, 172, 242]",B-employer_role
1637,##S,"[133, 225, 172, 242]",I-employer_role
1638,Manager,"[173, 225, 268, 242]",I-employer_role
1639,-,"[268, 225, 270, 242]",MISC
1640,NL,"[268, 225, 270, 242]",MISC
1641,-,"[268, 225, 270, 242]",MISC
1642,1988,"[872, 225, 922, 242]",MISC
1643,to,"[922, 225, 946, 242]",MISC
1644,1989,"[947, 225, 997, 242]",MISC
1645,-,"[998, 225, 1000, 242]",MISC
1646,NL,"[998, 225, 1000, 242]",MISC
1647,-,"[998, 225, 1000, 242]",MISC
1648,•,"[133, 261, 144, 279]",MISC
1649,Man,"[145, 261, 228, 279]",MISC
1650,##aged,"[145, 261, 228, 279]",MISC
1651,enterprise,"[229, 261, 409, 279]",MISC
1652,-,"[229, 261, 409, 279]",MISC
1653,wide,"[229, 261, 409, 279]",MISC
1654,mess,"[409, 261, 517, 279]",MISC
1655,##aging,"[409, 261, 517, 279]",MISC
1656,systems,"[517, 261, 601, 279]",MISC
1657,deployment,"[601, 261, 720, 279]",MISC
1658,and,"[721, 261, 757, 279]",MISC
1659,migration,"[757, 261, 865, 279]",MISC
1660,project,"[866, 261, 949, 279]",MISC
1661,from,"[950, 261, 996, 279]",MISC
1662,-,"[998, 261, 1000, 279]",MISC
1663,NL,"[998, 261, 1000, 279]",MISC
1664,-,"[998, 261, 1000, 279]",MISC
1665,legacy,"[153, 277, 216, 293]",MISC
1666,IBM,"[217, 277, 249, 293]",MISC
1667,main,"[249, 277, 344, 293]",MISC
1668,##frame,"[249, 277, 344, 293]",MISC
1669,Office,"[345, 277, 408, 293]",MISC
1670,Vision,"[409, 277, 472, 293]",MISC
1671,to,"[473, 277, 494, 293]",MISC
1672,distributed,"[495, 277, 611, 293]",MISC
1673,Microsoft,"[612, 277, 707, 293]",MISC
1674,Exchange,"[708, 277, 794, 293]",MISC
1675,servers,"[794, 277, 879, 293]",MISC
1676,.,"[794, 277, 879, 293]",MISC
1677,-,"[879, 277, 881, 293]",MISC
1678,NL,"[879, 277, 881, 293]",MISC
1679,-,"[879, 277, 881, 293]",MISC
1680,•,"[133, 295, 144, 312]",MISC
1681,Man,"[145, 295, 228, 312]",MISC
1682,##aged,"[145, 295, 228, 312]",MISC
1683,roll,"[229, 295, 275, 312]",MISC
1684,out,"[277, 295, 312, 312]",MISC
1685,of,"[313, 295, 335, 312]",MISC
1686,internal,"[337, 295, 431, 312]",MISC
1687,VA,"[433, 295, 468, 312]",MISC
1688,##X,"[433, 295, 468, 312]",MISC
1689,BA,"[469, 295, 528, 312]",MISC
1690,##SI,"[469, 295, 528, 312]",MISC
1691,##C,"[469, 295, 528, 312]",MISC
1692,software,"[529, 295, 624, 312]",MISC
1693,apps,"[625, 295, 685, 312]",MISC
1694,.,"[625, 295, 685, 312]",MISC
1695,De,"[685, 295, 780, 312]",MISC
1696,##p,"[685, 295, 780, 312]",MISC
1697,##loy,"[685, 295, 780, 312]",MISC
1698,##ed,"[685, 295, 780, 312]",MISC
1699,d,"[781, 295, 841, 312]",MISC
1700,##B,"[781, 295, 841, 312]",MISC
1701,##ase,"[781, 295, 841, 312]",MISC
1702,III,"[842, 295, 888, 312]",MISC
1703,+,"[842, 295, 888, 312]",MISC
1704,and,"[890, 295, 925, 312]",MISC
1705,Co,"[926, 295, 996, 312]",MISC
1706,##gno,"[926, 295, 996, 312]",MISC
1707,##s,"[926, 295, 996, 312]",MISC
1708,-,"[998, 295, 1000, 312]",MISC
1709,NL,"[998, 295, 1000, 312]",MISC
1710,-,"[998, 295, 1000, 312]",MISC
1711,databases,"[153, 309, 253, 327]",MISC
1712,for,"[254, 309, 288, 327]",MISC
1713,inventory,"[288, 309, 388, 327]",MISC
1714,and,"[389, 309, 422, 327]",MISC
1715,conference,"[423, 309, 534, 327]",MISC
1716,management,"[535, 309, 657, 327]",MISC
1717,.,"[535, 309, 657, 327]",MISC
1718,-,"[659, 309, 661, 327]",MISC
1719,NL,"[659, 309, 661, 327]",MISC
1720,-,"[659, 309, 661, 327]",MISC
1721,•,"[133, 325, 144, 343]",MISC
1722,Dev,"[144, 325, 244, 343]",MISC
1723,##elo,"[144, 325, 244, 343]",MISC
1724,##ped,"[144, 325, 244, 343]",MISC
1725,and,"[244, 325, 278, 343]",MISC
1726,maintained,"[278, 325, 389, 343]",MISC
1727,bill,"[389, 325, 467, 343]",MISC
1728,##ing,"[389, 325, 467, 343]",MISC
1729,and,"[467, 325, 600, 343]",MISC
1730,##fin,"[467, 325, 600, 343]",MISC
1731,##an,"[467, 325, 600, 343]",MISC
1732,##cial,"[467, 325, 600, 343]",MISC
1733,apps,"[601, 325, 645, 343]",MISC
1734,on,"[645, 325, 667, 343]",MISC
1735,VA,"[668, 325, 745, 343]",MISC
1736,##X,"[668, 325, 745, 343]",MISC
1737,/,"[668, 325, 745, 343]",MISC
1738,V,"[668, 325, 745, 343]",MISC
1739,##MS,"[668, 325, 745, 343]",MISC
1740,C,"[746, 325, 846, 343]",MISC
1741,##luster,"[746, 325, 846, 343]",MISC
1742,##s,"[746, 325, 846, 343]",MISC
1743,.,"[746, 325, 846, 343]",MISC
1744,-,"[846, 325, 848, 343]",MISC
1745,NL,"[846, 325, 848, 343]",MISC
1746,-,"[846, 325, 848, 343]",MISC
1747,•,"[133, 343, 144, 360]",MISC
1748,Man,"[144, 343, 224, 360]",MISC
1749,##aged,"[144, 343, 224, 360]",MISC
1750,MI,"[225, 343, 258, 360]",MISC
1751,##S,"[225, 343, 258, 360]",MISC
1752,budget,"[259, 343, 339, 360]",MISC
1753,.,"[259, 343, 339, 360]",MISC
1754,N,"[340, 343, 455, 360]",MISC
1755,##ego,"[340, 343, 455, 360]",MISC
1756,##tia,"[340, 343, 455, 360]",MISC
1757,##ted,"[340, 343, 455, 360]",MISC
1758,Service,"[455, 343, 534, 360]",MISC
1759,Level,"[535, 343, 593, 360]",MISC
1760,Agreement,"[593, 343, 708, 360]",MISC
1761,##s,"[593, 343, 708, 360]",MISC
1762,with,"[708, 343, 752, 360]",MISC
1763,key,"[754, 343, 787, 360]",MISC
1764,IT,"[788, 343, 810, 360]",MISC
1765,vendors,"[811, 343, 902, 360]",MISC
1766,.,"[811, 343, 902, 360]",MISC
1767,-,"[903, 343, 905, 360]",MISC
1768,NL,"[903, 343, 905, 360]",MISC
1769,-,"[903, 343, 905, 360]",MISC
1770,•,"[133, 360, 142, 377]",MISC
1771,Produced,"[144, 360, 231, 377]",MISC
1772,training,"[232, 360, 319, 377]",MISC
1773,videos,"[320, 360, 385, 377]",MISC
1774,for,"[387, 360, 418, 377]",MISC
1775,corporate,"[420, 360, 518, 377]",MISC
1776,IT,"[519, 360, 539, 377]",MISC
1777,maintenance,"[541, 360, 661, 377]",MISC
1778,and,"[662, 360, 694, 377]",MISC
1779,backup,"[695, 360, 760, 377]",MISC
1780,operations,"[762, 360, 882, 377]",MISC
1781,.,"[762, 360, 882, 377]",MISC
1782,-,"[883, 360, 885, 377]",MISC
1783,NL,"[883, 360, 885, 377]",MISC
1784,-,"[883, 360, 885, 377]",MISC
1785,Massachusetts,"[133, 392, 287, 409]",B-employer_company_name
1786,Institute,"[287, 392, 393, 409]",I-employer_company_name
1787,of,"[394, 392, 416, 409]",I-employer_company_name
1788,Technology,"[418, 392, 536, 409]",I-employer_company_name
1789,-,"[537, 392, 538, 409]",MISC
1790,NL,"[537, 392, 538, 409]",MISC
1791,-,"[537, 392, 538, 409]",MISC
1792,Cambridge,"[855, 392, 972, 409]",MISC
1793,",","[855, 392, 972, 409]",MISC
1794,MA,"[972, 392, 995, 409]",MISC
1795,-,"[996, 392, 998, 409]",MISC
1796,NL,"[996, 392, 998, 409]",MISC
1797,-,"[996, 392, 998, 409]",MISC
1798,Scientific,"[133, 411, 251, 427]",B-employer_role
1799,Research,"[253, 411, 347, 427]",I-employer_role
1800,Programme,"[348, 411, 467, 427]",I-employer_role
1801,##r,"[348, 411, 467, 427]",I-employer_role
1802,-,"[468, 411, 470, 427]",MISC
1803,NL,"[468, 411, 470, 427]",MISC
1804,-,"[468, 411, 470, 427]",MISC
1805,1986,"[872, 411, 918, 427]",MISC
1806,to,"[918, 411, 941, 427]",MISC
1807,1988,"[942, 411, 988, 427]",MISC
1808,-,"[988, 411, 990, 427]",MISC
1809,NL,"[988, 411, 990, 427]",MISC
1810,-,"[988, 411, 990, 427]",MISC
1811,•,"[133, 444, 144, 462]",MISC
1812,Dev,"[144, 444, 246, 462]",MISC
1813,##elo,"[144, 444, 246, 462]",MISC
1814,##ped,"[144, 444, 246, 462]",MISC
1815,software,"[247, 444, 337, 462]",MISC
1816,to,"[338, 444, 360, 462]",MISC
1817,implement,"[360, 444, 462, 462]",MISC
1818,numerical,"[463, 444, 565, 462]",MISC
1819,algorithms,"[565, 444, 678, 462]",MISC
1820,for,"[679, 444, 712, 462]",MISC
1821,ocean,"[713, 444, 859, 462]",MISC
1822,##ographic,"[713, 444, 859, 462]",MISC
1823,modeling,"[861, 444, 952, 462]",MISC
1824,with,"[952, 444, 997, 462]",MISC
1825,-,"[998, 444, 1000, 462]",MISC
1826,NL,"[998, 444, 1000, 462]",MISC
1827,-,"[998, 444, 1000, 462]",MISC
1828,VA,"[153, 460, 188, 476]",MISC
1829,##X,"[153, 460, 188, 476]",MISC
1830,F,"[189, 460, 270, 476]",MISC
1831,##OR,"[189, 460, 270, 476]",MISC
1832,##TR,"[189, 460, 270, 476]",MISC
1833,##AN,"[189, 460, 270, 476]",MISC
1834,and,"[272, 460, 307, 476]",MISC
1835,MA,"[307, 460, 389, 476]",MISC
1836,##TL,"[307, 460, 389, 476]",MISC
1837,##AB,"[307, 460, 389, 476]",MISC
1838,.,"[307, 460, 389, 476]",MISC
1839,Project,"[390, 460, 472, 476]",MISC
1840,was,"[473, 460, 508, 476]",MISC
1841,funded,"[509, 460, 579, 476]",MISC
1842,by,"[580, 460, 602, 476]",MISC
1843,the,"[604, 460, 639, 476]",MISC
1844,Naval,"[639, 460, 698, 476]",MISC
1845,Research,"[698, 460, 793, 476]",MISC
1846,Laboratory,"[793, 460, 923, 476]",MISC
1847,.,"[793, 460, 923, 476]",MISC
1848,-,"[924, 460, 925, 476]",MISC
1849,NL,"[924, 460, 925, 476]",MISC
1850,-,"[924, 460, 925, 476]",MISC
1851,•,"[133, 479, 142, 495]",MISC
1852,Pro,"[144, 479, 231, 495]",MISC
1853,##vide,"[144, 479, 231, 495]",MISC
1854,##d,"[144, 479, 231, 495]",MISC
1855,technical,"[231, 479, 330, 495]",MISC
1856,support,"[330, 479, 406, 495]",MISC
1857,to,"[407, 479, 427, 495]",MISC
1858,scientists,"[428, 479, 538, 495]",MISC
1859,for,"[538, 479, 569, 495]",MISC
1860,research,"[571, 479, 658, 495]",MISC
1861,in,"[658, 479, 679, 495]",MISC
1862,cancer,"[680, 479, 745, 495]",MISC
1863,treatment,"[746, 479, 844, 495]",MISC
1864,with,"[844, 479, 887, 495]",MISC
1865,ultra,"[888, 479, 997, 495]",MISC
1866,##sound,"[888, 479, 997, 495]",MISC
1867,-,"[998, 479, 1000, 495]",MISC
1868,NL,"[998, 479, 1000, 495]",MISC
1869,-,"[998, 479, 1000, 495]",MISC
1870,(,"[153, 495, 235, 513]",MISC
1871,a,"[153, 495, 235, 513]",MISC
1872,.,"[153, 495, 235, 513]",MISC
1873,k,"[153, 495, 235, 513]",MISC
1874,.,"[153, 495, 235, 513]",MISC
1875,a,"[153, 495, 235, 513]",MISC
1876,.,"[153, 495, 235, 513]",MISC
1877,H,"[236, 495, 401, 513]",MISC
1878,##yper,"[236, 495, 401, 513]",MISC
1879,##ther,"[236, 495, 401, 513]",MISC
1880,##mia,"[236, 495, 401, 513]",MISC
1881,),"[236, 495, 401, 513]",MISC
1882,.,"[236, 495, 401, 513]",MISC
1883,Work,"[403, 495, 473, 513]",MISC
1884,##ed,"[403, 495, 473, 513]",MISC
1885,with,"[474, 495, 521, 513]",MISC
1886,the,"[522, 495, 557, 513]",MISC
1887,N,"[558, 495, 593, 513]",MISC
1888,##I,"[558, 495, 593, 513]",MISC
1889,##H,"[558, 495, 593, 513]",MISC
1890,in,"[593, 495, 615, 513]",MISC
1891,their,"[617, 495, 676, 513]",MISC
1892,evaluation,"[677, 495, 795, 513]",MISC
1893,of,"[795, 495, 818, 513]",MISC
1894,the,"[819, 495, 854, 513]",MISC
1895,grant,"[855, 495, 914, 513]",MISC
1896,renewal,"[914, 495, 996, 513]",MISC
1897,-,"[998, 495, 1000, 513]",MISC
1898,NL,"[998, 495, 1000, 513]",MISC
1899,-,"[998, 495, 1000, 513]",MISC
1900,application,"[153, 511, 277, 529]",MISC
1901,.,"[153, 511, 277, 529]",MISC
1902,Project,"[279, 511, 351, 529]",MISC
1903,was,"[352, 511, 381, 529]",MISC
1904,funded,"[383, 511, 444, 529]",MISC
1905,by,"[446, 511, 466, 529]",MISC
1906,the,"[467, 511, 496, 529]",MISC
1907,National,"[498, 511, 581, 529]",MISC
1908,Institute,"[582, 511, 674, 529]",MISC
1909,of,"[676, 511, 696, 529]",MISC
1910,Health,"[697, 511, 769, 529]",MISC
1911,.,"[697, 511, 769, 529]",MISC
1912,-,"[770, 511, 772, 529]",MISC
1913,NL,"[770, 511, 772, 529]",MISC
1914,-,"[770, 511, 772, 529]",MISC
1915,E,"[133, 543, 512, 561]",B-education_heading
1916,##D,"[133, 543, 512, 561]",I-education_heading
1917,##UC,"[133, 543, 512, 561]",I-education_heading
1918,##AT,"[133, 543, 512, 561]",I-education_heading
1919,##ION,"[133, 543, 512, 561]",I-education_heading
1920,_,"[133, 543, 512, 561]",I-education_heading
1921,_,"[133, 543, 512, 561]",I-education_heading
1922,_,"[133, 543, 512, 561]",I-education_heading
1923,_,"[133, 543, 512, 561]",I-education_heading
1924,_,"[133, 543, 512, 561]",I-education_heading
1925,_,"[133, 543, 512, 561]",I-education_heading
1926,_,"[133, 543, 512, 561]",I-education_heading
1927,_,"[133, 543, 512, 561]",I-education_heading
1928,_,"[133, 543, 512, 561]",I-education_heading
1929,_,"[133, 543, 512, 561]",I-education_heading
1930,_,"[133, 543, 512, 561]",I-education_heading
1931,_,"[133, 543, 512, 561]",I-education_heading
1932,_,"[133, 543, 512, 561]",I-education_heading
1933,_,"[133, 543, 512, 561]",I-education_heading
1934,_,"[133, 543, 512, 561]",I-education_heading
1935,_,"[133, 543, 512, 561]",I-education_heading
1936,_,"[133, 543, 512, 561]",I-education_heading
1937,_,"[133, 543, 512, 561]",I-education_heading
1938,_,"[133, 543, 512, 561]",I-education_heading
1939,_,"[133, 543, 512, 561]",I-education_heading
1940,_,"[133, 543, 512, 561]",I-education_heading
1941,_,"[133, 543, 512, 561]",I-education_heading
1942,_,"[133, 543, 512, 561]",I-education_heading
1943,_,"[133, 543, 512, 561]",I-education_heading
1944,_,"[133, 543, 512, 561]",I-education_heading
1945,_,"[133, 543, 512, 561]",I-education_heading
1946,_,"[133, 543, 512, 561]",I-education_heading
1947,_,"[133, 543, 512, 561]",I-education_heading
1948,-,"[512, 543, 514, 561]",MISC
1949,NL,"[512, 543, 514, 561]",MISC
1950,-,"[512, 543, 514, 561]",MISC
1951,B,"[133, 578, 307, 594]",B-education_degree
1952,.,"[133, 578, 307, 594]",I-education_degree
1953,S,"[133, 578, 307, 594]",I-education_degree
1954,.,"[133, 578, 307, 594]",MISC
1955,/,"[133, 578, 307, 594]",MISC
1956,Electrical,"[133, 578, 307, 594]",B-education_course
1957,and,"[307, 578, 340, 594]",I-education_course
1958,Computer,"[342, 578, 434, 594]",I-education_course
1959,Engineering,"[435, 578, 561, 594]",I-education_course
1960,-,"[562, 578, 564, 594]",MISC
1961,NL,"[562, 578, 564, 594]",MISC
1962,-,"[562, 578, 564, 594]",MISC
1963,University,"[642, 578, 742, 594]",B-education_institute
1964,of,"[743, 578, 761, 594]",I-education_institute
1965,Massachusetts,"[763, 578, 902, 594]",I-education_institute
1966,",","[763, 578, 902, 594]",I-education_institute
1967,Amherst,"[903, 578, 972, 594]",I-education_institute
1968,-,"[974, 578, 975, 594]",MISC
1969,NL,"[974, 578, 975, 594]",MISC
1970,-,"[974, 578, 975, 594]",MISC
1971,B,"[133, 595, 290, 611]",B-education_degree
1972,.,"[133, 595, 290, 611]",I-education_degree
1973,A,"[133, 595, 290, 611]",I-education_degree
1974,.,"[133, 595, 290, 611]",MISC
1975,/,"[133, 595, 290, 611]",MISC
1976,Economics,"[133, 595, 290, 611]",B-education_course
1977,-,"[290, 595, 292, 611]",MISC
1978,NL,"[290, 595, 292, 611]",MISC
1979,-,"[290, 595, 292, 611]",MISC
1980,May,"[903, 595, 942, 611]",MISC
1981,1985,"[942, 595, 994, 611]",MISC
1982,-,"[994, 595, 996, 611]",MISC
1983,NL,"[994, 595, 996, 611]",MISC
1984,-,"[994, 595, 996, 611]",MISC
1985,•,"[133, 627, 142, 646]",MISC
1986,F,"[144, 627, 209, 646]",MISC
1987,##lue,"[144, 627, 209, 646]",MISC
1988,##nt,"[144, 627, 209, 646]",MISC
1989,in,"[209, 627, 229, 646]",MISC
1990,English,"[231, 627, 318, 646]",MISC
1991,",","[231, 627, 318, 646]",MISC
1992,French,"[318, 627, 394, 646]",MISC
1993,",","[318, 627, 394, 646]",MISC
1994,German,"[394, 627, 470, 646]",MISC
1995,",","[394, 627, 470, 646]",MISC
1996,Persian,"[470, 627, 557, 646]",MISC
1997,",","[470, 627, 557, 646]",MISC
1998,and,"[557, 627, 589, 646]",MISC
1999,Spanish,"[590, 627, 677, 646]",MISC
2000,.,"[590, 627, 677, 646]",MISC
2001,Con,"[677, 627, 784, 646]",MISC
2002,##vers,"[677, 627, 784, 646]",MISC
2003,##ant,"[677, 627, 784, 646]",MISC
2004,in,"[786, 627, 806, 646]",MISC
2005,Italian,"[807, 627, 883, 646]",MISC
2006,and,"[884, 627, 915, 646]",MISC
2007,-,"[916, 627, 918, 646]",MISC
2008,NL,"[916, 627, 918, 646]",MISC
2009,-,"[916, 627, 918, 646]",MISC
2010,Russian,"[153, 643, 235, 661]",MISC
2011,.,"[153, 643, 235, 661]",MISC
2012,A,"[235, 643, 276, 661]",MISC
2013,##vid,"[235, 643, 276, 661]",MISC
2014,practitioner,"[277, 643, 399, 661]",MISC
2015,of,"[400, 643, 420, 661]",MISC
2016,Yoga,"[420, 643, 470, 661]",MISC
2017,.,"[420, 643, 470, 661]",MISC
2018,-,"[472, 643, 474, 661]",MISC
2019,NL,"[472, 643, 474, 661]",MISC
2020,-,"[472, 643, 474, 661]",MISC
