,token,box,label
0,VI,"[77, 68, 134, 83]",B-name
1,##N,"[77, 68, 134, 83]",I-name
2,##OD,"[77, 68, 134, 83]",I-name
3,ER,"[134, 68, 246, 83]",I-name
4,##RA,"[134, 68, 246, 83]",I-name
5,##MS,"[134, 68, 246, 83]",I-name
6,##ET,"[134, 68, 246, 83]",I-name
7,##TY,"[134, 68, 246, 83]",I-name
8,-,"[248, 68, 250, 83]",MISC
9,NL,"[248, 68, 250, 83]",MISC
10,-,"[248, 68, 250, 83]",MISC
11,v,"[77, 85, 297, 100]",B-emails_email
12,##ino,"[77, 85, 297, 100]",I-emails_email
13,##d,"[77, 85, 297, 100]",I-emails_email
14,##var,"[77, 85, 297, 100]",I-emails_email
15,##ma,"[77, 85, 297, 100]",I-emails_email
16,##23,"[77, 85, 297, 100]",I-emails_email
17,##5,"[77, 85, 297, 100]",I-emails_email
18,@,"[77, 85, 297, 100]",I-emails_email
19,g,"[77, 85, 297, 100]",I-emails_email
20,##mail,"[77, 85, 297, 100]",I-emails_email
21,.,"[77, 85, 297, 100]",I-emails_email
22,com,"[77, 85, 297, 100]",I-emails_email
23,-,"[297, 85, 298, 100]",MISC
24,NL,"[297, 85, 298, 100]",MISC
25,-,"[297, 85, 298, 100]",MISC
26,Mobile,"[800, 85, 865, 100]",MISC
27,:,"[800, 85, 865, 100]",MISC
28,+,"[867, 85, 999, 100]",B-phones_phone
29,91,"[867, 85, 999, 100]",I-phones_phone
30,-,"[867, 85, 999, 100]",I-phones_phone
31,99,"[867, 85, 999, 100]",I-phones_phone
32,##86,"[867, 85, 999, 100]",I-phones_phone
33,##10,"[867, 85, 999, 100]",I-phones_phone
34,##39,"[867, 85, 999, 100]",I-phones_phone
35,##7,"[867, 85, 999, 100]",I-phones_phone
36,##3,"[867, 85, 999, 100]",I-phones_phone
37,-,"[1000, 85, 1001, 100]",MISC
38,NL,"[1000, 85, 1001, 100]",MISC
39,-,"[1000, 85, 1001, 100]",MISC
40,Profile,"[76, 124, 143, 139]",MISC
41,Su,"[144, 124, 211, 139]",MISC
42,##mma,"[144, 124, 211, 139]",MISC
43,##ry,"[144, 124, 211, 139]",MISC
44,-,"[211, 124, 213, 139]",MISC
45,NL,"[211, 124, 213, 139]",MISC
46,-,"[211, 124, 213, 139]",MISC
47,Currently,"[85, 156, 166, 174]",MISC
48,working,"[166, 156, 230, 174]",MISC
49,as,"[230, 156, 248, 174]",MISC
50,Senior,"[248, 156, 302, 174]",B-employer_role
51,Software,"[303, 156, 375, 174]",I-employer_role
52,Engineer,"[375, 156, 448, 174]",I-employer_role
53,at,"[448, 156, 466, 174]",MISC
54,S,"[466, 156, 547, 174]",MISC
55,##yna,"[466, 156, 547, 174]",MISC
56,##media,"[466, 156, 547, 174]",MISC
57,Video,"[548, 156, 593, 174]",MISC
58,Technologies,"[593, 156, 711, 174]",MISC
59,",","[593, 156, 711, 174]",MISC
60,Bangalore,"[711, 156, 793, 174]",MISC
61,(,"[793, 156, 847, 174]",MISC
62,C,"[793, 156, 847, 174]",MISC
63,##isco,"[793, 156, 847, 174]",MISC
64,Spin,"[847, 156, 883, 174]",MISC
65,off,"[883, 156, 920, 174]",MISC
66,),"[883, 156, 920, 174]",MISC
67,-,"[920, 156, 922, 174]",MISC
68,NL,"[920, 156, 922, 174]",MISC
69,-,"[920, 156, 922, 174]",MISC
70,from,"[110, 176, 146, 191]",MISC
71,March,"[147, 176, 240, 191]",MISC
72,##20,"[147, 176, 240, 191]",MISC
73,##19,"[147, 176, 240, 191]",MISC
74,",","[147, 176, 240, 191]",MISC
75,with,"[241, 176, 277, 191]",MISC
76,5,"[278, 176, 296, 191]",MISC
77,+,"[278, 176, 296, 191]",MISC
78,years,"[297, 176, 342, 191]",MISC
79,of,"[343, 176, 362, 191]",MISC
80,experience,"[362, 176, 473, 191]",MISC
81,.,"[362, 176, 473, 191]",MISC
82,-,"[474, 176, 476, 191]",MISC
83,NL,"[474, 176, 476, 191]",MISC
84,-,"[474, 176, 476, 191]",MISC
85,Work,"[85, 191, 143, 209]",MISC
86,##ed,"[85, 191, 143, 209]",MISC
87,as,"[145, 191, 163, 209]",MISC
88,Senior,"[164, 191, 222, 209]",B-employer_role
89,Software,"[224, 191, 302, 209]",I-employer_role
90,Engineer,"[303, 191, 380, 209]",I-employer_role
91,at,"[382, 191, 400, 209]",MISC
92,C,"[401, 191, 450, 209]",B-employer_company_name
93,##isco,"[401, 191, 450, 209]",I-employer_company_name
94,Video,"[451, 191, 500, 209]",I-employer_company_name
95,Technologies,"[500, 191, 627, 209]",I-employer_company_name
96,",","[500, 191, 627, 209]",MISC
97,Bangalore,"[628, 191, 717, 209]",MISC
98,(,"[717, 191, 755, 209]",MISC
99,L,"[717, 191, 755, 209]",MISC
100,&,"[717, 191, 755, 209]",MISC
101,T,"[717, 191, 755, 209]",MISC
102,Technology,"[757, 191, 854, 209]",MISC
103,Services,"[855, 191, 933, 209]",MISC
104,-,"[934, 191, 936, 209]",MISC
105,NL,"[934, 191, 936, 209]",MISC
106,-,"[934, 191, 936, 209]",MISC
107,pay,"[110, 213, 184, 227]",MISC
108,##roll,"[110, 213, 184, 227]",MISC
109,),"[110, 213, 184, 227]",MISC
110,from,"[186, 213, 222, 227]",MISC
111,January,"[224, 213, 289, 227]",MISC
112,2016,"[290, 213, 326, 227]",MISC
113,to,"[328, 213, 346, 227]",MISC
114,March,"[347, 213, 450, 227]",MISC
115,##20,"[347, 213, 450, 227]",MISC
116,##19,"[347, 213, 450, 227]",MISC
117,.,"[347, 213, 450, 227]",MISC
118,-,"[451, 213, 452, 227]",MISC
119,NL,"[451, 213, 452, 227]",MISC
120,-,"[451, 213, 452, 227]",MISC
121,Work,"[85, 228, 141, 247]",MISC
122,##ed,"[85, 228, 141, 247]",MISC
123,as,"[143, 228, 161, 247]",MISC
124,Software,"[162, 228, 238, 247]",B-employer_role
125,Engineer,"[239, 228, 315, 247]",I-employer_role
126,at,"[316, 228, 334, 247]",MISC
127,C,"[335, 228, 382, 247]",B-employer_company_name
128,##isco,"[335, 228, 382, 247]",I-employer_company_name
129,Video,"[383, 228, 430, 247]",I-employer_company_name
130,Technologies,"[431, 228, 554, 247]",I-employer_company_name
131,",","[431, 228, 554, 247]",MISC
132,Bangalore,"[556, 228, 641, 247]",MISC
133,(,"[642, 228, 718, 247]",MISC
134,In,"[642, 228, 718, 247]",MISC
135,##te,"[642, 228, 718, 247]",MISC
136,##gra,"[642, 228, 718, 247]",MISC
137,Micro,"[719, 228, 766, 247]",MISC
138,Services,"[767, 228, 843, 247]",MISC
139,pay,"[844, 228, 920, 247]",MISC
140,##roll,"[844, 228, 920, 247]",MISC
141,),"[844, 228, 920, 247]",MISC
142,from,"[921, 228, 968, 247]",MISC
143,-,"[969, 228, 971, 247]",MISC
144,NL,"[969, 228, 971, 247]",MISC
145,-,"[969, 228, 971, 247]",MISC
146,June,"[110, 250, 150, 265]",MISC
147,2014,"[150, 250, 190, 265]",MISC
148,to,"[190, 250, 210, 265]",MISC
149,January,"[210, 250, 278, 265]",MISC
150,2016,"[279, 250, 328, 265]",MISC
151,.,"[279, 250, 328, 265]",MISC
152,-,"[329, 250, 331, 265]",MISC
153,NL,"[329, 250, 331, 265]",MISC
154,-,"[329, 250, 331, 265]",MISC
155,Technical,"[79, 287, 155, 301]",B-skills_heading
156,Ex,"[156, 287, 232, 301]",I-skills_heading
157,##pert,"[156, 287, 232, 301]",I-skills_heading
158,##ise,"[156, 287, 232, 301]",I-skills_heading
159,-,"[233, 287, 235, 301]",MISC
160,NL,"[233, 287, 235, 301]",MISC
161,-,"[233, 287, 235, 301]",MISC
162,Ex,"[85, 319, 166, 338]",MISC
163,##pert,"[85, 319, 166, 338]",MISC
164,##ise,"[85, 319, 166, 338]",MISC
165,in,"[168, 319, 186, 338]",MISC
166,development,"[186, 319, 288, 338]",MISC
167,of,"[288, 319, 306, 338]",MISC
168,Micro,"[306, 319, 426, 338]",MISC
169,##ser,"[306, 319, 426, 338]",MISC
170,##vice,"[306, 319, 426, 338]",MISC
171,##s,"[306, 319, 426, 338]",MISC
172,based,"[426, 319, 471, 338]",MISC
173,Enterprise,"[472, 319, 563, 338]",MISC
174,&,"[565, 319, 574, 338]",MISC
175,Web,"[574, 319, 601, 338]",MISC
176,Applications,"[601, 319, 712, 338]",MISC
177,using,"[712, 319, 757, 338]",MISC
178,Java,"[758, 319, 840, 338]",MISC
179,&,"[758, 319, 840, 338]",MISC
180,J,"[758, 319, 840, 338]",MISC
181,##2,"[758, 319, 840, 338]",MISC
182,##EE,"[758, 319, 840, 338]",MISC
183,technologies,"[841, 319, 970, 338]",MISC
184,.,"[841, 319, 970, 338]",MISC
185,-,"[971, 319, 972, 338]",MISC
186,NL,"[971, 319, 972, 338]",MISC
187,-,"[971, 319, 972, 338]",MISC
188,Experience,"[85, 338, 181, 356]",MISC
189,in,"[182, 338, 200, 356]",MISC
190,Spring,"[202, 338, 269, 356]",MISC
191,",","[202, 338, 269, 356]",MISC
192,Spring,"[270, 338, 328, 356]",MISC
193,Bo,"[328, 338, 375, 356]",MISC
194,##ot,"[328, 338, 375, 356]",MISC
195,",","[328, 338, 375, 356]",MISC
196,Spring,"[376, 338, 434, 356]",MISC
197,Cloud,"[435, 338, 493, 356]",MISC
198,",","[435, 338, 493, 356]",MISC
199,Spring,"[493, 338, 551, 356]",MISC
200,Data,"[551, 338, 598, 356]",MISC
201,",","[551, 338, 598, 356]",MISC
202,Hi,"[600, 338, 696, 356]",MISC
203,##ber,"[600, 338, 696, 356]",MISC
204,##nate,"[600, 338, 696, 356]",MISC
205,",","[600, 338, 696, 356]",MISC
206,Oracle,"[697, 338, 764, 356]",MISC
207,",","[697, 338, 764, 356]",MISC
208,Mon,"[765, 338, 812, 356]",MISC
209,##go,"[765, 338, 812, 356]",MISC
210,DB,"[813, 338, 842, 356]",MISC
211,",","[813, 338, 842, 356]",MISC
212,No,"[842, 338, 918, 356]",MISC
213,##de,"[842, 338, 918, 356]",MISC
214,##J,"[842, 338, 918, 356]",MISC
215,##S,"[842, 338, 918, 356]",MISC
216,.,"[842, 338, 918, 356]",MISC
217,-,"[920, 338, 922, 356]",MISC
218,NL,"[920, 338, 922, 356]",MISC
219,-,"[920, 338, 922, 356]",MISC
220,Experience,"[85, 356, 177, 374]",MISC
221,in,"[178, 356, 196, 374]",MISC
222,developing,"[196, 356, 289, 374]",MISC
223,rich,"[289, 356, 325, 374]",MISC
224,user,"[326, 356, 363, 374]",MISC
225,interface,"[364, 356, 447, 374]",MISC
226,using,"[447, 356, 492, 374]",MISC
227,front,"[494, 356, 568, 374]",MISC
228,##end,"[494, 356, 568, 374]",MISC
229,technologies,"[568, 356, 678, 374]",MISC
230,like,"[679, 356, 716, 374]",MISC
231,Ang,"[717, 356, 791, 374]",MISC
232,##ular,"[717, 356, 791, 374]",MISC
233,",","[717, 356, 791, 374]",MISC
234,Type,"[791, 356, 892, 374]",MISC
235,##Script,"[791, 356, 892, 374]",MISC
236,",","[791, 356, 892, 374]",MISC
237,Re,"[893, 356, 947, 374]",MISC
238,##act,"[893, 356, 947, 374]",MISC
239,",","[893, 356, 947, 374]",MISC
240,-,"[949, 356, 951, 374]",MISC
241,NL,"[949, 356, 951, 374]",MISC
242,-,"[949, 356, 951, 374]",MISC
243,H,"[110, 377, 155, 391]",MISC
244,##t,"[110, 377, 155, 391]",MISC
245,##m,"[110, 377, 155, 391]",MISC
246,##l,"[110, 377, 155, 391]",MISC
247,",","[110, 377, 155, 391]",MISC
248,CS,"[157, 377, 193, 391]",MISC
249,##S,"[157, 377, 193, 391]",MISC
250,",","[157, 377, 193, 391]",MISC
251,Prime,"[195, 377, 269, 391]",MISC
252,##N,"[195, 377, 269, 391]",MISC
253,##g,"[195, 377, 269, 391]",MISC
254,",","[195, 377, 269, 391]",MISC
255,Material,"[270, 377, 344, 391]",MISC
256,Design,"[345, 377, 401, 391]",MISC
257,and,"[401, 377, 428, 391]",MISC
258,Re,"[429, 377, 569, 391]",MISC
259,##act,"[429, 377, 569, 391]",MISC
260,##M,"[429, 377, 569, 391]",MISC
261,##ater,"[429, 377, 569, 391]",MISC
262,##ial,"[429, 377, 569, 391]",MISC
263,.,"[429, 377, 569, 391]",MISC
264,-,"[570, 377, 572, 391]",MISC
265,NL,"[570, 377, 572, 391]",MISC
266,-,"[570, 377, 572, 391]",MISC
267,Ex,"[85, 392, 168, 410]",MISC
268,##pert,"[85, 392, 168, 410]",MISC
269,##ise,"[85, 392, 168, 410]",MISC
270,in,"[170, 392, 188, 410]",MISC
271,orchestra,"[189, 392, 310, 410]",MISC
272,##ting,"[189, 392, 310, 410]",MISC
273,C,"[311, 392, 358, 410]",MISC
274,##I,"[311, 392, 358, 410]",MISC
275,/,"[311, 392, 358, 410]",MISC
276,CD,"[311, 392, 358, 410]",MISC
277,processes,"[358, 392, 442, 410]",MISC
278,for,"[443, 392, 470, 410]",MISC
279,deployment,"[471, 392, 575, 410]",MISC
280,##s,"[471, 392, 575, 410]",MISC
281,using,"[575, 392, 622, 410]",MISC
282,Ku,"[622, 392, 725, 410]",MISC
283,##ber,"[622, 392, 725, 410]",MISC
284,##net,"[622, 392, 725, 410]",MISC
285,##es,"[622, 392, 725, 410]",MISC
286,",","[622, 392, 725, 410]",MISC
287,Dock,"[726, 392, 791, 410]",MISC
288,##er,"[726, 392, 791, 410]",MISC
289,",","[726, 392, 791, 410]",MISC
290,Jenkins,"[792, 392, 875, 410]",MISC
291,.,"[792, 392, 875, 410]",MISC
292,-,"[876, 392, 878, 410]",MISC
293,NL,"[876, 392, 878, 410]",MISC
294,-,"[876, 392, 878, 410]",MISC
295,Experience,"[85, 412, 179, 429]",MISC
296,in,"[180, 412, 198, 429]",MISC
297,unit,"[199, 412, 235, 429]",MISC
298,testing,"[237, 412, 302, 429]",MISC
299,the,"[304, 412, 331, 429]",MISC
300,applications,"[332, 412, 445, 429]",MISC
301,using,"[446, 412, 493, 429]",MISC
302,Jun,"[494, 412, 541, 429]",MISC
303,##it,"[494, 412, 541, 429]",MISC
304,&,"[541, 412, 550, 429]",MISC
305,Mo,"[551, 412, 625, 429]",MISC
306,##cki,"[551, 412, 625, 429]",MISC
307,##to,"[551, 412, 625, 429]",MISC
308,",","[551, 412, 625, 429]",MISC
309,Jasmine,"[627, 412, 768, 429]",MISC
310,",","[627, 412, 768, 429]",MISC
311,Ka,"[627, 412, 768, 429]",MISC
312,##rma,"[627, 412, 768, 429]",MISC
313,.,"[627, 412, 768, 429]",MISC
314,-,"[769, 412, 771, 429]",MISC
315,NL,"[769, 412, 771, 429]",MISC
316,-,"[769, 412, 771, 429]",MISC
317,Experience,"[85, 430, 177, 447]",MISC
318,in,"[179, 430, 197, 447]",MISC
319,Production,"[198, 430, 290, 447]",MISC
320,support,"[292, 430, 366, 447]",MISC
321,",","[292, 430, 366, 447]",MISC
322,Trouble,"[367, 430, 507, 447]",MISC
323,##sh,"[367, 430, 507, 447]",MISC
324,##oot,"[367, 430, 507, 447]",MISC
325,##ing,"[367, 430, 507, 447]",MISC
326,and,"[508, 430, 535, 447]",MISC
327,De,"[536, 430, 620, 447]",MISC
328,##bu,"[536, 430, 620, 447]",MISC
329,##gging,"[536, 430, 620, 447]",MISC
330,of,"[621, 430, 639, 447]",MISC
331,applications,"[640, 430, 770, 447]",MISC
332,.,"[640, 430, 770, 447]",MISC
333,-,"[771, 430, 773, 447]",MISC
334,NL,"[771, 430, 773, 447]",MISC
335,-,"[771, 430, 773, 447]",MISC
336,Experience,"[85, 447, 181, 465]",MISC
337,on,"[181, 447, 200, 465]",MISC
338,working,"[201, 447, 268, 465]",MISC
339,with,"[268, 447, 306, 465]",MISC
340,monitoring,"[307, 447, 403, 465]",MISC
341,and,"[403, 447, 430, 465]",MISC
342,visual,"[432, 447, 557, 465]",MISC
343,##ization,"[432, 447, 557, 465]",MISC
344,tools,"[557, 447, 604, 465]",MISC
345,like,"[605, 447, 643, 465]",MISC
346,G,"[643, 447, 729, 465]",MISC
347,##rap,"[643, 447, 729, 465]",MISC
348,##hana,"[643, 447, 729, 465]",MISC
349,",","[643, 447, 729, 465]",MISC
350,Pro,"[730, 447, 844, 465]",MISC
351,##met,"[730, 447, 844, 465]",MISC
352,##heus,"[730, 447, 844, 465]",MISC
353,.,"[730, 447, 844, 465]",MISC
354,-,"[846, 447, 847, 465]",MISC
355,NL,"[846, 447, 847, 465]",MISC
356,-,"[846, 447, 847, 465]",MISC
357,Experience,"[86, 465, 185, 483]",MISC
358,in,"[185, 465, 205, 483]",MISC
359,Auto,"[205, 465, 305, 483]",MISC
360,##mation,"[205, 465, 305, 483]",MISC
361,using,"[305, 465, 354, 483]",MISC
362,Se,"[355, 465, 434, 483]",MISC
363,##len,"[355, 465, 434, 483]",MISC
364,##ium,"[355, 465, 434, 483]",MISC
365,with,"[434, 465, 474, 483]",MISC
366,Python,"[474, 465, 554, 483]",MISC
367,.,"[474, 465, 554, 483]",MISC
368,-,"[554, 465, 556, 483]",MISC
369,NL,"[554, 465, 556, 483]",MISC
370,-,"[554, 465, 556, 483]",MISC
371,Complete,"[86, 483, 165, 501]",MISC
372,understanding,"[166, 483, 294, 501]",MISC
373,and,"[296, 483, 325, 501]",MISC
374,hands,"[326, 483, 375, 501]",MISC
375,on,"[376, 483, 396, 501]",MISC
376,experience,"[396, 483, 495, 501]",MISC
377,in,"[496, 483, 516, 501]",MISC
378,A,"[516, 483, 565, 501]",MISC
379,##gi,"[516, 483, 565, 501]",MISC
380,##le,"[516, 483, 565, 501]",MISC
381,development,"[566, 483, 674, 501]",MISC
382,method,"[676, 483, 824, 501]",MISC
383,##ologies,"[676, 483, 824, 501]",MISC
384,.,"[676, 483, 824, 501]",MISC
385,-,"[826, 483, 827, 501]",MISC
386,NL,"[826, 483, 827, 501]",MISC
387,-,"[826, 483, 827, 501]",MISC
388,Experience,"[85, 503, 181, 521]",MISC
389,on,"[182, 503, 200, 521]",MISC
390,working,"[202, 503, 269, 521]",MISC
391,with,"[270, 503, 308, 521]",MISC
392,SC,"[308, 503, 337, 521]",MISC
393,##M,"[308, 503, 337, 521]",MISC
394,tools,"[337, 503, 385, 521]",MISC
395,like,"[386, 503, 424, 521]",MISC
396,G,"[425, 503, 463, 521]",MISC
397,##it,"[425, 503, 463, 521]",MISC
398,",","[425, 503, 463, 521]",MISC
399,G,"[464, 503, 531, 521]",MISC
400,##it,"[464, 503, 531, 521]",MISC
401,##H,"[464, 503, 531, 521]",MISC
402,##ub,"[464, 503, 531, 521]",MISC
403,",","[464, 503, 531, 521]",MISC
404,G,"[531, 503, 598, 521]",MISC
405,##it,"[531, 503, 598, 521]",MISC
406,##la,"[531, 503, 598, 521]",MISC
407,##b,"[531, 503, 598, 521]",MISC
408,",","[531, 503, 598, 521]",MISC
409,Clear,"[599, 503, 704, 521]",MISC
410,##C,"[599, 503, 704, 521]",MISC
411,##ase,"[599, 503, 704, 521]",MISC
412,.,"[599, 503, 704, 521]",MISC
413,-,"[706, 503, 708, 521]",MISC
414,NL,"[706, 503, 708, 521]",MISC
415,-,"[706, 503, 708, 521]",MISC
416,Professional,"[74, 538, 179, 553]",B-work_experience_heading
417,Experience,"[180, 538, 266, 553]",I-work_experience_heading
418,-,"[268, 538, 269, 553]",MISC
419,NL,"[268, 538, 269, 553]",MISC
420,-,"[268, 538, 269, 553]",MISC
421,Jan,"[77, 573, 115, 587]",MISC
422,’,"[77, 573, 115, 587]",MISC
423,2016,"[115, 573, 154, 587]",MISC
424,to,"[154, 573, 172, 587]",MISC
425,till,"[173, 573, 211, 587]",MISC
426,date,"[211, 573, 258, 587]",MISC
427,:,"[211, 573, 258, 587]",MISC
428,S,"[258, 573, 400, 587]",B-employer_company_name
429,##yna,"[258, 573, 400, 587]",I-employer_company_name
430,##media,"[258, 573, 400, 587]",I-employer_company_name
431,/,"[258, 573, 400, 587]",I-employer_company_name
432,C,"[258, 573, 400, 587]",I-employer_company_name
433,##isco,"[258, 573, 400, 587]",I-employer_company_name
434,Video,"[401, 573, 448, 587]",I-employer_company_name
435,Technologies,"[449, 573, 572, 587]",I-employer_company_name
436,",","[449, 573, 572, 587]",MISC
437,Bangalore,"[573, 573, 658, 587]",MISC
438,as,"[658, 573, 676, 587]",MISC
439,Senior,"[677, 573, 733, 587]",B-employer_role
440,Software,"[734, 573, 810, 587]",I-employer_role
441,Engineer,"[811, 573, 896, 587]",I-employer_role
442,.,"[811, 573, 896, 587]",MISC
443,-,"[896, 573, 898, 587]",MISC
444,NL,"[896, 573, 898, 587]",MISC
445,-,"[896, 573, 898, 587]",MISC
446,Project,"[77, 608, 173, 624]",MISC
447,#,"[77, 608, 173, 624]",MISC
448,1,"[77, 608, 173, 624]",MISC
449,:,"[77, 608, 173, 624]",MISC
450,IV,"[174, 608, 203, 624]",MISC
451,##P,"[174, 608, 203, 624]",MISC
452,Operations,"[203, 608, 299, 624]",MISC
453,Hu,"[300, 608, 329, 624]",MISC
454,##b,"[300, 608, 329, 624]",MISC
455,-,"[329, 608, 331, 624]",MISC
456,NL,"[329, 608, 331, 624]",MISC
457,-,"[329, 608, 331, 624]",MISC
458,Su,"[76, 626, 146, 641]",MISC
459,##mma,"[76, 626, 146, 641]",MISC
460,##ry,"[76, 626, 146, 641]",MISC
461,:,"[148, 626, 157, 641]",MISC
462,An,"[158, 626, 178, 641]",MISC
463,Integrated,"[178, 626, 280, 641]",MISC
464,operations,"[281, 626, 383, 641]",MISC
465,work,"[384, 626, 465, 641]",MISC
466,##flow,"[384, 626, 465, 641]",MISC
467,and,"[466, 626, 497, 641]",MISC
468,management,"[497, 626, 598, 641]",MISC
469,portal,"[600, 626, 661, 641]",MISC
470,to,"[661, 626, 681, 641]",MISC
471,provision,"[682, 626, 783, 641]",MISC
472,",","[682, 626, 783, 641]",MISC
473,operate,"[784, 626, 855, 641]",MISC
474,and,"[856, 626, 887, 641]",MISC
475,-,"[887, 626, 889, 641]",MISC
476,NL,"[887, 626, 889, 641]",MISC
477,-,"[887, 626, 889, 641]",MISC
478,monitor,"[211, 643, 275, 657]",MISC
479,the,"[275, 643, 302, 657]",MISC
480,Infinite,"[302, 643, 375, 657]",MISC
481,video,"[375, 643, 420, 657]",MISC
482,platform,"[420, 643, 493, 657]",MISC
483,services,"[493, 643, 565, 657]",MISC
484,to,"[566, 643, 584, 657]",MISC
485,provide,"[584, 643, 647, 657]",MISC
486,sea,"[647, 643, 720, 657]",MISC
487,##m,"[647, 643, 720, 657]",MISC
488,##less,"[647, 643, 720, 657]",MISC
489,operational,"[720, 643, 820, 657]",MISC
490,experience,"[820, 643, 910, 657]",MISC
491,for,"[911, 643, 938, 657]",MISC
492,-,"[938, 643, 940, 657]",MISC
493,NL,"[938, 643, 940, 657]",MISC
494,-,"[938, 643, 940, 657]",MISC
495,the,"[211, 661, 239, 676]",MISC
496,video,"[240, 661, 285, 676]",MISC
497,services,"[287, 661, 361, 676]",MISC
498,as,"[362, 661, 380, 676]",MISC
499,a,"[380, 661, 389, 676]",MISC
500,logical,"[390, 661, 455, 676]",MISC
501,evolution,"[456, 661, 539, 676]",MISC
502,towards,"[540, 661, 605, 676]",MISC
503,a,"[606, 661, 615, 676]",MISC
504,con,"[615, 661, 698, 676]",MISC
505,##ver,"[615, 661, 698, 676]",MISC
506,##ged,"[615, 661, 698, 676]",MISC
507,video,"[700, 661, 745, 676]",MISC
508,platform,"[747, 661, 830, 676]",MISC
509,.,"[747, 661, 830, 676]",MISC
510,-,"[831, 661, 833, 676]",MISC
511,NL,"[831, 661, 833, 676]",MISC
512,-,"[831, 661, 833, 676]",MISC
513,Domain,"[77, 678, 172, 694]",MISC
514,:,"[172, 678, 186, 694]",MISC
515,ST,"[188, 678, 235, 694]",MISC
516,##B,"[188, 678, 235, 694]",MISC
517,-,"[235, 678, 237, 694]",MISC
518,NL,"[235, 678, 237, 694]",MISC
519,-,"[235, 678, 237, 694]",MISC
520,Role,"[77, 697, 137, 711]",MISC
521,:,"[137, 697, 152, 711]",MISC
522,Dev,"[152, 697, 287, 711]",MISC
523,##elo,"[152, 697, 287, 711]",MISC
524,##per,"[152, 697, 287, 711]",MISC
525,-,"[288, 697, 289, 711]",MISC
526,NL,"[288, 697, 289, 711]",MISC
527,-,"[288, 697, 289, 711]",MISC
528,Team,"[77, 713, 132, 728]",MISC
529,Si,"[133, 713, 188, 728]",MISC
530,##ze,"[133, 713, 188, 728]",MISC
531,:,"[189, 713, 202, 728]",MISC
532,6,"[203, 713, 216, 728]",MISC
533,-,"[217, 713, 219, 728]",MISC
534,NL,"[217, 713, 219, 728]",MISC
535,-,"[217, 713, 219, 728]",MISC
536,Environment,"[76, 730, 179, 745]",MISC
537,:,"[180, 730, 190, 745]",MISC
538,Java,"[190, 730, 237, 745]",MISC
539,",","[190, 730, 237, 745]",MISC
540,J,"[238, 730, 285, 745]",MISC
541,##2,"[238, 730, 285, 745]",MISC
542,##EE,"[238, 730, 285, 745]",MISC
543,",","[238, 730, 285, 745]",MISC
544,Spring,"[285, 730, 351, 745]",MISC
545,",","[285, 730, 351, 745]",MISC
546,Spring,"[352, 730, 408, 745]",MISC
547,Bo,"[409, 730, 456, 745]",MISC
548,##ot,"[409, 730, 456, 745]",MISC
549,",","[409, 730, 456, 745]",MISC
550,Hi,"[457, 730, 551, 745]",MISC
551,##ber,"[457, 730, 551, 745]",MISC
552,##nate,"[457, 730, 551, 745]",MISC
553,",","[457, 730, 551, 745]",MISC
554,Micro,"[552, 730, 600, 745]",MISC
555,Services,"[600, 730, 685, 745]",MISC
556,",","[600, 730, 685, 745]",MISC
557,No,"[686, 730, 751, 745]",MISC
558,##de,"[686, 730, 751, 745]",MISC
559,##J,"[686, 730, 751, 745]",MISC
560,##S,"[686, 730, 751, 745]",MISC
561,",","[686, 730, 751, 745]",MISC
562,Mon,"[753, 730, 829, 745]",MISC
563,##go,"[753, 730, 829, 745]",MISC
564,##D,"[753, 730, 829, 745]",MISC
565,##B,"[753, 730, 829, 745]",MISC
566,",","[753, 730, 829, 745]",MISC
567,Ang,"[829, 730, 905, 745]",MISC
568,##ular,"[829, 730, 905, 745]",MISC
569,",","[829, 730, 905, 745]",MISC
570,-,"[905, 730, 907, 745]",MISC
571,NL,"[905, 730, 907, 745]",MISC
572,-,"[905, 730, 907, 745]",MISC
573,Re,"[208, 747, 257, 762]",MISC
574,##act,"[208, 747, 257, 762]",MISC
575,",","[208, 747, 257, 762]",MISC
576,Java,"[257, 747, 346, 762]",MISC
577,##Script,"[257, 747, 346, 762]",MISC
578,.,"[257, 747, 346, 762]",MISC
579,-,"[347, 747, 349, 762]",MISC
580,NL,"[347, 747, 349, 762]",MISC
581,-,"[347, 747, 349, 762]",MISC
582,Too,"[77, 765, 125, 780]",MISC
583,##ls,"[77, 765, 125, 780]",MISC
584,:,"[125, 765, 134, 780]",MISC
585,Eclipse,"[134, 765, 209, 780]",MISC
586,",","[134, 765, 209, 780]",MISC
587,Visual,"[210, 765, 266, 780]",MISC
588,Studio,"[267, 765, 332, 780]",MISC
589,",","[267, 765, 332, 780]",MISC
590,G,"[334, 765, 370, 780]",MISC
591,##it,"[334, 765, 370, 780]",MISC
592,",","[334, 765, 370, 780]",MISC
593,Clear,"[372, 765, 475, 780]",MISC
594,##Q,"[372, 765, 475, 780]",MISC
595,##uest,"[372, 765, 475, 780]",MISC
596,",","[372, 765, 475, 780]",MISC
597,Ji,"[476, 765, 523, 780]",MISC
598,##ra,"[476, 765, 523, 780]",MISC
599,",","[476, 765, 523, 780]",MISC
600,Jenkins,"[523, 765, 598, 780]",MISC
601,",","[523, 765, 598, 780]",MISC
602,Ma,"[599, 765, 655, 780]",MISC
603,##ven,"[599, 765, 655, 780]",MISC
604,",","[599, 765, 655, 780]",MISC
605,Lo,"[656, 765, 712, 780]",MISC
606,##g,"[656, 765, 712, 780]",MISC
607,##4,"[656, 765, 712, 780]",MISC
608,##j,"[656, 765, 712, 780]",MISC
609,",","[656, 765, 712, 780]",MISC
610,Rally,"[713, 765, 769, 780]",MISC
611,",","[713, 765, 769, 780]",MISC
612,Ki,"[770, 765, 835, 780]",MISC
613,##bana,"[770, 765, 835, 780]",MISC
614,.,"[770, 765, 835, 780]",MISC
615,-,"[836, 765, 838, 780]",MISC
616,NL,"[836, 765, 838, 780]",MISC
617,-,"[836, 765, 838, 780]",MISC
618,Re,"[77, 801, 206, 815]",MISC
619,##sp,"[77, 801, 206, 815]",MISC
620,##ons,"[77, 801, 206, 815]",MISC
621,##ibi,"[77, 801, 206, 815]",MISC
622,##lities,"[77, 801, 206, 815]",MISC
623,-,"[206, 801, 208, 815]",MISC
624,NL,"[206, 801, 208, 815]",MISC
625,-,"[206, 801, 208, 815]",MISC
626,In,"[85, 815, 159, 832]",MISC
627,##volved,"[85, 815, 159, 832]",MISC
628,in,"[160, 815, 178, 832]",MISC
629,design,"[179, 815, 235, 832]",MISC
630,discussions,"[235, 815, 336, 832]",MISC
631,and,"[338, 815, 365, 832]",MISC
632,understanding,"[366, 815, 488, 832]",MISC
633,of,"[488, 815, 506, 832]",MISC
634,business,"[507, 815, 581, 832]",MISC
635,requirements,"[582, 815, 694, 832]",MISC
636,and,"[694, 815, 721, 832]",MISC
637,identify,"[722, 815, 797, 832]",MISC
638,the,"[797, 815, 824, 832]",MISC
639,relevant,"[825, 815, 900, 832]",MISC
640,functional,"[900, 815, 993, 832]",MISC
641,-,"[994, 815, 996, 832]",MISC
642,NL,"[994, 815, 996, 832]",MISC
643,-,"[994, 815, 996, 832]",MISC
644,and,"[110, 836, 135, 850]",MISC
645,technical,"[137, 836, 216, 850]",MISC
646,requirements,"[217, 836, 340, 850]",MISC
647,.,"[217, 836, 340, 850]",MISC
648,-,"[342, 836, 344, 850]",MISC
649,NL,"[342, 836, 344, 850]",MISC
650,-,"[342, 836, 344, 850]",MISC
651,Dev,"[85, 850, 172, 867]",MISC
652,##elo,"[85, 850, 172, 867]",MISC
653,##ped,"[85, 850, 172, 867]",MISC
654,applications,"[173, 850, 289, 867]",MISC
655,with,"[290, 850, 328, 867]",MISC
656,Spring,"[329, 850, 387, 867]",MISC
657,Bo,"[387, 850, 425, 867]",MISC
658,##ot,"[387, 850, 425, 867]",MISC
659,Framework,"[426, 850, 513, 867]",MISC
660,and,"[514, 850, 543, 867]",MISC
661,Java,"[543, 850, 581, 867]",MISC
662,object,"[582, 850, 640, 867]",MISC
663,relation,"[641, 850, 737, 867]",MISC
664,##al,"[641, 850, 737, 867]",MISC
665,mapping,"[738, 850, 805, 867]",MISC
666,framework,"[806, 850, 922, 867]",MISC
667,##s,"[806, 850, 922, 867]",MISC
668,.,"[806, 850, 922, 867]",MISC
669,-,"[923, 850, 925, 867]",MISC
670,NL,"[923, 850, 925, 867]",MISC
671,-,"[923, 850, 925, 867]",MISC
672,Experience,"[86, 868, 185, 885]",MISC
673,in,"[187, 868, 206, 885]",MISC
674,managing,"[207, 868, 286, 885]",MISC
675,and,"[287, 868, 316, 885]",MISC
676,helping,"[318, 868, 387, 885]",MISC
677,the,"[388, 868, 417, 885]",MISC
678,team,"[419, 868, 458, 885]",MISC
679,to,"[459, 868, 479, 885]",MISC
680,perform,"[479, 868, 548, 885]",MISC
681,at,"[550, 868, 570, 885]",MISC
682,highest,"[570, 868, 639, 885]",MISC
683,level,"[641, 868, 690, 885]",MISC
684,as,"[691, 868, 711, 885]",MISC
685,a,"[711, 868, 720, 885]",MISC
686,mentor,"[721, 868, 801, 885]",MISC
687,.,"[721, 868, 801, 885]",MISC
688,-,"[802, 868, 804, 885]",MISC
689,NL,"[802, 868, 804, 885]",MISC
690,-,"[802, 868, 804, 885]",MISC
691,Dev,"[85, 886, 166, 903]",MISC
692,##elo,"[85, 886, 166, 903]",MISC
693,##ped,"[85, 886, 166, 903]",MISC
694,single,"[166, 886, 221, 903]",MISC
695,page,"[221, 886, 257, 903]",MISC
696,applications,"[257, 886, 366, 903]",MISC
697,using,"[366, 886, 412, 903]",MISC
698,Ang,"[412, 886, 484, 903]",MISC
699,##ular,"[412, 886, 484, 903]",MISC
700,",","[412, 886, 484, 903]",MISC
701,Type,"[484, 886, 648, 903]",MISC
702,##s,"[484, 886, 648, 903]",MISC
703,##cript,"[484, 886, 648, 903]",MISC
704,",","[484, 886, 648, 903]",MISC
705,Re,"[484, 886, 648, 903]",MISC
706,##act,"[484, 886, 648, 903]",MISC
707,.,"[484, 886, 648, 903]",MISC
708,-,"[648, 886, 650, 903]",MISC
709,NL,"[648, 886, 650, 903]",MISC
710,-,"[648, 886, 650, 903]",MISC
711,Re,"[86, 905, 194, 921]",MISC
712,##sponsible,"[86, 905, 194, 921]",MISC
713,for,"[196, 905, 225, 921]",MISC
714,creating,"[226, 905, 306, 921]",MISC
715,H,"[306, 905, 335, 921]",MISC
716,##LA,"[306, 905, 335, 921]",MISC
717,document,"[336, 905, 416, 921]",MISC
718,and,"[416, 905, 445, 921]",MISC
719,the,"[447, 905, 476, 921]",MISC
720,deployment,"[477, 905, 576, 921]",MISC
721,diagram,"[577, 905, 646, 921]",MISC
722,for,"[647, 905, 676, 921]",MISC
723,the,"[677, 905, 706, 921]",MISC
724,newly,"[707, 905, 756, 921]",MISC
725,added,"[757, 905, 857, 921]",MISC
726,##M,"[757, 905, 857, 921]",MISC
727,##ic,"[757, 905, 857, 921]",MISC
728,##ro,"[757, 905, 857, 921]",MISC
729,services,"[858, 905, 957, 921]",MISC
730,.,"[858, 905, 957, 921]",MISC
731,-,"[958, 905, 960, 921]",MISC
732,NL,"[958, 905, 960, 921]",MISC
733,-,"[958, 905, 960, 921]",MISC
734,Re,"[85, 924, 188, 941]",MISC
735,##sponsible,"[85, 924, 188, 941]",MISC
736,for,"[190, 924, 217, 941]",MISC
737,creating,"[219, 924, 295, 941]",MISC
738,a,"[295, 924, 304, 941]",MISC
739,test,"[305, 924, 343, 941]",MISC
740,plan,"[343, 924, 381, 941]",MISC
741,of,"[381, 924, 399, 941]",MISC
742,unit,"[400, 924, 438, 941]",MISC
743,test,"[438, 924, 476, 941]",MISC
744,scenarios,"[476, 924, 562, 941]",MISC
745,and,"[562, 924, 590, 941]",MISC
746,test,"[591, 924, 629, 941]",MISC
747,cases,"[629, 924, 676, 941]",MISC
748,and,"[677, 924, 704, 941]",MISC
749,unit,"[705, 924, 744, 941]",MISC
750,testing,"[744, 924, 809, 941]",MISC
751,of,"[810, 924, 829, 941]",MISC
752,the,"[830, 924, 857, 941]",MISC
753,-,"[858, 924, 860, 941]",MISC
754,NL,"[858, 924, 860, 941]",MISC
755,-,"[858, 924, 860, 941]",MISC
756,application,"[110, 945, 210, 959]",MISC
757,using,"[210, 945, 255, 959]",MISC
758,Jun,"[256, 945, 310, 959]",MISC
759,##it,"[256, 945, 310, 959]",MISC
760,",","[256, 945, 310, 959]",MISC
761,Mo,"[310, 945, 374, 959]",MISC
762,##cki,"[310, 945, 374, 959]",MISC
763,##to,"[310, 945, 374, 959]",MISC
764,and,"[374, 945, 401, 959]",MISC
765,Ka,"[401, 945, 455, 959]",MISC
766,##rma,"[401, 945, 455, 959]",MISC
767,",","[401, 945, 455, 959]",MISC
768,Jasmine,"[456, 945, 537, 959]",MISC
769,.,"[456, 945, 537, 959]",MISC
770,-,"[538, 945, 539, 959]",MISC
771,NL,"[538, 945, 539, 959]",MISC
772,-,"[538, 945, 539, 959]",MISC
773,Task,"[85, 962, 123, 980]",MISC
774,planning,"[124, 962, 200, 980]",MISC
775,and,"[201, 962, 228, 980]",MISC
776,est,"[230, 962, 326, 980]",MISC
777,##imation,"[230, 962, 326, 980]",MISC
778,of,"[326, 962, 344, 980]",MISC
779,stories,"[345, 962, 421, 980]",MISC
780,",","[345, 962, 421, 980]",MISC
781,along,"[422, 962, 469, 980]",MISC
782,with,"[470, 962, 508, 980]",MISC
783,the,"[509, 962, 536, 980]",MISC
784,smooth,"[538, 962, 594, 980]",MISC
785,delivery,"[596, 962, 672, 980]",MISC
786,of,"[673, 962, 691, 980]",MISC
787,the,"[692, 962, 719, 980]",MISC
788,product,"[721, 962, 806, 980]",MISC
789,.,"[721, 962, 806, 980]",MISC
790,-,"[807, 962, 809, 980]",MISC
791,NL,"[807, 962, 809, 980]",MISC
792,-,"[807, 962, 809, 980]",MISC
793,In,"[85, 983, 161, 999]",MISC
794,##volved,"[85, 983, 161, 999]",MISC
795,in,"[161, 983, 179, 999]",MISC
796,coding,"[180, 983, 246, 999]",MISC
797,",","[180, 983, 246, 999]",MISC
798,testing,"[247, 983, 323, 999]",MISC
799,",","[247, 983, 323, 999]",MISC
800,de,"[323, 983, 418, 999]",MISC
801,##bu,"[323, 983, 418, 999]",MISC
802,##gging,"[323, 983, 418, 999]",MISC
803,",","[323, 983, 418, 999]",MISC
804,documentation,"[419, 983, 542, 999]",MISC
805,and,"[543, 983, 570, 999]",MISC
806,code,"[571, 983, 609, 999]",MISC
807,reviews,"[609, 983, 695, 999]",MISC
808,.,"[609, 983, 695, 999]",MISC
809,-,"[695, 983, 697, 999]",MISC
810,NL,"[695, 983, 697, 999]",MISC
811,-,"[695, 983, 697, 999]",MISC
812,Project,"[77, 66, 175, 81]",MISC
813,#,"[77, 66, 175, 81]",MISC
814,2,"[77, 66, 175, 81]",MISC
815,:,"[77, 66, 175, 81]",MISC
816,IV,"[176, 66, 205, 81]",MISC
817,##P,"[176, 66, 205, 81]",MISC
818,Channel,"[206, 66, 274, 81]",MISC
819,Manager,"[275, 66, 344, 81]",MISC
820,-,"[344, 66, 346, 81]",MISC
821,NL,"[344, 66, 346, 81]",MISC
822,-,"[344, 66, 346, 81]",MISC
823,Su,"[76, 84, 146, 98]",MISC
824,##mma,"[76, 84, 146, 98]",MISC
825,##ry,"[76, 84, 146, 98]",MISC
826,:,"[147, 84, 157, 98]",MISC
827,Con,"[158, 84, 250, 98]",MISC
828,##fi,"[158, 84, 250, 98]",MISC
829,##gu,"[158, 84, 250, 98]",MISC
830,##re,"[158, 84, 250, 98]",MISC
831,channel,"[250, 84, 321, 98]",MISC
832,meta,"[322, 84, 403, 98]",MISC
833,##data,"[322, 84, 403, 98]",MISC
834,delivery,"[404, 84, 486, 98]",MISC
835,streams,"[486, 84, 557, 98]",MISC
836,and,"[558, 84, 589, 98]",MISC
837,channel,"[589, 84, 660, 98]",MISC
838,placement,"[661, 84, 753, 98]",MISC
839,with,"[753, 84, 793, 98]",MISC
840,select,"[794, 84, 856, 98]",MISC
841,or,"[856, 84, 876, 98]",MISC
842,-,"[876, 84, 878, 98]",MISC
843,NL,"[876, 84, 878, 98]",MISC
844,-,"[876, 84, 878, 98]",MISC
845,order,"[211, 102, 259, 117]",MISC
846,number,"[260, 102, 318, 117]",MISC
847,and,"[318, 102, 347, 117]",MISC
848,con,"[347, 102, 434, 117]",MISC
849,##fi,"[347, 102, 434, 117]",MISC
850,##gu,"[347, 102, 434, 117]",MISC
851,##re,"[347, 102, 434, 117]",MISC
852,channel,"[435, 102, 502, 117]",MISC
853,lineup,"[503, 102, 561, 117]",MISC
854,by,"[561, 102, 579, 117]",MISC
855,region,"[580, 102, 638, 117]",MISC
856,or,"[639, 102, 657, 117]",MISC
857,device,"[658, 102, 725, 117]",MISC
858,.,"[658, 102, 725, 117]",MISC
859,-,"[726, 102, 728, 117]",MISC
860,NL,"[726, 102, 728, 117]",MISC
861,-,"[726, 102, 728, 117]",MISC
862,Domain,"[77, 120, 172, 135]",MISC
863,:,"[172, 120, 186, 135]",MISC
864,ST,"[188, 120, 235, 135]",MISC
865,##B,"[188, 120, 235, 135]",MISC
866,-,"[235, 120, 237, 135]",MISC
867,NL,"[235, 120, 237, 135]",MISC
868,-,"[235, 120, 237, 135]",MISC
869,Role,"[77, 137, 137, 152]",MISC
870,:,"[137, 137, 152, 152]",MISC
871,Dev,"[152, 137, 287, 152]",MISC
872,##elo,"[152, 137, 287, 152]",MISC
873,##per,"[152, 137, 287, 152]",MISC
874,-,"[288, 137, 289, 152]",MISC
875,NL,"[288, 137, 289, 152]",MISC
876,-,"[288, 137, 289, 152]",MISC
877,Team,"[77, 154, 132, 169]",MISC
878,Si,"[133, 154, 188, 169]",MISC
879,##ze,"[133, 154, 188, 169]",MISC
880,:,"[189, 154, 202, 169]",MISC
881,4,"[203, 154, 216, 169]",MISC
882,-,"[217, 154, 219, 169]",MISC
883,NL,"[217, 154, 219, 169]",MISC
884,-,"[217, 154, 219, 169]",MISC
885,Environment,"[76, 171, 179, 185]",MISC
886,:,"[180, 171, 189, 185]",MISC
887,Java,"[189, 171, 236, 185]",MISC
888,",","[189, 171, 236, 185]",MISC
889,J,"[237, 171, 284, 185]",MISC
890,##2,"[237, 171, 284, 185]",MISC
891,##EE,"[237, 171, 284, 185]",MISC
892,",","[237, 171, 284, 185]",MISC
893,Spring,"[284, 171, 349, 185]",MISC
894,",","[284, 171, 349, 185]",MISC
895,Hi,"[351, 171, 445, 185]",MISC
896,##ber,"[351, 171, 445, 185]",MISC
897,##nate,"[351, 171, 445, 185]",MISC
898,",","[351, 171, 445, 185]",MISC
899,Web,"[445, 171, 473, 185]",MISC
900,Services,"[474, 171, 559, 185]",MISC
901,",","[474, 171, 559, 185]",MISC
902,-,"[559, 171, 561, 185]",MISC
903,NL,"[559, 171, 561, 185]",MISC
904,-,"[559, 171, 561, 185]",MISC
905,Do,"[76, 189, 112, 204]",MISC
906,##jo,"[76, 189, 112, 204]",MISC
907,Too,"[113, 189, 158, 204]",MISC
908,##ls,"[113, 189, 158, 204]",MISC
909,:,"[159, 189, 168, 204]",MISC
910,Eclipse,"[169, 189, 243, 204]",MISC
911,",","[169, 189, 243, 204]",MISC
912,G,"[243, 189, 279, 204]",MISC
913,##it,"[243, 189, 279, 204]",MISC
914,",","[243, 189, 279, 204]",MISC
915,Ji,"[280, 189, 325, 204]",MISC
916,##ra,"[280, 189, 325, 204]",MISC
917,",","[280, 189, 325, 204]",MISC
918,Jenkins,"[327, 189, 401, 204]",MISC
919,",","[327, 189, 401, 204]",MISC
920,Ma,"[401, 189, 455, 204]",MISC
921,##ven,"[401, 189, 455, 204]",MISC
922,",","[401, 189, 455, 204]",MISC
923,Lo,"[457, 189, 511, 204]",MISC
924,##g,"[457, 189, 511, 204]",MISC
925,##4,"[457, 189, 511, 204]",MISC
926,##j,"[457, 189, 511, 204]",MISC
927,",","[457, 189, 511, 204]",MISC
928,Rally,"[513, 189, 567, 204]",MISC
929,.,"[513, 189, 567, 204]",MISC
930,-,"[568, 189, 570, 204]",MISC
931,NL,"[568, 189, 570, 204]",MISC
932,-,"[568, 189, 570, 204]",MISC
933,Re,"[77, 224, 206, 239]",MISC
934,##sp,"[77, 224, 206, 239]",MISC
935,##ons,"[77, 224, 206, 239]",MISC
936,##ibi,"[77, 224, 206, 239]",MISC
937,##lities,"[77, 224, 206, 239]",MISC
938,-,"[206, 224, 208, 239]",MISC
939,NL,"[206, 224, 208, 239]",MISC
940,-,"[206, 224, 208, 239]",MISC
941,In,"[85, 240, 159, 256]",MISC
942,##volved,"[85, 240, 159, 256]",MISC
943,in,"[160, 240, 178, 256]",MISC
944,developing,"[179, 240, 271, 256]",MISC
945,application,"[273, 240, 376, 256]",MISC
946,business,"[376, 240, 451, 256]",MISC
947,layer,"[451, 240, 497, 256]",MISC
948,development,"[498, 240, 602, 256]",MISC
949,through,"[602, 240, 667, 256]",MISC
950,spring,"[668, 240, 724, 256]",MISC
951,framework,"[724, 240, 827, 256]",MISC
952,.,"[724, 240, 827, 256]",MISC
953,-,"[827, 240, 829, 256]",MISC
954,NL,"[827, 240, 829, 256]",MISC
955,-,"[827, 240, 829, 256]",MISC
956,In,"[85, 257, 157, 274]",MISC
957,##volved,"[85, 257, 157, 274]",MISC
958,in,"[159, 257, 177, 274]",MISC
959,unit,"[177, 257, 213, 274]",MISC
960,testing,"[214, 257, 277, 274]",MISC
961,of,"[278, 257, 297, 274]",MISC
962,the,"[297, 257, 324, 274]",MISC
963,application,"[325, 257, 424, 274]",MISC
964,and,"[426, 257, 453, 274]",MISC
965,performed,"[454, 257, 535, 274]",MISC
966,feature,"[537, 257, 711, 274]",MISC
967,/,"[537, 257, 711, 274]",MISC
968,integration,"[537, 257, 711, 274]",MISC
969,testing,"[712, 257, 793, 274]",MISC
970,.,"[712, 257, 793, 274]",MISC
971,-,"[795, 257, 797, 274]",MISC
972,NL,"[795, 257, 797, 274]",MISC
973,-,"[795, 257, 797, 274]",MISC
974,Follow,"[85, 274, 161, 291]",MISC
975,##ed,"[85, 274, 161, 291]",MISC
976,SD,"[161, 274, 199, 291]",MISC
977,##LC,"[161, 274, 199, 291]",MISC
978,best,"[200, 274, 238, 291]",MISC
979,practices,"[238, 274, 323, 291]",MISC
980,such,"[324, 274, 362, 291]",MISC
981,as,"[362, 274, 380, 291]",MISC
982,continuous,"[381, 274, 475, 291]",MISC
983,integration,"[476, 274, 590, 291]",MISC
984,",","[476, 274, 590, 291]",MISC
985,automated,"[591, 274, 676, 291]",MISC
986,unit,"[676, 274, 714, 291]",MISC
987,test,"[714, 274, 753, 291]",MISC
988,and,"[753, 274, 780, 291]",MISC
989,re,"[781, 274, 875, 291]",MISC
990,##gression,"[781, 274, 875, 291]",MISC
991,testing,"[877, 274, 942, 291]",MISC
992,-,"[943, 274, 945, 291]",MISC
993,NL,"[943, 274, 945, 291]",MISC
994,-,"[943, 274, 945, 291]",MISC
995,and,"[110, 293, 137, 309]",MISC
996,focus,"[139, 293, 186, 309]",MISC
997,on,"[186, 293, 204, 309]",MISC
998,end,"[205, 293, 232, 309]",MISC
999,to,"[234, 293, 252, 309]",MISC
1000,end,"[253, 293, 280, 309]",MISC
1001,quality,"[281, 293, 346, 309]",MISC
1002,of,"[348, 293, 366, 309]",MISC
1003,the,"[367, 293, 490, 309]",MISC
1004,##del,"[367, 293, 490, 309]",MISC
1005,##iver,"[367, 293, 490, 309]",MISC
1006,##y,"[367, 293, 490, 309]",MISC
1007,.,"[367, 293, 490, 309]",MISC
1008,-,"[490, 293, 492, 309]",MISC
1009,NL,"[490, 293, 492, 309]",MISC
1010,-,"[490, 293, 492, 309]",MISC
1011,June,"[54, 330, 101, 344]",MISC
1012,’,"[54, 330, 101, 344]",MISC
1013,2014,"[102, 330, 140, 344]",MISC
1014,to,"[141, 330, 159, 344]",MISC
1015,Jan,"[161, 330, 199, 344]",MISC
1016,’,"[161, 330, 199, 344]",MISC
1017,2016,"[199, 330, 246, 344]",MISC
1018,:,"[199, 330, 246, 344]",MISC
1019,C,"[248, 330, 295, 344]",B-employer_company_name
1020,##isco,"[248, 330, 295, 344]",I-employer_company_name
1021,Video,"[296, 330, 343, 344]",I-employer_company_name
1022,Technologies,"[345, 330, 470, 344]",I-employer_company_name
1023,",","[345, 330, 470, 344]",MISC
1024,Bangalore,"[471, 330, 558, 344]",MISC
1025,as,"[558, 330, 576, 344]",MISC
1026,Software,"[577, 330, 654, 344]",B-employer_role
1027,Engineer,"[655, 330, 742, 344]",I-employer_role
1028,.,"[655, 330, 742, 344]",MISC
1029,-,"[742, 330, 744, 344]",MISC
1030,NL,"[742, 330, 744, 344]",MISC
1031,-,"[742, 330, 744, 344]",MISC
1032,Project,"[77, 365, 172, 379]",MISC
1033,#,"[77, 365, 172, 379]",MISC
1034,3,"[77, 365, 172, 379]",MISC
1035,:,"[77, 365, 172, 379]",MISC
1036,Via,"[172, 365, 228, 379]",MISC
1037,##sat,"[172, 365, 228, 379]",MISC
1038,Rev,"[229, 365, 294, 379]",MISC
1039,##erse,"[229, 365, 294, 379]",MISC
1040,EP,"[295, 365, 323, 379]",MISC
1041,##G,"[295, 365, 323, 379]",MISC
1042,-,"[324, 365, 326, 379]",MISC
1043,NL,"[324, 365, 326, 379]",MISC
1044,-,"[324, 365, 326, 379]",MISC
1045,Su,"[76, 382, 143, 396]",MISC
1046,##mma,"[76, 382, 143, 396]",MISC
1047,##ry,"[76, 382, 143, 396]",MISC
1048,:,"[144, 382, 153, 396]",MISC
1049,Electronic,"[154, 382, 250, 396]",MISC
1050,program,"[252, 382, 319, 396]",MISC
1051,guides,"[320, 382, 378, 396]",MISC
1052,are,"[379, 382, 408, 396]",MISC
1053,menu,"[408, 382, 504, 396]",MISC
1054,-,"[408, 382, 504, 396]",MISC
1055,based,"[408, 382, 504, 396]",MISC
1056,systems,"[506, 382, 573, 396]",MISC
1057,that,"[574, 382, 612, 396]",MISC
1058,provide,"[613, 382, 680, 396]",MISC
1059,television,"[682, 382, 778, 396]",MISC
1060,users,"[780, 382, 827, 396]",MISC
1061,with,"[829, 382, 867, 396]",MISC
1062,continuously,"[868, 382, 984, 396]",MISC
1063,-,"[985, 382, 987, 396]",MISC
1064,NL,"[985, 382, 987, 396]",MISC
1065,-,"[985, 382, 987, 396]",MISC
1066,updated,"[202, 399, 318, 413]",MISC
1067,##men,"[202, 399, 318, 413]",MISC
1068,##us,"[202, 399, 318, 413]",MISC
1069,displaying,"[318, 399, 414, 413]",MISC
1070,broadcast,"[415, 399, 502, 413]",MISC
1071,programming,"[502, 399, 607, 413]",MISC
1072,for,"[608, 399, 637, 413]",MISC
1073,Current,"[637, 399, 704, 413]",MISC
1074,and,"[705, 399, 734, 413]",MISC
1075,upcoming,"[734, 399, 810, 413]",MISC
1076,programming,"[811, 399, 927, 413]",MISC
1077,.,"[811, 399, 927, 413]",MISC
1078,-,"[927, 399, 929, 413]",MISC
1079,NL,"[927, 399, 929, 413]",MISC
1080,-,"[927, 399, 929, 413]",MISC
1081,Via,"[202, 416, 259, 431]",MISC
1082,##sat,"[202, 416, 259, 431]",MISC
1083,guides,"[259, 416, 315, 431]",MISC
1084,has,"[316, 416, 343, 431]",MISC
1085,feature,"[345, 416, 410, 431]",MISC
1086,backward,"[411, 416, 485, 431]",MISC
1087,scroll,"[487, 416, 581, 431]",MISC
1088,##ing,"[487, 416, 581, 431]",MISC
1089,",","[487, 416, 581, 431]",MISC
1090,to,"[582, 416, 600, 431]",MISC
1091,promote,"[601, 416, 666, 431]",MISC
1092,their,"[667, 416, 714, 431]",MISC
1093,Catch,"[715, 416, 789, 431]",MISC
1094,-,"[715, 416, 789, 431]",MISC
1095,up,"[715, 416, 789, 431]",MISC
1096,content,"[791, 416, 856, 431]",MISC
1097,which,"[857, 416, 904, 431]",MISC
1098,allows,"[905, 416, 961, 431]",MISC
1099,-,"[961, 416, 963, 431]",MISC
1100,NL,"[961, 416, 963, 431]",MISC
1101,-,"[961, 416, 963, 431]",MISC
1102,the,"[202, 429, 231, 447]",MISC
1103,user,"[233, 429, 273, 447]",MISC
1104,to,"[274, 429, 294, 447]",MISC
1105,watch,"[294, 429, 345, 447]",MISC
1106,an,"[345, 429, 365, 447]",MISC
1107,event,"[365, 429, 416, 447]",MISC
1108,after,"[416, 429, 467, 447]",MISC
1109,it,"[467, 429, 487, 447]",MISC
1110,has,"[487, 429, 516, 447]",MISC
1111,been,"[518, 429, 558, 447]",MISC
1112,broadcast,"[559, 429, 680, 447]",MISC
1113,##ed,"[559, 429, 680, 447]",MISC
1114,.,"[559, 429, 680, 447]",MISC
1115,-,"[681, 429, 682, 447]",MISC
1116,NL,"[681, 429, 682, 447]",MISC
1117,-,"[681, 429, 682, 447]",MISC
1118,Domain,"[77, 449, 166, 464]",MISC
1119,:,"[168, 449, 182, 464]",MISC
1120,ST,"[183, 449, 226, 464]",MISC
1121,##B,"[183, 449, 226, 464]",MISC
1122,-,"[228, 449, 230, 464]",MISC
1123,NL,"[228, 449, 230, 464]",MISC
1124,-,"[228, 449, 230, 464]",MISC
1125,Role,"[77, 469, 132, 483]",MISC
1126,:,"[132, 469, 145, 483]",MISC
1127,Dev,"[146, 469, 269, 483]",MISC
1128,##elo,"[146, 469, 269, 483]",MISC
1129,##per,"[146, 469, 269, 483]",MISC
1130,-,"[269, 469, 271, 483]",MISC
1131,NL,"[269, 469, 271, 483]",MISC
1132,-,"[269, 469, 271, 483]",MISC
1133,Team,"[77, 486, 128, 500]",MISC
1134,Si,"[128, 486, 179, 500]",MISC
1135,##ze,"[128, 486, 179, 500]",MISC
1136,:,"[179, 486, 192, 500]",MISC
1137,8,"[192, 486, 204, 500]",MISC
1138,-,"[204, 486, 206, 500]",MISC
1139,NL,"[204, 486, 206, 500]",MISC
1140,-,"[204, 486, 206, 500]",MISC
1141,Environment,"[77, 501, 182, 516]",MISC
1142,:,"[77, 501, 182, 516]",MISC
1143,Java,"[184, 501, 228, 516]",MISC
1144,",","[184, 501, 228, 516]",MISC
1145,Jun,"[229, 501, 272, 516]",MISC
1146,##it,"[229, 501, 272, 516]",MISC
1147,-,"[273, 501, 275, 516]",MISC
1148,NL,"[273, 501, 275, 516]",MISC
1149,-,"[273, 501, 275, 516]",MISC
1150,Too,"[77, 520, 125, 534]",MISC
1151,##ls,"[77, 520, 125, 534]",MISC
1152,:,"[126, 520, 135, 534]",MISC
1153,Eclipse,"[135, 520, 212, 534]",MISC
1154,",","[135, 520, 212, 534]",MISC
1155,Clear,"[213, 520, 309, 534]",MISC
1156,##C,"[213, 520, 309, 534]",MISC
1157,##ase,"[213, 520, 309, 534]",MISC
1158,",","[213, 520, 309, 534]",MISC
1159,G,"[310, 520, 348, 534]",MISC
1160,##it,"[310, 520, 348, 534]",MISC
1161,",","[310, 520, 348, 534]",MISC
1162,Gen,"[348, 520, 406, 534]",MISC
1163,##ie,"[348, 520, 406, 534]",MISC
1164,",","[348, 520, 406, 534]",MISC
1165,Jenkins,"[406, 520, 482, 534]",MISC
1166,",","[406, 520, 482, 534]",MISC
1167,Rally,"[484, 520, 542, 534]",MISC
1168,",","[484, 520, 542, 534]",MISC
1169,Clear,"[542, 520, 647, 534]",MISC
1170,##Q,"[542, 520, 647, 534]",MISC
1171,##uest,"[542, 520, 647, 534]",MISC
1172,.,"[542, 520, 647, 534]",MISC
1173,-,"[648, 520, 650, 534]",MISC
1174,NL,"[648, 520, 650, 534]",MISC
1175,-,"[648, 520, 650, 534]",MISC
1176,Re,"[77, 555, 206, 569]",MISC
1177,##sp,"[77, 555, 206, 569]",MISC
1178,##ons,"[77, 555, 206, 569]",MISC
1179,##ibi,"[77, 555, 206, 569]",MISC
1180,##lities,"[77, 555, 206, 569]",MISC
1181,-,"[206, 555, 208, 569]",MISC
1182,NL,"[206, 555, 208, 569]",MISC
1183,-,"[206, 555, 208, 569]",MISC
1184,In,"[85, 569, 161, 586]",MISC
1185,##volved,"[85, 569, 161, 586]",MISC
1186,in,"[162, 569, 180, 586]",MISC
1187,feature,"[181, 569, 246, 586]",MISC
1188,development,"[248, 569, 353, 586]",MISC
1189,using,"[353, 569, 400, 586]",MISC
1190,best,"[401, 569, 439, 586]",MISC
1191,design,"[439, 569, 496, 586]",MISC
1192,patterns,"[497, 569, 573, 586]",MISC
1193,for,"[573, 569, 601, 586]",MISC
1194,the,"[602, 569, 629, 586]",MISC
1195,requirements,"[631, 569, 754, 586]",MISC
1196,",","[631, 569, 754, 586]",MISC
1197,design,"[755, 569, 811, 586]",MISC
1198,discussions,"[813, 569, 918, 586]",MISC
1199,-,"[918, 569, 920, 586]",MISC
1200,NL,"[918, 569, 920, 586]",MISC
1201,-,"[918, 569, 920, 586]",MISC
1202,and,"[110, 589, 135, 603]",MISC
1203,identifying,"[137, 589, 235, 603]",MISC
1204,the,"[236, 589, 261, 603]",MISC
1205,technical,"[263, 589, 343, 603]",MISC
1206,requirements,"[344, 589, 451, 603]",MISC
1207,and,"[452, 589, 477, 603]",MISC
1208,unit,"[479, 589, 513, 603]",MISC
1209,testing,"[515, 589, 576, 603]",MISC
1210,of,"[578, 589, 594, 603]",MISC
1211,the,"[596, 589, 621, 603]",MISC
1212,application,"[623, 589, 721, 603]",MISC
1213,using,"[722, 589, 765, 603]",MISC
1214,Jun,"[767, 589, 819, 603]",MISC
1215,##it,"[767, 589, 819, 603]",MISC
1216,",","[767, 589, 819, 603]",MISC
1217,Mo,"[821, 589, 900, 603]",MISC
1218,##cki,"[821, 589, 900, 603]",MISC
1219,##to,"[821, 589, 900, 603]",MISC
1220,.,"[821, 589, 900, 603]",MISC
1221,-,"[902, 589, 903, 603]",MISC
1222,NL,"[902, 589, 903, 603]",MISC
1223,-,"[902, 589, 903, 603]",MISC
1224,In,"[85, 604, 161, 621]",MISC
1225,##volved,"[85, 604, 161, 621]",MISC
1226,in,"[162, 604, 180, 621]",MISC
1227,creating,"[181, 604, 257, 621]",MISC
1228,the,"[257, 604, 284, 621]",MISC
1229,plan,"[286, 604, 324, 621]",MISC
1230,to,"[324, 604, 342, 621]",MISC
1231,execute,"[343, 604, 409, 621]",MISC
1232,the,"[410, 604, 437, 621]",MISC
1233,test,"[439, 604, 477, 621]",MISC
1234,cases,"[477, 604, 524, 621]",MISC
1235,and,"[525, 604, 552, 621]",MISC
1236,executing,"[554, 604, 639, 621]",MISC
1237,g,"[640, 604, 687, 621]",MISC
1238,##eni,"[640, 604, 687, 621]",MISC
1239,##e,"[640, 604, 687, 621]",MISC
1240,automated,"[688, 604, 773, 621]",MISC
1241,test,"[774, 604, 812, 621]",MISC
1242,scripts,"[812, 604, 897, 621]",MISC
1243,.,"[812, 604, 897, 621]",MISC
1244,-,"[898, 604, 900, 621]",MISC
1245,NL,"[898, 604, 900, 621]",MISC
1246,-,"[898, 604, 900, 621]",MISC
1247,A,"[85, 624, 132, 641]",MISC
1248,##gi,"[85, 624, 132, 641]",MISC
1249,##le,"[85, 624, 132, 641]",MISC
1250,consisting,"[133, 624, 227, 641]",MISC
1251,of,"[228, 624, 246, 641]",MISC
1252,it,"[247, 624, 332, 641]",MISC
1253,##erative,"[247, 624, 332, 641]",MISC
1254,TD,"[333, 624, 360, 641]",MISC
1255,##D,"[333, 624, 360, 641]",MISC
1256,approach,"[362, 624, 438, 641]",MISC
1257,with,"[438, 624, 476, 641]",MISC
1258,regular,"[476, 624, 541, 641]",MISC
1259,s,"[543, 624, 619, 641]",MISC
1260,##c,"[543, 624, 619, 641]",MISC
1261,##rum,"[543, 624, 619, 641]",MISC
1262,##s,"[543, 624, 619, 641]",MISC
1263,.,"[543, 624, 619, 641]",MISC
1264,-,"[619, 624, 621, 641]",MISC
1265,NL,"[619, 624, 621, 641]",MISC
1266,-,"[619, 624, 621, 641]",MISC
1267,Achievement,"[74, 664, 192, 678]",MISC
1268,##s,"[74, 664, 192, 678]",MISC
1269,-,"[192, 664, 193, 678]",MISC
1270,NL,"[192, 664, 193, 678]",MISC
1271,-,"[192, 664, 193, 678]",MISC
1272,Con,"[85, 698, 170, 716]",MISC
1273,##nect,"[85, 698, 170, 716]",MISC
1274,##ed,"[85, 698, 170, 716]",MISC
1275,Re,"[170, 698, 283, 716]",MISC
1276,##cognition,"[170, 698, 283, 716]",MISC
1277,:,"[170, 698, 283, 716]",MISC
1278,For,"[284, 698, 311, 716]",MISC
1279,developing,"[313, 698, 407, 716]",MISC
1280,the,"[408, 698, 435, 716]",MISC
1281,deliver,"[436, 698, 539, 716]",MISC
1282,##able,"[436, 698, 539, 716]",MISC
1283,Information,"[540, 698, 644, 716]",MISC
1284,Architecture,"[645, 698, 757, 716]",MISC
1285,(,"[759, 698, 795, 716]",MISC
1286,I,"[759, 698, 795, 716]",MISC
1287,##A,"[759, 698, 795, 716]",MISC
1288,),"[759, 698, 795, 716]",MISC
1289,component,"[797, 698, 882, 716]",MISC
1290,on,"[882, 698, 900, 716]",MISC
1291,time,"[901, 698, 957, 716]",MISC
1292,.,"[901, 698, 957, 716]",MISC
1293,-,"[958, 698, 960, 716]",MISC
1294,NL,"[958, 698, 960, 716]",MISC
1295,-,"[958, 698, 960, 716]",MISC
1296,Star,"[86, 716, 126, 734]",MISC
1297,of,"[127, 716, 147, 734]",MISC
1298,the,"[147, 716, 176, 734]",MISC
1299,Month,"[178, 716, 238, 734]",MISC
1300,:,"[178, 716, 238, 734]",MISC
1301,For,"[239, 716, 268, 734]",MISC
1302,handling,"[270, 716, 352, 734]",MISC
1303,the,"[352, 716, 381, 734]",MISC
1304,Op,"[383, 716, 442, 734]",MISC
1305,##s,"[383, 716, 442, 734]",MISC
1306,##H,"[383, 716, 442, 734]",MISC
1307,##ub,"[383, 716, 442, 734]",MISC
1308,components,"[444, 716, 546, 734]",MISC
1309,user,"[546, 716, 586, 734]",MISC
1310,guides,"[587, 716, 647, 734]",MISC
1311,and,"[649, 716, 678, 734]",MISC
1312,Help,"[680, 716, 719, 734]",MISC
1313,files,"[720, 716, 771, 734]",MISC
1314,with,"[772, 716, 812, 734]",MISC
1315,Tech,"[813, 716, 852, 734]",MISC
1316,Writer,"[854, 716, 913, 734]",MISC
1317,&,"[915, 716, 924, 734]",MISC
1318,-,"[925, 716, 927, 734]",MISC
1319,NL,"[925, 716, 927, 734]",MISC
1320,-,"[925, 716, 927, 734]",MISC
1321,for,"[110, 738, 137, 752]",MISC
1322,successful,"[138, 738, 233, 752]",MISC
1323,delivery,"[233, 738, 307, 752]",MISC
1324,of,"[309, 738, 327, 752]",MISC
1325,Re,"[328, 738, 469, 752]",MISC
1326,##com,"[328, 738, 469, 752]",MISC
1327,##men,"[328, 738, 469, 752]",MISC
1328,##dation,"[328, 738, 469, 752]",MISC
1329,##s,"[328, 738, 469, 752]",MISC
1330,feature,"[470, 738, 535, 752]",MISC
1331,to,"[536, 738, 554, 752]",MISC
1332,DB,"[555, 738, 582, 752]",MISC
1333,##S,"[555, 738, 582, 752]",MISC
1334,Custom,"[583, 738, 658, 752]",MISC
1335,##er,"[583, 738, 658, 752]",MISC
1336,on,"[659, 738, 677, 752]",MISC
1337,time,"[678, 738, 734, 752]",MISC
1338,.,"[678, 738, 734, 752]",MISC
1339,-,"[735, 738, 737, 752]",MISC
1340,NL,"[735, 738, 737, 752]",MISC
1341,-,"[735, 738, 737, 752]",MISC
1342,Spot,"[85, 754, 123, 772]",MISC
1343,Award,"[125, 754, 183, 772]",MISC
1344,:,"[125, 754, 183, 772]",MISC
1345,For,"[184, 754, 213, 772]",MISC
1346,the,"[214, 754, 243, 772]",MISC
1347,continuous,"[243, 754, 341, 772]",MISC
1348,support,"[342, 754, 411, 772]",MISC
1349,to,"[411, 754, 429, 772]",MISC
1350,IL,"[430, 754, 449, 772]",MISC
1351,team,"[450, 754, 488, 772]",MISC
1352,on,"[490, 754, 508, 772]",MISC
1353,content,"[509, 754, 578, 772]",MISC
1354,cu,"[578, 754, 656, 772]",MISC
1355,##ration,"[578, 754, 656, 772]",MISC
1356,Project,"[657, 754, 744, 772]",MISC
1357,.,"[657, 754, 744, 772]",MISC
1358,-,"[746, 754, 748, 772]",MISC
1359,NL,"[746, 754, 748, 772]",MISC
1360,-,"[746, 754, 748, 772]",MISC
1361,Education,"[65, 793, 146, 807]",B-education_heading
1362,-,"[146, 793, 148, 807]",MISC
1363,NL,"[146, 793, 148, 807]",MISC
1364,-,"[146, 793, 148, 807]",MISC
1365,B,"[85, 824, 103, 842]",MISC
1366,.,"[85, 824, 103, 842]",MISC
1367,Tech,"[104, 824, 142, 842]",MISC
1368,in,"[142, 824, 160, 842]",MISC
1369,Electronics,"[161, 824, 265, 842]",B-education_course
1370,stream,"[266, 824, 332, 842]",MISC
1371,",","[266, 824, 332, 842]",MISC
1372,from,"[333, 824, 371, 842]",MISC
1373,Lords,"[371, 824, 418, 842]",MISC
1374,Institute,"[419, 824, 504, 842]",MISC
1375,of,"[505, 824, 523, 842]",MISC
1376,Engineering,"[524, 824, 627, 842]",MISC
1377,and,"[629, 824, 656, 842]",MISC
1378,Technology,"[657, 824, 761, 842]",MISC
1379,",","[657, 824, 761, 842]",MISC
1380,J,"[762, 824, 856, 842]",MISC
1381,##awa,"[762, 824, 856, 842]",MISC
1382,##har,"[762, 824, 856, 842]",MISC
1383,##lal,"[762, 824, 856, 842]",MISC
1384,Nehru,"[858, 824, 905, 842]",MISC
1385,-,"[905, 824, 907, 842]",MISC
1386,NL,"[905, 824, 907, 842]",MISC
1387,-,"[905, 824, 907, 842]",MISC
1388,Tech,"[110, 846, 222, 860]",MISC
1389,##nological,"[110, 846, 222, 860]",MISC
1390,University,"[222, 846, 317, 860]",MISC
1391,",","[222, 846, 317, 860]",MISC
1392,Hyderabad,"[317, 846, 412, 860]",MISC
1393,.,"[317, 846, 412, 860]",MISC
1394,-,"[413, 846, 414, 860]",MISC
1395,NL,"[413, 846, 414, 860]",MISC
1396,-,"[413, 846, 414, 860]",MISC
1397,Intermediate,"[85, 860, 210, 879]",B-education_degree
1398,",","[85, 860, 210, 879]",MISC
1399,from,"[211, 860, 249, 879]",MISC
1400,M,"[250, 860, 279, 879]",MISC
1401,##NR,"[250, 860, 279, 879]",MISC
1402,Resident,"[279, 860, 384, 879]",MISC
1403,##ial,"[279, 860, 384, 879]",MISC
1404,Junior,"[386, 860, 444, 879]",MISC
1405,College,"[444, 860, 520, 879]",MISC
1406,",","[444, 860, 520, 879]",MISC
1407,Hyderabad,"[521, 860, 627, 879]",MISC
1408,.,"[521, 860, 627, 879]",MISC
1409,-,"[628, 860, 630, 879]",MISC
1410,NL,"[628, 860, 630, 879]",MISC
1411,-,"[628, 860, 630, 879]",MISC
1412,Personal,"[65, 902, 134, 916]",B-personal_details_heading
1413,Det,"[134, 902, 194, 916]",I-personal_details_heading
1414,##ails,"[134, 902, 194, 916]",I-personal_details_heading
1415,-,"[195, 902, 197, 916]",MISC
1416,NL,"[195, 902, 197, 916]",MISC
1417,-,"[195, 902, 197, 916]",MISC
1418,Ad,"[77, 938, 155, 953]",MISC
1419,##dress,"[77, 938, 155, 953]",MISC
1420,:,"[156, 938, 167, 953]",MISC
1421,H,"[167, 938, 221, 953]",MISC
1422,-,"[167, 938, 221, 953]",MISC
1423,no,"[167, 938, 221, 953]",MISC
1424,:,"[167, 938, 221, 953]",MISC
1425,5,"[223, 938, 245, 953]",MISC
1426,",","[223, 938, 245, 953]",MISC
1427,2nd,"[245, 938, 278, 953]",MISC
1428,floor,"[279, 938, 346, 953]",MISC
1429,",","[279, 938, 346, 953]",MISC
1430,12th,"[346, 938, 389, 953]",MISC
1431,cross,"[391, 938, 458, 953]",MISC
1432,",","[391, 938, 458, 953]",MISC
1433,20th,"[458, 938, 501, 953]",MISC
1434,Main,"[502, 938, 557, 953]",MISC
1435,",","[502, 938, 557, 953]",MISC
1436,Mad,"[558, 938, 658, 953]",MISC
1437,##i,"[558, 938, 658, 953]",MISC
1438,##wala,"[558, 938, 658, 953]",MISC
1439,.,"[558, 938, 658, 953]",MISC
1440,-,"[659, 938, 661, 953]",MISC
1441,NL,"[659, 938, 661, 953]",MISC
1442,-,"[659, 938, 661, 953]",MISC
1443,Place,"[77, 955, 164, 970]",MISC
1444,:,"[166, 955, 182, 970]",MISC
1445,Bangalore,"[183, 955, 359, 970]",MISC
1446,.,"[183, 955, 359, 970]",MISC
1447,-,"[360, 955, 362, 970]",MISC
1448,NL,"[360, 955, 362, 970]",MISC
1449,-,"[360, 955, 362, 970]",MISC
