,token,box,label
0,Stefano,"[454, 48, 522, 64]",B-name
1,Fat,"[522, 48, 608, 64]",I-name
2,##tor,"[522, 48, 608, 64]",I-name
3,##ini,"[522, 48, 608, 64]",I-name
4,-,"[610, 48, 611, 64]",MISC
5,NL,"[610, 48, 611, 64]",MISC
6,-,"[610, 48, 611, 64]",MISC
7,39,"[357, 65, 381, 81]",MISC
8,St,"[381, 65, 415, 81]",MISC
9,.,"[381, 65, 415, 81]",MISC
10,Stephen,"[416, 65, 522, 81]",MISC
11,’,"[416, 65, 522, 81]",MISC
12,s,"[416, 65, 522, 81]",MISC
13,road,"[523, 65, 582, 81]",MISC
14,",","[523, 65, 582, 81]",MISC
15,E,"[582, 65, 605, 81]",MISC
16,##3,"[582, 65, 605, 81]",MISC
17,5,"[605, 65, 639, 81]",MISC
18,##J,"[605, 65, 639, 81]",MISC
19,##D,"[605, 65, 639, 81]",MISC
20,London,"[641, 65, 710, 81]",MISC
21,-,"[711, 65, 713, 81]",MISC
22,NL,"[711, 65, 713, 81]",MISC
23,-,"[711, 65, 713, 81]",MISC
24,s,"[307, 81, 610, 98]",B-emails_email
25,##te,"[307, 81, 610, 98]",I-emails_email
26,##fan,"[307, 81, 610, 98]",I-emails_email
27,##o,"[307, 81, 610, 98]",I-emails_email
28,_,"[307, 81, 610, 98]",I-emails_email
29,fat,"[307, 81, 610, 98]",I-emails_email
30,##tor,"[307, 81, 610, 98]",I-emails_email
31,##ini,"[307, 81, 610, 98]",I-emails_email
32,@,"[307, 81, 610, 98]",I-emails_email
33,hot,"[307, 81, 610, 98]",I-emails_email
34,##mail,"[307, 81, 610, 98]",I-emails_email
35,.,"[307, 81, 610, 98]",I-emails_email
36,com,"[307, 81, 610, 98]",I-emails_email
37,|,"[610, 81, 619, 98]",MISC
38,+,"[620, 81, 755, 98]",B-phones_phone
39,44,"[620, 81, 755, 98]",I-phones_phone
40,##7,"[620, 81, 755, 98]",I-phones_phone
41,##9,"[620, 81, 755, 98]",I-phones_phone
42,##32,"[620, 81, 755, 98]",I-phones_phone
43,##5,"[620, 81, 755, 98]",I-phones_phone
44,##80,"[620, 81, 755, 98]",I-phones_phone
45,##7,"[620, 81, 755, 98]",I-phones_phone
46,##8,"[620, 81, 755, 98]",I-phones_phone
47,##1,"[620, 81, 755, 98]",I-phones_phone
48,-,"[756, 81, 758, 98]",MISC
49,NL,"[756, 81, 758, 98]",MISC
50,-,"[756, 81, 758, 98]",MISC
51,Professional,"[64, 133, 180, 150]",B-work_experience_heading
52,Profile,"[180, 133, 246, 150]",I-work_experience_heading
53,-,"[248, 133, 250, 150]",MISC
54,NL,"[248, 133, 250, 150]",MISC
55,-,"[248, 133, 250, 150]",MISC
56,I,"[64, 168, 75, 184]",MISC
57,am,"[75, 168, 96, 184]",MISC
58,a,"[96, 168, 107, 184]",MISC
59,highly,"[107, 168, 172, 184]",MISC
60,motivated,"[172, 168, 269, 184]",MISC
61,and,"[270, 168, 302, 184]",MISC
62,qualified,"[303, 168, 399, 184]",MISC
63,economist,"[401, 168, 497, 184]",MISC
64,and,"[498, 168, 530, 184]",MISC
65,a,"[531, 168, 542, 184]",MISC
66,data,"[542, 168, 585, 184]",MISC
67,scientist,"[585, 168, 682, 184]",MISC
68,with,"[683, 168, 726, 184]",MISC
69,a,"[726, 168, 737, 184]",MISC
70,good,"[737, 168, 780, 184]",MISC
71,background,"[781, 168, 899, 184]",MISC
72,",","[781, 168, 899, 184]",MISC
73,and,"[900, 168, 932, 184]",MISC
74,strong,"[933, 168, 997, 184]",MISC
75,-,"[998, 168, 999, 184]",MISC
76,NL,"[998, 168, 999, 184]",MISC
77,-,"[998, 168, 999, 184]",MISC
78,interest,"[64, 184, 161, 201]",MISC
79,",","[64, 184, 161, 201]",MISC
80,in,"[161, 184, 182, 201]",MISC
81,Statistics,"[182, 184, 300, 201]",MISC
82,.,"[182, 184, 300, 201]",MISC
83,After,"[300, 184, 354, 201]",MISC
84,my,"[354, 184, 375, 201]",MISC
85,degree,"[375, 184, 440, 201]",MISC
86,in,"[440, 184, 461, 201]",MISC
87,Political,"[461, 184, 558, 201]",MISC
88,Economy,"[558, 184, 633, 201]",MISC
89,and,"[633, 184, 665, 201]",MISC
90,2,"[665, 184, 676, 201]",MISC
91,internship,"[676, 184, 805, 201]",MISC
92,##s,"[676, 184, 805, 201]",MISC
93,",","[676, 184, 805, 201]",MISC
94,I,"[805, 184, 815, 201]",MISC
95,decided,"[815, 184, 890, 201]",MISC
96,to,"[890, 184, 912, 201]",MISC
97,extend,"[912, 184, 976, 201]",MISC
98,my,"[976, 184, 998, 201]",MISC
99,-,"[998, 184, 1000, 201]",MISC
100,NL,"[998, 184, 1000, 201]",MISC
101,-,"[998, 184, 1000, 201]",MISC
102,knowledge,"[64, 201, 168, 217]",MISC
103,in,"[169, 201, 192, 217]",MISC
104,Data,"[193, 201, 239, 217]",MISC
105,Science,"[239, 201, 320, 217]",MISC
106,through,"[321, 201, 402, 217]",MISC
107,another,"[403, 201, 484, 217]",MISC
108,master,"[485, 201, 565, 217]",MISC
109,",","[485, 201, 565, 217]",MISC
110,which,"[567, 201, 624, 217]",MISC
111,enabled,"[625, 201, 706, 217]",MISC
112,me,"[707, 201, 730, 217]",MISC
113,to,"[731, 201, 754, 217]",MISC
114,combine,"[754, 201, 834, 217]",MISC
115,the,"[836, 201, 870, 217]",MISC
116,2,"[871, 201, 882, 217]",MISC
117,fields,"[883, 201, 963, 217]",MISC
118,.,"[883, 201, 963, 217]",MISC
119,I,"[964, 201, 975, 217]",MISC
120,am,"[976, 201, 999, 217]",MISC
121,-,"[1000, 201, 1001, 217]",MISC
122,NL,"[1000, 201, 1001, 217]",MISC
123,-,"[1000, 201, 1001, 217]",MISC
124,interested,"[64, 219, 168, 235]",MISC
125,in,"[169, 219, 189, 235]",MISC
126,a,"[190, 219, 199, 235]",MISC
127,career,"[200, 219, 263, 235]",MISC
128,in,"[263, 219, 283, 235]",MISC
129,an,"[284, 219, 304, 235]",MISC
130,company,"[305, 219, 379, 235]",MISC
131,where,"[379, 219, 431, 235]",MISC
132,important,"[431, 219, 524, 235]",MISC
133,global,"[526, 219, 588, 235]",MISC
134,projects,"[589, 219, 671, 235]",MISC
135,would,"[672, 219, 724, 235]",MISC
136,benefit,"[725, 219, 798, 235]",MISC
137,from,"[798, 219, 840, 235]",MISC
138,these,"[840, 219, 892, 235]",MISC
139,skills,"[893, 219, 966, 235]",MISC
140,.,"[893, 219, 966, 235]",MISC
141,I,"[966, 219, 975, 235]",MISC
142,am,"[977, 219, 996, 235]",MISC
143,-,"[998, 219, 1000, 235]",MISC
144,NL,"[998, 219, 1000, 235]",MISC
145,-,"[998, 219, 1000, 235]",MISC
146,confident,"[64, 235, 155, 251]",MISC
147,that,"[156, 235, 196, 251]",MISC
148,my,"[197, 235, 217, 251]",MISC
149,thorough,"[218, 235, 298, 251]",MISC
150,statistical,"[300, 235, 556, 251]",MISC
151,/,"[300, 235, 556, 251]",MISC
152,e,"[300, 235, 556, 251]",MISC
153,##con,"[300, 235, 556, 251]",MISC
154,##ometric,"[300, 235, 556, 251]",MISC
155,##al,"[300, 235, 556, 251]",MISC
156,knowledge,"[556, 235, 658, 251]",MISC
157,",","[556, 235, 658, 251]",MISC
158,combined,"[659, 235, 740, 251]",MISC
159,with,"[741, 235, 781, 251]",MISC
160,excellent,"[782, 235, 873, 251]",MISC
161,skills,"[875, 235, 935, 251]",MISC
162,in,"[936, 235, 956, 251]",MISC
163,data,"[957, 235, 996, 251]",MISC
164,-,"[998, 235, 999, 251]",MISC
165,NL,"[998, 235, 999, 251]",MISC
166,-,"[998, 235, 999, 251]",MISC
167,science,"[64, 252, 134, 268]",MISC
168,and,"[134, 252, 163, 268]",MISC
169,machine,"[164, 252, 234, 268]",MISC
170,learning,"[235, 252, 313, 268]",MISC
171,will,"[315, 252, 355, 268]",MISC
172,be,"[355, 252, 375, 268]",MISC
173,of,"[375, 252, 395, 268]",MISC
174,great,"[396, 252, 446, 268]",MISC
175,value,"[446, 252, 496, 268]",MISC
176,for,"[496, 252, 525, 268]",MISC
177,this,"[526, 252, 566, 268]",MISC
178,role,"[566, 252, 617, 268]",MISC
179,.,"[566, 252, 617, 268]",MISC
180,-,"[617, 252, 618, 268]",MISC
181,NL,"[617, 252, 618, 268]",MISC
182,-,"[617, 252, 618, 268]",MISC
183,Education,"[64, 303, 159, 319]",B-education_heading
184,-,"[159, 303, 161, 319]",MISC
185,NL,"[159, 303, 161, 319]",MISC
186,-,"[159, 303, 161, 319]",MISC
187,September,"[64, 337, 169, 353]",MISC
188,2016,"[170, 337, 217, 353]",MISC
189,-,"[217, 337, 228, 353]",MISC
190,September,"[229, 337, 335, 353]",MISC
191,2017,"[335, 337, 382, 353]",MISC
192,-,"[382, 337, 384, 353]",MISC
193,NL,"[382, 337, 384, 353]",MISC
194,-,"[382, 337, 384, 353]",MISC
195,1,"[64, 370, 109, 388]",MISC
196,.,"[64, 370, 109, 388]",MISC
197,1,"[64, 370, 109, 388]",MISC
198,",","[64, 370, 109, 388]",MISC
199,M,"[109, 370, 165, 388]",B-education_degree
200,.,"[109, 370, 165, 388]",I-education_degree
201,Sc,"[109, 370, 165, 388]",I-education_degree
202,.,"[109, 370, 165, 388]",MISC
203,Big,"[109, 370, 165, 388]",B-education_course
204,Data,"[166, 370, 200, 388]",I-education_course
205,Science,"[200, 370, 245, 388]",I-education_course
206,",","[246, 370, 335, 388]",MISC
207,Queen,"[337, 370, 392, 388]",B-education_institute
208,Mary,"[393, 370, 438, 388]",I-education_institute
209,University,"[439, 370, 552, 388]",I-education_institute
210,of,"[553, 370, 574, 388]",I-education_institute
211,London,"[575, 370, 643, 388]",I-education_institute
212,-,"[644, 370, 645, 388]",MISC
213,NL,"[644, 370, 645, 388]",MISC
214,-,"[644, 370, 645, 388]",MISC
215,Statistical,"[106, 405, 217, 422]",MISC
216,and,"[217, 405, 246, 422]",MISC
217,technological,"[247, 405, 378, 422]",MISC
218,tools,"[378, 405, 429, 422]",MISC
219,for,"[429, 405, 457, 422]",MISC
220,data,"[459, 405, 498, 422]",MISC
221,and,"[499, 405, 528, 422]",MISC
222,big,"[530, 405, 558, 422]",MISC
223,data,"[560, 405, 599, 422]",MISC
224,analysis,"[600, 405, 690, 422]",MISC
225,",","[600, 405, 690, 422]",MISC
226,including,"[691, 405, 780, 422]",MISC
227,Machine,"[782, 405, 852, 422]",MISC
228,Learning,"[852, 405, 942, 422]",MISC
229,",","[852, 405, 942, 422]",MISC
230,Data,"[943, 405, 982, 422]",MISC
231,-,"[983, 405, 985, 422]",MISC
232,NL,"[983, 405, 985, 422]",MISC
233,-,"[983, 405, 985, 422]",MISC
234,Mining,"[128, 422, 200, 439]",MISC
235,",","[128, 422, 200, 439]",MISC
236,Big,"[200, 422, 231, 439]",MISC
237,Data,"[231, 422, 270, 439]",MISC
238,Process,"[272, 422, 385, 439]",MISC
239,##ing,"[272, 422, 385, 439]",MISC
240,",","[272, 422, 385, 439]",MISC
241,Data,"[385, 422, 425, 439]",MISC
242,Ana,"[426, 422, 518, 439]",MISC
243,##ly,"[426, 422, 518, 439]",MISC
244,##tics,"[426, 422, 518, 439]",MISC
245,and,"[519, 422, 549, 439]",MISC
246,Business,"[550, 422, 630, 439]",MISC
247,Technology,"[632, 422, 734, 439]",MISC
248,Strategy,"[735, 422, 815, 439]",MISC
249,-,"[817, 422, 819, 439]",MISC
250,NL,"[817, 422, 819, 439]",MISC
251,-,"[817, 422, 819, 439]",MISC
252,Final,"[106, 439, 156, 455]",MISC
253,project,"[158, 439, 229, 455]",MISC
254,about,"[229, 439, 280, 455]",MISC
255,cop,"[281, 439, 361, 455]",MISC
256,##ula,"[281, 439, 361, 455]",MISC
257,##s,"[281, 439, 361, 455]",MISC
258,",","[281, 439, 361, 455]",MISC
259,a,"[363, 439, 372, 455]",MISC
260,powerful,"[373, 439, 453, 455]",MISC
261,statistical,"[455, 439, 568, 455]",MISC
262,method,"[568, 439, 629, 455]",MISC
263,to,"[629, 439, 649, 455]",MISC
264,study,"[650, 439, 700, 455]",MISC
265,depend,"[701, 439, 803, 455]",MISC
266,##ency,"[701, 439, 803, 455]",MISC
267,between,"[804, 439, 875, 455]",MISC
268,variables,"[875, 439, 977, 455]",MISC
269,",","[875, 439, 977, 455]",MISC
270,-,"[978, 439, 980, 455]",MISC
271,NL,"[978, 439, 980, 455]",MISC
272,-,"[978, 439, 980, 455]",MISC
273,applied,"[128, 456, 196, 473]",MISC
274,to,"[197, 456, 217, 473]",MISC
275,both,"[217, 456, 256, 473]",MISC
276,stock,"[257, 456, 305, 473]",MISC
277,returns,"[306, 456, 374, 473]",MISC
278,data,"[375, 456, 414, 473]",MISC
279,and,"[415, 456, 443, 473]",MISC
280,El,"[444, 456, 602, 473]",MISC
281,##ec,"[444, 456, 602, 473]",MISC
282,##tro,"[444, 456, 602, 473]",MISC
283,-,"[444, 456, 602, 473]",MISC
284,magnetic,"[444, 456, 602, 473]",MISC
285,field,"[602, 456, 650, 473]",MISC
286,data,"[651, 456, 700, 473]",MISC
287,.,"[651, 456, 700, 473]",MISC
288,-,"[701, 456, 703, 473]",MISC
289,NL,"[701, 456, 703, 473]",MISC
290,-,"[701, 456, 703, 473]",MISC
291,September,"[64, 490, 168, 506]",MISC
292,2011,"[169, 490, 216, 506]",MISC
293,-,"[216, 490, 227, 506]",MISC
294,March,"[228, 490, 285, 506]",MISC
295,2014,"[286, 490, 343, 506]",MISC
296,:,"[286, 490, 343, 506]",MISC
297,-,"[345, 490, 347, 506]",MISC
298,NL,"[345, 490, 347, 506]",MISC
299,-,"[345, 490, 347, 506]",MISC
300,Full,"[64, 524, 107, 541]",MISC
301,marks,"[108, 524, 164, 541]",MISC
302,and,"[164, 524, 196, 541]",MISC
303,honours,"[198, 524, 285, 541]",MISC
304,",","[198, 524, 285, 541]",MISC
305,M,"[287, 524, 342, 541]",B-education_degree
306,.,"[287, 524, 342, 541]",I-education_degree
307,Sc,"[287, 524, 342, 541]",I-education_degree
308,.,"[287, 524, 342, 541]",MISC
309,Political,"[287, 524, 342, 541]",B-education_course
310,Economy,"[342, 524, 442, 541]",I-education_course
311,",","[443, 524, 530, 541]",MISC
312,Un,"[443, 524, 530, 541]",B-education_institute
313,##ivers,"[443, 524, 530, 541]",I-education_institute
314,##ita,"[443, 524, 530, 541]",I-education_institute
315,de,"[532, 524, 643, 541]",I-education_institute
316,##gli,"[532, 524, 643, 541]",I-education_institute
317,St,"[643, 524, 698, 541]",I-education_institute
318,##udi,"[643, 524, 698, 541]",I-education_institute
319,di,"[699, 524, 754, 541]",I-education_institute
320,Roma,"[754, 524, 776, 541]",I-education_institute
321,“,"[777, 524, 820, 541]",I-education_institute
322,La,"[777, 524, 820, 541]",I-education_institute
323,Sa,"[821, 524, 853, 541]",I-education_institute
324,##pie,"[821, 524, 853, 541]",I-education_institute
325,##nza,"[821, 524, 853, 541]",I-education_institute
326,”,"[821, 524, 853, 541]",I-education_institute
327,-,"[955, 524, 957, 541]",MISC
328,NL,"[955, 524, 957, 541]",MISC
329,-,"[955, 524, 957, 541]",MISC
330,Special,"[106, 559, 230, 575]",MISC
331,##ising,"[106, 559, 230, 575]",MISC
332,in,"[230, 559, 250, 575]",MISC
333,Economic,"[251, 559, 333, 575]",MISC
334,Analysis,"[333, 559, 425, 575]",MISC
335,",","[333, 559, 425, 575]",MISC
336,main,"[426, 559, 467, 575]",MISC
337,courses,"[468, 559, 539, 575]",MISC
338,in,"[540, 559, 559, 575]",MISC
339,Statistics,"[560, 559, 673, 575]",MISC
340,",","[560, 559, 673, 575]",MISC
341,E,"[674, 559, 806, 575]",MISC
342,##con,"[674, 559, 806, 575]",MISC
343,##ometric,"[674, 559, 806, 575]",MISC
344,##s,"[674, 559, 806, 575]",MISC
345,",","[674, 559, 806, 575]",MISC
346,Mac,"[808, 559, 951, 575]",MISC
347,##ro,"[808, 559, 951, 575]",MISC
348,##economic,"[808, 559, 951, 575]",MISC
349,##s,"[808, 559, 951, 575]",MISC
350,and,"[952, 559, 983, 575]",MISC
351,-,"[983, 559, 985, 575]",MISC
352,NL,"[983, 559, 985, 575]",MISC
353,-,"[983, 559, 985, 575]",MISC
354,Micro,"[128, 575, 270, 591]",MISC
355,##economic,"[128, 575, 270, 591]",MISC
356,##s,"[128, 575, 270, 591]",MISC
357,-,"[270, 575, 271, 591]",MISC
358,NL,"[270, 575, 271, 591]",MISC
359,-,"[270, 575, 271, 591]",MISC
360,Final,"[106, 592, 152, 608]",MISC
361,dissertation,"[154, 592, 268, 608]",MISC
362,in,"[269, 592, 287, 608]",MISC
363,statistics,"[289, 592, 394, 608]",MISC
364,",","[289, 592, 394, 608]",MISC
365,consisting,"[394, 592, 489, 608]",MISC
366,of,"[491, 592, 509, 608]",MISC
367,a,"[510, 592, 519, 608]",MISC
368,study,"[520, 592, 566, 608]",MISC
369,of,"[568, 592, 586, 608]",MISC
370,a,"[587, 592, 596, 608]",MISC
371,capture,"[597, 592, 759, 608]",MISC
372,-,"[597, 592, 759, 608]",MISC
373,re,"[597, 592, 759, 608]",MISC
374,##cap,"[597, 592, 759, 608]",MISC
375,##ture,"[597, 592, 759, 608]",MISC
376,statistical,"[760, 592, 866, 608]",MISC
377,model,"[866, 592, 912, 608]",MISC
378,to,"[914, 592, 932, 608]",MISC
379,-,"[933, 592, 935, 608]",MISC
380,NL,"[933, 592, 935, 608]",MISC
381,-,"[933, 592, 935, 608]",MISC
382,estimate,"[128, 610, 207, 626]",MISC
383,the,"[208, 610, 237, 626]",MISC
384,abundance,"[238, 610, 328, 626]",MISC
385,of,"[328, 610, 348, 626]",MISC
386,el,"[348, 610, 418, 626]",MISC
387,##usive,"[348, 610, 418, 626]",MISC
388,populations,"[418, 610, 538, 626]",MISC
389,.,"[418, 610, 538, 626]",MISC
390,-,"[538, 610, 540, 626]",MISC
391,NL,"[538, 610, 540, 626]",MISC
392,-,"[538, 610, 540, 626]",MISC
393,September,"[64, 643, 168, 659]",MISC
394,2007,"[169, 643, 216, 659]",MISC
395,-,"[216, 643, 227, 659]",MISC
396,March,"[228, 643, 285, 659]",MISC
397,2011,"[286, 643, 343, 659]",MISC
398,:,"[286, 643, 343, 659]",MISC
399,-,"[345, 643, 347, 659]",MISC
400,NL,"[345, 643, 347, 659]",MISC
401,-,"[345, 643, 347, 659]",MISC
402,99,"[64, 677, 125, 693]",MISC
403,/,"[64, 677, 125, 693]",MISC
404,110,"[64, 677, 125, 693]",MISC
405,B,"[64, 677, 125, 693]",B-education_degree
406,.,"[64, 677, 125, 693]",I-education_degree
407,Sc,"[64, 677, 125, 693]",I-education_degree
408,.,"[126, 677, 178, 693]",MISC
409,Economics,"[179, 677, 282, 693]",B-education_course
410,",","[179, 677, 282, 693]",MISC
411,Un,"[179, 677, 282, 693]",B-education_institute
412,##ivers,"[179, 677, 282, 693]",I-education_institute
413,##ita,"[179, 677, 282, 693]",I-education_institute
414,de,"[283, 677, 387, 693]",I-education_institute
415,##gli,"[283, 677, 387, 693]",I-education_institute
416,St,"[387, 677, 439, 693]",I-education_institute
417,##udi,"[387, 677, 439, 693]",I-education_institute
418,di,"[439, 677, 491, 693]",I-education_institute
419,Roma,"[492, 677, 511, 693]",I-education_institute
420,“,"[512, 677, 554, 693]",I-education_institute
421,La,"[512, 677, 554, 693]",I-education_institute
422,Sa,"[554, 677, 585, 693]",I-education_institute
423,##pie,"[554, 677, 585, 693]",I-education_institute
424,##nza,"[554, 677, 585, 693]",I-education_institute
425,”,"[554, 677, 585, 693]",I-education_institute
426,-,"[679, 677, 681, 693]",MISC
427,NL,"[679, 677, 681, 693]",MISC
428,-,"[679, 677, 681, 693]",MISC
429,September,"[64, 711, 168, 728]",MISC
430,2002,"[168, 711, 213, 728]",MISC
431,–,"[215, 711, 225, 728]",MISC
432,July,"[226, 711, 271, 728]",MISC
433,2007,"[273, 711, 330, 728]",MISC
434,:,"[273, 711, 330, 728]",MISC
435,-,"[330, 711, 332, 728]",MISC
436,NL,"[330, 711, 332, 728]",MISC
437,-,"[330, 711, 332, 728]",MISC
438,98,"[64, 745, 135, 762]",MISC
439,/,"[64, 745, 135, 762]",MISC
440,100,"[64, 745, 135, 762]",MISC
441,",","[64, 745, 135, 762]",MISC
442,High,"[136, 745, 175, 762]",B-education_degree
443,School,"[177, 745, 237, 762]",I-education_degree
444,Diploma,"[238, 745, 318, 762]",I-education_degree
445,",","[238, 745, 318, 762]",MISC
446,Li,"[320, 745, 370, 762]",B-education_institute
447,##ce,"[320, 745, 370, 762]",I-education_institute
448,##o,"[320, 745, 370, 762]",I-education_institute
449,G,"[371, 745, 451, 762]",I-education_institute
450,##inn,"[371, 745, 451, 762]",I-education_institute
451,##asi,"[371, 745, 451, 762]",I-education_institute
452,##o,"[371, 745, 451, 762]",I-education_institute
453,“,"[453, 745, 533, 762]",I-education_institute
454,Mariano,"[453, 745, 533, 762]",I-education_institute
455,B,"[535, 745, 615, 762]",I-education_institute
456,##ura,"[535, 745, 615, 762]",I-education_institute
457,##tti,"[535, 745, 615, 762]",I-education_institute
458,”,"[535, 745, 615, 762]",I-education_institute
459,-,"[617, 745, 618, 762]",MISC
460,NL,"[617, 745, 618, 762]",MISC
461,-,"[617, 745, 618, 762]",MISC
462,Employment,"[64, 797, 175, 813]",B-work_experience_heading
463,History,"[176, 797, 255, 813]",I-work_experience_heading
464,-,"[255, 797, 257, 813]",MISC
465,NL,"[255, 797, 257, 813]",MISC
466,-,"[255, 797, 257, 813]",MISC
467,June,"[64, 830, 110, 846]",MISC
468,2016,"[111, 830, 157, 846]",MISC
469,-,"[158, 830, 169, 846]",MISC
470,September,"[170, 830, 275, 846]",MISC
471,2016,"[275, 830, 333, 846]",MISC
472,:,"[275, 830, 333, 846]",MISC
473,-,"[334, 830, 336, 846]",MISC
474,NL,"[334, 830, 336, 846]",MISC
475,-,"[334, 830, 336, 846]",MISC
476,Inter,"[64, 864, 169, 881]",B-employer_role
477,##ns,"[64, 864, 169, 881]",I-employer_role
478,##hip,"[64, 864, 169, 881]",I-employer_role
479,",","[64, 864, 169, 881]",MISC
480,An,"[170, 864, 236, 881]",B-employer_company_name
481,##cite,"[170, 864, 236, 881]",I-employer_company_name
482,##l,"[170, 864, 236, 881]",I-employer_company_name
483,S,"[237, 864, 294, 881]",I-employer_company_name
484,.,"[237, 864, 294, 881]",I-employer_company_name
485,p,"[237, 864, 294, 881]",I-employer_company_name
486,.,"[237, 864, 294, 881]",I-employer_company_name
487,A,"[237, 864, 294, 881]",I-employer_company_name
488,.,"[237, 864, 294, 881]",MISC
489,-,"[295, 864, 296, 881]",MISC
490,NL,"[295, 864, 296, 881]",MISC
491,-,"[295, 864, 296, 881]",MISC
492,An,"[106, 899, 174, 915]",B-employer_company_name
493,##cite,"[106, 899, 174, 915]",I-employer_company_name
494,##l,"[106, 899, 174, 915]",I-employer_company_name
495,S,"[175, 899, 234, 915]",I-employer_company_name
496,.,"[175, 899, 234, 915]",I-employer_company_name
497,p,"[175, 899, 234, 915]",I-employer_company_name
498,.,"[175, 899, 234, 915]",I-employer_company_name
499,A,"[175, 899, 234, 915]",I-employer_company_name
500,.,"[175, 899, 234, 915]",MISC
501,is,"[235, 899, 255, 915]",MISC
502,an,"[255, 899, 274, 915]",MISC
503,Italian,"[275, 899, 343, 915]",MISC
504,services,"[344, 899, 423, 915]",MISC
505,company,"[423, 899, 491, 915]",MISC
506,developing,"[493, 899, 591, 915]",MISC
507,and,"[592, 899, 621, 915]",MISC
508,delivering,"[622, 899, 720, 915]",MISC
509,IT,"[721, 899, 741, 915]",MISC
510,solutions,"[741, 899, 828, 915]",MISC
511,for,"[830, 899, 859, 915]",MISC
512,municipality,"[860, 899, 989, 915]",MISC
513,",","[860, 899, 989, 915]",MISC
514,-,"[989, 899, 991, 915]",MISC
515,NL,"[989, 899, 991, 915]",MISC
516,-,"[989, 899, 991, 915]",MISC
517,and,"[128, 915, 157, 931]",MISC
518,project,"[157, 915, 223, 931]",MISC
519,management,"[224, 915, 319, 931]",MISC
520,consulting,"[321, 915, 415, 931]",MISC
521,services,"[417, 915, 492, 931]",MISC
522,for,"[494, 915, 522, 931]",MISC
523,local,"[522, 915, 569, 931]",MISC
524,institutions,"[570, 915, 694, 931]",MISC
525,.,"[570, 915, 694, 931]",MISC
526,-,"[695, 915, 697, 931]",MISC
527,NL,"[695, 915, 697, 931]",MISC
528,-,"[695, 915, 697, 931]",MISC
529,Project,"[107, 932, 178, 948]",MISC
530,manager,"[180, 932, 251, 948]",MISC
531,assistant,"[253, 932, 357, 948]",MISC
532,",","[253, 932, 357, 948]",MISC
533,supporting,"[358, 932, 461, 948]",MISC
534,manager,"[462, 932, 555, 948]",MISC
535,’,"[462, 932, 555, 948]",MISC
536,s,"[462, 932, 555, 948]",MISC
537,work,"[556, 932, 598, 948]",MISC
538,on,"[598, 932, 618, 948]",MISC
539,projects,"[619, 932, 701, 948]",MISC
540,aiming,"[703, 932, 765, 948]",MISC
541,to,"[766, 932, 785, 948]",MISC
542,help,"[787, 932, 828, 948]",MISC
543,the,"[828, 932, 859, 948]",MISC
544,public,"[860, 932, 922, 948]",MISC
545,-,"[923, 932, 924, 948]",MISC
546,NL,"[923, 932, 924, 948]",MISC
547,-,"[923, 932, 924, 948]",MISC
548,administration,"[128, 950, 268, 966]",MISC
549,##s,"[128, 950, 268, 966]",MISC
550,to,"[268, 950, 286, 966]",MISC
551,improve,"[287, 950, 351, 966]",MISC
552,efficiency,"[352, 950, 445, 966]",MISC
553,-,"[445, 950, 447, 966]",MISC
554,NL,"[445, 950, 447, 966]",MISC
555,-,"[445, 950, 447, 966]",MISC
556,Specifically,"[106, 966, 224, 983]",MISC
557,working,"[225, 966, 293, 983]",MISC
558,on,"[295, 966, 314, 983]",MISC
559,project,"[315, 966, 383, 983]",MISC
560,management,"[384, 966, 482, 983]",MISC
561,consulting,"[483, 966, 582, 983]",MISC
562,for,"[583, 966, 611, 983]",MISC
563,local,"[612, 966, 661, 983]",MISC
564,institution,"[662, 966, 771, 983]",MISC
565,on,"[771, 966, 791, 983]",MISC
566,innovation,"[791, 966, 889, 983]",MISC
567,-,"[890, 966, 892, 983]",MISC
568,NL,"[890, 966, 892, 983]",MISC
569,-,"[890, 966, 892, 983]",MISC
570,programmes,"[128, 983, 234, 999]",MISC
571,financed,"[234, 983, 319, 999]",MISC
572,by,"[319, 983, 339, 999]",MISC
573,national,"[341, 983, 425, 999]",MISC
574,and,"[425, 983, 456, 999]",MISC
575,European,"[457, 983, 541, 999]",MISC
576,funds,"[542, 983, 605, 999]",MISC
577,.,"[542, 983, 605, 999]",MISC
578,-,"[606, 983, 608, 999]",MISC
579,NL,"[606, 983, 608, 999]",MISC
580,-,"[606, 983, 608, 999]",MISC
581,September,"[64, 81, 166, 98]",MISC
582,2014,"[166, 81, 211, 98]",MISC
583,-,"[212, 81, 223, 98]",MISC
584,February,"[223, 81, 313, 98]",MISC
585,2015,"[315, 81, 370, 98]",MISC
586,:,"[315, 81, 370, 98]",MISC
587,-,"[372, 81, 373, 98]",MISC
588,NL,"[372, 81, 373, 98]",MISC
589,-,"[372, 81, 373, 98]",MISC
590,Inter,"[64, 116, 169, 133]",B-employer_role
591,##ns,"[64, 116, 169, 133]",I-employer_role
592,##hip,"[64, 116, 169, 133]",I-employer_role
593,",","[64, 116, 169, 133]",MISC
594,Ban,"[170, 116, 219, 133]",B-employer_company_name
595,##ca,"[170, 116, 219, 133]",I-employer_company_name
596,d,"[219, 116, 296, 133]",I-employer_company_name
597,’,"[219, 116, 296, 133]",I-employer_company_name
598,Italia,"[219, 116, 296, 133]",I-employer_company_name
599,-,"[296, 116, 298, 133]",MISC
600,NL,"[296, 116, 298, 133]",MISC
601,-,"[296, 116, 298, 133]",MISC
602,Development,"[106, 150, 217, 166]",MISC
603,of,"[218, 150, 238, 166]",MISC
604,statistical,"[238, 150, 349, 166]",MISC
605,programmes,"[350, 150, 450, 166]",MISC
606,for,"[451, 150, 482, 166]",MISC
607,statistical,"[482, 150, 734, 166]",MISC
608,/,"[482, 150, 734, 166]",MISC
609,e,"[482, 150, 734, 166]",MISC
610,##con,"[482, 150, 734, 166]",MISC
611,##ometric,"[482, 150, 734, 166]",MISC
612,##al,"[482, 150, 734, 166]",MISC
613,analysis,"[735, 150, 816, 166]",MISC
614,and,"[816, 150, 847, 166]",MISC
615,data,"[847, 150, 886, 166]",MISC
616,management,"[887, 150, 988, 166]",MISC
617,-,"[989, 150, 991, 166]",MISC
618,NL,"[989, 150, 991, 166]",MISC
619,-,"[989, 150, 991, 166]",MISC
620,using,"[128, 168, 177, 184]",MISC
621,statistical,"[178, 168, 285, 184]",MISC
622,software,"[286, 168, 365, 184]",MISC
623,"""","[365, 168, 394, 184]",MISC
624,R,"[365, 168, 394, 184]",MISC
625,"""","[365, 168, 394, 184]",MISC
626,in,"[395, 168, 414, 184]",MISC
627,the,"[415, 168, 443, 184]",MISC
628,Economic,"[444, 168, 523, 184]",MISC
629,and,"[523, 168, 552, 184]",MISC
630,Statistics,"[553, 168, 651, 184]",MISC
631,Department,"[651, 168, 750, 184]",MISC
632,of,"[750, 168, 770, 184]",MISC
633,the,"[770, 168, 798, 184]",MISC
634,Italian,"[799, 168, 867, 184]",MISC
635,Central,"[869, 168, 937, 184]",MISC
636,Bank,"[938, 168, 986, 184]",MISC
637,.,"[938, 168, 986, 184]",MISC
638,-,"[987, 168, 989, 184]",MISC
639,NL,"[987, 168, 989, 184]",MISC
640,-,"[987, 168, 989, 184]",MISC
641,Development,"[107, 184, 225, 200]",MISC
642,of,"[226, 184, 247, 200]",MISC
643,programmes,"[248, 184, 355, 200]",MISC
644,for,"[356, 184, 388, 200]",MISC
645,managing,"[388, 184, 485, 200]",MISC
646,",","[388, 184, 485, 200]",MISC
647,processing,"[486, 184, 593, 200]",MISC
648,and,"[594, 184, 626, 200]",MISC
649,up,"[626, 184, 712, 200]",MISC
650,##dating,"[626, 184, 712, 200]",MISC
651,foreign,"[713, 184, 788, 200]",MISC
652,trade,"[789, 184, 842, 200]",MISC
653,and,"[843, 184, 875, 200]",MISC
654,prices,"[875, 184, 940, 200]",MISC
655,data,"[940, 184, 983, 200]",MISC
656,-,"[983, 184, 985, 200]",MISC
657,NL,"[983, 184, 985, 200]",MISC
658,-,"[983, 184, 985, 200]",MISC
659,and,"[128, 201, 157, 217]",MISC
660,time,"[158, 201, 197, 217]",MISC
661,series,"[198, 201, 266, 217]",MISC
662,",","[198, 201, 266, 217]",MISC
663,and,"[267, 201, 296, 217]",MISC
664,integration,"[297, 201, 404, 217]",MISC
665,and,"[406, 201, 434, 217]",MISC
666,up,"[435, 201, 514, 217]",MISC
667,##dating,"[435, 201, 514, 217]",MISC
668,of,"[514, 201, 534, 217]",MISC
669,internal,"[534, 201, 613, 217]",MISC
670,databases,"[613, 201, 701, 217]",MISC
671,with,"[703, 201, 742, 217]",MISC
672,external,"[742, 201, 830, 217]",MISC
673,.,"[742, 201, 830, 217]",MISC
674,-,"[831, 201, 833, 217]",MISC
675,NL,"[831, 201, 833, 217]",MISC
676,-,"[831, 201, 833, 217]",MISC
677,Job,"[64, 252, 166, 268]",MISC
678,-,"[64, 252, 166, 268]",MISC
679,related,"[64, 252, 166, 268]",MISC
680,skills,"[167, 252, 222, 268]",MISC
681,-,"[223, 252, 225, 268]",MISC
682,NL,"[223, 252, 225, 268]",MISC
683,-,"[223, 252, 225, 268]",MISC
684,High,"[106, 286, 165, 302]",MISC
685,##ly,"[106, 286, 165, 302]",MISC
686,competent,"[167, 286, 256, 302]",MISC
687,in,"[258, 286, 278, 302]",MISC
688,quantitative,"[278, 286, 398, 302]",MISC
689,skills,"[399, 286, 458, 302]",MISC
690,and,"[460, 286, 489, 302]",MISC
691,analytical,"[490, 286, 591, 302]",MISC
692,thinking,"[591, 286, 681, 302]",MISC
693,",","[591, 286, 681, 302]",MISC
694,developed,"[682, 286, 772, 302]",MISC
695,through,"[773, 286, 843, 302]",MISC
696,my,"[844, 286, 864, 302]",MISC
697,studies,"[864, 286, 934, 302]",MISC
698,and,"[935, 286, 964, 302]",MISC
699,-,"[966, 286, 967, 302]",MISC
700,NL,"[966, 286, 967, 302]",MISC
701,-,"[966, 286, 967, 302]",MISC
702,strengthened,"[128, 303, 246, 319]",MISC
703,during,"[248, 303, 307, 319]",MISC
704,my,"[308, 303, 327, 319]",MISC
705,internship,"[327, 303, 426, 319]",MISC
706,at,"[427, 303, 447, 319]",MISC
707,the,"[447, 303, 476, 319]",MISC
708,Italian,"[477, 303, 545, 319]",MISC
709,Central,"[547, 303, 614, 319]",MISC
710,Bank,"[616, 303, 656, 319]",MISC
711,-,"[656, 303, 658, 319]",MISC
712,NL,"[656, 303, 658, 319]",MISC
713,-,"[656, 303, 658, 319]",MISC
714,Excellent,"[107, 319, 201, 337]",MISC
715,data,"[202, 319, 243, 337]",MISC
716,analysis,"[244, 319, 328, 337]",MISC
717,skills,"[329, 319, 402, 337]",MISC
718,",","[329, 319, 402, 337]",MISC
719,gained,"[403, 319, 466, 337]",MISC
720,through,"[467, 319, 540, 337]",MISC
721,my,"[541, 319, 560, 337]",MISC
722,master,"[562, 319, 625, 337]",MISC
723,in,"[625, 319, 645, 337]",MISC
724,Big,"[647, 319, 677, 337]",MISC
725,Data,"[678, 319, 719, 337]",MISC
726,Science,"[721, 319, 805, 337]",MISC
727,.,"[721, 319, 805, 337]",MISC
728,Excellent,"[805, 319, 900, 337]",MISC
729,command,"[901, 319, 974, 337]",MISC
730,of,"[975, 319, 994, 337]",MISC
731,-,"[996, 319, 998, 337]",MISC
732,NL,"[996, 319, 998, 337]",MISC
733,-,"[996, 319, 998, 337]",MISC
734,R,"[128, 337, 152, 353]",MISC
735,",","[128, 337, 152, 353]",MISC
736,MA,"[152, 337, 236, 353]",MISC
737,##TL,"[152, 337, 236, 353]",MISC
738,##AB,"[152, 337, 236, 353]",MISC
739,",","[152, 337, 236, 353]",MISC
740,Python,"[236, 337, 320, 353]",MISC
741,.,"[236, 337, 320, 353]",MISC
742,Good,"[320, 337, 367, 353]",MISC
743,command,"[369, 337, 453, 353]",MISC
744,of,"[453, 337, 476, 353]",MISC
745,Had,"[477, 337, 548, 353]",MISC
746,##oop,"[477, 337, 548, 353]",MISC
747,-,"[549, 337, 550, 353]",MISC
748,NL,"[549, 337, 550, 353]",MISC
749,-,"[549, 337, 550, 353]",MISC
750,Strong,"[106, 354, 165, 370]",MISC
751,organisation,"[167, 354, 306, 370]",MISC
752,##al,"[167, 354, 306, 370]",MISC
753,skills,"[308, 354, 378, 370]",MISC
754,",","[308, 354, 378, 370]",MISC
755,gained,"[379, 354, 438, 370]",MISC
756,through,"[439, 354, 509, 370]",MISC
757,my,"[510, 354, 529, 370]",MISC
758,internship,"[530, 354, 630, 370]",MISC
759,at,"[631, 354, 650, 370]",MISC
760,An,"[651, 354, 721, 370]",B-employer_company_name
761,##cite,"[651, 354, 721, 370]",I-employer_company_name
762,##l,"[651, 354, 721, 370]",I-employer_company_name
763,S,"[721, 354, 772, 370]",I-employer_company_name
764,.,"[721, 354, 772, 370]",I-employer_company_name
765,p,"[721, 354, 772, 370]",I-employer_company_name
766,.,"[721, 354, 772, 370]",I-employer_company_name
767,A,"[721, 354, 772, 370]",I-employer_company_name
768,and,"[772, 354, 801, 370]",MISC
769,through,"[802, 354, 872, 370]",MISC
770,all,"[873, 354, 901, 370]",MISC
771,the,"[903, 354, 932, 370]",MISC
772,-,"[933, 354, 935, 370]",MISC
773,NL,"[933, 354, 935, 370]",MISC
774,-,"[933, 354, 935, 370]",MISC
775,activities,"[128, 370, 228, 388]",MISC
776,I,"[230, 370, 239, 388]",MISC
777,n,"[240, 370, 321, 388]",MISC
778,##urt,"[240, 370, 321, 388]",MISC
779,##ured,"[240, 370, 321, 388]",MISC
780,through,"[321, 370, 391, 388]",MISC
781,my,"[393, 370, 412, 388]",MISC
782,studies,"[413, 370, 483, 388]",MISC
783,and,"[484, 370, 515, 388]",MISC
784,periods,"[515, 370, 584, 388]",MISC
785,of,"[586, 370, 606, 388]",MISC
786,employment,"[606, 370, 706, 388]",MISC
787,(,"[708, 370, 778, 388]",MISC
788,member,"[708, 370, 778, 388]",MISC
789,of,"[779, 370, 799, 388]",MISC
790,associations,"[799, 370, 930, 388]",MISC
791,",","[799, 370, 930, 388]",MISC
792,-,"[932, 370, 933, 388]",MISC
793,NL,"[932, 370, 933, 388]",MISC
794,-,"[932, 370, 933, 388]",MISC
795,student,"[128, 388, 189, 404]",MISC
796,representative,"[190, 388, 323, 404]",MISC
797,",","[190, 388, 323, 404]",MISC
798,sports,"[323, 388, 384, 404]",MISC
799,",","[323, 388, 384, 404]",MISC
800,travelling,"[385, 388, 482, 404]",MISC
801,),"[385, 388, 482, 404]",MISC
802,-,"[483, 388, 484, 404]",MISC
803,NL,"[483, 388, 484, 404]",MISC
804,-,"[483, 388, 484, 404]",MISC
805,Additional,"[64, 422, 166, 438]",B-others_heading
806,skills,"[167, 422, 228, 438]",I-others_heading
807,and,"[229, 422, 259, 438]",I-others_heading
808,experience,"[260, 422, 362, 438]",I-others_heading
809,-,"[363, 422, 364, 438]",MISC
810,NL,"[363, 422, 364, 438]",MISC
811,-,"[363, 422, 364, 438]",MISC
812,F,"[106, 456, 167, 473]",MISC
813,##lue,"[106, 456, 167, 473]",MISC
814,##nt,"[106, 456, 167, 473]",MISC
815,in,"[169, 456, 188, 473]",MISC
816,English,"[190, 456, 261, 473]",MISC
817,and,"[262, 456, 293, 473]",MISC
818,Italian,"[293, 456, 376, 473]",MISC
819,",","[293, 456, 376, 473]",MISC
820,intermediate,"[376, 456, 500, 473]",MISC
821,in,"[501, 456, 521, 473]",MISC
822,Spanish,"[522, 456, 593, 473]",MISC
823,and,"[594, 456, 625, 473]",MISC
824,Portuguese,"[626, 456, 729, 473]",MISC
825,-,"[729, 456, 731, 473]",MISC
826,NL,"[729, 456, 731, 473]",MISC
827,-,"[729, 456, 731, 473]",MISC
828,Board,"[107, 473, 163, 490]",MISC
829,member,"[164, 473, 230, 490]",MISC
830,for,"[232, 473, 264, 490]",MISC
831,several,"[266, 473, 344, 490]",MISC
832,years,"[345, 473, 400, 490]",MISC
833,(,"[401, 473, 457, 490]",MISC
834,2008,"[401, 473, 457, 490]",MISC
835,-,"[458, 473, 469, 490]",MISC
836,2011,"[469, 473, 525, 490]",MISC
837,),"[469, 473, 525, 490]",MISC
838,of,"[526, 473, 547, 490]",MISC
839,the,"[548, 473, 581, 490]",MISC
840,r,"[582, 473, 638, 490]",MISC
841,##oman,"[582, 473, 638, 490]",MISC
842,seat,"[639, 473, 684, 490]",MISC
843,of,"[684, 473, 706, 490]",MISC
844,A,"[707, 473, 773, 490]",MISC
845,##EG,"[707, 473, 773, 490]",MISC
846,##EE,"[707, 473, 773, 490]",MISC
847,",","[707, 473, 773, 490]",MISC
848,the,"[775, 473, 807, 490]",MISC
849,largest,"[808, 473, 887, 490]",MISC
850,European,"[888, 473, 977, 490]",MISC
851,-,"[978, 473, 980, 490]",MISC
852,NL,"[978, 473, 980, 490]",MISC
853,-,"[978, 473, 980, 490]",MISC
854,student,"[128, 490, 200, 506]",MISC
855,organization,"[201, 490, 324, 506]",MISC
856,in,"[324, 490, 344, 506]",MISC
857,the,"[345, 490, 376, 506]",MISC
858,EU,"[376, 490, 407, 506]",MISC
859,.,"[376, 490, 407, 506]",MISC
860,I,"[407, 490, 416, 506]",MISC
861,personally,"[417, 490, 519, 506]",MISC
862,promoted,"[521, 490, 603, 506]",MISC
863,a,"[603, 490, 612, 506]",MISC
864,cooperation,"[614, 490, 726, 506]",MISC
865,agreement,"[727, 490, 818, 506]",MISC
866,with,"[820, 490, 861, 506]",MISC
867,the,"[861, 490, 892, 506]",MISC
868,“,"[892, 490, 943, 506]",MISC
869,John,"[892, 490, 943, 506]",MISC
870,-,"[944, 490, 946, 506]",MISC
871,NL,"[944, 490, 946, 506]",MISC
872,-,"[944, 490, 946, 506]",MISC
873,C,"[128, 508, 189, 524]",MISC
874,##ab,"[128, 508, 189, 524]",MISC
875,##ot,"[128, 508, 189, 524]",MISC
876,”,"[128, 508, 189, 524]",MISC
877,American,"[190, 508, 270, 524]",MISC
878,university,"[272, 508, 374, 524]",MISC
879,in,"[375, 508, 395, 524]",MISC
880,Rome,"[395, 508, 445, 524]",MISC
881,.,"[395, 508, 445, 524]",MISC
882,-,"[447, 508, 449, 524]",MISC
883,NL,"[447, 508, 449, 524]",MISC
884,-,"[447, 508, 449, 524]",MISC
885,Part,"[107, 524, 223, 540]",MISC
886,##ici,"[107, 524, 223, 540]",MISC
887,##pan,"[107, 524, 223, 540]",MISC
888,##t,"[107, 524, 223, 540]",MISC
889,in,"[224, 524, 243, 540]",MISC
890,several,"[245, 524, 318, 540]",MISC
891,European,"[319, 524, 403, 540]",MISC
892,Youth,"[404, 524, 456, 540]",MISC
893,Exchange,"[457, 524, 541, 540]",MISC
894,Projects,"[542, 524, 626, 540]",MISC
895,(,"[627, 524, 657, 540]",MISC
896,in,"[627, 524, 657, 540]",MISC
897,2005,"[659, 524, 700, 540]",MISC
898,and,"[701, 524, 732, 540]",MISC
899,2006,"[733, 524, 785, 540]",MISC
900,),"[733, 524, 785, 540]",MISC
901,about,"[786, 524, 838, 540]",MISC
902,active,"[839, 524, 913, 540]",MISC
903,-,"[839, 524, 913, 540]",MISC
904,-,"[914, 524, 915, 540]",MISC
905,NL,"[914, 524, 915, 540]",MISC
906,-,"[914, 524, 915, 540]",MISC
907,citizenship,"[128, 541, 237, 557]",MISC
908,and,"[239, 541, 268, 557]",MISC
909,non,"[269, 541, 369, 557]",MISC
910,-,"[269, 541, 369, 557]",MISC
911,formal,"[269, 541, 369, 557]",MISC
912,education,"[370, 541, 470, 557]",MISC
913,",","[370, 541, 470, 557]",MISC
914,as,"[471, 541, 490, 557]",MISC
915,well,"[491, 541, 530, 557]",MISC
916,as,"[531, 541, 551, 557]",MISC
917,“,"[551, 541, 651, 557]",MISC
918,Leonardo,"[551, 541, 651, 557]",MISC
919,”,"[551, 541, 651, 557]",MISC
920,project,"[652, 541, 722, 557]",MISC
921,resulting,"[722, 541, 812, 557]",MISC
922,in,"[813, 541, 833, 557]",MISC
923,more,"[833, 541, 873, 557]",MISC
924,than,"[874, 541, 913, 557]",MISC
925,one,"[914, 541, 942, 557]",MISC
926,-,"[944, 541, 946, 557]",MISC
927,NL,"[944, 541, 946, 557]",MISC
928,-,"[944, 541, 946, 557]",MISC
929,month,"[128, 557, 186, 575]",MISC
930,of,"[186, 557, 207, 575]",MISC
931,summer,"[209, 557, 277, 575]",MISC
932,work,"[277, 557, 322, 575]",MISC
933,in,"[323, 557, 345, 575]",MISC
934,Budapest,"[346, 557, 437, 575]",MISC
935,-,"[438, 557, 440, 575]",MISC
936,NL,"[438, 557, 440, 575]",MISC
937,-,"[438, 557, 440, 575]",MISC
938,Interest,"[106, 575, 201, 591]",MISC
939,##ed,"[106, 575, 201, 591]",MISC
940,in,"[202, 575, 220, 591]",MISC
941,travelling,"[221, 575, 327, 591]",MISC
942,",","[221, 575, 327, 591]",MISC
943,reading,"[327, 575, 402, 591]",MISC
944,",","[327, 575, 402, 591]",MISC
945,social,"[404, 575, 461, 591]",MISC
946,issues,"[461, 575, 527, 591]",MISC
947,",","[461, 575, 527, 591]",MISC
948,technology,"[528, 575, 634, 591]",MISC
949,",","[528, 575, 634, 591]",MISC
950,music,"[634, 575, 691, 591]",MISC
951,.,"[634, 575, 691, 591]",MISC
952,-,"[692, 575, 694, 591]",MISC
953,NL,"[692, 575, 694, 591]",MISC
954,-,"[692, 575, 694, 591]",MISC
