,token,box,label
0,C,"[291, 78, 589, 117]",MISC
1,##UR,"[291, 78, 589, 117]",MISC
2,##RI,"[291, 78, 589, 117]",MISC
3,##CU,"[291, 78, 589, 117]",MISC
4,##L,"[291, 78, 589, 117]",MISC
5,##UM,"[291, 78, 589, 117]",MISC
6,VI,"[590, 78, 738, 117]",MISC
7,##TA,"[590, 78, 738, 117]",MISC
8,##E,"[590, 78, 738, 117]",MISC
9,-,"[739, 78, 741, 117]",MISC
10,NL,"[739, 78, 741, 117]",MISC
11,-,"[739, 78, 741, 117]",MISC
12,SA,"[101, 136, 206, 157]",B-name
13,##CH,"[101, 136, 206, 157]",I-name
14,##IN,"[101, 136, 206, 157]",I-name
15,K,"[207, 136, 296, 157]",I-name
16,##UM,"[207, 136, 296, 157]",I-name
17,##AR,"[207, 136, 296, 157]",I-name
18,-,"[296, 136, 298, 157]",MISC
19,NL,"[296, 136, 298, 157]",MISC
20,-,"[296, 136, 298, 157]",MISC
21,S,"[101, 158, 296, 180]",MISC
22,/,"[101, 158, 296, 180]",MISC
23,O,"[101, 158, 296, 180]",MISC
24,-,"[101, 158, 296, 180]",MISC
25,RA,"[101, 158, 296, 180]",MISC
26,##J,"[101, 158, 296, 180]",MISC
27,##EN,"[101, 158, 296, 180]",MISC
28,##DR,"[101, 158, 296, 180]",MISC
29,##A,"[101, 158, 296, 180]",MISC
30,Y,"[297, 158, 379, 180]",MISC
31,##AD,"[297, 158, 379, 180]",MISC
32,##AV,"[297, 158, 379, 180]",MISC
33,-,"[379, 158, 381, 180]",MISC
34,NL,"[379, 158, 381, 180]",MISC
35,-,"[379, 158, 381, 180]",MISC
36,P,"[101, 180, 253, 202]",MISC
37,##ER,"[101, 180, 253, 202]",MISC
38,##MA,"[101, 180, 253, 202]",MISC
39,##NE,"[101, 180, 253, 202]",MISC
40,##NT,"[101, 180, 253, 202]",MISC
41,AD,"[254, 180, 575, 202]",MISC
42,##D,"[254, 180, 575, 202]",MISC
43,-,"[254, 180, 575, 202]",MISC
44,AT,"[254, 180, 575, 202]",MISC
45,+,"[254, 180, 575, 202]",MISC
46,P,"[254, 180, 575, 202]",MISC
47,##O,"[254, 180, 575, 202]",MISC
48,-,"[254, 180, 575, 202]",MISC
49,B,"[254, 180, 575, 202]",MISC
50,##IS,"[254, 180, 575, 202]",MISC
51,##HA,"[254, 180, 575, 202]",MISC
52,##NP,"[254, 180, 575, 202]",MISC
53,##UR,"[254, 180, 575, 202]",MISC
54,AR,"[576, 180, 643, 202]",MISC
55,##AR,"[576, 180, 643, 202]",MISC
56,PS,"[644, 180, 932, 202]",MISC
57,+,"[644, 180, 932, 202]",MISC
58,B,"[644, 180, 932, 202]",MISC
59,##L,"[644, 180, 932, 202]",MISC
60,##OC,"[644, 180, 932, 202]",MISC
61,##K,"[644, 180, 932, 202]",MISC
62,-,"[644, 180, 932, 202]",MISC
63,G,"[644, 180, 932, 202]",MISC
64,##WA,"[644, 180, 932, 202]",MISC
65,##LP,"[644, 180, 932, 202]",MISC
66,##AR,"[644, 180, 932, 202]",MISC
67,##A,"[644, 180, 932, 202]",MISC
68,-,"[933, 180, 934, 202]",MISC
69,NL,"[933, 180, 934, 202]",MISC
70,-,"[933, 180, 934, 202]",MISC
71,D,"[101, 202, 323, 224]",MISC
72,##IS,"[101, 202, 323, 224]",MISC
73,##T,"[101, 202, 323, 224]",MISC
74,-,"[101, 202, 323, 224]",MISC
75,MA,"[101, 202, 323, 224]",MISC
76,##D,"[101, 202, 323, 224]",MISC
77,##H,"[101, 202, 323, 224]",MISC
78,##EP,"[101, 202, 323, 224]",MISC
79,##UR,"[101, 202, 323, 224]",MISC
80,##A,"[101, 202, 323, 224]",MISC
81,",","[101, 202, 323, 224]",MISC
82,B,"[324, 202, 501, 224]",MISC
83,##I,"[324, 202, 501, 224]",MISC
84,##HA,"[324, 202, 501, 224]",MISC
85,##R,"[324, 202, 501, 224]",MISC
86,-,"[324, 202, 501, 224]",MISC
87,85,"[324, 202, 501, 224]",MISC
88,##21,"[324, 202, 501, 224]",MISC
89,##15,"[324, 202, 501, 224]",MISC
90,-,"[502, 202, 504, 224]",MISC
91,NL,"[502, 202, 504, 224]",MISC
92,-,"[502, 202, 504, 224]",MISC
93,M,"[101, 224, 159, 246]",MISC
94,##O,"[101, 224, 159, 246]",MISC
95,##B,"[101, 224, 159, 246]",MISC
96,-,"[101, 224, 159, 246]",MISC
97,87,"[159, 224, 303, 246]",B-phones_phone
98,##0,"[159, 224, 303, 246]",I-phones_phone
99,##9,"[159, 224, 303, 246]",I-phones_phone
100,##8,"[159, 224, 303, 246]",I-phones_phone
101,##9,"[159, 224, 303, 246]",I-phones_phone
102,##8,"[159, 224, 303, 246]",I-phones_phone
103,##30,"[159, 224, 303, 246]",I-phones_phone
104,##8,"[159, 224, 303, 246]",I-phones_phone
105,-,"[303, 224, 305, 246]",MISC
106,NL,"[303, 224, 305, 246]",MISC
107,-,"[303, 224, 305, 246]",MISC
108,E,"[101, 246, 477, 268]",MISC
109,##MA,"[101, 246, 477, 268]",MISC
110,##IL,"[101, 246, 477, 268]",MISC
111,:,"[101, 246, 477, 268]",MISC
112,sa,"[101, 246, 477, 268]",B-emails_email
113,##chin,"[101, 246, 477, 268]",I-emails_email
114,##sa,"[101, 246, 477, 268]",I-emails_email
115,##kt,"[101, 246, 477, 268]",I-emails_email
116,##i,"[101, 246, 477, 268]",I-emails_email
117,##30,"[101, 246, 477, 268]",I-emails_email
118,@,"[101, 246, 477, 268]",I-emails_email
119,g,"[101, 246, 477, 268]",I-emails_email
120,##mail,"[101, 246, 477, 268]",I-emails_email
121,.,"[101, 246, 477, 268]",I-emails_email
122,com,"[101, 246, 477, 268]",I-emails_email
123,-,"[477, 246, 479, 268]",MISC
124,NL,"[477, 246, 479, 268]",MISC
125,-,"[477, 246, 479, 268]",MISC
126,_,"[101, 269, 1000, 290]",MISC
127,_,"[101, 269, 1000, 290]",MISC
128,_,"[101, 269, 1000, 290]",MISC
129,_,"[101, 269, 1000, 290]",MISC
130,_,"[101, 269, 1000, 290]",MISC
131,_,"[101, 269, 1000, 290]",MISC
132,_,"[101, 269, 1000, 290]",MISC
133,_,"[101, 269, 1000, 290]",MISC
134,_,"[101, 269, 1000, 290]",MISC
135,_,"[101, 269, 1000, 290]",MISC
136,_,"[101, 269, 1000, 290]",MISC
137,_,"[101, 269, 1000, 290]",MISC
138,_,"[101, 269, 1000, 290]",MISC
139,_,"[101, 269, 1000, 290]",MISC
140,_,"[101, 269, 1000, 290]",MISC
141,_,"[101, 269, 1000, 290]",MISC
142,_,"[101, 269, 1000, 290]",MISC
143,_,"[101, 269, 1000, 290]",MISC
144,_,"[101, 269, 1000, 290]",MISC
145,_,"[101, 269, 1000, 290]",MISC
146,_,"[101, 269, 1000, 290]",MISC
147,_,"[101, 269, 1000, 290]",MISC
148,_,"[101, 269, 1000, 290]",MISC
149,_,"[101, 269, 1000, 290]",MISC
150,_,"[101, 269, 1000, 290]",MISC
151,_,"[101, 269, 1000, 290]",MISC
152,_,"[101, 269, 1000, 290]",MISC
153,_,"[101, 269, 1000, 290]",MISC
154,_,"[101, 269, 1000, 290]",MISC
155,_,"[101, 269, 1000, 290]",MISC
156,_,"[101, 269, 1000, 290]",MISC
157,_,"[101, 269, 1000, 290]",MISC
158,_,"[101, 269, 1000, 290]",MISC
159,_,"[101, 269, 1000, 290]",MISC
160,_,"[101, 269, 1000, 290]",MISC
161,_,"[101, 269, 1000, 290]",MISC
162,_,"[101, 269, 1000, 290]",MISC
163,_,"[101, 269, 1000, 290]",MISC
164,_,"[101, 269, 1000, 290]",MISC
165,_,"[101, 269, 1000, 290]",MISC
166,_,"[101, 269, 1000, 290]",MISC
167,_,"[101, 269, 1000, 290]",MISC
168,_,"[101, 269, 1000, 290]",MISC
169,_,"[101, 269, 1000, 290]",MISC
170,_,"[101, 269, 1000, 290]",MISC
171,_,"[101, 269, 1000, 290]",MISC
172,_,"[101, 269, 1000, 290]",MISC
173,_,"[101, 269, 1000, 290]",MISC
174,_,"[101, 269, 1000, 290]",MISC
175,_,"[101, 269, 1000, 290]",MISC
176,_,"[101, 269, 1000, 290]",MISC
177,_,"[101, 269, 1000, 290]",MISC
178,_,"[101, 269, 1000, 290]",MISC
179,_,"[101, 269, 1000, 290]",MISC
180,_,"[101, 269, 1000, 290]",MISC
181,_,"[101, 269, 1000, 290]",MISC
182,_,"[101, 269, 1000, 290]",MISC
183,_,"[101, 269, 1000, 290]",MISC
184,_,"[101, 269, 1000, 290]",MISC
185,_,"[101, 269, 1000, 290]",MISC
186,_,"[101, 269, 1000, 290]",MISC
187,_,"[101, 269, 1000, 290]",MISC
188,_,"[101, 269, 1000, 290]",MISC
189,_,"[101, 269, 1000, 290]",MISC
190,_,"[101, 269, 1000, 290]",MISC
191,_,"[101, 269, 1000, 290]",MISC
192,_,"[101, 269, 1000, 290]",MISC
193,_,"[101, 269, 1000, 290]",MISC
194,_,"[101, 269, 1000, 290]",MISC
195,_,"[101, 269, 1000, 290]",MISC
196,_,"[101, 269, 1000, 290]",MISC
197,-,"[1000, 269, 1001, 290]",MISC
198,NL,"[1000, 269, 1001, 290]",MISC
199,-,"[1000, 269, 1001, 290]",MISC
200,E,"[101, 292, 245, 312]",MISC
201,##X,"[101, 292, 245, 312]",MISC
202,##P,"[101, 292, 245, 312]",MISC
203,##ER,"[101, 292, 245, 312]",MISC
204,##IE,"[101, 292, 245, 312]",MISC
205,##NC,"[101, 292, 245, 312]",MISC
206,##E,"[101, 292, 245, 312]",MISC
207,-,"[101, 292, 245, 312]",MISC
208,Executive,"[247, 292, 366, 312]",MISC
209,Operations,"[366, 292, 498, 312]",MISC
210,at,"[499, 292, 524, 312]",MISC
211,hero,"[526, 292, 578, 312]",B-employer_company_name
212,fin,"[579, 292, 671, 312]",I-employer_company_name
213,##cor,"[579, 292, 671, 312]",I-employer_company_name
214,##p,"[579, 292, 671, 312]",I-employer_company_name
215,l,"[672, 292, 724, 312]",I-employer_company_name
216,##t,"[672, 292, 724, 312]",I-employer_company_name
217,##d,"[672, 292, 724, 312]",I-employer_company_name
218,.,"[672, 292, 724, 312]",MISC
219,-,"[725, 292, 726, 312]",MISC
220,NL,"[725, 292, 726, 312]",MISC
221,-,"[725, 292, 726, 312]",MISC
222,CA,"[101, 314, 200, 334]",MISC
223,##RE,"[101, 314, 200, 334]",MISC
224,##ER,"[101, 314, 200, 334]",MISC
225,O,"[201, 314, 367, 334]",MISC
226,##B,"[201, 314, 367, 334]",MISC
227,##J,"[201, 314, 367, 334]",MISC
228,##EC,"[201, 314, 367, 334]",MISC
229,##TI,"[201, 314, 367, 334]",MISC
230,##VE,"[201, 314, 367, 334]",MISC
231,:,"[201, 314, 367, 334]",MISC
232,-,"[368, 314, 370, 334]",MISC
233,NL,"[368, 314, 370, 334]",MISC
234,-,"[368, 314, 370, 334]",MISC
235,See,"[166, 358, 254, 378]",MISC
236,##king,"[166, 358, 254, 378]",MISC
237,a,"[255, 358, 268, 378]",MISC
238,Good,"[268, 358, 319, 378]",MISC
239,Po,"[319, 358, 420, 378]",MISC
240,##si,"[319, 358, 420, 378]",MISC
241,##tion,"[319, 358, 420, 378]",MISC
242,to,"[421, 358, 447, 378]",MISC
243,U,"[447, 358, 536, 378]",MISC
244,##til,"[447, 358, 536, 378]",MISC
245,##ize,"[447, 358, 536, 378]",MISC
246,My,"[536, 358, 562, 378]",MISC
247,Skills,"[562, 358, 638, 378]",MISC
248,and,"[639, 358, 677, 378]",MISC
249,A,"[677, 358, 791, 378]",MISC
250,##bilities,"[677, 358, 791, 378]",MISC
251,in,"[792, 358, 817, 378]",MISC
252,an,"[817, 358, 843, 378]",MISC
253,Industry,"[843, 358, 944, 378]",MISC
254,-,"[945, 358, 947, 378]",MISC
255,NL,"[945, 358, 947, 378]",MISC
256,-,"[945, 358, 947, 378]",MISC
257,That,"[101, 380, 151, 402]",MISC
258,Off,"[152, 380, 228, 402]",MISC
259,##ers,"[152, 380, 228, 402]",MISC
260,Professional,"[229, 380, 381, 402]",MISC
261,Growth,"[382, 380, 458, 402]",MISC
262,While,"[459, 380, 523, 402]",MISC
263,Being,"[523, 380, 587, 402]",MISC
264,Resource,"[587, 380, 739, 402]",MISC
265,##ful,"[587, 380, 739, 402]",MISC
266,",","[587, 380, 739, 402]",MISC
267,Inn,"[741, 380, 867, 402]",MISC
268,##ova,"[741, 380, 867, 402]",MISC
269,##tive,"[741, 380, 867, 402]",MISC
270,and,"[869, 380, 907, 402]",MISC
271,-,"[907, 380, 909, 402]",MISC
272,NL,"[907, 380, 909, 402]",MISC
273,-,"[907, 380, 909, 402]",MISC
274,F,"[101, 402, 193, 424]",MISC
275,##lex,"[101, 402, 193, 424]",MISC
276,##ible,"[101, 402, 193, 424]",MISC
277,.,"[101, 402, 193, 424]",MISC
278,-,"[193, 402, 195, 424]",MISC
279,NL,"[193, 402, 195, 424]",MISC
280,-,"[193, 402, 195, 424]",MISC
281,AC,"[101, 443, 235, 464]",B-education_heading
282,##AD,"[101, 443, 235, 464]",I-education_heading
283,##EM,"[101, 443, 235, 464]",I-education_heading
284,##IC,"[101, 443, 235, 464]",I-education_heading
285,PR,"[235, 443, 369, 464]",I-education_heading
286,##O,"[235, 443, 369, 464]",I-education_heading
287,##FI,"[235, 443, 369, 464]",I-education_heading
288,##LE,"[235, 443, 369, 464]",I-education_heading
289,:,"[235, 443, 369, 464]",I-education_heading
290,-,"[370, 443, 372, 464]",MISC
291,NL,"[370, 443, 372, 464]",MISC
292,-,"[370, 443, 372, 464]",MISC
293,•,"[68, 483, 84, 505]",MISC
294,Mat,"[86, 483, 310, 505]",B-education_degree
295,##ric,"[86, 483, 310, 505]",I-education_degree
296,##ulation,"[86, 483, 310, 505]",I-education_degree
297,From,"[311, 483, 380, 505]",MISC
298,BS,"[381, 483, 450, 505]",MISC
299,##E,"[381, 483, 450, 505]",MISC
300,##B,"[381, 483, 450, 505]",MISC
301,(,"[450, 483, 553, 505]",MISC
302,MA,"[450, 483, 553, 505]",B-education_institute
303,##D,"[450, 483, 553, 505]",I-education_institute
304,##H,"[450, 483, 553, 505]",I-education_institute
305,##U,"[450, 483, 553, 505]",I-education_institute
306,RAM,"[554, 483, 605, 505]",I-education_institute
307,H,"[607, 483, 675, 505]",I-education_institute
308,##IG,"[607, 483, 675, 505]",I-education_institute
309,##H,"[607, 483, 675, 505]",I-education_institute
310,SC,"[676, 483, 779, 505]",I-education_institute
311,##H,"[676, 483, 779, 505]",I-education_institute
312,##O,"[676, 483, 779, 505]",I-education_institute
313,##OL,"[676, 483, 779, 505]",I-education_institute
314,G,"[780, 483, 988, 505]",I-education_institute
315,##WA,"[780, 483, 988, 505]",I-education_institute
316,##LP,"[780, 483, 988, 505]",I-education_institute
317,##AR,"[780, 483, 988, 505]",I-education_institute
318,##A,"[780, 483, 988, 505]",I-education_institute
319,),"[780, 483, 988, 505]",MISC
320,48,"[780, 483, 988, 505]",MISC
321,%,"[780, 483, 988, 505]",MISC
322,-,"[989, 483, 990, 505]",MISC
323,NL,"[989, 483, 990, 505]",MISC
324,-,"[989, 483, 990, 505]",MISC
325,•,"[68, 505, 83, 527]",MISC
326,Intermediate,"[83, 505, 264, 527]",B-education_degree
327,From,"[265, 505, 325, 527]",MISC
328,BS,"[326, 505, 385, 527]",MISC
329,##E,"[326, 505, 385, 527]",MISC
330,##B,"[326, 505, 385, 527]",MISC
331,(,"[386, 505, 460, 527]",MISC
332,M,"[386, 505, 460, 527]",B-education_institute
333,##MM,"[386, 505, 460, 527]",I-education_institute
334,##V,"[386, 505, 460, 527]",I-education_institute
335,College,"[462, 505, 567, 527]",I-education_institute
336,G,"[568, 505, 687, 527]",I-education_institute
337,##wal,"[568, 505, 687, 527]",I-education_institute
338,##par,"[568, 505, 687, 527]",I-education_institute
339,##a,"[568, 505, 687, 527]",I-education_institute
340,Mad,"[689, 505, 839, 527]",I-education_institute
341,##he,"[689, 505, 839, 527]",I-education_institute
342,##pura,"[689, 505, 839, 527]",I-education_institute
343,),"[689, 505, 839, 527]",MISC
344,-,"[840, 505, 842, 527]",MISC
345,NL,"[840, 505, 842, 527]",MISC
346,-,"[840, 505, 842, 527]",MISC
347,59,"[101, 527, 282, 549]",MISC
348,%,"[101, 527, 282, 549]",MISC
349,(,"[101, 527, 282, 549]",MISC
350,SC,"[101, 527, 282, 549]",MISC
351,##IE,"[101, 527, 282, 549]",MISC
352,##NC,"[101, 527, 282, 549]",MISC
353,##E,"[101, 527, 282, 549]",MISC
354,),"[101, 527, 282, 549]",MISC
355,-,"[282, 527, 283, 549]",MISC
356,NL,"[282, 527, 283, 549]",MISC
357,-,"[282, 527, 283, 549]",MISC
358,•,"[68, 549, 86, 571]",MISC
359,AD,"[87, 549, 163, 571]",MISC
360,##CA,"[87, 549, 163, 571]",MISC
361,From,"[163, 549, 239, 571]",MISC
362,B,"[239, 549, 409, 571]",MISC
363,##HA,"[239, 549, 409, 571]",MISC
364,##GA,"[239, 549, 409, 571]",MISC
365,##LP,"[239, 549, 409, 571]",MISC
366,##UR,"[239, 549, 409, 571]",MISC
367,-,"[410, 549, 412, 571]",MISC
368,NL,"[410, 549, 412, 571]",MISC
369,-,"[410, 549, 412, 571]",MISC
370,H,"[101, 590, 204, 612]",MISC
371,##O,"[101, 590, 204, 612]",MISC
372,##BB,"[101, 590, 204, 612]",MISC
373,##IE,"[101, 590, 204, 612]",MISC
374,##S,"[101, 590, 204, 612]",MISC
375,:,"[101, 590, 204, 612]",MISC
376,Listen,"[205, 590, 323, 612]",MISC
377,##ing,"[205, 590, 323, 612]",MISC
378,Music,"[323, 590, 401, 612]",MISC
379,",","[323, 590, 401, 612]",MISC
380,Playing,"[402, 590, 492, 612]",MISC
381,cricket,"[493, 590, 596, 612]",MISC
382,.,"[493, 590, 596, 612]",MISC
383,-,"[598, 590, 600, 612]",MISC
384,NL,"[598, 590, 600, 612]",MISC
385,-,"[598, 590, 600, 612]",MISC
386,E,"[101, 634, 446, 657]",MISC
387,##X,"[101, 634, 446, 657]",MISC
388,##P,"[101, 634, 446, 657]",MISC
389,##ER,"[101, 634, 446, 657]",MISC
390,##IE,"[101, 634, 446, 657]",MISC
391,##NC,"[101, 634, 446, 657]",MISC
392,##E,"[101, 634, 446, 657]",MISC
393,-,"[101, 634, 446, 657]",MISC
394,O,"[101, 634, 446, 657]",MISC
395,##P,"[101, 634, 446, 657]",MISC
396,##ER,"[101, 634, 446, 657]",MISC
397,##AT,"[101, 634, 446, 657]",MISC
398,##ON,"[101, 634, 446, 657]",MISC
399,##S,"[101, 634, 446, 657]",MISC
400,R,"[447, 634, 550, 657]",MISC
401,##ET,"[447, 634, 550, 657]",MISC
402,##A,"[447, 634, 550, 657]",MISC
403,##IL,"[447, 634, 550, 657]",MISC
404,F,"[551, 634, 672, 657]",MISC
405,##IN,"[551, 634, 672, 657]",MISC
406,##AN,"[551, 634, 672, 657]",MISC
407,##CE,"[551, 634, 672, 657]",MISC
408,AT,"[672, 634, 707, 657]",MISC
409,H,"[707, 634, 776, 657]",MISC
410,##ER,"[707, 634, 776, 657]",MISC
411,##O,"[707, 634, 776, 657]",MISC
412,F,"[776, 634, 898, 657]",MISC
413,##IN,"[776, 634, 898, 657]",MISC
414,##CO,"[776, 634, 898, 657]",MISC
415,##RP,"[776, 634, 898, 657]",MISC
416,L,"[898, 634, 966, 657]",MISC
417,##T,"[898, 634, 966, 657]",MISC
418,##D,"[898, 634, 966, 657]",MISC
419,.,"[898, 634, 966, 657]",MISC
420,-,"[967, 634, 969, 657]",MISC
421,NL,"[967, 634, 969, 657]",MISC
422,-,"[967, 634, 969, 657]",MISC
423,P,"[101, 679, 233, 701]",B-personal_details_heading
424,##ER,"[101, 679, 233, 701]",I-personal_details_heading
425,##SO,"[101, 679, 233, 701]",I-personal_details_heading
426,##NA,"[101, 679, 233, 701]",I-personal_details_heading
427,##L,"[101, 679, 233, 701]",I-personal_details_heading
428,DE,"[233, 679, 365, 701]",I-personal_details_heading
429,##TA,"[233, 679, 365, 701]",I-personal_details_heading
430,##IL,"[233, 679, 365, 701]",I-personal_details_heading
431,##S,"[233, 679, 365, 701]",I-personal_details_heading
432,:,"[233, 679, 365, 701]",I-personal_details_heading
433,-,"[365, 679, 367, 701]",MISC
434,NL,"[365, 679, 367, 701]",MISC
435,-,"[365, 679, 367, 701]",MISC
436,N,"[101, 720, 231, 738]",MISC
437,##AM,"[101, 720, 231, 738]",MISC
438,##E,"[101, 720, 231, 738]",MISC
439,:,"[232, 720, 264, 738]",MISC
440,SA,"[265, 720, 460, 738]",B-name
441,##CH,"[265, 720, 460, 738]",I-name
442,##IN,"[265, 720, 460, 738]",I-name
443,K,"[461, 720, 624, 738]",I-name
444,##UM,"[461, 720, 624, 738]",I-name
445,##AR,"[461, 720, 624, 738]",I-name
446,-,"[625, 720, 627, 738]",MISC
447,NL,"[625, 720, 627, 738]",MISC
448,-,"[625, 720, 627, 738]",MISC
449,D,"[101, 739, 171, 757]",MISC
450,##AT,"[101, 739, 171, 757]",MISC
451,##E,"[101, 739, 171, 757]",MISC
452,OF,"[173, 739, 207, 757]",MISC
453,B,"[209, 739, 297, 757]",MISC
454,##IR,"[209, 739, 297, 757]",MISC
455,##TH,"[209, 739, 297, 757]",MISC
456,:,"[299, 739, 315, 757]",MISC
457,15,"[317, 739, 387, 757]",MISC
458,##TH,"[317, 739, 387, 757]",MISC
459,J,"[389, 739, 459, 757]",MISC
460,##UN,"[389, 739, 459, 757]",MISC
461,##E,"[389, 739, 459, 757]",MISC
462,2000,"[461, 739, 531, 757]",MISC
463,-,"[533, 739, 535, 757]",MISC
464,NL,"[533, 739, 535, 757]",MISC
465,-,"[533, 739, 535, 757]",MISC
466,FA,"[101, 757, 236, 776]",MISC
467,##TH,"[101, 757, 236, 776]",MISC
468,##ER,"[101, 757, 236, 776]",MISC
469,##S,"[101, 757, 236, 776]",MISC
470,N,"[237, 757, 315, 776]",MISC
471,##AM,"[237, 757, 315, 776]",MISC
472,##E,"[237, 757, 315, 776]",MISC
473,:,"[316, 757, 334, 776]",MISC
474,RA,"[335, 757, 491, 776]",MISC
475,##J,"[335, 757, 491, 776]",MISC
476,##EN,"[335, 757, 491, 776]",MISC
477,##DR,"[335, 757, 491, 776]",MISC
478,##A,"[335, 757, 491, 776]",MISC
479,Y,"[491, 757, 589, 776]",MISC
480,##AD,"[491, 757, 589, 776]",MISC
481,##AV,"[491, 757, 589, 776]",MISC
482,-,"[589, 757, 591, 776]",MISC
483,NL,"[589, 757, 591, 776]",MISC
484,-,"[589, 757, 591, 776]",MISC
485,SE,"[101, 776, 231, 796]",MISC
486,##X,"[101, 776, 231, 796]",MISC
487,:,"[232, 776, 275, 796]",MISC
488,MA,"[275, 776, 449, 796]",MISC
489,##LE,"[275, 776, 449, 796]",MISC
490,-,"[450, 776, 452, 796]",MISC
491,NL,"[450, 776, 452, 796]",MISC
492,-,"[450, 776, 452, 796]",MISC
493,MA,"[101, 796, 227, 814]",MISC
494,##RI,"[101, 796, 227, 814]",MISC
495,##TA,"[101, 796, 227, 814]",MISC
496,##L,"[101, 796, 227, 814]",MISC
497,ST,"[229, 796, 337, 814]",MISC
498,##AT,"[229, 796, 337, 814]",MISC
499,##US,"[229, 796, 337, 814]",MISC
500,:,"[339, 796, 357, 814]",MISC
501,UN,"[357, 796, 522, 814]",MISC
502,##MA,"[357, 796, 522, 814]",MISC
503,##R,"[357, 796, 522, 814]",MISC
504,##RI,"[357, 796, 522, 814]",MISC
505,##ED,"[357, 796, 522, 814]",MISC
506,-,"[522, 796, 524, 814]",MISC
507,NL,"[522, 796, 524, 814]",MISC
508,-,"[522, 796, 524, 814]",MISC
509,N,"[101, 815, 321, 833]",MISC
510,##AT,"[101, 815, 321, 833]",MISC
511,##ION,"[101, 815, 321, 833]",MISC
512,##AL,"[101, 815, 321, 833]",MISC
513,##IT,"[101, 815, 321, 833]",MISC
514,##Y,"[101, 815, 321, 833]",MISC
515,:,"[323, 815, 343, 833]",MISC
516,IN,"[343, 815, 464, 833]",MISC
517,##DI,"[343, 815, 464, 833]",MISC
518,##AN,"[343, 815, 464, 833]",MISC
519,-,"[464, 815, 466, 833]",MISC
520,NL,"[464, 815, 466, 833]",MISC
521,-,"[464, 815, 466, 833]",MISC
522,LA,"[101, 834, 253, 852]",MISC
523,##NG,"[101, 834, 253, 852]",MISC
524,##U,"[101, 834, 253, 852]",MISC
525,##AG,"[101, 834, 253, 852]",MISC
526,##ES,"[101, 834, 253, 852]",MISC
527,K,"[253, 834, 336, 852]",MISC
528,##N,"[253, 834, 336, 852]",MISC
529,##OW,"[253, 834, 336, 852]",MISC
530,##N,"[253, 834, 336, 852]",MISC
531,:,"[338, 834, 354, 852]",MISC
532,E,"[354, 834, 472, 852]",MISC
533,##NG,"[354, 834, 472, 852]",MISC
534,##L,"[354, 834, 472, 852]",MISC
535,##IS,"[354, 834, 472, 852]",MISC
536,##H,"[354, 834, 472, 852]",MISC
537,&,"[473, 834, 489, 852]",MISC
538,H,"[490, 834, 573, 852]",MISC
539,##IN,"[490, 834, 573, 852]",MISC
540,##DI,"[490, 834, 573, 852]",MISC
541,AND,"[574, 834, 625, 852]",MISC
542,MA,"[625, 834, 726, 852]",MISC
543,##TH,"[625, 834, 726, 852]",MISC
544,##L,"[625, 834, 726, 852]",MISC
545,##I,"[625, 834, 726, 852]",MISC
546,-,"[726, 834, 728, 852]",MISC
547,NL,"[726, 834, 728, 852]",MISC
548,-,"[726, 834, 728, 852]",MISC
549,P,"[101, 856, 254, 874]",MISC
550,##ER,"[101, 856, 254, 874]",MISC
551,##MA,"[101, 856, 254, 874]",MISC
552,##NE,"[101, 856, 254, 874]",MISC
553,##NT,"[101, 856, 254, 874]",MISC
554,AD,"[256, 856, 375, 874]",MISC
555,##DR,"[256, 856, 375, 874]",MISC
556,##ES,"[256, 856, 375, 874]",MISC
557,##S,"[256, 856, 375, 874]",MISC
558,:,"[377, 856, 393, 874]",MISC
559,SA,"[394, 856, 497, 874]",B-name
560,##CH,"[394, 856, 497, 874]",I-name
561,##IN,"[394, 856, 497, 874]",I-name
562,K,"[497, 856, 582, 874]",I-name
563,##UM,"[497, 856, 582, 874]",I-name
564,##AR,"[497, 856, 582, 874]",I-name
565,-,"[584, 856, 585, 874]",MISC
566,NL,"[584, 856, 585, 874]",MISC
567,-,"[584, 856, 585, 874]",MISC
568,P,"[108, 921, 198, 942]",MISC
569,##LA,"[108, 921, 198, 942]",MISC
570,##CE,"[108, 921, 198, 942]",MISC
571,:,"[199, 921, 217, 942]",MISC
572,MA,"[217, 921, 380, 942]",MISC
573,##D,"[217, 921, 380, 942]",MISC
574,##H,"[217, 921, 380, 942]",MISC
575,##EP,"[217, 921, 380, 942]",MISC
576,##UR,"[217, 921, 380, 942]",MISC
577,##A,"[217, 921, 380, 942]",MISC
578,-,"[381, 921, 383, 942]",MISC
579,NL,"[381, 921, 383, 942]",MISC
580,-,"[381, 921, 383, 942]",MISC
581,Sign,"[766, 943, 875, 964]",MISC
582,##ature,"[766, 943, 875, 964]",MISC
583,:,"[876, 943, 887, 964]",MISC
584,-,"[888, 943, 899, 964]",MISC
585,-,"[900, 943, 902, 964]",MISC
586,NL,"[900, 943, 902, 964]",MISC
587,-,"[900, 943, 902, 964]",MISC
588,of,"[101, 983, 121, 1000]",MISC
589,My,"[122, 983, 142, 1000]",MISC
590,A,"[144, 983, 240, 1000]",MISC
591,##bilities,"[144, 983, 240, 1000]",MISC
592,and,"[241, 983, 272, 1000]",MISC
593,Your,"[274, 983, 315, 1000]",MISC
594,Need,"[317, 983, 369, 1000]",MISC
595,##s,"[317, 983, 369, 1000]",MISC
596,Together,"[371, 983, 456, 1000]",MISC
597,Can,"[458, 983, 488, 1000]",MISC
598,A,"[490, 983, 564, 1000]",MISC
599,##chi,"[490, 983, 564, 1000]",MISC
600,##eve,"[490, 983, 564, 1000]",MISC
601,The,"[566, 983, 597, 1000]",MISC
602,Goal,"[598, 983, 651, 1000]",MISC
603,.,"[598, 983, 651, 1000]",MISC
604,-,"[652, 983, 654, 1000]",MISC
605,NL,"[652, 983, 654, 1000]",MISC
606,-,"[652, 983, 654, 1000]",MISC
