,token,box,label
0,SA,"[129, 101, 180, 113]",B-name
1,##AD,"[129, 101, 180, 113]",I-name
2,MA,"[180, 101, 243, 113]",I-name
3,##L,"[180, 101, 243, 113]",I-name
4,##I,"[180, 101, 243, 113]",I-name
5,##K,"[180, 101, 243, 113]",I-name
6,-,"[243, 101, 245, 113]",MISC
7,NL,"[243, 101, 245, 113]",MISC
8,-,"[243, 101, 245, 113]",MISC
9,Ha,"[154, 118, 218, 130]",MISC
10,##rrow,"[154, 118, 218, 130]",MISC
11,",","[154, 118, 218, 130]",MISC
12,UK,"[219, 118, 237, 130]",MISC
13,|,"[237, 118, 246, 130]",MISC
14,07,"[246, 118, 356, 130]",B-phones_phone
15,##53,"[246, 118, 356, 130]",I-phones_phone
16,##42,"[246, 118, 356, 130]",I-phones_phone
17,##46,"[246, 118, 356, 130]",I-phones_phone
18,##60,"[246, 118, 356, 130]",I-phones_phone
19,##0,"[246, 118, 356, 130]",I-phones_phone
20,|,"[246, 118, 356, 130]",MISC
21,s,"[357, 118, 503, 130]",B-emails_email
22,##44,"[357, 118, 503, 130]",I-emails_email
23,##d,"[357, 118, 503, 130]",I-emails_email
24,##m,"[357, 118, 503, 130]",I-emails_email
25,##r,"[357, 118, 503, 130]",I-emails_email
26,@,"[357, 118, 503, 130]",I-emails_email
27,g,"[357, 118, 503, 130]",I-emails_email
28,##mail,"[357, 118, 503, 130]",I-emails_email
29,.,"[357, 118, 503, 130]",I-emails_email
30,com,"[357, 118, 503, 130]",I-emails_email
31,-,"[504, 118, 506, 130]",MISC
32,NL,"[504, 118, 506, 130]",MISC
33,-,"[504, 118, 506, 130]",MISC
34,S,"[129, 160, 207, 172]",B-summary_heading
35,##UM,"[129, 160, 207, 172]",I-summary_heading
36,##MA,"[129, 160, 207, 172]",I-summary_heading
37,##R,"[129, 160, 207, 172]",I-summary_heading
38,##Y,"[129, 160, 207, 172]",I-summary_heading
39,-,"[207, 160, 209, 172]",MISC
40,NL,"[207, 160, 209, 172]",MISC
41,-,"[207, 160, 209, 172]",MISC
42,Java,"[154, 177, 189, 191]",MISC
43,developer,"[190, 177, 269, 191]",MISC
44,with,"[269, 177, 303, 191]",MISC
45,over,"[305, 177, 339, 191]",MISC
46,12,"[340, 177, 356, 191]",MISC
47,years,"[358, 177, 410, 191]",MISC
48,’,"[358, 177, 410, 191]",MISC
49,extensive,"[411, 177, 490, 191]",MISC
50,hands,"[490, 177, 560, 191]",MISC
51,-,"[490, 177, 560, 191]",MISC
52,on,"[490, 177, 560, 191]",MISC
53,experience,"[561, 177, 649, 191]",MISC
54,in,"[649, 177, 665, 191]",MISC
55,designing,"[667, 177, 746, 191]",MISC
56,and,"[746, 177, 771, 191]",MISC
57,developing,"[773, 177, 861, 191]",MISC
58,web,"[861, 177, 886, 191]",MISC
59,based,"[887, 177, 931, 191]",MISC
60,and,"[932, 177, 957, 191]",MISC
61,-,"[958, 177, 960, 191]",MISC
62,NL,"[958, 177, 960, 191]",MISC
63,-,"[958, 177, 960, 191]",MISC
64,rest,"[154, 192, 214, 205]",MISC
65,##ful,"[154, 192, 214, 205]",MISC
66,API,"[214, 192, 246, 205]",MISC
67,##s,"[214, 192, 246, 205]",MISC
68,mainly,"[248, 192, 299, 205]",MISC
69,using,"[299, 192, 341, 205]",MISC
70,J,"[342, 192, 367, 205]",MISC
71,##V,"[342, 192, 367, 205]",MISC
72,##M,"[342, 192, 367, 205]",MISC
73,based,"[367, 192, 409, 205]",MISC
74,languages,"[410, 192, 486, 205]",MISC
75,including,"[486, 192, 562, 205]",MISC
76,Java,"[563, 192, 595, 205]",MISC
77,and,"[597, 192, 622, 205]",MISC
78,Sc,"[623, 192, 673, 205]",MISC
79,##ala,"[623, 192, 673, 205]",MISC
80,.,"[623, 192, 673, 205]",MISC
81,Great,"[674, 192, 715, 205]",MISC
82,interest,"[716, 192, 783, 205]",MISC
83,and,"[784, 192, 810, 205]",MISC
84,exposure,"[810, 192, 877, 205]",MISC
85,towards,"[878, 192, 937, 205]",MISC
86,front,"[938, 192, 988, 205]",MISC
87,-,"[938, 192, 988, 205]",MISC
88,-,"[989, 192, 990, 205]",MISC
89,NL,"[989, 192, 990, 205]",MISC
90,-,"[989, 192, 990, 205]",MISC
91,end,"[154, 206, 180, 219]",MISC
92,technologies,"[181, 206, 286, 219]",MISC
93,like,"[287, 206, 321, 219]",MISC
94,Ang,"[323, 206, 384, 219]",MISC
95,##ular,"[323, 206, 384, 219]",MISC
96,and,"[385, 206, 410, 219]",MISC
97,Re,"[411, 206, 454, 219]",MISC
98,##act,"[411, 206, 454, 219]",MISC
99,as,"[455, 206, 472, 219]",MISC
100,well,"[473, 206, 507, 219]",MISC
101,as,"[509, 206, 525, 219]",MISC
102,Dev,"[526, 206, 579, 219]",MISC
103,##O,"[526, 206, 579, 219]",MISC
104,##ps,"[526, 206, 579, 219]",MISC
105,experience,"[579, 206, 668, 219]",MISC
106,mainly,"[668, 206, 720, 219]",MISC
107,dealing,"[721, 206, 782, 219]",MISC
108,with,"[783, 206, 817, 219]",MISC
109,cloud,"[818, 206, 862, 219]",MISC
110,based,"[863, 206, 906, 219]",MISC
111,systems,"[907, 206, 968, 219]",MISC
112,-,"[969, 206, 971, 219]",MISC
113,NL,"[969, 206, 971, 219]",MISC
114,-,"[969, 206, 971, 219]",MISC
115,using,"[154, 220, 196, 233]",MISC
116,Dock,"[197, 220, 264, 233]",MISC
117,##ers,"[197, 220, 264, 233]",MISC
118,.,"[197, 220, 264, 233]",MISC
119,I,"[265, 220, 273, 233]",MISC
120,have,"[274, 220, 306, 233]",MISC
121,extensive,"[308, 220, 384, 233]",MISC
122,experience,"[385, 220, 470, 233]",MISC
123,working,"[470, 220, 530, 233]",MISC
124,in,"[530, 220, 546, 233]",MISC
125,A,"[547, 220, 588, 233]",MISC
126,##gi,"[547, 220, 588, 233]",MISC
127,##le,"[547, 220, 588, 233]",MISC
128,environments,"[590, 220, 691, 233]",MISC
129,and,"[692, 220, 717, 233]",MISC
130,in,"[718, 220, 734, 233]",MISC
131,delivering,"[735, 220, 820, 233]",MISC
132,IT,"[820, 220, 836, 233]",B-education_course
133,solutions,"[837, 220, 913, 233]",MISC
134,to,"[914, 220, 930, 233]",MISC
135,meet,"[931, 220, 964, 233]",MISC
136,-,"[965, 220, 967, 233]",MISC
137,NL,"[965, 220, 967, 233]",MISC
138,-,"[965, 220, 967, 233]",MISC
139,business,"[154, 234, 221, 247]",MISC
140,needs,"[221, 234, 263, 247]",MISC
141,in,"[263, 234, 279, 247]",MISC
142,e,"[280, 234, 363, 247]",MISC
143,-,"[280, 234, 363, 247]",MISC
144,commerce,"[280, 234, 363, 247]",MISC
145,and,"[363, 234, 463, 247]",MISC
146,##fin,"[363, 234, 463, 247]",MISC
147,##an,"[363, 234, 463, 247]",MISC
148,##cial,"[363, 234, 463, 247]",MISC
149,services,"[464, 234, 530, 247]",MISC
150,industry,"[531, 234, 597, 247]",MISC
151,sectors,"[597, 234, 664, 247]",MISC
152,.,"[597, 234, 664, 247]",MISC
153,-,"[664, 234, 666, 247]",MISC
154,NL,"[664, 234, 666, 247]",MISC
155,-,"[664, 234, 666, 247]",MISC
156,Excellent,"[154, 248, 234, 263]",MISC
157,work,"[234, 248, 268, 263]",MISC
158,et,"[269, 248, 312, 263]",MISC
159,##hic,"[269, 248, 312, 263]",MISC
160,with,"[313, 248, 347, 263]",MISC
161,a,"[348, 248, 356, 263]",MISC
162,keen,"[357, 248, 392, 263]",MISC
163,mind,"[393, 248, 427, 263]",MISC
164,that,"[428, 248, 462, 263]",MISC
165,understands,"[463, 248, 559, 263]",MISC
166,complex,"[560, 248, 621, 263]",MISC
167,systems,"[622, 248, 683, 263]",MISC
168,and,"[684, 248, 709, 263]",MISC
169,emerging,"[710, 248, 780, 263]",MISC
170,technologies,"[781, 248, 885, 263]",MISC
171,quickly,"[886, 248, 948, 263]",MISC
172,and,"[948, 248, 973, 263]",MISC
173,is,"[975, 248, 991, 263]",MISC
174,-,"[992, 248, 994, 263]",MISC
175,NL,"[992, 248, 994, 263]",MISC
176,-,"[992, 248, 994, 263]",MISC
177,able,"[154, 264, 187, 277]",MISC
178,to,"[187, 264, 204, 277]",MISC
179,efficiently,"[204, 264, 294, 277]",MISC
180,convert,"[294, 264, 350, 277]",MISC
181,those,"[351, 264, 391, 277]",MISC
182,as,"[392, 264, 409, 277]",MISC
183,cost,"[409, 264, 522, 277]",MISC
184,-,"[409, 264, 522, 277]",MISC
185,effective,"[409, 264, 522, 277]",MISC
186,innovations,"[524, 264, 614, 277]",MISC
187,towards,"[614, 264, 670, 277]",MISC
188,the,"[672, 264, 695, 277]",MISC
189,bottom,"[696, 264, 745, 277]",MISC
190,line,"[745, 264, 785, 277]",MISC
191,.,"[745, 264, 785, 277]",MISC
192,Passion,"[786, 264, 868, 277]",MISC
193,##ate,"[786, 264, 868, 277]",MISC
194,about,"[869, 264, 908, 277]",MISC
195,ongoing,"[910, 264, 965, 277]",MISC
196,-,"[967, 264, 969, 277]",MISC
197,NL,"[967, 264, 969, 277]",MISC
198,-,"[967, 264, 969, 277]",MISC
199,professional,"[154, 278, 254, 291]",MISC
200,and,"[254, 278, 277, 291]",MISC
201,personal,"[279, 278, 344, 291]",MISC
202,development,"[345, 278, 444, 291]",MISC
203,.,"[345, 278, 444, 291]",MISC
204,-,"[445, 278, 446, 291]",MISC
205,NL,"[445, 278, 446, 291]",MISC
206,-,"[445, 278, 446, 291]",MISC
207,T,"[129, 309, 218, 322]",B-skills_heading
208,##EC,"[129, 309, 218, 322]",I-skills_heading
209,##H,"[129, 309, 218, 322]",I-skills_heading
210,##NI,"[129, 309, 218, 322]",I-skills_heading
211,##CA,"[129, 309, 218, 322]",I-skills_heading
212,##L,"[129, 309, 218, 322]",I-skills_heading
213,SK,"[218, 309, 276, 322]",I-skills_heading
214,##IL,"[218, 309, 276, 322]",I-skills_heading
215,##LS,"[218, 309, 276, 322]",I-skills_heading
216,-,"[277, 309, 279, 322]",MISC
217,NL,"[277, 309, 279, 322]",MISC
218,-,"[277, 309, 279, 322]",MISC
219,J,"[154, 326, 196, 338]",MISC
220,##AV,"[154, 326, 196, 338]",MISC
221,##A,"[154, 326, 196, 338]",MISC
222,/,"[197, 326, 206, 338]",MISC
223,J,"[207, 326, 238, 338]",MISC
224,##V,"[207, 326, 238, 338]",MISC
225,##M,"[207, 326, 238, 338]",MISC
226,-,"[239, 326, 241, 338]",MISC
227,NL,"[239, 326, 241, 338]",MISC
228,-,"[239, 326, 241, 338]",MISC
229,J,"[154, 340, 178, 354]",MISC
230,##D,"[154, 340, 178, 354]",MISC
231,##K,"[154, 340, 178, 354]",MISC
232,7,"[180, 340, 212, 354]",MISC
233,/,"[180, 340, 212, 354]",MISC
234,8,"[180, 340, 212, 354]",MISC
235,",","[180, 340, 212, 354]",MISC
236,Spring,"[213, 340, 262, 354]",MISC
237,3,"[263, 340, 287, 354]",MISC
238,/,"[263, 340, 287, 354]",MISC
239,4,"[263, 340, 287, 354]",MISC
240,(,"[288, 340, 337, 354]",MISC
241,Core,"[288, 340, 337, 354]",MISC
242,",","[288, 340, 337, 354]",MISC
243,MV,"[339, 340, 371, 354]",MISC
244,##C,"[339, 340, 371, 354]",MISC
245,",","[339, 340, 371, 354]",MISC
246,J,"[372, 340, 414, 354]",MISC
247,##D,"[372, 340, 414, 354]",MISC
248,##BC,"[372, 340, 414, 354]",MISC
249,",","[372, 340, 414, 354]",MISC
250,A,"[414, 340, 446, 354]",MISC
251,##OP,"[414, 340, 446, 354]",MISC
252,",","[414, 340, 446, 354]",MISC
253,TX,"[447, 340, 471, 354]",MISC
254,",","[447, 340, 471, 354]",MISC
255,Security,"[473, 340, 546, 354]",MISC
256,",","[473, 340, 546, 354]",MISC
257,Spring,"[548, 340, 597, 354]",MISC
258,Bo,"[598, 340, 640, 354]",MISC
259,##ot,"[598, 340, 640, 354]",MISC
260,",","[598, 340, 640, 354]",MISC
261,Spring,"[640, 340, 689, 354]",MISC
262,Cloud,"[690, 340, 748, 354]",MISC
263,),"[690, 340, 748, 354]",MISC
264,",","[690, 340, 748, 354]",MISC
265,Hi,"[749, 340, 866, 354]",MISC
266,##ber,"[749, 340, 866, 354]",MISC
267,##nate,"[749, 340, 866, 354]",MISC
268,/,"[749, 340, 866, 354]",MISC
269,JP,"[749, 340, 866, 354]",MISC
270,##A,"[749, 340, 866, 354]",MISC
271,",","[749, 340, 866, 354]",MISC
272,S,"[866, 340, 915, 354]",MISC
273,##lick,"[866, 340, 915, 354]",MISC
274,",","[866, 340, 915, 354]",MISC
275,Sc,"[916, 340, 958, 354]",MISC
276,##ala,"[916, 340, 958, 354]",MISC
277,-,"[958, 340, 960, 354]",MISC
278,NL,"[958, 340, 960, 354]",MISC
279,-,"[958, 340, 960, 354]",MISC
280,(,"[154, 355, 162, 368]",MISC
281,Play,"[163, 355, 219, 368]",MISC
282,##2,"[163, 355, 219, 368]",MISC
283,),"[163, 355, 219, 368]",MISC
284,",","[163, 355, 219, 368]",MISC
285,Java,"[220, 355, 253, 368]",MISC
286,Multi,"[253, 355, 376, 368]",MISC
287,##th,"[253, 355, 376, 368]",MISC
288,##read,"[253, 355, 376, 368]",MISC
289,##ing,"[253, 355, 376, 368]",MISC
290,",","[253, 355, 376, 368]",MISC
291,An,"[377, 355, 409, 368]",MISC
292,##t,"[377, 355, 409, 368]",MISC
293,",","[377, 355, 409, 368]",MISC
294,Ma,"[410, 355, 458, 368]",MISC
295,##ven,"[410, 355, 458, 368]",MISC
296,",","[410, 355, 458, 368]",MISC
297,G,"[459, 355, 515, 368]",MISC
298,##rad,"[459, 355, 515, 368]",MISC
299,##le,"[459, 355, 515, 368]",MISC
300,",","[459, 355, 515, 368]",MISC
301,J,"[517, 355, 573, 368]",MISC
302,##B,"[517, 355, 573, 368]",MISC
303,##eh,"[517, 355, 573, 368]",MISC
304,##ave,"[517, 355, 573, 368]",MISC
305,-,"[574, 355, 576, 368]",MISC
306,NL,"[574, 355, 576, 368]",MISC
307,-,"[574, 355, 576, 368]",MISC
308,O,"[154, 381, 210, 393]",MISC
309,##TH,"[154, 381, 210, 393]",MISC
310,##ER,"[154, 381, 210, 393]",MISC
311,LA,"[211, 381, 312, 393]",MISC
312,##NG,"[211, 381, 312, 393]",MISC
313,##U,"[211, 381, 312, 393]",MISC
314,##AG,"[211, 381, 312, 393]",MISC
315,##ES,"[211, 381, 312, 393]",MISC
316,&,"[312, 381, 323, 393]",MISC
317,Framework,"[323, 381, 435, 393]",MISC
318,##s,"[323, 381, 435, 393]",MISC
319,-,"[436, 381, 437, 393]",MISC
320,NL,"[436, 381, 437, 393]",MISC
321,-,"[436, 381, 437, 393]",MISC
322,P,"[154, 395, 187, 407]",MISC
323,##HP,"[154, 395, 187, 407]",MISC
324,",","[154, 395, 187, 407]",MISC
325,O,"[188, 395, 211, 407]",MISC
326,##O,"[188, 395, 211, 407]",MISC
327,",","[188, 395, 211, 407]",MISC
328,Java,"[213, 395, 305, 407]",MISC
329,##Script,"[213, 395, 305, 407]",MISC
330,",","[213, 395, 305, 407]",MISC
331,E,"[305, 395, 338, 407]",MISC
332,##S,"[305, 395, 338, 407]",MISC
333,##6,"[305, 395, 338, 407]",MISC
334,",","[305, 395, 338, 407]",MISC
335,Type,"[339, 395, 422, 407]",MISC
336,##Script,"[339, 395, 422, 407]",MISC
337,-,"[423, 395, 425, 407]",MISC
338,NL,"[423, 395, 425, 407]",MISC
339,-,"[423, 395, 425, 407]",MISC
340,U,"[154, 420, 174, 433]",MISC
341,##I,"[154, 420, 174, 433]",MISC
342,T,"[176, 420, 302, 433]",MISC
343,##EC,"[176, 420, 302, 433]",MISC
344,##H,"[176, 420, 302, 433]",MISC
345,##N,"[176, 420, 302, 433]",MISC
346,##OL,"[176, 420, 302, 433]",MISC
347,##O,"[176, 420, 302, 433]",MISC
348,##GI,"[176, 420, 302, 433]",MISC
349,##ES,"[176, 420, 302, 433]",MISC
350,-,"[302, 420, 304, 433]",MISC
351,NL,"[302, 420, 304, 433]",MISC
352,-,"[302, 420, 304, 433]",MISC
353,Material,"[154, 434, 221, 448]",MISC
354,I,"[221, 434, 245, 448]",MISC
355,##O,"[221, 434, 245, 448]",MISC
356,",","[221, 434, 245, 448]",MISC
357,Re,"[247, 434, 339, 448]",MISC
358,##acts,"[247, 434, 339, 448]",MISC
359,##tra,"[247, 434, 339, 448]",MISC
360,##p,"[247, 434, 339, 448]",MISC
361,",","[247, 434, 339, 448]",MISC
362,H,"[339, 434, 371, 448]",MISC
363,##TM,"[339, 434, 371, 448]",MISC
364,##L,"[339, 434, 371, 448]",MISC
365,5,"[372, 434, 389, 448]",MISC
366,",","[372, 434, 389, 448]",MISC
367,CS,"[389, 434, 412, 448]",MISC
368,##S,"[389, 434, 412, 448]",MISC
369,3,"[414, 434, 447, 448]",MISC
370,.,"[414, 434, 447, 448]",MISC
371,0,"[414, 434, 447, 448]",MISC
372,",","[414, 434, 447, 448]",MISC
373,J,"[448, 434, 505, 448]",MISC
374,##Q,"[448, 434, 505, 448]",MISC
375,##uer,"[448, 434, 505, 448]",MISC
376,##y,"[448, 434, 505, 448]",MISC
377,",","[448, 434, 505, 448]",MISC
378,Ang,"[506, 434, 589, 448]",MISC
379,##ular,"[506, 434, 589, 448]",MISC
380,##J,"[506, 434, 589, 448]",MISC
381,##S,"[506, 434, 589, 448]",MISC
382,",","[506, 434, 589, 448]",MISC
383,Type,"[590, 434, 682, 448]",MISC
384,##Script,"[590, 434, 682, 448]",MISC
385,",","[590, 434, 682, 448]",MISC
386,Re,"[682, 434, 731, 448]",MISC
387,##act,"[682, 434, 731, 448]",MISC
388,",","[682, 434, 731, 448]",MISC
389,Red,"[733, 434, 781, 448]",MISC
390,##ux,"[733, 434, 781, 448]",MISC
391,",","[733, 434, 781, 448]",MISC
392,Saga,"[783, 434, 824, 448]",MISC
393,",","[783, 434, 824, 448]",MISC
394,G,"[825, 434, 866, 448]",MISC
395,##ulp,"[825, 434, 866, 448]",MISC
396,",","[825, 434, 866, 448]",MISC
397,Boots,"[867, 434, 950, 448]",MISC
398,##tra,"[867, 434, 950, 448]",MISC
399,##p,"[867, 434, 950, 448]",MISC
400,",","[867, 434, 950, 448]",MISC
401,L,"[950, 434, 992, 448]",MISC
402,##ES,"[950, 434, 992, 448]",MISC
403,##S,"[950, 434, 992, 448]",MISC
404,",","[950, 434, 992, 448]",MISC
405,-,"[992, 434, 994, 448]",MISC
406,NL,"[992, 434, 994, 448]",MISC
407,-,"[992, 434, 994, 448]",MISC
408,SA,"[154, 450, 192, 462]",MISC
409,##AS,"[154, 450, 192, 462]",MISC
410,-,"[192, 450, 194, 462]",MISC
411,NL,"[192, 450, 194, 462]",MISC
412,-,"[192, 450, 194, 462]",MISC
413,D,"[154, 475, 246, 488]",MISC
414,##AT,"[154, 475, 246, 488]",MISC
415,##AB,"[154, 475, 246, 488]",MISC
416,##AS,"[154, 475, 246, 488]",MISC
417,##E,"[154, 475, 246, 488]",MISC
418,&,"[247, 475, 258, 488]",MISC
419,B,"[259, 475, 293, 488]",MISC
420,##IG,"[259, 475, 293, 488]",MISC
421,D,"[294, 475, 339, 488]",MISC
422,##AT,"[294, 475, 339, 488]",MISC
423,##A,"[294, 475, 339, 488]",MISC
424,-,"[340, 475, 342, 488]",MISC
425,NL,"[340, 475, 342, 488]",MISC
426,-,"[340, 475, 342, 488]",MISC
427,Oracle,"[154, 489, 214, 502]",MISC
428,",","[154, 489, 214, 502]",MISC
429,My,"[214, 489, 264, 502]",MISC
430,##S,"[214, 489, 264, 502]",MISC
431,##QL,"[214, 489, 264, 502]",MISC
432,",","[214, 489, 264, 502]",MISC
433,Post,"[265, 489, 341, 502]",MISC
434,##g,"[265, 489, 341, 502]",MISC
435,##res,"[265, 489, 341, 502]",MISC
436,",","[265, 489, 341, 502]",MISC
437,S,"[341, 489, 367, 502]",MISC
438,##QL,"[341, 489, 367, 502]",MISC
439,Server,"[367, 489, 426, 502]",MISC
440,",","[367, 489, 426, 502]",MISC
441,Mon,"[426, 489, 493, 502]",MISC
442,##go,"[426, 489, 493, 502]",MISC
443,##D,"[426, 489, 493, 502]",MISC
444,##B,"[426, 489, 493, 502]",MISC
445,",","[426, 489, 493, 502]",MISC
446,Cassandra,"[494, 489, 579, 502]",MISC
447,",","[494, 489, 579, 502]",MISC
448,El,"[579, 489, 689, 502]",MISC
449,##astic,"[579, 489, 689, 502]",MISC
450,##S,"[579, 489, 689, 502]",MISC
451,##ear,"[579, 489, 689, 502]",MISC
452,##ch,"[579, 489, 689, 502]",MISC
453,-,"[690, 489, 691, 502]",MISC
454,NL,"[690, 489, 691, 502]",MISC
455,-,"[690, 489, 691, 502]",MISC
456,C,"[154, 514, 212, 527]",MISC
457,##L,"[154, 514, 212, 527]",MISC
458,##O,"[154, 514, 212, 527]",MISC
459,##U,"[154, 514, 212, 527]",MISC
460,##D,"[154, 514, 212, 527]",MISC
461,&,"[213, 514, 223, 527]",MISC
462,SE,"[224, 514, 305, 527]",MISC
463,##R,"[224, 514, 305, 527]",MISC
464,##VE,"[224, 514, 305, 527]",MISC
465,##RS,"[224, 514, 305, 527]",MISC
466,-,"[306, 514, 308, 527]",MISC
467,NL,"[306, 514, 308, 527]",MISC
468,-,"[306, 514, 308, 527]",MISC
469,Tom,"[154, 528, 207, 542]",MISC
470,##cat,"[154, 528, 207, 542]",MISC
471,6,"[207, 528, 241, 542]",MISC
472,/,"[207, 528, 241, 542]",MISC
473,7,"[207, 528, 241, 542]",MISC
474,",","[207, 528, 241, 542]",MISC
475,Web,"[242, 528, 313, 542]",MISC
476,##log,"[242, 528, 313, 542]",MISC
477,##ic,"[242, 528, 313, 542]",MISC
478,10,"[313, 528, 365, 542]",MISC
479,/,"[313, 528, 365, 542]",MISC
480,12,"[313, 528, 365, 542]",MISC
481,",","[313, 528, 365, 542]",MISC
482,Glass,"[365, 528, 443, 542]",MISC
483,##fish,"[365, 528, 443, 542]",MISC
484,3,"[445, 528, 479, 542]",MISC
485,/,"[445, 528, 479, 542]",MISC
486,4,"[445, 528, 479, 542]",MISC
487,",","[445, 528, 479, 542]",MISC
488,J,"[480, 528, 532, 542]",MISC
489,##B,"[480, 528, 532, 542]",MISC
490,##oss,"[480, 528, 532, 542]",MISC
491,",","[480, 528, 532, 542]",MISC
492,J,"[532, 528, 576, 542]",MISC
493,##B,"[532, 528, 576, 542]",MISC
494,##oss,"[532, 528, 576, 542]",MISC
495,Fu,"[576, 528, 620, 542]",MISC
496,##se,"[576, 528, 620, 542]",MISC
497,",","[576, 528, 620, 542]",MISC
498,Amazon,"[620, 528, 673, 542]",MISC
499,Web,"[673, 528, 698, 542]",MISC
500,Services,"[700, 528, 770, 542]",MISC
501,(,"[770, 528, 822, 542]",MISC
502,A,"[770, 528, 822, 542]",MISC
503,##WS,"[770, 528, 822, 542]",MISC
504,),"[770, 528, 822, 542]",MISC
505,",","[770, 528, 822, 542]",MISC
506,Google,"[823, 528, 875, 542]",MISC
507,Cloud,"[875, 528, 919, 542]",MISC
508,(,"[919, 528, 954, 542]",MISC
509,A,"[919, 528, 954, 542]",MISC
510,##pp,"[919, 528, 954, 542]",MISC
511,-,"[954, 528, 956, 542]",MISC
512,NL,"[954, 528, 956, 542]",MISC
513,-,"[954, 528, 956, 542]",MISC
514,Engine,"[154, 544, 214, 556]",MISC
515,",","[154, 544, 214, 556]",MISC
516,Co,"[215, 544, 274, 556]",MISC
517,##mp,"[215, 544, 274, 556]",MISC
518,##ute,"[215, 544, 274, 556]",MISC
519,Engine,"[275, 544, 334, 556]",MISC
520,",","[275, 544, 334, 556]",MISC
521,Con,"[335, 544, 411, 556]",MISC
522,##tain,"[335, 544, 411, 556]",MISC
523,##er,"[335, 544, 411, 556]",MISC
524,Engine,"[412, 544, 481, 556]",MISC
525,),"[412, 544, 481, 556]",MISC
526,",","[412, 544, 481, 556]",MISC
527,Dock,"[481, 544, 541, 556]",MISC
528,##er,"[481, 544, 541, 556]",MISC
529,",","[481, 544, 541, 556]",MISC
530,Google,"[541, 544, 592, 556]",MISC
531,Ku,"[593, 544, 678, 556]",MISC
532,##ber,"[593, 544, 678, 556]",MISC
533,##net,"[593, 544, 678, 556]",MISC
534,##es,"[593, 544, 678, 556]",MISC
535,-,"[679, 544, 681, 556]",MISC
536,NL,"[679, 544, 681, 556]",MISC
537,-,"[679, 544, 681, 556]",MISC
538,TO,"[154, 569, 210, 582]",MISC
539,##OL,"[154, 569, 210, 582]",MISC
540,##S,"[154, 569, 210, 582]",MISC
541,&,"[211, 569, 222, 582]",MISC
542,DE,"[223, 569, 302, 582]",MISC
543,##V,"[223, 569, 302, 582]",MISC
544,-,"[223, 569, 302, 582]",MISC
545,O,"[223, 569, 302, 582]",MISC
546,##PS,"[223, 569, 302, 582]",MISC
547,-,"[302, 569, 304, 582]",MISC
548,NL,"[302, 569, 304, 582]",MISC
549,-,"[302, 569, 304, 582]",MISC
550,Dock,"[154, 583, 212, 596]",MISC
551,##er,"[154, 583, 212, 596]",MISC
552,",","[154, 583, 212, 596]",MISC
553,Intel,"[212, 583, 286, 596]",MISC
554,##li,"[212, 583, 286, 596]",MISC
555,##J,"[212, 583, 286, 596]",MISC
556,",","[212, 583, 286, 596]",MISC
557,Eclipse,"[287, 583, 352, 596]",MISC
558,",","[287, 583, 352, 596]",MISC
559,SV,"[353, 583, 385, 596]",MISC
560,##N,"[353, 583, 385, 596]",MISC
561,",","[353, 583, 385, 596]",MISC
562,G,"[386, 583, 418, 596]",MISC
563,##it,"[386, 583, 418, 596]",MISC
564,",","[386, 583, 418, 596]",MISC
565,J,"[419, 583, 477, 596]",MISC
566,##M,"[419, 583, 477, 596]",MISC
567,##eter,"[419, 583, 477, 596]",MISC
568,",","[419, 583, 477, 596]",MISC
569,Ji,"[477, 583, 516, 596]",MISC
570,##ra,"[477, 583, 516, 596]",MISC
571,",","[477, 583, 516, 596]",MISC
572,Con,"[518, 583, 608, 596]",MISC
573,##f,"[518, 583, 608, 596]",MISC
574,##lue,"[518, 583, 608, 596]",MISC
575,##nce,"[518, 583, 608, 596]",MISC
576,",","[518, 583, 608, 596]",MISC
577,Ba,"[609, 583, 667, 596]",MISC
578,##mbo,"[609, 583, 667, 596]",MISC
579,##o,"[609, 583, 667, 596]",MISC
580,",","[609, 583, 667, 596]",MISC
581,Jenkins,"[667, 583, 732, 596]",MISC
582,",","[667, 583, 732, 596]",MISC
583,Um,"[733, 583, 782, 596]",MISC
584,##let,"[733, 583, 782, 596]",MISC
585,",","[733, 583, 782, 596]",MISC
586,Adobe,"[782, 583, 822, 596]",MISC
587,X,"[824, 583, 847, 596]",MISC
588,##D,"[824, 583, 847, 596]",MISC
589,",","[824, 583, 847, 596]",MISC
590,R,"[849, 583, 888, 596]",MISC
591,##iel,"[849, 583, 888, 596]",MISC
592,##y,"[849, 583, 888, 596]",MISC
593,and,"[890, 583, 913, 596]",MISC
594,MS,"[915, 583, 931, 596]",MISC
595,V,"[931, 583, 971, 596]",MISC
596,##isi,"[931, 583, 971, 596]",MISC
597,##o,"[931, 583, 971, 596]",MISC
598,-,"[972, 583, 974, 596]",MISC
599,NL,"[972, 583, 974, 596]",MISC
600,-,"[972, 583, 974, 596]",MISC
601,U,"[154, 597, 181, 610]",MISC
602,##ML,"[154, 597, 181, 610]",MISC
603,Too,"[183, 597, 221, 610]",MISC
604,##l,"[183, 597, 221, 610]",MISC
605,-,"[221, 597, 223, 610]",MISC
606,NL,"[221, 597, 223, 610]",MISC
607,-,"[221, 597, 223, 610]",MISC
608,E,"[129, 628, 227, 642]",B-work_experience_heading
609,##X,"[129, 628, 227, 642]",I-work_experience_heading
610,##P,"[129, 628, 227, 642]",I-work_experience_heading
611,##ER,"[129, 628, 227, 642]",I-work_experience_heading
612,##IE,"[129, 628, 227, 642]",I-work_experience_heading
613,##NC,"[129, 628, 227, 642]",I-work_experience_heading
614,##E,"[129, 628, 227, 642]",I-work_experience_heading
615,-,"[227, 628, 228, 642]",MISC
616,NL,"[227, 628, 228, 642]",MISC
617,-,"[227, 628, 228, 642]",MISC
618,The,"[154, 646, 180, 659]",B-employer_company_name
619,FA,"[180, 646, 196, 659]",I-employer_company_name
620,(,"[197, 646, 273, 659]",I-employer_company_name
621,Football,"[197, 646, 273, 659]",I-employer_company_name
622,Association,"[273, 646, 383, 659]",I-employer_company_name
623,),"[273, 646, 383, 659]",I-employer_company_name
624,",","[273, 646, 383, 659]",I-employer_company_name
625,St,"[383, 646, 400, 659]",I-employer_company_name
626,Georges,"[400, 646, 458, 659]",I-employer_company_name
627,Park,"[460, 646, 501, 659]",I-employer_company_name
628,",","[460, 646, 501, 659]",MISC
629,Burton,"[502, 646, 552, 659]",MISC
630,on,"[553, 646, 569, 659]",MISC
631,Trent,"[570, 646, 611, 659]",MISC
632,-,"[612, 646, 614, 659]",MISC
633,NL,"[612, 646, 614, 659]",MISC
634,-,"[612, 646, 614, 659]",MISC
635,Software,"[154, 661, 228, 673]",B-employer_role
636,Dev,"[229, 661, 294, 673]",I-employer_role
637,##elo,"[229, 661, 294, 673]",I-employer_role
638,##p,"[229, 661, 294, 673]",I-employer_role
639,(,"[294, 661, 386, 673]",I-employer_role
640,Con,"[294, 661, 386, 673]",I-employer_role
641,##tract,"[294, 661, 386, 673]",I-employer_role
642,),"[294, 661, 386, 673]",I-employer_role
643,-,"[387, 661, 389, 673]",MISC
644,NL,"[387, 661, 389, 673]",MISC
645,-,"[387, 661, 389, 673]",MISC
646,Jan,"[154, 675, 183, 687]",MISC
647,2019,"[184, 675, 222, 687]",MISC
648,–,"[223, 675, 232, 687]",MISC
649,till,"[233, 675, 271, 687]",MISC
650,now,"[273, 675, 301, 687]",MISC
651,-,"[302, 675, 304, 687]",MISC
652,NL,"[302, 675, 304, 687]",MISC
653,-,"[302, 675, 304, 687]",MISC
654,Work,"[196, 691, 248, 701]",MISC
655,##ed,"[196, 691, 248, 701]",MISC
656,on,"[248, 691, 264, 701]",MISC
657,a,"[266, 691, 273, 701]",MISC
658,green,"[275, 691, 361, 701]",MISC
659,##field,"[275, 691, 361, 701]",MISC
660,project,"[362, 691, 424, 701]",MISC
661,as,"[424, 691, 440, 701]",MISC
662,a,"[441, 691, 448, 701]",MISC
663,full,"[450, 691, 484, 701]",MISC
664,stack,"[485, 691, 528, 701]",MISC
665,developer,"[529, 691, 615, 701]",MISC
666,",","[529, 691, 615, 701]",MISC
667,written,"[617, 691, 678, 701]",MISC
668,core,"[678, 691, 712, 701]",MISC
669,services,"[713, 691, 782, 701]",MISC
670,and,"[783, 691, 808, 701]",MISC
671,administered,"[810, 691, 914, 701]",MISC
672,-,"[915, 691, 917, 701]",MISC
673,NL,"[915, 691, 917, 701]",MISC
674,-,"[915, 691, 917, 701]",MISC
675,delivery,"[219, 703, 284, 717]",MISC
676,of,"[284, 703, 301, 717]",MISC
677,full,"[301, 703, 333, 717]",MISC
678,application,"[333, 703, 421, 717]",MISC
679,including,"[422, 703, 494, 717]",MISC
680,front,"[495, 703, 535, 717]",MISC
681,end,"[536, 703, 568, 717]",MISC
682,",","[536, 703, 568, 717]",MISC
683,back,"[569, 703, 601, 717]",MISC
684,end,"[601, 703, 624, 717]",MISC
685,and,"[625, 703, 649, 717]",MISC
686,mobile,"[650, 703, 698, 717]",MISC
687,application,"[698, 703, 796, 717]",MISC
688,.,"[698, 703, 796, 717]",MISC
689,-,"[796, 703, 798, 717]",MISC
690,NL,"[796, 703, 798, 717]",MISC
691,-,"[796, 703, 798, 717]",MISC
692,Looking,"[196, 720, 259, 731]",MISC
693,at,"[259, 720, 277, 731]",MISC
694,the,"[277, 720, 304, 731]",MISC
695,all,"[304, 720, 331, 731]",MISC
696,aspects,"[331, 720, 394, 731]",MISC
697,of,"[395, 720, 413, 731]",MISC
698,the,"[413, 720, 440, 731]",MISC
699,development,"[440, 720, 539, 731]",MISC
700,all,"[539, 720, 566, 731]",MISC
701,the,"[566, 720, 593, 731]",MISC
702,way,"[593, 720, 620, 731]",MISC
703,from,"[621, 720, 657, 731]",MISC
704,front,"[657, 720, 738, 731]",MISC
705,-,"[657, 720, 738, 731]",MISC
706,end,"[657, 720, 738, 731]",MISC
707,to,"[738, 720, 756, 731]",MISC
708,back,"[756, 720, 837, 731]",MISC
709,-,"[756, 720, 837, 731]",MISC
710,end,"[756, 720, 837, 731]",MISC
711,.,"[756, 720, 837, 731]",MISC
712,-,"[837, 720, 839, 731]",MISC
713,NL,"[837, 720, 839, 731]",MISC
714,-,"[837, 720, 839, 731]",MISC
715,Lead,"[196, 735, 232, 745]",MISC
716,team,"[234, 735, 270, 745]",MISC
717,of,"[271, 735, 289, 745]",MISC
718,offshore,"[290, 735, 364, 745]",MISC
719,developers,"[365, 735, 468, 745]",MISC
720,.,"[365, 735, 468, 745]",MISC
721,-,"[468, 735, 470, 745]",MISC
722,NL,"[468, 735, 470, 745]",MISC
723,-,"[468, 735, 470, 745]",MISC
724,St,"[154, 746, 205, 759]",MISC
725,##ack,"[154, 746, 205, 759]",MISC
726,:,"[154, 746, 205, 759]",MISC
727,A,"[206, 746, 318, 759]",MISC
728,##gi,"[206, 746, 318, 759]",MISC
729,##le,"[206, 746, 318, 759]",MISC
730,(,"[206, 746, 318, 759]",MISC
731,Sc,"[206, 746, 318, 759]",MISC
732,##rum,"[206, 746, 318, 759]",MISC
733,),"[206, 746, 318, 759]",MISC
734,",","[206, 746, 318, 759]",MISC
735,Java,"[318, 746, 353, 759]",MISC
736,8,"[353, 746, 369, 759]",MISC
737,",","[353, 746, 369, 759]",MISC
738,Spring,"[370, 746, 421, 759]",MISC
739,boot,"[422, 746, 463, 759]",MISC
740,",","[422, 746, 463, 759]",MISC
741,TD,"[465, 746, 499, 759]",MISC
742,##D,"[465, 746, 499, 759]",MISC
743,",","[465, 746, 499, 759]",MISC
744,Fly,"[500, 746, 550, 759]",MISC
745,##way,"[500, 746, 550, 759]",MISC
746,DB,"[551, 746, 577, 759]",MISC
747,",","[551, 746, 577, 759]",MISC
748,Spring,"[577, 746, 628, 759]",MISC
749,data,"[629, 746, 663, 759]",MISC
750,JP,"[664, 746, 698, 759]",MISC
751,##A,"[664, 746, 698, 759]",MISC
752,",","[664, 746, 698, 759]",MISC
753,Re,"[698, 746, 749, 759]",MISC
754,##act,"[698, 746, 749, 759]",MISC
755,",","[698, 746, 749, 759]",MISC
756,Red,"[750, 746, 800, 759]",MISC
757,##ux,"[750, 746, 800, 759]",MISC
758,",","[750, 746, 800, 759]",MISC
759,Saga,"[802, 746, 843, 759]",MISC
760,",","[802, 746, 843, 759]",MISC
761,Material,"[845, 746, 913, 759]",MISC
762,U,"[914, 746, 930, 759]",MISC
763,##I,"[914, 746, 930, 759]",MISC
764,-,"[931, 746, 933, 759]",MISC
765,NL,"[931, 746, 933, 759]",MISC
766,-,"[931, 746, 933, 759]",MISC
767,Boots,"[154, 760, 230, 773]",MISC
768,##tra,"[154, 760, 230, 773]",MISC
769,##p,"[154, 760, 230, 773]",MISC
770,",","[154, 760, 230, 773]",MISC
771,-,"[230, 760, 232, 773]",MISC
772,NL,"[230, 760, 232, 773]",MISC
773,-,"[230, 760, 232, 773]",MISC
774,Google,"[154, 774, 207, 789]",MISC
775,cloud,"[207, 774, 259, 789]",MISC
776,",","[207, 774, 259, 789]",MISC
777,Google,"[259, 774, 312, 789]",MISC
778,A,"[312, 774, 337, 789]",MISC
779,##pp,"[312, 774, 337, 789]",MISC
780,engine,"[338, 774, 400, 789]",MISC
781,.,"[338, 774, 400, 789]",MISC
782,-,"[399, 774, 401, 789]",MISC
783,NL,"[399, 774, 401, 789]",MISC
784,-,"[399, 774, 401, 789]",MISC
785,Master,"[154, 804, 234, 817]",B-employer_company_name
786,##C,"[154, 804, 234, 817]",I-employer_company_name
787,##ard,"[154, 804, 234, 817]",I-employer_company_name
788,International,"[234, 804, 336, 817]",I-employer_company_name
789,Inc,"[337, 804, 376, 817]",I-employer_company_name
790,.,"[337, 804, 376, 817]",MISC
791,",","[337, 804, 376, 817]",MISC
792,Peterborough,"[376, 804, 470, 817]",MISC
793,-,"[472, 804, 473, 817]",MISC
794,NL,"[472, 804, 473, 817]",MISC
795,-,"[472, 804, 473, 817]",MISC
796,Software,"[154, 818, 227, 831]",B-employer_role
797,Dev,"[228, 818, 311, 831]",I-employer_role
798,##elo,"[228, 818, 311, 831]",I-employer_role
799,##per,"[228, 818, 311, 831]",I-employer_role
800,(,"[311, 818, 403, 831]",I-employer_role
801,Con,"[311, 818, 403, 831]",I-employer_role
802,##tract,"[311, 818, 403, 831]",I-employer_role
803,),"[311, 818, 403, 831]",I-employer_role
804,-,"[403, 818, 405, 831]",MISC
805,NL,"[403, 818, 405, 831]",MISC
806,-,"[403, 818, 405, 831]",MISC
807,April,"[810, 818, 859, 831]",MISC
808,2016,"[861, 818, 900, 831]",MISC
809,–,"[901, 818, 910, 831]",MISC
810,Jan,"[911, 818, 940, 831]",MISC
811,2019,"[941, 818, 981, 831]",MISC
812,-,"[981, 818, 983, 831]",MISC
813,NL,"[981, 818, 983, 831]",MISC
814,-,"[981, 818, 983, 831]",MISC
815,worked,"[196, 835, 250, 845]",MISC
816,as,"[251, 835, 269, 845]",MISC
817,a,"[270, 835, 279, 845]",MISC
818,developer,"[279, 835, 360, 845]",MISC
819,in,"[362, 835, 380, 845]",MISC
820,a,"[380, 835, 389, 845]",MISC
821,strictly,"[389, 835, 461, 845]",MISC
822,A,"[463, 835, 508, 845]",MISC
823,##gi,"[463, 835, 508, 845]",MISC
824,##le,"[463, 835, 508, 845]",MISC
825,and,"[509, 835, 536, 845]",MISC
826,TD,"[536, 835, 564, 845]",MISC
827,##D,"[536, 835, 564, 845]",MISC
828,environment,"[564, 835, 665, 845]",MISC
829,on,"[665, 835, 683, 845]",MISC
830,Master,"[684, 835, 794, 845]",MISC
831,##C,"[684, 835, 794, 845]",MISC
832,##ard,"[684, 835, 794, 845]",MISC
833,’,"[684, 835, 794, 845]",MISC
834,s,"[684, 835, 794, 845]",MISC
835,-,"[794, 835, 796, 845]",MISC
836,NL,"[794, 835, 796, 845]",MISC
837,-,"[794, 835, 796, 845]",MISC
838,Multi,"[219, 846, 336, 860]",MISC
839,-,"[219, 846, 336, 860]",MISC
840,C,"[219, 846, 336, 860]",MISC
841,##ur,"[219, 846, 336, 860]",MISC
842,##ren,"[219, 846, 336, 860]",MISC
843,##cy,"[219, 846, 336, 860]",MISC
844,Cash,"[337, 846, 369, 860]",MISC
845,Pass,"[371, 846, 437, 860]",MISC
846,##port,"[371, 846, 437, 860]",MISC
847,product,"[438, 846, 496, 860]",MISC
848,based,"[497, 846, 538, 860]",MISC
849,on,"[539, 846, 555, 860]",MISC
850,micro,"[556, 846, 673, 860]",MISC
851,-,"[556, 846, 673, 860]",MISC
852,services,"[556, 846, 673, 860]",MISC
853,architecture,"[673, 846, 781, 860]",MISC
854,",","[673, 846, 781, 860]",MISC
855,concurrency,"[783, 846, 875, 860]",MISC
856,and,"[875, 846, 900, 860]",MISC
857,R,"[900, 846, 933, 860]",MISC
858,##ES,"[900, 846, 933, 860]",MISC
859,##T,"[900, 846, 933, 860]",MISC
860,API,"[934, 846, 975, 860]",MISC
861,##s,"[934, 846, 975, 860]",MISC
862,.,"[934, 846, 975, 860]",MISC
863,-,"[976, 846, 978, 860]",MISC
864,NL,"[976, 846, 978, 860]",MISC
865,-,"[976, 846, 978, 860]",MISC
866,Deal,"[196, 863, 259, 874]",MISC
867,##ing,"[196, 863, 259, 874]",MISC
868,with,"[259, 863, 295, 874]",MISC
869,complex,"[295, 863, 358, 874]",MISC
870,data,"[358, 863, 394, 874]",MISC
871,for,"[394, 863, 419, 874]",MISC
872,fraud,"[421, 863, 466, 874]",MISC
873,detection,"[466, 863, 556, 874]",MISC
874,.,"[466, 863, 556, 874]",MISC
875,-,"[556, 863, 558, 874]",MISC
876,NL,"[556, 863, 558, 874]",MISC
877,-,"[556, 863, 558, 874]",MISC
878,Also,"[196, 879, 230, 888]",MISC
879,responsible,"[230, 879, 326, 888]",MISC
880,for,"[326, 879, 351, 888]",MISC
881,weekly,"[352, 879, 402, 888]",MISC
882,production,"[404, 879, 491, 888]",MISC
883,releases,"[491, 879, 559, 888]",MISC
884,including,"[561, 879, 638, 888]",MISC
885,DB,"[639, 879, 655, 888]",MISC
886,patches,"[656, 879, 725, 888]",MISC
887,.,"[656, 879, 725, 888]",MISC
888,-,"[726, 879, 727, 888]",MISC
889,NL,"[726, 879, 727, 888]",MISC
890,-,"[726, 879, 727, 888]",MISC
891,St,"[197, 893, 280, 902]",MISC
892,##ric,"[197, 893, 280, 902]",MISC
893,##tly,"[197, 893, 280, 902]",MISC
894,B,"[281, 893, 311, 902]",MISC
895,##D,"[281, 893, 311, 902]",MISC
896,##D,"[281, 893, 311, 902]",MISC
897,and,"[312, 893, 342, 902]",MISC
898,TD,"[343, 893, 374, 902]",MISC
899,##D,"[343, 893, 374, 902]",MISC
900,-,"[374, 893, 376, 902]",MISC
901,NL,"[374, 893, 376, 902]",MISC
902,-,"[374, 893, 376, 902]",MISC
903,St,"[154, 904, 203, 917]",MISC
904,##ack,"[154, 904, 203, 917]",MISC
905,:,"[154, 904, 203, 917]",MISC
906,A,"[203, 904, 243, 917]",MISC
907,##gi,"[203, 904, 243, 917]",MISC
908,##le,"[203, 904, 243, 917]",MISC
909,(,"[244, 904, 300, 917]",MISC
910,Sc,"[244, 904, 300, 917]",MISC
911,##rum,"[244, 904, 300, 917]",MISC
912,",","[244, 904, 300, 917]",MISC
913,X,"[301, 904, 333, 917]",MISC
914,##P,"[301, 904, 333, 917]",MISC
915,),"[301, 904, 333, 917]",MISC
916,",","[301, 904, 333, 917]",MISC
917,Pa,"[333, 904, 366, 917]",MISC
918,##ir,"[333, 904, 366, 917]",MISC
919,Programming,"[366, 904, 463, 917]",MISC
920,",","[366, 904, 463, 917]",MISC
921,TD,"[464, 904, 487, 917]",MISC
922,##D,"[464, 904, 487, 917]",MISC
923,(,"[488, 904, 544, 917]",MISC
924,Jun,"[488, 904, 544, 917]",MISC
925,##it,"[488, 904, 544, 917]",MISC
926,",","[488, 904, 544, 917]",MISC
927,Mo,"[545, 904, 617, 917]",MISC
928,##cki,"[545, 904, 617, 917]",MISC
929,##to,"[545, 904, 617, 917]",MISC
930,),"[545, 904, 617, 917]",MISC
931,",","[545, 904, 617, 917]",MISC
932,Ji,"[618, 904, 658, 917]",MISC
933,##ra,"[618, 904, 658, 917]",MISC
934,",","[618, 904, 658, 917]",MISC
935,Jenkins,"[659, 904, 724, 917]",MISC
936,",","[659, 904, 724, 917]",MISC
937,-,"[724, 904, 726, 917]",MISC
938,NL,"[724, 904, 726, 917]",MISC
939,-,"[724, 904, 726, 917]",MISC
940,B,"[154, 918, 178, 932]",MISC
941,##D,"[154, 918, 178, 932]",MISC
942,##D,"[154, 918, 178, 932]",MISC
943,(,"[179, 918, 260, 932]",MISC
944,J,"[179, 918, 260, 932]",MISC
945,##B,"[179, 918, 260, 932]",MISC
946,##eh,"[179, 918, 260, 932]",MISC
947,##ave,"[179, 918, 260, 932]",MISC
948,),"[179, 918, 260, 932]",MISC
949,",","[179, 918, 260, 932]",MISC
950,Java,"[260, 918, 293, 932]",MISC
951,7,"[293, 918, 325, 932]",MISC
952,/,"[293, 918, 325, 932]",MISC
953,8,"[293, 918, 325, 932]",MISC
954,",","[293, 918, 325, 932]",MISC
955,Sc,"[325, 918, 365, 932]",MISC
956,##ala,"[325, 918, 365, 932]",MISC
957,(,"[366, 918, 406, 932]",MISC
958,Play,"[366, 918, 406, 932]",MISC
959,2,"[407, 918, 430, 932]",MISC
960,),"[407, 918, 430, 932]",MISC
961,",","[407, 918, 430, 932]",MISC
962,Twitter,"[431, 918, 487, 932]",MISC
963,Boots,"[488, 918, 569, 932]",MISC
964,##tra,"[488, 918, 569, 932]",MISC
965,##p,"[488, 918, 569, 932]",MISC
966,",","[488, 918, 569, 932]",MISC
967,Ang,"[569, 918, 650, 932]",MISC
968,##ular,"[569, 918, 650, 932]",MISC
969,##J,"[569, 918, 650, 932]",MISC
970,##s,"[569, 918, 650, 932]",MISC
971,",","[569, 918, 650, 932]",MISC
972,j,"[651, 918, 707, 932]",MISC
973,##Q,"[651, 918, 707, 932]",MISC
974,##uer,"[651, 918, 707, 932]",MISC
975,##y,"[651, 918, 707, 932]",MISC
976,",","[651, 918, 707, 932]",MISC
977,-,"[708, 918, 709, 932]",MISC
978,NL,"[708, 918, 709, 932]",MISC
979,-,"[708, 918, 709, 932]",MISC
980,Java,"[154, 933, 248, 946]",MISC
981,##Script,"[154, 933, 248, 946]",MISC
982,",","[154, 933, 248, 946]",MISC
983,H,"[250, 933, 284, 946]",MISC
984,##TM,"[250, 933, 284, 946]",MISC
985,##L,"[250, 933, 284, 946]",MISC
986,5,"[284, 933, 300, 946]",MISC
987,",","[284, 933, 300, 946]",MISC
988,CS,"[301, 933, 327, 946]",MISC
989,##S,"[301, 933, 327, 946]",MISC
990,3,"[327, 933, 344, 946]",MISC
991,",","[327, 933, 344, 946]",MISC
992,L,"[345, 933, 388, 946]",MISC
993,##ES,"[345, 933, 388, 946]",MISC
994,##S,"[345, 933, 388, 946]",MISC
995,",","[345, 933, 388, 946]",MISC
996,Oracle,"[388, 933, 438, 946]",MISC
997,Database,"[440, 933, 517, 946]",MISC
998,",","[440, 933, 517, 946]",MISC
999,S,"[518, 933, 568, 946]",MISC
1000,##lick,"[518, 933, 568, 946]",MISC
1001,",","[518, 933, 568, 946]",MISC
1002,Mon,"[570, 933, 638, 946]",MISC
1003,##go,"[570, 933, 638, 946]",MISC
1004,##D,"[570, 933, 638, 946]",MISC
1005,##B,"[570, 933, 638, 946]",MISC
1006,",","[570, 933, 638, 946]",MISC
1007,Rest,"[639, 933, 673, 946]",MISC
1008,API,"[673, 933, 717, 946]",MISC
1009,##s,"[673, 933, 717, 946]",MISC
1010,",","[673, 933, 717, 946]",MISC
1011,-,"[717, 933, 718, 946]",MISC
1012,NL,"[717, 933, 718, 946]",MISC
1013,-,"[717, 933, 718, 946]",MISC
1014,S,"[154, 947, 194, 960]",MISC
1015,##OA,"[154, 947, 194, 960]",MISC
1016,##P,"[154, 947, 194, 960]",MISC
1017,-,"[194, 947, 196, 960]",MISC
1018,NL,"[194, 947, 196, 960]",MISC
1019,-,"[194, 947, 196, 960]",MISC
1020,My,"[154, 973, 219, 985]",B-employer_company_name
1021,##so,"[154, 973, 219, 985]",I-employer_company_name
1022,##ur,"[154, 973, 219, 985]",I-employer_company_name
1023,##ce,"[154, 973, 219, 985]",I-employer_company_name
1024,consulting,"[220, 973, 311, 985]",I-employer_company_name
1025,",","[220, 973, 311, 985]",MISC
1026,C,"[311, 973, 369, 985]",MISC
1027,##raw,"[311, 973, 369, 985]",MISC
1028,##ley,"[311, 973, 369, 985]",MISC
1029,-,"[369, 973, 371, 985]",MISC
1030,NL,"[369, 973, 371, 985]",MISC
1031,-,"[369, 973, 371, 985]",MISC
1032,Java,"[154, 987, 190, 1000]",B-employer_role
1033,Dev,"[191, 987, 272, 1000]",I-employer_role
1034,##elo,"[191, 987, 272, 1000]",I-employer_role
1035,##per,"[191, 987, 272, 1000]",I-employer_role
1036,(,"[274, 987, 364, 1000]",I-employer_role
1037,Con,"[274, 987, 364, 1000]",I-employer_role
1038,##tract,"[274, 987, 364, 1000]",I-employer_role
1039,),"[274, 987, 364, 1000]",I-employer_role
1040,-,"[365, 987, 367, 1000]",MISC
1041,NL,"[365, 987, 367, 1000]",MISC
1042,-,"[365, 987, 367, 1000]",MISC
1043,June,"[810, 987, 850, 1000]",MISC
1044,2013,"[850, 987, 890, 1000]",MISC
1045,–,"[890, 987, 899, 1000]",MISC
1046,April,"[900, 987, 949, 1000]",MISC
1047,2016,"[950, 987, 990, 1000]",MISC
1048,-,"[990, 987, 992, 1000]",MISC
1049,NL,"[990, 987, 992, 1000]",MISC
1050,-,"[990, 987, 992, 1000]",MISC
1051,SA,"[129, 50, 180, 63]",B-name
1052,##AD,"[129, 50, 180, 63]",I-name
1053,MA,"[180, 50, 243, 63]",I-name
1054,##L,"[180, 50, 243, 63]",I-name
1055,##I,"[180, 50, 243, 63]",I-name
1056,##K,"[180, 50, 243, 63]",I-name
1057,-,"[243, 50, 245, 63]",MISC
1058,NL,"[243, 50, 245, 63]",MISC
1059,-,"[243, 50, 245, 63]",MISC
1060,PA,"[908, 50, 958, 63]",MISC
1061,##GE,"[908, 50, 958, 63]",MISC
1062,2,"[959, 50, 972, 63]",MISC
1063,-,"[972, 50, 974, 63]",MISC
1064,NL,"[972, 50, 974, 63]",MISC
1065,-,"[972, 50, 974, 63]",MISC
1066,Work,"[196, 104, 252, 113]",MISC
1067,##ed,"[196, 104, 252, 113]",MISC
1068,on,"[252, 104, 270, 113]",MISC
1069,various,"[271, 104, 336, 113]",MISC
1070,web,"[337, 104, 364, 113]",MISC
1071,based,"[365, 104, 410, 113]",MISC
1072,J,"[412, 104, 448, 113]",MISC
1073,##AV,"[412, 104, 448, 113]",MISC
1074,##A,"[412, 104, 448, 113]",MISC
1075,applications,"[449, 104, 570, 113]",MISC
1076,.,"[449, 104, 570, 113]",MISC
1077,-,"[571, 104, 572, 113]",MISC
1078,NL,"[571, 104, 572, 113]",MISC
1079,-,"[571, 104, 572, 113]",MISC
1080,Designed,"[196, 118, 266, 127]",MISC
1081,back,"[266, 118, 336, 127]",MISC
1082,-,"[266, 118, 336, 127]",MISC
1083,end,"[266, 118, 336, 127]",MISC
1084,functionality,"[336, 118, 450, 127]",MISC
1085,of,"[450, 118, 467, 127]",MISC
1086,multiple,"[468, 118, 538, 127]",MISC
1087,website,"[538, 118, 600, 127]",MISC
1088,projects,"[600, 118, 670, 127]",MISC
1089,including,"[670, 118, 747, 127]",MISC
1090,e,"[749, 118, 836, 127]",MISC
1091,-,"[749, 118, 836, 127]",MISC
1092,commerce,"[749, 118, 836, 127]",MISC
1093,and,"[837, 118, 862, 127]",MISC
1094,C,"[863, 118, 888, 127]",MISC
1095,##MS,"[863, 118, 888, 127]",MISC
1096,-,"[890, 118, 891, 127]",MISC
1097,NL,"[890, 118, 891, 127]",MISC
1098,-,"[890, 118, 891, 127]",MISC
1099,websites,"[219, 129, 288, 142]",MISC
1100,.,"[219, 129, 288, 142]",MISC
1101,-,"[288, 129, 290, 142]",MISC
1102,NL,"[288, 129, 290, 142]",MISC
1103,-,"[288, 129, 290, 142]",MISC
1104,Designed,"[196, 146, 268, 157]",MISC
1105,and,"[269, 146, 296, 157]",MISC
1106,developed,"[297, 146, 378, 157]",MISC
1107,a,"[379, 146, 388, 157]",MISC
1108,search,"[389, 146, 443, 157]",MISC
1109,engine,"[444, 146, 498, 157]",MISC
1110,optimization,"[499, 146, 608, 157]",MISC
1111,system,"[609, 146, 663, 157]",MISC
1112,that,"[664, 146, 700, 157]",MISC
1113,ran,"[700, 146, 727, 157]",MISC
1114,every,"[728, 146, 773, 157]",MISC
1115,night,"[774, 146, 819, 157]",MISC
1116,and,"[819, 146, 846, 157]",MISC
1117,imported,"[847, 146, 919, 157]",MISC
1118,-,"[920, 146, 922, 157]",MISC
1119,NL,"[920, 146, 922, 157]",MISC
1120,-,"[920, 146, 922, 157]",MISC
1121,high,"[219, 157, 254, 171]",MISC
1122,quality,"[254, 157, 316, 171]",MISC
1123,data,"[316, 157, 350, 171]",MISC
1124,from,"[351, 157, 385, 171]",MISC
1125,C,"[386, 157, 420, 171]",MISC
1126,##MS,"[386, 157, 420, 171]",MISC
1127,.,"[386, 157, 420, 171]",MISC
1128,-,"[421, 157, 423, 171]",MISC
1129,NL,"[421, 157, 423, 171]",MISC
1130,-,"[421, 157, 423, 171]",MISC
1131,Dev,"[196, 175, 277, 185]",MISC
1132,##elo,"[196, 175, 277, 185]",MISC
1133,##ped,"[196, 175, 277, 185]",MISC
1134,an,"[278, 175, 296, 185]",MISC
1135,ad,"[296, 175, 341, 185]",MISC
1136,##min,"[296, 175, 341, 185]",MISC
1137,system,"[342, 175, 396, 185]",MISC
1138,for,"[397, 175, 424, 185]",MISC
1139,businesses,"[424, 175, 514, 185]",MISC
1140,to,"[515, 175, 533, 185]",MISC
1141,manage,"[534, 175, 588, 185]",MISC
1142,various,"[588, 175, 651, 185]",MISC
1143,attributes,"[652, 175, 751, 185]",MISC
1144,.,"[652, 175, 751, 185]",MISC
1145,-,"[753, 175, 754, 185]",MISC
1146,NL,"[753, 175, 754, 185]",MISC
1147,-,"[753, 175, 754, 185]",MISC
1148,St,"[154, 187, 209, 199]",MISC
1149,##ack,"[154, 187, 209, 199]",MISC
1150,:,"[154, 187, 209, 199]",MISC
1151,Java,"[209, 187, 245, 199]",MISC
1152,7,"[246, 187, 264, 199]",MISC
1153,",","[246, 187, 264, 199]",MISC
1154,Spring,"[264, 187, 318, 199]",MISC
1155,MV,"[319, 187, 355, 199]",MISC
1156,##C,"[319, 187, 355, 199]",MISC
1157,",","[319, 187, 355, 199]",MISC
1158,My,"[355, 187, 410, 199]",MISC
1159,##S,"[355, 187, 410, 199]",MISC
1160,##QL,"[355, 187, 410, 199]",MISC
1161,",","[355, 187, 410, 199]",MISC
1162,S,"[410, 187, 446, 199]",MISC
1163,##QL,"[410, 187, 446, 199]",MISC
1164,",","[410, 187, 446, 199]",MISC
1165,Tom,"[447, 187, 510, 199]",MISC
1166,##cat,"[447, 187, 510, 199]",MISC
1167,",","[447, 187, 510, 199]",MISC
1168,Jenkins,"[511, 187, 583, 199]",MISC
1169,",","[511, 187, 583, 199]",MISC
1170,H,"[584, 187, 620, 199]",MISC
1171,##TM,"[584, 187, 620, 199]",MISC
1172,##L,"[584, 187, 620, 199]",MISC
1173,4,"[620, 187, 638, 199]",MISC
1174,",","[620, 187, 638, 199]",MISC
1175,CS,"[639, 187, 666, 199]",MISC
1176,##S,"[639, 187, 666, 199]",MISC
1177,-,"[666, 187, 668, 199]",MISC
1178,NL,"[666, 187, 668, 199]",MISC
1179,-,"[666, 187, 668, 199]",MISC
1180,Inn,"[154, 212, 236, 225]",B-employer_company_name
1181,##ova,"[154, 212, 236, 225]",I-employer_company_name
1182,##tive,"[154, 212, 236, 225]",I-employer_company_name
1183,Solutions,"[236, 212, 308, 225]",I-employer_company_name
1184,for,"[309, 212, 332, 225]",I-employer_company_name
1185,Education,"[333, 212, 414, 225]",I-employer_company_name
1186,",","[333, 212, 414, 225]",MISC
1187,Milton,"[414, 212, 461, 225]",MISC
1188,Keynes,"[463, 212, 509, 225]",MISC
1189,-,"[511, 212, 513, 225]",MISC
1190,NL,"[511, 212, 513, 225]",MISC
1191,-,"[511, 212, 513, 225]",MISC
1192,Java,"[154, 226, 190, 240]",B-employer_role
1193,Dev,"[192, 226, 277, 240]",I-employer_role
1194,##elo,"[192, 226, 277, 240]",I-employer_role
1195,##per,"[192, 226, 277, 240]",I-employer_role
1196,-,"[277, 226, 279, 240]",MISC
1197,NL,"[277, 226, 279, 240]",MISC
1198,-,"[277, 226, 279, 240]",MISC
1199,May,"[810, 226, 845, 240]",MISC
1200,2011,"[845, 226, 890, 240]",MISC
1201,–,"[891, 226, 902, 240]",MISC
1202,May,"[903, 226, 937, 240]",MISC
1203,2013,"[937, 226, 982, 240]",MISC
1204,-,"[983, 226, 985, 240]",MISC
1205,NL,"[983, 226, 985, 240]",MISC
1206,-,"[983, 226, 985, 240]",MISC
1207,Work,"[196, 243, 248, 254]",MISC
1208,##ed,"[196, 243, 248, 254]",MISC
1209,as,"[248, 243, 264, 254]",MISC
1210,a,"[265, 243, 273, 254]",MISC
1211,developer,"[274, 243, 352, 254]",MISC
1212,on,"[353, 243, 369, 254]",MISC
1213,a,"[370, 243, 377, 254]",MISC
1214,Green,"[379, 243, 465, 254]",MISC
1215,##field,"[379, 243, 465, 254]",MISC
1216,project,"[466, 243, 525, 254]",MISC
1217,from,"[527, 243, 561, 254]",MISC
1218,very,"[562, 243, 596, 254]",MISC
1219,start,"[597, 243, 640, 254]",MISC
1220,till,"[640, 243, 674, 254]",MISC
1221,its,"[675, 243, 700, 254]",MISC
1222,delivery,"[701, 243, 779, 254]",MISC
1223,.,"[701, 243, 779, 254]",MISC
1224,-,"[780, 243, 781, 254]",MISC
1225,NL,"[780, 243, 781, 254]",MISC
1226,-,"[780, 243, 781, 254]",MISC
1227,Direct,"[196, 258, 266, 268]",MISC
1228,##ly,"[196, 258, 266, 268]",MISC
1229,communicated,"[266, 258, 371, 268]",MISC
1230,with,"[371, 258, 406, 268]",MISC
1231,stakeholders,"[407, 258, 511, 268]",MISC
1232,throughout,"[512, 258, 599, 268]",MISC
1233,the,"[600, 258, 625, 268]",MISC
1234,development,"[626, 258, 722, 268]",MISC
1235,of,"[723, 258, 739, 268]",MISC
1236,the,"[741, 258, 766, 268]",MISC
1237,project,"[767, 258, 837, 268]",MISC
1238,.,"[767, 258, 837, 268]",MISC
1239,-,"[837, 258, 839, 268]",MISC
1240,NL,"[837, 258, 839, 268]",MISC
1241,-,"[837, 258, 839, 268]",MISC
1242,Designed,"[196, 272, 270, 282]",MISC
1243,and,"[270, 272, 297, 282]",MISC
1244,delivered,"[298, 272, 381, 282]",MISC
1245,a,"[381, 272, 390, 282]",MISC
1246,new,"[391, 272, 418, 282]",MISC
1247,SA,"[419, 272, 455, 282]",MISC
1248,##AS,"[419, 272, 455, 282]",MISC
1249,application,"[456, 272, 557, 282]",MISC
1250,to,"[558, 272, 576, 282]",MISC
1251,be,"[576, 272, 594, 282]",MISC
1252,used,"[595, 272, 631, 282]",MISC
1253,by,"[632, 272, 650, 282]",MISC
1254,clients,"[650, 272, 715, 282]",MISC
1255,including,"[715, 272, 798, 282]",MISC
1256,many,"[798, 272, 835, 282]",MISC
1257,-,"[836, 272, 837, 282]",MISC
1258,NL,"[836, 272, 837, 282]",MISC
1259,-,"[836, 272, 837, 282]",MISC
1260,premier,"[219, 284, 277, 296]",MISC
1261,league,"[277, 284, 326, 296]",MISC
1262,clubs,"[327, 284, 375, 296]",MISC
1263,.,"[327, 284, 375, 296]",MISC
1264,-,"[376, 284, 378, 296]",MISC
1265,NL,"[376, 284, 378, 296]",MISC
1266,-,"[376, 284, 378, 296]",MISC
1267,Help,"[196, 300, 250, 312]",MISC
1268,##ed,"[196, 300, 250, 312]",MISC
1269,company,"[251, 300, 315, 312]",MISC
1270,winning,"[316, 300, 379, 312]",MISC
1271,a,"[381, 300, 390, 312]",MISC
1272,new,"[390, 300, 417, 312]",MISC
1273,client,"[417, 300, 472, 312]",MISC
1274,“,"[473, 300, 556, 312]",MISC
1275,Football,"[473, 300, 556, 312]",MISC
1276,Premier,"[556, 300, 619, 312]",MISC
1277,League,"[620, 300, 674, 312]",MISC
1278,Club,"[676, 300, 730, 312]",MISC
1279,”,"[676, 300, 730, 312]",MISC
1280,.,"[676, 300, 730, 312]",MISC
1281,-,"[731, 300, 733, 312]",MISC
1282,NL,"[731, 300, 733, 312]",MISC
1283,-,"[731, 300, 733, 312]",MISC
1284,Man,"[196, 315, 261, 326]",MISC
1285,##aged,"[196, 315, 261, 326]",MISC
1286,many,"[263, 315, 301, 326]",MISC
1287,Dev,"[301, 315, 357, 326]",MISC
1288,##O,"[301, 315, 357, 326]",MISC
1289,##ps,"[301, 315, 357, 326]",MISC
1290,operations,"[358, 315, 452, 326]",MISC
1291,including,"[453, 315, 538, 326]",MISC
1292,setting,"[539, 315, 604, 326]",MISC
1293,up,"[605, 315, 624, 326]",MISC
1294,A,"[625, 315, 662, 326]",MISC
1295,##WS,"[625, 315, 662, 326]",MISC
1296,.,"[625, 315, 662, 326]",MISC
1297,-,"[663, 315, 664, 326]",MISC
1298,NL,"[663, 315, 664, 326]",MISC
1299,-,"[663, 315, 664, 326]",MISC
1300,St,"[154, 327, 203, 340]",MISC
1301,##ack,"[154, 327, 203, 340]",MISC
1302,:,"[154, 327, 203, 340]",MISC
1303,A,"[204, 327, 246, 340]",MISC
1304,##gi,"[204, 327, 246, 340]",MISC
1305,##le,"[204, 327, 246, 340]",MISC
1306,(,"[246, 327, 310, 340]",MISC
1307,Sc,"[246, 327, 310, 340]",MISC
1308,##rum,"[246, 327, 310, 340]",MISC
1309,),"[246, 327, 310, 340]",MISC
1310,",","[246, 327, 310, 340]",MISC
1311,Jenkins,"[312, 327, 377, 340]",MISC
1312,",","[312, 327, 377, 340]",MISC
1313,J,"[378, 327, 443, 340]",MISC
1314,##B,"[378, 327, 443, 340]",MISC
1315,##eh,"[378, 327, 443, 340]",MISC
1316,##ave,"[378, 327, 443, 340]",MISC
1317,",","[378, 327, 443, 340]",MISC
1318,Java,"[445, 327, 477, 340]",MISC
1319,6,"[478, 327, 494, 340]",MISC
1320,",","[478, 327, 494, 340]",MISC
1321,Spring,"[494, 327, 543, 340]",MISC
1322,MV,"[544, 327, 576, 340]",MISC
1323,##C,"[544, 327, 576, 340]",MISC
1324,",","[544, 327, 576, 340]",MISC
1325,JP,"[577, 327, 692, 340]",MISC
1326,##A,"[577, 327, 692, 340]",MISC
1327,/,"[577, 327, 692, 340]",MISC
1328,Hi,"[577, 327, 692, 340]",MISC
1329,##ber,"[577, 327, 692, 340]",MISC
1330,##nate,"[577, 327, 692, 340]",MISC
1331,",","[577, 327, 692, 340]",MISC
1332,-,"[693, 327, 695, 340]",MISC
1333,NL,"[693, 327, 695, 340]",MISC
1334,-,"[693, 327, 695, 340]",MISC
1335,j,"[154, 341, 214, 354]",MISC
1336,##Q,"[154, 341, 214, 354]",MISC
1337,##uer,"[154, 341, 214, 354]",MISC
1338,##y,"[154, 341, 214, 354]",MISC
1339,",","[154, 341, 214, 354]",MISC
1340,Ang,"[215, 341, 274, 354]",MISC
1341,##ular,"[215, 341, 274, 354]",MISC
1342,J,"[275, 341, 300, 354]",MISC
1343,##S,"[275, 341, 300, 354]",MISC
1344,",","[275, 341, 300, 354]",MISC
1345,Re,"[301, 341, 385, 354]",MISC
1346,##quire,"[301, 341, 385, 354]",MISC
1347,##J,"[301, 341, 385, 354]",MISC
1348,##S,"[301, 341, 385, 354]",MISC
1349,",","[301, 341, 385, 354]",MISC
1350,H,"[386, 341, 437, 354]",MISC
1351,##TM,"[386, 341, 437, 354]",MISC
1352,##L,"[386, 341, 437, 354]",MISC
1353,##5,"[386, 341, 437, 354]",MISC
1354,",","[386, 341, 437, 354]",MISC
1355,CS,"[438, 341, 479, 354]",MISC
1356,##S,"[438, 341, 479, 354]",MISC
1357,##3,"[438, 341, 479, 354]",MISC
1358,",","[438, 341, 479, 354]",MISC
1359,L,"[481, 341, 522, 354]",MISC
1360,##ES,"[481, 341, 522, 354]",MISC
1361,##S,"[481, 341, 522, 354]",MISC
1362,",","[481, 341, 522, 354]",MISC
1363,Glass,"[524, 341, 609, 354]",MISC
1364,##fish,"[524, 341, 609, 354]",MISC
1365,",","[524, 341, 609, 354]",MISC
1366,My,"[610, 341, 660, 354]",MISC
1367,##S,"[610, 341, 660, 354]",MISC
1368,##QL,"[610, 341, 660, 354]",MISC
1369,",","[610, 341, 660, 354]",MISC
1370,Amazon,"[661, 341, 712, 354]",MISC
1371,-,"[713, 341, 715, 354]",MISC
1372,NL,"[713, 341, 715, 354]",MISC
1373,-,"[713, 341, 715, 354]",MISC
1374,Web,"[154, 355, 180, 368]",MISC
1375,Services,"[181, 355, 249, 368]",MISC
1376,(,"[251, 355, 303, 368]",MISC
1377,A,"[251, 355, 303, 368]",MISC
1378,##WS,"[251, 355, 303, 368]",MISC
1379,),"[251, 355, 303, 368]",MISC
1380,",","[251, 355, 303, 368]",MISC
1381,V,"[304, 355, 372, 368]",MISC
1382,##ag,"[304, 355, 372, 368]",MISC
1383,##rant,"[304, 355, 372, 368]",MISC
1384,",","[304, 355, 372, 368]",MISC
1385,P,"[374, 355, 426, 368]",MISC
1386,##up,"[374, 355, 426, 368]",MISC
1387,##pet,"[374, 355, 426, 368]",MISC
1388,-,"[427, 355, 428, 368]",MISC
1389,NL,"[427, 355, 428, 368]",MISC
1390,-,"[427, 355, 428, 368]",MISC
1391,O,"[154, 381, 203, 395]",B-employer_company_name
1392,##yster,"[154, 381, 203, 395]",I-employer_company_name
1393,Business,"[204, 381, 271, 395]",I-employer_company_name
1394,Dynamics,"[271, 381, 345, 395]",I-employer_company_name
1395,",","[271, 381, 345, 395]",MISC
1396,Liverpool,"[346, 381, 420, 395]",MISC
1397,-,"[421, 381, 423, 395]",MISC
1398,NL,"[421, 381, 423, 395]",MISC
1399,-,"[421, 381, 423, 395]",MISC
1400,Java,"[154, 395, 190, 409]",B-employer_role
1401,Dev,"[191, 395, 272, 409]",I-employer_role
1402,##elo,"[191, 395, 272, 409]",I-employer_role
1403,##per,"[191, 395, 272, 409]",I-employer_role
1404,(,"[274, 395, 364, 409]",MISC
1405,Con,"[274, 395, 364, 409]",MISC
1406,##tract,"[274, 395, 364, 409]",MISC
1407,),"[274, 395, 364, 409]",MISC
1408,-,"[365, 395, 367, 409]",MISC
1409,NL,"[365, 395, 367, 409]",MISC
1410,-,"[365, 395, 367, 409]",MISC
1411,Jan,"[810, 395, 843, 409]",MISC
1412,2010,"[843, 395, 887, 409]",MISC
1413,–,"[888, 395, 898, 409]",MISC
1414,May,"[899, 395, 931, 409]",MISC
1415,2011,"[932, 395, 975, 409]",MISC
1416,-,"[976, 395, 978, 409]",MISC
1417,NL,"[976, 395, 978, 409]",MISC
1418,-,"[976, 395, 978, 409]",MISC
1419,Work,"[196, 413, 248, 423]",MISC
1420,##ed,"[196, 413, 248, 423]",MISC
1421,as,"[250, 413, 266, 423]",MISC
1422,developer,"[267, 413, 347, 423]",MISC
1423,to,"[348, 413, 364, 423]",MISC
1424,help,"[366, 413, 400, 423]",MISC
1425,agency,"[402, 413, 454, 423]",MISC
1426,deliver,"[455, 413, 517, 423]",MISC
1427,its,"[518, 413, 543, 423]",MISC
1428,project,"[545, 413, 606, 423]",MISC
1429,on,"[608, 413, 624, 423]",MISC
1430,a,"[626, 413, 633, 423]",MISC
1431,crucial,"[634, 413, 696, 423]",MISC
1432,stage,"[697, 413, 749, 423]",MISC
1433,.,"[697, 413, 749, 423]",MISC
1434,-,"[751, 413, 753, 423]",MISC
1435,NL,"[751, 413, 753, 423]",MISC
1436,-,"[751, 413, 753, 423]",MISC
1437,St,"[154, 438, 209, 451]",MISC
1438,##ack,"[154, 438, 209, 451]",MISC
1439,:,"[154, 438, 209, 451]",MISC
1440,Java,"[209, 438, 245, 451]",MISC
1441,5,"[245, 438, 281, 451]",MISC
1442,/,"[245, 438, 281, 451]",MISC
1443,6,"[245, 438, 281, 451]",MISC
1444,",","[245, 438, 281, 451]",MISC
1445,Spring,"[281, 438, 336, 451]",MISC
1446,MV,"[336, 438, 372, 451]",MISC
1447,##C,"[336, 438, 372, 451]",MISC
1448,",","[336, 438, 372, 451]",MISC
1449,My,"[372, 438, 426, 451]",MISC
1450,##S,"[372, 438, 426, 451]",MISC
1451,##QL,"[372, 438, 426, 451]",MISC
1452,",","[372, 438, 426, 451]",MISC
1453,S,"[427, 438, 463, 451]",MISC
1454,##QL,"[427, 438, 463, 451]",MISC
1455,",","[427, 438, 463, 451]",MISC
1456,Tom,"[463, 438, 526, 451]",MISC
1457,##cat,"[463, 438, 526, 451]",MISC
1458,",","[463, 438, 526, 451]",MISC
1459,Jenkins,"[526, 438, 598, 451]",MISC
1460,",","[526, 438, 598, 451]",MISC
1461,H,"[599, 438, 635, 451]",MISC
1462,##TM,"[599, 438, 635, 451]",MISC
1463,##L,"[599, 438, 635, 451]",MISC
1464,4,"[635, 438, 653, 451]",MISC
1465,",","[635, 438, 653, 451]",MISC
1466,CS,"[653, 438, 680, 451]",MISC
1467,##S,"[653, 438, 680, 451]",MISC
1468,-,"[681, 438, 682, 451]",MISC
1469,NL,"[681, 438, 682, 451]",MISC
1470,-,"[681, 438, 682, 451]",MISC
1471,J,"[154, 464, 190, 478]",B-employer_company_name
1472,##O,"[154, 464, 190, 478]",I-employer_company_name
1473,##B,"[154, 464, 190, 478]",I-employer_company_name
1474,##U,"[154, 464, 190, 478]",I-employer_company_name
1475,Group,"[191, 464, 245, 478]",I-employer_company_name
1476,",","[191, 464, 245, 478]",MISC
1477,London,"[247, 464, 301, 478]",MISC
1478,-,"[302, 464, 304, 478]",MISC
1479,NL,"[302, 464, 304, 478]",MISC
1480,-,"[302, 464, 304, 478]",MISC
1481,IT,"[154, 478, 171, 492]",B-education_course
1482,Consul,"[172, 478, 260, 492]",MISC
1483,##tant,"[172, 478, 260, 492]",MISC
1484,(,"[261, 478, 367, 492]",MISC
1485,Free,"[261, 478, 367, 492]",MISC
1486,##lance,"[261, 478, 367, 492]",MISC
1487,##r,"[261, 478, 367, 492]",MISC
1488,),"[261, 478, 367, 492]",MISC
1489,-,"[367, 478, 369, 492]",MISC
1490,NL,"[367, 478, 369, 492]",MISC
1491,-,"[367, 478, 369, 492]",MISC
1492,Jan,"[810, 478, 843, 492]",MISC
1493,2006,"[843, 478, 886, 492]",MISC
1494,–,"[886, 478, 897, 492]",MISC
1495,Dec,"[897, 478, 929, 492]",MISC
1496,2009,"[929, 478, 972, 492]",MISC
1497,-,"[972, 478, 974, 492]",MISC
1498,NL,"[972, 478, 974, 492]",MISC
1499,-,"[972, 478, 974, 492]",MISC
1500,Designed,"[197, 496, 276, 506]",MISC
1501,new,"[277, 496, 306, 506]",MISC
1502,modules,"[308, 496, 378, 506]",MISC
1503,for,"[378, 496, 407, 506]",MISC
1504,J,"[408, 496, 479, 506]",MISC
1505,##O,"[408, 496, 479, 506]",MISC
1506,##OM,"[408, 496, 479, 506]",MISC
1507,##LA,"[408, 496, 479, 506]",MISC
1508,.,"[408, 496, 479, 506]",MISC
1509,-,"[479, 496, 481, 506]",MISC
1510,NL,"[479, 496, 481, 506]",MISC
1511,-,"[479, 496, 481, 506]",MISC
1512,Work,"[196, 510, 248, 520]",MISC
1513,##ed,"[196, 510, 248, 520]",MISC
1514,along,"[249, 510, 292, 520]",MISC
1515,with,"[294, 510, 328, 520]",MISC
1516,a,"[329, 510, 337, 520]",MISC
1517,team,"[338, 510, 372, 520]",MISC
1518,of,"[374, 510, 390, 520]",MISC
1519,developers,"[392, 510, 480, 520]",MISC
1520,working,"[481, 510, 542, 520]",MISC
1521,from,"[543, 510, 577, 520]",MISC
1522,different,"[579, 510, 658, 520]",MISC
1523,global,"[659, 510, 711, 520]",MISC
1524,locations,"[712, 510, 801, 520]",MISC
1525,.,"[712, 510, 801, 520]",MISC
1526,-,"[801, 510, 803, 520]",MISC
1527,NL,"[801, 510, 803, 520]",MISC
1528,-,"[801, 510, 803, 520]",MISC
1529,Monitor,"[196, 524, 284, 534]",MISC
1530,##ing,"[196, 524, 284, 534]",MISC
1531,performance,"[285, 524, 382, 534]",MISC
1532,and,"[382, 524, 407, 534]",MISC
1533,critical,"[409, 524, 479, 534]",MISC
1534,times,"[480, 524, 568, 534]",MISC
1535,##cale,"[480, 524, 568, 534]",MISC
1536,##s,"[480, 524, 568, 534]",MISC
1537,to,"[568, 524, 585, 534]",MISC
1538,meet,"[586, 524, 620, 534]",MISC
1539,the,"[622, 524, 647, 534]",MISC
1540,deadline,"[648, 524, 728, 534]",MISC
1541,##s,"[648, 524, 728, 534]",MISC
1542,and,"[728, 524, 753, 534]",MISC
1543,ensure,"[755, 524, 807, 534]",MISC
1544,the,"[808, 524, 833, 534]",MISC
1545,success,"[835, 524, 896, 534]",MISC
1546,-,"[897, 524, 899, 534]",MISC
1547,NL,"[897, 524, 899, 534]",MISC
1548,-,"[897, 524, 899, 534]",MISC
1549,of,"[219, 535, 234, 549]",MISC
1550,the,"[235, 535, 256, 549]",MISC
1551,project,"[258, 535, 319, 549]",MISC
1552,.,"[258, 535, 319, 549]",MISC
1553,-,"[320, 535, 322, 549]",MISC
1554,NL,"[320, 535, 322, 549]",MISC
1555,-,"[320, 535, 322, 549]",MISC
1556,W,"[196, 552, 241, 563]",MISC
1557,##rote,"[196, 552, 241, 563]",MISC
1558,many,"[243, 552, 279, 563]",MISC
1559,re,"[280, 552, 363, 563]",MISC
1560,-,"[280, 552, 363, 563]",MISC
1561,usable,"[280, 552, 363, 563]",MISC
1562,components,"[364, 552, 456, 563]",MISC
1563,including,"[457, 552, 540, 563]",MISC
1564,modules,"[541, 552, 606, 563]",MISC
1565,to,"[606, 552, 624, 563]",MISC
1566,accept,"[625, 552, 681, 563]",MISC
1567,Pay,"[681, 552, 737, 563]",MISC
1568,##P,"[681, 552, 737, 563]",MISC
1569,##al,"[681, 552, 737, 563]",MISC
1570,payments,"[737, 552, 810, 563]",MISC
1571,and,"[811, 552, 838, 563]",MISC
1572,secure,"[839, 552, 895, 563]",MISC
1573,-,"[895, 552, 897, 563]",MISC
1574,NL,"[895, 552, 897, 563]",MISC
1575,-,"[895, 552, 897, 563]",MISC
1576,Lo,"[219, 565, 266, 578]",MISC
1577,##gins,"[219, 565, 266, 578]",MISC
1578,in,"[268, 565, 282, 578]",MISC
1579,Java,"[284, 565, 323, 578]",MISC
1580,.,"[284, 565, 323, 578]",MISC
1581,-,"[324, 565, 326, 578]",MISC
1582,NL,"[324, 565, 326, 578]",MISC
1583,-,"[324, 565, 326, 578]",MISC
1584,St,"[154, 579, 207, 592]",MISC
1585,##ack,"[154, 579, 207, 592]",MISC
1586,:,"[154, 579, 207, 592]",MISC
1587,Java,"[208, 579, 242, 592]",MISC
1588,5,"[244, 579, 278, 592]",MISC
1589,/,"[244, 579, 278, 592]",MISC
1590,6,"[244, 579, 278, 592]",MISC
1591,",","[244, 579, 278, 592]",MISC
1592,P,"[280, 579, 314, 592]",MISC
1593,##HP,"[280, 579, 314, 592]",MISC
1594,",","[280, 579, 314, 592]",MISC
1595,My,"[315, 579, 368, 592]",MISC
1596,##S,"[315, 579, 368, 592]",MISC
1597,##QL,"[315, 579, 368, 592]",MISC
1598,",","[315, 579, 368, 592]",MISC
1599,S,"[369, 579, 403, 592]",MISC
1600,##QL,"[369, 579, 403, 592]",MISC
1601,",","[369, 579, 403, 592]",MISC
1602,Tom,"[405, 579, 466, 592]",MISC
1603,##cat,"[405, 579, 466, 592]",MISC
1604,",","[405, 579, 466, 592]",MISC
1605,Java,"[467, 579, 565, 592]",MISC
1606,##Script,"[467, 579, 565, 592]",MISC
1607,",","[467, 579, 565, 592]",MISC
1608,H,"[566, 579, 600, 592]",MISC
1609,##TM,"[566, 579, 600, 592]",MISC
1610,##L,"[566, 579, 600, 592]",MISC
1611,4,"[602, 579, 618, 592]",MISC
1612,",","[602, 579, 618, 592]",MISC
1613,CS,"[620, 579, 645, 592]",MISC
1614,##S,"[620, 579, 645, 592]",MISC
1615,-,"[646, 579, 648, 592]",MISC
1616,NL,"[646, 579, 648, 592]",MISC
1617,-,"[646, 579, 648, 592]",MISC
1618,E,"[129, 635, 221, 649]",B-education_heading
1619,##D,"[129, 635, 221, 649]",I-education_heading
1620,##UC,"[129, 635, 221, 649]",I-education_heading
1621,##AT,"[129, 635, 221, 649]",I-education_heading
1622,##ION,"[129, 635, 221, 649]",I-education_heading
1623,-,"[221, 635, 223, 649]",MISC
1624,NL,"[221, 635, 223, 649]",MISC
1625,-,"[221, 635, 223, 649]",MISC
1626,University,"[154, 652, 234, 666]",B-education_institute
1627,of,"[234, 652, 248, 666]",I-education_institute
1628,Punjab,"[250, 652, 304, 666]",I-education_institute
1629,",","[250, 652, 304, 666]",I-education_institute
1630,Pakistan,"[305, 652, 368, 666]",I-education_institute
1631,-,"[369, 652, 371, 666]",MISC
1632,NL,"[369, 652, 371, 666]",MISC
1633,-,"[369, 652, 371, 666]",MISC
1634,Bachelor,"[154, 668, 228, 682]",B-education_degree
1635,of,"[230, 668, 248, 682]",I-education_degree
1636,Sciences,"[249, 668, 323, 682]",I-education_degree
1637,(,"[324, 668, 389, 682]",MISC
1638,Math,"[324, 668, 389, 682]",B-education_course
1639,##s,"[324, 668, 389, 682]",I-education_course
1640,),"[324, 668, 389, 682]",MISC
1641,-,"[390, 668, 392, 682]",MISC
1642,NL,"[390, 668, 392, 682]",MISC
1643,-,"[390, 668, 392, 682]",MISC
1644,Premier,"[154, 706, 210, 718]",B-education_institute
1645,College,"[210, 706, 273, 718]",I-education_institute
1646,",","[210, 706, 273, 718]",I-education_institute
1647,Pakistan,"[274, 706, 337, 718]",I-education_institute
1648,-,"[338, 706, 340, 718]",MISC
1649,NL,"[338, 706, 340, 718]",MISC
1650,-,"[338, 706, 340, 718]",MISC
1651,MBA,"[154, 721, 189, 734]",B-education_degree
1652,-,"[189, 721, 200, 734]",MISC
1653,IT,"[200, 721, 222, 734]",B-education_course
1654,-,"[223, 721, 225, 734]",MISC
1655,NL,"[223, 721, 225, 734]",MISC
1656,-,"[223, 721, 225, 734]",MISC
1657,IN,"[129, 793, 216, 805]",B-skills_heading
1658,##TE,"[129, 793, 216, 805]",I-skills_heading
1659,##RE,"[129, 793, 216, 805]",I-skills_heading
1660,##ST,"[129, 793, 216, 805]",I-skills_heading
1661,##S,"[129, 793, 216, 805]",I-skills_heading
1662,-,"[216, 793, 218, 805]",MISC
1663,NL,"[216, 793, 218, 805]",MISC
1664,-,"[216, 793, 218, 805]",MISC
1665,I,"[154, 810, 162, 822]",MISC
1666,enjoy,"[163, 810, 206, 822]",MISC
1667,various,"[207, 810, 266, 822]",MISC
1668,sports,"[268, 810, 320, 822]",MISC
1669,including,"[320, 810, 397, 822]",MISC
1670,swimming,"[398, 810, 467, 822]",MISC
1671,and,"[468, 810, 493, 822]",MISC
1672,badminton,"[494, 810, 581, 822]",MISC
1673,.,"[494, 810, 581, 822]",MISC
1674,My,"[581, 810, 598, 822]",MISC
1675,ho,"[599, 810, 658, 822]",MISC
1676,##bb,"[599, 810, 658, 822]",MISC
1677,##ies,"[599, 810, 658, 822]",MISC
1678,also,"[660, 810, 694, 822]",MISC
1679,include,"[695, 810, 754, 822]",MISC
1680,photography,"[756, 810, 860, 822]",MISC
1681,.,"[756, 810, 860, 822]",MISC
1682,I,"[860, 810, 867, 822]",MISC
1683,have,"[869, 810, 903, 822]",MISC
1684,a,"[904, 810, 911, 822]",MISC
1685,passion,"[912, 810, 972, 822]",MISC
1686,for,"[973, 810, 999, 822]",MISC
1687,-,"[999, 810, 1001, 822]",MISC
1688,NL,"[999, 810, 1001, 822]",MISC
1689,-,"[999, 810, 1001, 822]",MISC
1690,electronic,"[154, 824, 239, 838]",MISC
1691,technology,"[241, 824, 325, 838]",MISC
1692,advancement,"[327, 824, 421, 838]",MISC
1693,and,"[422, 824, 447, 838]",MISC
1694,keep,"[448, 824, 482, 838]",MISC
1695,myself,"[482, 824, 533, 838]",MISC
1696,updated,"[534, 824, 593, 838]",MISC
1697,through,"[594, 824, 654, 838]",MISC
1698,various,"[655, 824, 714, 838]",MISC
1699,sources,"[715, 824, 774, 838]",MISC
1700,of,"[775, 824, 792, 838]",MISC
1701,information,"[793, 824, 895, 838]",MISC
1702,.,"[793, 824, 895, 838]",MISC
1703,But,"[896, 824, 921, 838]",MISC
1704,above,"[922, 824, 963, 838]",MISC
1705,all,"[965, 824, 990, 838]",MISC
1706,I,"[991, 824, 998, 838]",MISC
1707,-,"[1000, 824, 1001, 838]",MISC
1708,NL,"[1000, 824, 1001, 838]",MISC
1709,-,"[1000, 824, 1001, 838]",MISC
1710,take,"[154, 838, 187, 852]",MISC
1711,every,"[188, 838, 227, 852]",MISC
1712,opportunity,"[229, 838, 319, 852]",MISC
1713,to,"[320, 838, 336, 852]",MISC
1714,interact,"[336, 838, 401, 852]",MISC
1715,and,"[402, 838, 426, 852]",MISC
1716,social,"[427, 838, 501, 852]",MISC
1717,##ize,"[427, 838, 501, 852]",MISC
1718,with,"[501, 838, 534, 852]",MISC
1719,people,"[534, 838, 583, 852]",MISC
1720,from,"[584, 838, 616, 852]",MISC
1721,all,"[617, 838, 641, 852]",MISC
1722,walks,"[642, 838, 682, 852]",MISC
1723,of,"[683, 838, 699, 852]",MISC
1724,like,"[700, 838, 739, 852]",MISC
1725,.,"[700, 838, 739, 852]",MISC
1726,Adventure,"[741, 838, 822, 852]",MISC
1727,",","[741, 838, 822, 852]",MISC
1728,travelling,"[824, 838, 905, 852]",MISC
1729,and,"[906, 838, 930, 852]",MISC
1730,-,"[931, 838, 933, 852]",MISC
1731,NL,"[931, 838, 933, 852]",MISC
1732,-,"[931, 838, 933, 852]",MISC
1733,exploring,"[154, 853, 225, 866]",MISC
1734,different,"[226, 853, 297, 866]",MISC
1735,cultures,"[298, 853, 361, 866]",MISC
1736,and,"[362, 853, 386, 866]",MISC
1737,societies,"[386, 853, 457, 866]",MISC
1738,also,"[458, 853, 489, 866]",MISC
1739,f,"[490, 853, 569, 866]",MISC
1740,##as,"[490, 853, 569, 866]",MISC
1741,##cin,"[490, 853, 569, 866]",MISC
1742,##ates,"[490, 853, 569, 866]",MISC
1743,me,"[570, 853, 594, 866]",MISC
1744,.,"[570, 853, 594, 866]",MISC
1745,-,"[594, 853, 596, 866]",MISC
1746,NL,"[594, 853, 596, 866]",MISC
1747,-,"[594, 853, 596, 866]",MISC
1748,R,"[129, 884, 232, 897]",B-others_heading
1749,##EF,"[129, 884, 232, 897]",I-others_heading
1750,##ER,"[129, 884, 232, 897]",I-others_heading
1751,##EN,"[129, 884, 232, 897]",I-others_heading
1752,##CE,"[129, 884, 232, 897]",I-others_heading
1753,##S,"[129, 884, 232, 897]",I-others_heading
1754,-,"[232, 884, 234, 897]",MISC
1755,NL,"[232, 884, 234, 897]",MISC
1756,-,"[232, 884, 234, 897]",MISC
1757,Reference,"[154, 901, 236, 914]",MISC
1758,##s,"[154, 901, 236, 914]",MISC
1759,are,"[237, 901, 261, 914]",MISC
1760,available,"[262, 901, 336, 914]",MISC
1761,on,"[337, 901, 353, 914]",MISC
1762,request,"[353, 901, 418, 914]",MISC
1763,.,"[353, 901, 418, 914]",MISC
1764,-,"[419, 901, 421, 914]",MISC
1765,NL,"[419, 901, 421, 914]",MISC
1766,-,"[419, 901, 421, 914]",MISC
