,token,box,label
0,Technical,"[49, 39, 153, 55]",MISC
1,Support,"[155, 39, 236, 55]",MISC
2,/,"[237, 39, 341, 55]",MISC
3,Help,"[237, 39, 341, 55]",MISC
4,##D,"[237, 39, 341, 55]",MISC
5,##es,"[237, 39, 341, 55]",MISC
6,##k,"[237, 39, 341, 55]",MISC
7,-,"[342, 39, 344, 55]",MISC
8,NL,"[342, 39, 344, 55]",MISC
9,-,"[342, 39, 344, 55]",MISC
10,M,"[49, 92, 167, 110]",B-name
11,##O,"[49, 92, 167, 110]",I-name
12,##UN,"[49, 92, 167, 110]",I-name
13,##KA,"[49, 92, 167, 110]",I-name
14,##IL,"[49, 92, 167, 110]",I-name
15,##A,"[49, 92, 167, 110]",I-name
16,Sal,"[168, 92, 260, 110]",MISC
17,##if,"[168, 92, 260, 110]",MISC
18,##ou,"[168, 92, 260, 110]",MISC
19,-,"[261, 92, 263, 110]",MISC
20,NL,"[261, 92, 263, 110]",MISC
21,-,"[261, 92, 263, 110]",MISC
22,15,"[49, 138, 81, 154]",MISC
23,",","[49, 138, 81, 154]",MISC
24,rue,"[82, 138, 113, 154]",MISC
25,Henri,"[114, 138, 167, 154]",MISC
26,R,"[168, 138, 255, 154]",MISC
27,##ibi,"[168, 138, 255, 154]",MISC
28,##ere,"[168, 138, 255, 154]",MISC
29,",","[168, 138, 255, 154]",MISC
30,750,"[255, 138, 308, 154]",MISC
31,##19,"[255, 138, 308, 154]",MISC
32,Paris,"[309, 138, 362, 154]",MISC
33,sa,"[364, 138, 666, 154]",B-emails_email
34,##li,"[364, 138, 666, 154]",I-emails_email
35,##fo,"[364, 138, 666, 154]",I-emails_email
36,##um,"[364, 138, 666, 154]",I-emails_email
37,##ou,"[364, 138, 666, 154]",I-emails_email
38,##nka,"[364, 138, 666, 154]",I-emails_email
39,##ila,"[364, 138, 666, 154]",I-emails_email
40,@,"[364, 138, 666, 154]",I-emails_email
41,hot,"[364, 138, 666, 154]",I-emails_email
42,##mail,"[364, 138, 666, 154]",I-emails_email
43,.,"[364, 138, 666, 154]",I-emails_email
44,com,"[364, 138, 666, 154]",I-emails_email
45,-,"[667, 138, 669, 154]",MISC
46,NL,"[667, 138, 669, 154]",MISC
47,-,"[667, 138, 669, 154]",MISC
48,06,"[736, 138, 765, 154]",B-phones_phone
49,09,"[765, 138, 793, 154]",I-phones_phone
50,64,"[793, 138, 821, 154]",I-phones_phone
51,61,"[821, 138, 849, 154]",I-phones_phone
52,07,"[849, 138, 878, 154]",I-phones_phone
53,-,"[878, 138, 879, 154]",MISC
54,NL,"[878, 138, 879, 154]",MISC
55,-,"[878, 138, 879, 154]",MISC
56,He,"[113, 173, 134, 191]",MISC
57,has,"[135, 173, 169, 191]",MISC
58,more,"[170, 173, 214, 191]",MISC
59,than,"[215, 173, 259, 191]",MISC
60,nine,"[261, 173, 305, 191]",MISC
61,consecutive,"[307, 173, 432, 191]",MISC
62,years,"[432, 173, 489, 191]",MISC
63,of,"[489, 173, 510, 191]",MISC
64,professional,"[512, 173, 648, 191]",MISC
65,experience,"[649, 173, 762, 191]",MISC
66,in,"[763, 173, 784, 191]",MISC
67,the,"[786, 173, 820, 191]",MISC
68,complex,"[820, 173, 900, 191]",MISC
69,areas,"[900, 173, 957, 191]",MISC
70,of,"[957, 173, 978, 191]",MISC
71,-,"[980, 173, 982, 191]",MISC
72,NL,"[980, 173, 982, 191]",MISC
73,-,"[980, 173, 982, 191]",MISC
74,IT,"[113, 191, 134, 208]",MISC
75,maintenance,"[134, 191, 265, 208]",MISC
76,",","[134, 191, 265, 208]",MISC
77,administrative,"[265, 191, 417, 208]",MISC
78,and,"[418, 191, 450, 208]",MISC
79,financial,"[451, 191, 548, 208]",MISC
80,management,"[549, 191, 667, 208]",MISC
81,",","[549, 191, 667, 208]",MISC
82,good,"[669, 191, 711, 208]",MISC
83,experience,"[713, 191, 820, 208]",MISC
84,in,"[822, 191, 843, 208]",MISC
85,monitoring,"[844, 191, 951, 208]",MISC
86,the,"[953, 191, 984, 208]",MISC
87,-,"[985, 191, 987, 208]",MISC
88,NL,"[985, 191, 987, 208]",MISC
89,-,"[985, 191, 987, 208]",MISC
90,evaluation,"[113, 209, 229, 226]",MISC
91,and,"[229, 209, 263, 226]",MISC
92,project,"[264, 209, 346, 226]",MISC
93,management,"[346, 209, 463, 226]",MISC
94,with,"[463, 209, 509, 226]",MISC
95,a,"[509, 209, 520, 226]",MISC
96,good,"[521, 209, 567, 226]",MISC
97,command,"[568, 209, 649, 226]",MISC
98,of,"[650, 209, 673, 226]",MISC
99,English,"[673, 209, 765, 226]",MISC
100,.,"[673, 209, 765, 226]",MISC
101,-,"[766, 209, 768, 226]",MISC
102,NL,"[766, 209, 768, 226]",MISC
103,-,"[766, 209, 768, 226]",MISC
104,He,"[113, 244, 134, 263]",MISC
105,has,"[134, 244, 166, 263]",MISC
106,the,"[166, 244, 197, 263]",MISC
107,following,"[197, 244, 293, 263]",MISC
108,skills,"[293, 244, 356, 263]",MISC
109,:,"[356, 244, 367, 263]",MISC
110,-,"[367, 244, 369, 263]",MISC
111,NL,"[367, 244, 369, 263]",MISC
112,-,"[367, 244, 369, 263]",MISC
113,I,"[155, 281, 302, 298]",MISC
114,##dent,"[155, 281, 302, 298]",MISC
115,##ification,"[155, 281, 302, 298]",MISC
116,of,"[303, 281, 322, 298]",MISC
117,incidents,"[324, 281, 418, 298]",MISC
118,and,"[419, 281, 449, 298]",MISC
119,proposal,"[451, 281, 534, 298]",MISC
120,of,"[536, 281, 555, 298]",MISC
121,solutions,"[557, 281, 650, 298]",MISC
122,for,"[652, 281, 682, 298]",MISC
123,the,"[684, 281, 714, 298]",MISC
124,resolution,"[715, 281, 820, 298]",MISC
125,of,"[821, 281, 841, 298]",MISC
126,these,"[842, 281, 904, 298]",MISC
127,.,"[842, 281, 904, 298]",MISC
128,-,"[906, 281, 908, 298]",MISC
129,NL,"[906, 281, 908, 298]",MISC
130,-,"[906, 281, 908, 298]",MISC
131,A,"[156, 299, 235, 316]",MISC
132,##bility,"[156, 299, 235, 316]",MISC
133,to,"[237, 299, 260, 316]",MISC
134,reduce,"[260, 299, 329, 316]",MISC
135,the,"[329, 299, 362, 316]",MISC
136,number,"[363, 299, 432, 316]",MISC
137,of,"[433, 299, 455, 316]",MISC
138,Help,"[456, 299, 502, 316]",MISC
139,Des,"[502, 299, 548, 316]",MISC
140,##k,"[502, 299, 548, 316]",MISC
141,requests,"[548, 299, 640, 316]",MISC
142,by,"[640, 299, 663, 316]",MISC
143,prevent,"[663, 299, 778, 316]",MISC
144,##ive,"[663, 299, 778, 316]",MISC
145,actions,"[778, 299, 870, 316]",MISC
146,.,"[778, 299, 870, 316]",MISC
147,-,"[871, 299, 872, 316]",MISC
148,NL,"[871, 299, 872, 316]",MISC
149,-,"[871, 299, 872, 316]",MISC
150,In,"[156, 317, 292, 334]",MISC
151,##stal,"[156, 317, 292, 334]",MISC
152,##lation,"[156, 317, 292, 334]",MISC
153,of,"[293, 317, 315, 334]",MISC
154,computer,"[316, 317, 406, 334]",MISC
155,equipment,"[408, 317, 510, 334]",MISC
156,and,"[511, 317, 545, 334]",MISC
157,updates,"[545, 317, 625, 334]",MISC
158,during,"[626, 317, 693, 334]",MISC
159,moves,"[694, 317, 751, 334]",MISC
160,and,"[752, 317, 785, 334]",MISC
161,other,"[786, 317, 843, 334]",MISC
162,works,"[843, 317, 969, 334]",MISC
163,##tation,"[843, 317, 969, 334]",MISC
164,-,"[969, 317, 971, 334]",MISC
165,NL,"[969, 317, 971, 334]",MISC
166,-,"[969, 317, 971, 334]",MISC
167,movements,"[176, 335, 277, 352]",MISC
168,with,"[278, 335, 323, 352]",MISC
169,System,"[324, 335, 391, 352]",MISC
170,and,"[392, 335, 426, 352]",MISC
171,Network,"[426, 335, 506, 352]",MISC
172,Administration,"[506, 335, 675, 352]",MISC
173,.,"[506, 335, 675, 352]",MISC
174,-,"[676, 335, 678, 352]",MISC
175,NL,"[676, 335, 678, 352]",MISC
176,-,"[676, 335, 678, 352]",MISC
177,Real,"[156, 352, 279, 371]",MISC
178,##ization,"[156, 352, 279, 371]",MISC
179,of,"[281, 352, 302, 371]",MISC
180,computer,"[304, 352, 394, 371]",MISC
181,maintenance,"[394, 352, 518, 371]",MISC
182,operations,"[519, 352, 633, 371]",MISC
183,remotely,"[633, 352, 723, 371]",MISC
184,as,"[724, 352, 745, 371]",MISC
185,on,"[747, 352, 768, 371]",MISC
186,site,"[770, 352, 826, 371]",MISC
187,.,"[770, 352, 826, 371]",MISC
188,-,"[826, 352, 828, 371]",MISC
189,NL,"[826, 352, 828, 371]",MISC
190,-,"[826, 352, 828, 371]",MISC
191,Excellent,"[155, 371, 250, 389]",MISC
192,inter,"[251, 371, 389, 389]",MISC
193,##person,"[251, 371, 389, 389]",MISC
194,##al,"[251, 371, 389, 389]",MISC
195,skills,"[390, 371, 453, 389]",MISC
196,and,"[454, 371, 486, 389]",MISC
197,a,"[486, 371, 496, 389]",MISC
198,sense,"[496, 371, 549, 389]",MISC
199,of,"[550, 371, 571, 389]",MISC
200,customer,"[571, 371, 656, 389]",MISC
201,service,"[656, 371, 741, 389]",MISC
202,",","[656, 371, 741, 389]",MISC
203,A,"[742, 371, 816, 389]",MISC
204,##bility,"[742, 371, 816, 389]",MISC
205,to,"[817, 371, 838, 389]",MISC
206,listen,"[838, 371, 912, 389]",MISC
207,",","[838, 371, 912, 389]",MISC
208,adapt,"[913, 371, 976, 389]",MISC
209,",","[913, 371, 976, 389]",MISC
210,-,"[977, 371, 978, 389]",MISC
211,NL,"[977, 371, 978, 389]",MISC
212,-,"[977, 371, 978, 389]",MISC
213,analyze,"[176, 389, 254, 407]",MISC
214,and,"[254, 389, 286, 407]",MISC
215,di,"[288, 389, 387, 407]",MISC
216,##ag,"[288, 389, 387, 407]",MISC
217,##nose,"[288, 389, 387, 407]",MISC
218,.,"[288, 389, 387, 407]",MISC
219,-,"[388, 389, 390, 407]",MISC
220,NL,"[388, 389, 390, 407]",MISC
221,-,"[388, 389, 390, 407]",MISC
222,Technical,"[155, 407, 254, 424]",MISC
223,assistance,"[255, 407, 375, 424]",MISC
224,",","[255, 407, 375, 424]",MISC
225,-,"[377, 407, 509, 424]",MISC
226,Main,"[377, 407, 509, 424]",MISC
227,##taining,"[377, 407, 509, 424]",MISC
228,the,"[510, 407, 541, 424]",MISC
229,team,"[543, 407, 608, 424]",MISC
230,',"[543, 407, 608, 424]",MISC
231,s,"[543, 407, 608, 424]",MISC
232,schedule,"[609, 407, 708, 424]",MISC
233,",","[609, 407, 708, 424]",MISC
234,-,"[709, 407, 818, 424]",MISC
235,Animation,"[709, 407, 818, 424]",MISC
236,of,"[819, 407, 841, 424]",MISC
237,the,"[842, 407, 873, 424]",MISC
238,team,"[875, 407, 919, 424]",MISC
239,to,"[919, 407, 940, 424]",MISC
240,-,"[941, 407, 943, 424]",MISC
241,NL,"[941, 407, 943, 424]",MISC
242,-,"[941, 407, 943, 424]",MISC
243,create,"[176, 425, 238, 442]",MISC
244,optimization,"[240, 425, 376, 442]",MISC
245,##s,"[240, 425, 376, 442]",MISC
246,in,"[377, 425, 396, 442]",MISC
247,the,"[398, 425, 428, 442]",MISC
248,resolution,"[430, 425, 534, 442]",MISC
249,of,"[535, 425, 554, 442]",MISC
250,tickets,"[556, 425, 629, 442]",MISC
251,but,"[630, 425, 660, 442]",MISC
252,also,"[662, 425, 702, 442]",MISC
253,the,"[704, 425, 734, 442]",MISC
254,removal,"[736, 425, 808, 442]",MISC
255,of,"[810, 425, 829, 442]",MISC
256,recurring,"[831, 425, 924, 442]",MISC
257,sources,"[926, 425, 998, 442]",MISC
258,-,"[999, 425, 1001, 442]",MISC
259,NL,"[999, 425, 1001, 442]",MISC
260,-,"[999, 425, 1001, 442]",MISC
261,of,"[176, 442, 194, 460]",MISC
262,incidents,"[195, 442, 291, 460]",MISC
263,",","[195, 442, 291, 460]",MISC
264,-,"[292, 442, 301, 460]",MISC
265,-,"[302, 442, 303, 460]",MISC
266,NL,"[302, 442, 303, 460]",MISC
267,-,"[302, 442, 303, 460]",MISC
268,Development,"[155, 460, 276, 479]",MISC
269,of,"[277, 460, 298, 479]",MISC
270,training,"[299, 460, 388, 479]",MISC
271,materials,"[388, 460, 487, 479]",MISC
272,and,"[487, 460, 519, 479]",MISC
273,animation,"[521, 460, 630, 479]",MISC
274,##s,"[521, 460, 630, 479]",MISC
275,of,"[631, 460, 652, 479]",MISC
276,the,"[653, 460, 685, 479]",MISC
277,training,"[687, 460, 775, 479]",MISC
278,modules,"[775, 460, 851, 479]",MISC
279,in,"[853, 460, 952, 479]",MISC
280,-,"[853, 460, 952, 479]",MISC
281,house,"[853, 460, 952, 479]",MISC
282,",","[853, 460, 952, 479]",MISC
283,for,"[952, 460, 984, 479]",MISC
284,-,"[985, 460, 987, 479]",MISC
285,NL,"[985, 460, 987, 479]",MISC
286,-,"[985, 460, 987, 479]",MISC
287,Sage,"[176, 479, 280, 497]",MISC
288,-,"[176, 479, 280, 497]",MISC
289,Sa,"[176, 479, 280, 497]",MISC
290,##ari,"[176, 479, 280, 497]",MISC
291,software,"[281, 479, 364, 497]",MISC
292,(,"[365, 479, 448, 497]",MISC
293,pay,"[365, 479, 448, 497]",MISC
294,##roll,"[365, 479, 448, 497]",MISC
295,and,"[449, 479, 479, 497]",MISC
296,accounting,"[481, 479, 606, 497]",MISC
297,),"[481, 479, 606, 497]",MISC
298,",","[481, 479, 606, 497]",MISC
299,and,"[607, 479, 637, 497]",MISC
300,Microsoft,"[638, 479, 732, 497]",MISC
301,Project,"[733, 479, 805, 497]",MISC
302,for,"[806, 479, 836, 497]",MISC
303,project,"[838, 479, 910, 497]",MISC
304,-,"[911, 479, 913, 497]",MISC
305,NL,"[911, 479, 913, 497]",MISC
306,-,"[911, 479, 913, 497]",MISC
307,management,"[176, 497, 305, 514]",MISC
308,.,"[176, 497, 305, 514]",MISC
309,-,"[305, 497, 307, 514]",MISC
310,NL,"[305, 497, 307, 514]",MISC
311,-,"[305, 497, 307, 514]",MISC
312,E,"[49, 533, 203, 550]",B-work_experience_heading
313,##X,"[49, 533, 203, 550]",I-work_experience_heading
314,##P,"[49, 533, 203, 550]",I-work_experience_heading
315,##ER,"[49, 533, 203, 550]",I-work_experience_heading
316,##IE,"[49, 533, 203, 550]",I-work_experience_heading
317,##NC,"[49, 533, 203, 550]",I-work_experience_heading
318,##ES,"[49, 533, 203, 550]",I-work_experience_heading
319,PR,"[203, 533, 426, 550]",I-work_experience_heading
320,##O,"[203, 533, 426, 550]",I-work_experience_heading
321,##F,"[203, 533, 426, 550]",I-work_experience_heading
322,##ES,"[203, 533, 426, 550]",I-work_experience_heading
323,##SI,"[203, 533, 426, 550]",I-work_experience_heading
324,##ON,"[203, 533, 426, 550]",I-work_experience_heading
325,##NE,"[203, 533, 426, 550]",I-work_experience_heading
326,##LL,"[203, 533, 426, 550]",I-work_experience_heading
327,##ES,"[203, 533, 426, 550]",I-work_experience_heading
328,:,"[427, 533, 440, 550]",I-work_experience_heading
329,-,"[441, 533, 443, 550]",MISC
330,NL,"[441, 533, 443, 550]",MISC
331,-,"[441, 533, 443, 550]",MISC
332,Tech,"[441, 533, 443, 550]",B-employer_role
333,##nic,"[441, 533, 443, 550]",I-employer_role
334,##ien,"[441, 533, 443, 550]",I-employer_role
335,support,"[84, 569, 213, 587]",I-employer_role
336,/,"[215, 569, 305, 587]",I-employer_role
337,Help,"[215, 569, 305, 587]",I-employer_role
338,Des,"[306, 569, 370, 587]",I-employer_role
339,##k,"[306, 569, 370, 587]",I-employer_role
340,Cabinet,"[424, 569, 514, 587]",B-employer_company_name
341,SA,"[515, 569, 554, 587]",I-employer_company_name
342,##M,"[515, 569, 554, 587]",I-employer_company_name
343,-,"[554, 569, 556, 587]",MISC
344,NL,"[554, 569, 556, 587]",MISC
345,-,"[554, 569, 556, 587]",MISC
346,07,"[729, 569, 754, 587]",MISC
347,/,"[755, 569, 768, 587]",MISC
348,2012,"[768, 569, 820, 587]",MISC
349,to,"[820, 569, 845, 587]",MISC
350,04,"[846, 569, 871, 587]",MISC
351,/,"[873, 569, 885, 587]",MISC
352,2018,"[886, 569, 937, 587]",MISC
353,-,"[938, 569, 939, 587]",MISC
354,NL,"[938, 569, 939, 587]",MISC
355,-,"[938, 569, 939, 587]",MISC
356,Establishment,"[111, 587, 257, 604]",MISC
357,and,"[259, 587, 292, 604]",MISC
358,training,"[293, 587, 383, 604]",MISC
359,of,"[384, 587, 405, 604]",MISC
360,a,"[406, 587, 417, 604]",MISC
361,team,"[418, 587, 462, 604]",MISC
362,of,"[463, 587, 485, 604]",MISC
363,10,"[486, 587, 507, 604]",MISC
364,technicians,"[509, 587, 632, 604]",MISC
365,on,"[634, 587, 655, 604]",MISC
366,computer,"[657, 587, 747, 604]",MISC
367,maintenance,"[748, 587, 871, 604]",MISC
368,and,"[873, 587, 906, 604]",MISC
369,incident,"[907, 587, 997, 604]",MISC
370,-,"[998, 587, 999, 604]",MISC
371,NL,"[998, 587, 999, 604]",MISC
372,-,"[998, 587, 999, 604]",MISC
373,management,"[111, 605, 222, 622]",MISC
374,from,"[223, 605, 267, 622]",MISC
375,a,"[267, 605, 278, 622]",MISC
376,ticket,"[278, 605, 344, 622]",MISC
377,management,"[345, 605, 457, 622]",MISC
378,application,"[457, 605, 579, 622]",MISC
379,developed,"[580, 605, 679, 622]",MISC
380,on,"[681, 605, 702, 622]",MISC
381,Ex,"[703, 605, 768, 622]",MISC
382,##cel,"[703, 605, 768, 622]",MISC
383,.,"[703, 605, 768, 622]",MISC
384,-,"[770, 605, 781, 622]",MISC
385,con,"[781, 605, 893, 622]",MISC
386,##clusive,"[781, 605, 893, 622]",MISC
387,result,"[893, 605, 971, 622]",MISC
388,.,"[893, 605, 971, 622]",MISC
389,-,"[971, 605, 973, 622]",MISC
390,NL,"[971, 605, 973, 622]",MISC
391,-,"[971, 605, 973, 622]",MISC
392,-,"[111, 623, 121, 640]",MISC
393,the,"[122, 623, 153, 640]",MISC
394,reception,"[154, 623, 251, 640]",MISC
395,of,"[251, 623, 273, 640]",MISC
396,requests,"[273, 623, 358, 640]",MISC
397,and,"[360, 623, 391, 640]",MISC
398,user,"[392, 623, 434, 640]",MISC
399,incidents,"[435, 623, 532, 640]",MISC
400,of,"[533, 623, 554, 640]",MISC
401,our,"[554, 623, 586, 640]",MISC
402,customers,"[587, 623, 684, 640]",MISC
403,(,"[684, 623, 758, 640]",MISC
404,calls,"[684, 623, 758, 640]",MISC
405,",","[684, 623, 758, 640]",MISC
406,mail,"[760, 623, 823, 640]",MISC
407,##s,"[760, 623, 823, 640]",MISC
408,",","[760, 623, 823, 640]",MISC
409,tickets,"[825, 623, 922, 640]",MISC
410,),"[825, 623, 922, 640]",MISC
411,.,"[825, 623, 922, 640]",MISC
412,The,"[922, 623, 954, 640]",MISC
413,main,"[954, 623, 997, 640]",MISC
414,-,"[998, 623, 999, 640]",MISC
415,NL,"[998, 623, 999, 640]",MISC
416,-,"[998, 623, 999, 640]",MISC
417,mission,"[111, 640, 189, 658]",MISC
418,is,"[189, 640, 211, 658]",MISC
419,the,"[212, 640, 245, 658]",MISC
420,qualification,"[246, 640, 401, 658]",MISC
421,",","[246, 640, 401, 658]",MISC
422,trace,"[403, 640, 537, 658]",MISC
423,##ability,"[403, 640, 537, 658]",MISC
424,and,"[537, 640, 571, 658]",MISC
425,follow,"[571, 640, 672, 658]",MISC
426,-,"[571, 640, 672, 658]",MISC
427,up,"[571, 640, 672, 658]",MISC
428,of,"[672, 640, 693, 658]",MISC
429,support,"[695, 640, 772, 658]",MISC
430,requests,"[773, 640, 874, 658]",MISC
431,.,"[773, 640, 874, 658]",MISC
432,As,"[874, 640, 895, 658]",MISC
433,well,"[897, 640, 941, 658]",MISC
434,as,"[942, 640, 963, 658]",MISC
435,the,"[964, 640, 998, 658]",MISC
436,-,"[998, 640, 1000, 658]",MISC
437,NL,"[998, 640, 1000, 658]",MISC
438,-,"[998, 640, 1000, 658]",MISC
439,processing,"[111, 658, 219, 677]",MISC
440,and,"[219, 658, 251, 677]",MISC
441,the,"[251, 658, 283, 677]",MISC
442,resolution,"[284, 658, 392, 677]",MISC
443,in,"[392, 658, 413, 677]",MISC
444,respect,"[414, 658, 488, 677]",MISC
445,of,"[489, 658, 511, 677]",MISC
446,the,"[511, 658, 543, 677]",MISC
447,instructions,"[543, 658, 672, 677]",MISC
448,and,"[673, 658, 705, 677]",MISC
449,the,"[706, 658, 737, 677]",MISC
450,fixed,"[738, 658, 791, 677]",MISC
451,perimeter,"[792, 658, 900, 677]",MISC
452,:,"[792, 658, 900, 677]",MISC
453,support,"[900, 658, 975, 677]",MISC
454,of,"[976, 658, 997, 677]",MISC
455,-,"[998, 658, 999, 677]",MISC
456,NL,"[998, 658, 999, 677]",MISC
457,-,"[998, 658, 999, 677]",MISC
458,the,"[111, 677, 146, 694]",MISC
459,assistance,"[146, 677, 265, 694]",MISC
460,to,"[265, 677, 288, 694]",MISC
461,the,"[289, 677, 324, 694]",MISC
462,users,"[324, 677, 382, 694]",MISC
463,(,"[383, 677, 465, 694]",MISC
464,remote,"[383, 677, 465, 694]",MISC
465,getting,"[466, 677, 548, 694]",MISC
466,in,"[549, 677, 572, 694]",MISC
467,hand,"[573, 677, 619, 694]",MISC
468,when,"[620, 677, 666, 694]",MISC
469,possible,"[668, 677, 786, 694]",MISC
470,),"[668, 677, 786, 694]",MISC
471,",","[668, 677, 786, 694]",MISC
472,supervision,"[786, 677, 915, 694]",MISC
473,alert,"[917, 677, 998, 694]",MISC
474,##s,"[917, 677, 998, 694]",MISC
475,",","[917, 677, 998, 694]",MISC
476,-,"[999, 677, 1001, 694]",MISC
477,NL,"[999, 677, 1001, 694]",MISC
478,-,"[999, 677, 1001, 694]",MISC
479,administration,"[111, 695, 277, 712]",MISC
480,##s,"[111, 695, 277, 712]",MISC
481,of,"[277, 695, 298, 712]",MISC
482,the,"[299, 695, 331, 712]",MISC
483,user,"[333, 695, 377, 712]",MISC
484,accounts,"[377, 695, 476, 712]",MISC
485,",","[377, 695, 476, 712]",MISC
486,management,"[477, 695, 586, 712]",MISC
487,of,"[588, 695, 609, 712]",MISC
488,park,"[610, 695, 664, 712]",MISC
489,",","[610, 695, 664, 712]",MISC
490,workshop,"[665, 695, 753, 712]",MISC
491,(,"[754, 695, 809, 712]",MISC
492,post,"[754, 695, 809, 712]",MISC
493,preparation,"[809, 695, 942, 712]",MISC
494,",","[809, 695, 942, 712]",MISC
495,fault,"[942, 695, 997, 712]",MISC
496,-,"[998, 695, 999, 712]",MISC
497,NL,"[998, 695, 999, 712]",MISC
498,-,"[998, 695, 999, 712]",MISC
499,diagnosis,"[111, 713, 222, 730]",MISC
500,),"[111, 713, 222, 730]",MISC
501,",","[111, 713, 222, 730]",MISC
502,documentation,"[222, 713, 353, 730]",MISC
503,of,"[354, 713, 374, 730]",MISC
504,resolutions,"[374, 713, 494, 730]",MISC
505,.,"[374, 713, 494, 730]",MISC
506,-,"[496, 713, 498, 730]",MISC
507,NL,"[496, 713, 498, 730]",MISC
508,-,"[496, 713, 498, 730]",MISC
509,-,"[111, 730, 121, 748]",MISC
510,Rep,"[122, 730, 187, 748]",MISC
511,##air,"[122, 730, 187, 748]",MISC
512,/,"[188, 730, 199, 748]",MISC
513,installation,"[199, 730, 332, 748]",MISC
514,of,"[333, 730, 354, 748]",MISC
515,PC,"[355, 730, 387, 748]",MISC
516,",","[355, 730, 387, 748]",MISC
517,(,"[388, 730, 476, 748]",MISC
518,mail,"[388, 730, 476, 748]",MISC
519,##box,"[388, 730, 476, 748]",MISC
520,configuration,"[477, 730, 620, 748]",MISC
521,/,"[621, 730, 631, 748]",MISC
522,data,"[632, 730, 676, 748]",MISC
523,transfer,"[676, 730, 786, 748]",MISC
524,),"[676, 730, 786, 748]",MISC
525,",","[676, 730, 786, 748]",MISC
526,good,"[787, 730, 831, 748]",MISC
527,control,"[831, 730, 907, 748]",MISC
528,of,"[909, 730, 930, 748]",MISC
529,office,"[931, 730, 997, 748]",MISC
530,-,"[998, 730, 999, 748]",MISC
531,NL,"[998, 730, 999, 748]",MISC
532,-,"[998, 730, 999, 748]",MISC
533,networks,"[111, 748, 190, 766]",MISC
534,(,"[191, 748, 290, 766]",MISC
535,switches,"[191, 748, 290, 766]",MISC
536,",","[191, 748, 290, 766]",MISC
537,patch,"[291, 748, 382, 766]",MISC
538,##ing,"[291, 748, 382, 766]",MISC
539,",","[291, 748, 382, 766]",MISC
540,fire,"[382, 748, 481, 766]",MISC
541,##wall,"[382, 748, 481, 766]",MISC
542,##s,"[382, 748, 481, 766]",MISC
543,",","[382, 748, 481, 766]",MISC
544,IP,"[482, 748, 502, 766]",MISC
545,addressing,"[502, 748, 601, 766]",MISC
546,.,"[602, 748, 641, 766]",MISC
547,.,"[602, 748, 641, 766]",MISC
548,.,"[602, 748, 641, 766]",MISC
549,),"[602, 748, 641, 766]",MISC
550,-,"[643, 748, 644, 766]",MISC
551,NL,"[643, 748, 644, 766]",MISC
552,-,"[643, 748, 644, 766]",MISC
553,Consul,"[79, 785, 204, 802]",B-employer_role
554,##tant,"[79, 785, 204, 802]",I-employer_role
555,In,"[206, 785, 370, 802]",I-employer_role
556,##form,"[206, 785, 370, 802]",I-employer_role
557,##atic,"[206, 785, 370, 802]",I-employer_role
558,##ien,"[206, 785, 370, 802]",I-employer_role
559,ON,"[371, 785, 408, 802]",B-employer_company_name
560,##G,"[371, 785, 408, 802]",I-employer_company_name
561,Save,"[410, 785, 459, 802]",I-employer_company_name
562,The,"[460, 785, 497, 802]",I-employer_company_name
563,Children,"[499, 785, 599, 802]",I-employer_company_name
564,-,"[600, 785, 602, 802]",MISC
565,NL,"[600, 785, 602, 802]",MISC
566,-,"[600, 785, 602, 802]",MISC
567,06,"[701, 785, 724, 802]",MISC
568,/,"[724, 785, 816, 802]",MISC
569,10,"[724, 785, 816, 802]",MISC
570,/,"[724, 785, 816, 802]",MISC
571,2011,"[724, 785, 816, 802]",MISC
572,to,"[817, 785, 840, 802]",MISC
573,25,"[840, 785, 909, 802]",MISC
574,/,"[840, 785, 909, 802]",MISC
575,10,"[840, 785, 909, 802]",MISC
576,/,"[840, 785, 909, 802]",MISC
577,2012,"[909, 785, 955, 802]",MISC
578,-,"[955, 785, 957, 802]",MISC
579,NL,"[955, 785, 957, 802]",MISC
580,-,"[955, 785, 957, 802]",MISC
581,Management,"[111, 803, 234, 820]",MISC
582,of,"[236, 803, 260, 820]",MISC
583,the,"[261, 803, 298, 820]",MISC
584,park,"[298, 803, 348, 820]",MISC
585,and,"[348, 803, 385, 820]",MISC
586,IT,"[386, 803, 410, 820]",MISC
587,and,"[411, 803, 448, 820]",MISC
588,office,"[448, 803, 522, 820]",MISC
589,equipment,"[523, 803, 647, 820]",MISC
590,",","[523, 803, 647, 820]",MISC
591,as,"[648, 803, 673, 820]",MISC
592,well,"[673, 803, 722, 820]",MISC
593,as,"[723, 803, 748, 820]",MISC
594,the,"[748, 803, 785, 820]",MISC
595,implementation,"[785, 803, 959, 820]",MISC
596,of,"[960, 803, 985, 820]",MISC
597,a,"[985, 803, 998, 820]",MISC
598,-,"[998, 803, 999, 820]",MISC
599,NL,"[998, 803, 999, 820]",MISC
600,-,"[998, 803, 999, 820]",MISC
601,pay,"[111, 820, 187, 838]",MISC
602,##roll,"[111, 820, 187, 838]",MISC
603,software,"[188, 820, 277, 838]",MISC
604,for,"[277, 820, 309, 838]",MISC
605,human,"[310, 820, 365, 838]",MISC
606,resources,"[366, 820, 465, 838]",MISC
607,management,"[466, 820, 587, 838]",MISC
608,.,"[466, 820, 587, 838]",MISC
609,-,"[588, 820, 598, 838]",MISC
610,Analysis,"[599, 820, 687, 838]",MISC
611,of,"[687, 820, 709, 838]",MISC
612,incidents,"[709, 820, 808, 838]",MISC
613,with,"[809, 820, 853, 838]",MISC
614,users,"[854, 820, 908, 838]",MISC
615,(,"[909, 820, 997, 838]",MISC
616,office,"[909, 820, 997, 838]",MISC
617,",","[909, 820, 997, 838]",MISC
618,-,"[998, 820, 999, 838]",MISC
619,NL,"[998, 820, 999, 838]",MISC
620,-,"[998, 820, 999, 838]",MISC
621,network,"[111, 838, 201, 856]",MISC
622,",","[111, 838, 201, 856]",MISC
623,.,"[202, 838, 235, 856]",MISC
624,.,"[202, 838, 235, 856]",MISC
625,),"[202, 838, 235, 856]",MISC
626,-,"[236, 838, 246, 856]",MISC
627,Re,"[247, 838, 314, 856]",MISC
628,##mote,"[247, 838, 314, 856]",MISC
629,intervention,"[315, 838, 452, 856]",MISC
630,or,"[452, 838, 473, 856]",MISC
631,on,"[475, 838, 554, 856]",MISC
632,-,"[475, 838, 554, 856]",MISC
633,site,"[475, 838, 554, 856]",MISC
634,proximity,"[554, 838, 655, 856]",MISC
635,support,"[657, 838, 736, 856]",MISC
636,for,"[736, 838, 770, 856]",MISC
637,incident,"[770, 838, 860, 856]",MISC
638,resolution,"[861, 838, 985, 856]",MISC
639,.,"[861, 838, 985, 856]",MISC
640,-,"[986, 838, 997, 856]",MISC
641,-,"[998, 838, 999, 856]",MISC
642,NL,"[998, 838, 999, 856]",MISC
643,-,"[998, 838, 999, 856]",MISC
644,E,"[111, 856, 220, 873]",MISC
645,##sca,"[111, 856, 220, 873]",MISC
646,##lation,"[111, 856, 220, 873]",MISC
647,of,"[222, 856, 243, 873]",MISC
648,problems,"[244, 856, 332, 873]",MISC
649,after,"[333, 856, 388, 873]",MISC
650,qualification,"[389, 856, 555, 873]",MISC
651,.,"[389, 856, 555, 873]",MISC
652,-,"[389, 856, 555, 873]",MISC
653,Training,"[555, 856, 643, 873]",MISC
654,then,"[644, 856, 688, 873]",MISC
655,management,"[688, 856, 798, 873]",MISC
656,of,"[800, 856, 821, 873]",MISC
657,user,"[822, 856, 866, 873]",MISC
658,accounts,"[866, 856, 965, 873]",MISC
659,",","[866, 856, 965, 873]",MISC
660,.,"[966, 856, 998, 873]",MISC
661,.,"[966, 856, 998, 873]",MISC
662,-,"[966, 856, 998, 873]",MISC
663,-,"[1000, 856, 1001, 873]",MISC
664,NL,"[1000, 856, 1001, 873]",MISC
665,-,"[1000, 856, 1001, 873]",MISC
666,Keeping,"[111, 875, 187, 891]",MISC
667,inventory,"[187, 875, 285, 891]",MISC
668,up,"[286, 875, 307, 891]",MISC
669,to,"[308, 875, 329, 891]",MISC
670,date,"[330, 875, 383, 891]",MISC
671,-,"[330, 875, 383, 891]",MISC
672,Pre,"[385, 875, 505, 891]",MISC
673,##par,"[385, 875, 505, 891]",MISC
674,##ation,"[385, 875, 505, 891]",MISC
675,or,"[505, 875, 526, 891]",MISC
676,migration,"[527, 875, 624, 891]",MISC
677,of,"[625, 875, 647, 891]",MISC
678,works,"[647, 875, 789, 891]",MISC
679,##tations,"[647, 875, 789, 891]",MISC
680,.,"[647, 875, 789, 891]",MISC
681,-,"[790, 875, 800, 891]",MISC
682,Train,"[801, 875, 877, 891]",MISC
683,##er,"[801, 875, 877, 891]",MISC
684,in,"[877, 875, 898, 891]",MISC
685,Microsoft,"[899, 875, 996, 891]",MISC
686,-,"[998, 875, 999, 891]",MISC
687,NL,"[998, 875, 999, 891]",MISC
688,-,"[998, 875, 999, 891]",MISC
689,Project,"[111, 893, 187, 910]",MISC
690,for,"[188, 893, 220, 910]",MISC
691,a,"[221, 893, 232, 910]",MISC
692,perfect,"[232, 893, 308, 910]",MISC
693,master,"[309, 893, 385, 910]",MISC
694,##y,"[309, 893, 385, 910]",MISC
695,of,"[387, 893, 408, 910]",MISC
696,computer,"[409, 893, 539, 910]",MISC
697,##ized,"[409, 893, 539, 910]",MISC
698,project,"[541, 893, 617, 910]",MISC
699,management,"[618, 893, 739, 910]",MISC
700,.,"[618, 893, 739, 910]",MISC
701,-,"[740, 893, 742, 910]",MISC
702,NL,"[740, 893, 742, 910]",MISC
703,-,"[740, 893, 742, 910]",MISC
704,Re,"[111, 928, 257, 946]",B-employer_role
705,##sp,"[111, 928, 257, 946]",I-employer_role
706,##ons,"[111, 928, 257, 946]",I-employer_role
707,##able,"[111, 928, 257, 946]",I-employer_role
708,inform,"[259, 928, 420, 946]",I-employer_role
709,##ati,"[259, 928, 420, 946]",I-employer_role
710,##que,"[259, 928, 420, 946]",I-employer_role
711,E,"[420, 928, 567, 946]",B-employer_company_name
712,-,"[420, 928, 567, 946]",I-employer_company_name
713,S,"[420, 928, 567, 946]",I-employer_company_name
714,##OL,"[420, 928, 567, 946]",I-employer_company_name
715,##UT,"[420, 928, 567, 946]",I-employer_company_name
716,##ION,"[420, 928, 567, 946]",I-employer_company_name
717,##S,"[420, 928, 567, 946]",I-employer_company_name
718,-,"[568, 928, 570, 946]",MISC
719,NL,"[568, 928, 570, 946]",MISC
720,-,"[568, 928, 570, 946]",MISC
721,17,"[694, 928, 750, 946]",MISC
722,/,"[694, 928, 750, 946]",MISC
723,06,"[694, 928, 750, 946]",MISC
724,/,"[752, 928, 809, 946]",MISC
725,2001,"[752, 928, 809, 946]",MISC
726,to,"[810, 928, 833, 946]",MISC
727,15,"[834, 928, 857, 946]",MISC
728,/,"[857, 928, 949, 946]",MISC
729,03,"[857, 928, 949, 946]",MISC
730,/,"[857, 928, 949, 946]",MISC
731,2011,"[857, 928, 949, 946]",MISC
732,-,"[950, 928, 952, 946]",MISC
733,NL,"[950, 928, 952, 946]",MISC
734,-,"[950, 928, 952, 946]",MISC
735,Computer,"[111, 964, 201, 981]",MISC
736,maintenance,"[201, 964, 325, 981]",MISC
737,work,"[326, 964, 382, 981]",MISC
738,.,"[326, 964, 382, 981]",MISC
739,-,"[382, 964, 393, 981]",MISC
740,Educational,"[394, 964, 517, 981]",MISC
741,support,"[518, 964, 596, 981]",MISC
742,in,"[597, 964, 618, 981]",MISC
743,coaching,"[620, 964, 710, 981]",MISC
744,and,"[710, 964, 744, 981]",MISC
745,computer,"[744, 964, 834, 981]",MISC
746,training,"[835, 964, 925, 981]",MISC
747,on,"[925, 964, 946, 981]",MISC
748,the,"[948, 964, 981, 981]",MISC
749,-,"[982, 964, 984, 981]",MISC
750,NL,"[982, 964, 984, 981]",MISC
751,-,"[982, 964, 984, 981]",MISC
752,use,"[111, 983, 144, 1000]",MISC
753,of,"[144, 983, 166, 1000]",MISC
754,new,"[167, 983, 200, 1000]",MISC
755,technologies,"[200, 983, 335, 1000]",MISC
756,to,"[335, 983, 356, 1000]",MISC
757,standard,"[357, 983, 479, 1000]",MISC
758,##ize,"[357, 983, 479, 1000]",MISC
759,and,"[480, 983, 514, 1000]",MISC
760,improve,"[514, 983, 592, 1000]",MISC
761,the,"[592, 983, 626, 1000]",MISC
762,level,"[626, 983, 681, 1000]",MISC
763,of,"[682, 983, 703, 1000]",MISC
764,users,"[704, 983, 772, 1000]",MISC
765,.,"[704, 983, 772, 1000]",MISC
766,-,"[772, 983, 773, 1000]",MISC
767,NL,"[772, 983, 773, 1000]",MISC
768,-,"[772, 983, 773, 1000]",MISC
769,English,"[49, 48, 127, 65]",MISC
770,Professor,"[127, 48, 236, 65]",MISC
771,-,"[127, 48, 236, 65]",MISC
772,-,"[238, 48, 240, 65]",MISC
773,NL,"[238, 48, 240, 65]",MISC
774,-,"[238, 48, 240, 65]",MISC
775,E,"[300, 48, 358, 65]",MISC
776,##co,"[300, 48, 358, 65]",MISC
777,##le,"[300, 48, 358, 65]",MISC
778,Fr,"[359, 48, 465, 65]",MISC
779,##an,"[359, 48, 465, 65]",MISC
780,##ca,"[359, 48, 465, 65]",MISC
781,##ise,"[359, 48, 465, 65]",MISC
782,de,"[466, 48, 489, 65]",MISC
783,Ban,"[490, 48, 561, 65]",MISC
784,##ju,"[490, 48, 561, 65]",MISC
785,##l,"[490, 48, 561, 65]",MISC
786,-,"[561, 48, 563, 65]",MISC
787,NL,"[561, 48, 563, 65]",MISC
788,-,"[561, 48, 563, 65]",MISC
789,Jan,"[613, 48, 689, 65]",MISC
790,##vier,"[613, 48, 689, 65]",MISC
791,a,"[690, 48, 701, 65]",MISC
792,Ju,"[701, 48, 777, 65]",MISC
793,##ille,"[701, 48, 777, 65]",MISC
794,##t,"[701, 48, 777, 65]",MISC
795,1997,"[779, 48, 823, 65]",MISC
796,-,"[823, 48, 825, 65]",MISC
797,NL,"[823, 48, 825, 65]",MISC
798,-,"[823, 48, 825, 65]",MISC
799,Head,"[54, 65, 97, 83]",MISC
800,of,"[98, 65, 119, 83]",MISC
801,Primary,"[120, 65, 196, 83]",MISC
802,Course,"[197, 65, 263, 83]",MISC
803,Training,"[263, 65, 350, 83]",MISC
804,for,"[351, 65, 383, 83]",MISC
805,providing,"[384, 65, 481, 83]",MISC
806,English,"[483, 65, 559, 83]",MISC
807,courses,"[560, 65, 636, 83]",MISC
808,to,"[637, 65, 658, 83]",MISC
809,primary,"[659, 65, 735, 83]",MISC
810,school,"[736, 65, 801, 83]",MISC
811,students,"[802, 65, 899, 83]",MISC
812,.,"[802, 65, 899, 83]",MISC
813,-,"[901, 65, 902, 83]",MISC
814,NL,"[901, 65, 902, 83]",MISC
815,-,"[901, 65, 902, 83]",MISC
816,F,"[49, 138, 190, 154]",MISC
817,##OR,"[49, 138, 190, 154]",MISC
818,##MA,"[49, 138, 190, 154]",MISC
819,##TI,"[49, 138, 190, 154]",MISC
820,##ON,"[49, 138, 190, 154]",MISC
821,##S,"[49, 138, 190, 154]",MISC
822,:,"[190, 138, 204, 154]",MISC
823,-,"[204, 138, 206, 154]",MISC
824,NL,"[204, 138, 206, 154]",MISC
825,-,"[204, 138, 206, 154]",MISC
826,Institutions,"[127, 174, 325, 191]",MISC
827,-,"[325, 174, 341, 191]",MISC
828,Period,"[341, 174, 472, 191]",MISC
829,##es,"[341, 174, 472, 191]",MISC
830,-,"[473, 174, 489, 191]",MISC
831,Di,"[490, 174, 620, 191]",MISC
832,##p,"[490, 174, 620, 191]",MISC
833,##lo,"[490, 174, 620, 191]",MISC
834,##mes,"[490, 174, 620, 191]",MISC
835,-,"[622, 174, 638, 191]",MISC
836,Disc,"[638, 174, 818, 191]",MISC
837,##ip,"[638, 174, 818, 191]",MISC
838,##lines,"[638, 174, 818, 191]",MISC
839,et,"[820, 174, 951, 191]",MISC
840,##udi,"[820, 174, 951, 191]",MISC
841,##ees,"[820, 174, 951, 191]",MISC
842,-,"[952, 174, 954, 191]",MISC
843,NL,"[952, 174, 954, 191]",MISC
844,-,"[952, 174, 954, 191]",MISC
845,C,"[49, 195, 120, 231]",MISC
846,.,"[49, 195, 120, 231]",MISC
847,M,"[49, 195, 120, 231]",MISC
848,.,"[49, 195, 120, 231]",MISC
849,A,"[49, 195, 120, 231]",MISC
850,Paris,"[120, 195, 191, 231]",MISC
851,-,"[191, 195, 205, 231]",MISC
852,2018,"[205, 195, 332, 231]",MISC
853,-,"[205, 195, 332, 231]",MISC
854,2019,"[205, 195, 332, 231]",MISC
855,Certificate,"[333, 195, 488, 231]",MISC
856,-,"[489, 195, 503, 231]",MISC
857,Sage,"[503, 195, 560, 231]",MISC
858,Sa,"[560, 195, 645, 231]",MISC
859,##ari,"[560, 195, 645, 231]",MISC
860,",","[560, 195, 645, 231]",MISC
861,Pay,"[645, 195, 744, 231]",MISC
862,##roll,"[645, 195, 744, 231]",MISC
863,Management,"[744, 195, 886, 231]",MISC
864,-,"[886, 195, 888, 231]",MISC
865,NL,"[886, 195, 888, 231]",MISC
866,-,"[886, 195, 888, 231]",MISC
867,Institute,"[49, 250, 118, 303]",B-education_institute
868,of,"[119, 250, 133, 303]",I-education_institute
869,V,"[135, 250, 213, 303]",I-education_institute
870,##oc,"[135, 250, 213, 303]",I-education_institute
871,##ational,"[135, 250, 213, 303]",I-education_institute
872,Training,"[213, 250, 275, 303]",I-education_institute
873,(,"[275, 250, 328, 303]",I-education_institute
874,I,"[275, 250, 328, 303]",I-education_institute
875,.,"[275, 250, 328, 303]",I-education_institute
876,F,"[275, 250, 328, 303]",I-education_institute
877,.,"[275, 250, 328, 303]",I-education_institute
878,P,"[275, 250, 328, 303]",I-education_institute
879,.,"[275, 250, 328, 303]",I-education_institute
880,Da,"[330, 250, 376, 303]",I-education_institute
881,##kar,"[330, 250, 376, 303]",I-education_institute
882,),"[330, 250, 376, 303]",I-education_institute
883,-,"[377, 250, 384, 303]",MISC
884,University,"[385, 250, 462, 303]",MISC
885,Diploma,"[463, 250, 516, 303]",MISC
886,of,"[517, 250, 532, 303]",MISC
887,1993,"[533, 250, 602, 303]",MISC
888,-,"[533, 250, 602, 303]",MISC
889,1998,"[533, 250, 602, 303]",MISC
890,Engineering,"[603, 250, 688, 303]",MISC
891,-,"[689, 250, 696, 303]",MISC
892,Network,"[697, 250, 750, 303]",B-education_course
893,and,"[752, 250, 775, 303]",I-education_course
894,Computer,"[775, 250, 837, 303]",I-education_course
895,Maintenance,"[838, 250, 922, 303]",I-education_course
896,-,"[924, 250, 925, 303]",MISC
897,NL,"[924, 250, 925, 303]",MISC
898,-,"[924, 250, 925, 303]",MISC
899,Polytechnic,"[49, 313, 148, 341]",B-education_institute
900,of,"[149, 313, 167, 341]",I-education_institute
901,B,"[167, 313, 275, 341]",I-education_institute
902,##irn,"[167, 313, 275, 341]",I-education_institute
903,##in,"[167, 313, 275, 341]",I-education_institute
904,-,"[167, 313, 275, 341]",I-education_institute
905,Ke,"[167, 313, 275, 341]",I-education_institute
906,##bb,"[167, 313, 275, 341]",I-education_institute
907,##i,"[167, 313, 275, 341]",I-education_institute
908,-,"[277, 313, 285, 341]",MISC
909,1990,"[286, 313, 367, 341]",MISC
910,-,"[286, 313, 367, 341]",MISC
911,1993,"[286, 313, 367, 341]",MISC
912,Higher,"[368, 313, 421, 341]",B-education_degree
913,National,"[422, 313, 495, 341]",I-education_degree
914,Diploma,"[495, 313, 559, 341]",I-education_degree
915,-,"[559, 313, 568, 341]",MISC
916,Accounting,"[568, 313, 658, 341]",B-education_course
917,and,"[659, 313, 685, 341]",I-education_course
918,Financial,"[686, 313, 768, 341]",I-education_course
919,Management,"[768, 313, 858, 341]",I-education_course
920,in,"[859, 313, 877, 341]",I-education_course
921,English,"[877, 313, 941, 341]",I-education_course
922,-,"[941, 313, 943, 341]",MISC
923,NL,"[941, 313, 943, 341]",MISC
924,-,"[941, 313, 943, 341]",MISC
925,So,"[49, 351, 118, 377]",B-education_institute
926,##koto,"[49, 351, 118, 377]",I-education_institute
927,Un,"[119, 351, 233, 377]",I-education_institute
928,##ivers,"[119, 351, 233, 377]",I-education_institute
929,##ite,"[119, 351, 233, 377]",I-education_institute
930,-,"[235, 351, 245, 377]",MISC
931,1990,"[246, 351, 292, 377]",MISC
932,-,"[293, 351, 303, 377]",MISC
933,English,"[304, 351, 384, 377]",B-education_degree
934,la,"[385, 351, 465, 377]",I-education_degree
935,##nga,"[385, 351, 465, 377]",I-education_degree
936,##ge,"[385, 351, 465, 377]",I-education_degree
937,certificate,"[467, 351, 594, 377]",I-education_degree
938,-,"[594, 351, 605, 377]",MISC
939,L,"[606, 351, 616, 377]",MISC
940,Basic,"[617, 351, 674, 377]",B-education_course
941,language,"[675, 351, 767, 377]",I-education_course
942,study,"[768, 351, 825, 377]",I-education_course
943,of,"[826, 351, 849, 377]",I-education_course
944,English,"[849, 351, 929, 377]",I-education_course
945,-,"[931, 351, 932, 377]",MISC
946,NL,"[931, 351, 932, 377]",MISC
947,-,"[931, 351, 932, 377]",MISC
948,L,"[49, 388, 144, 414]",B-education_institute
949,##y,"[49, 388, 144, 414]",I-education_institute
950,##ce,"[49, 388, 144, 414]",I-education_institute
951,##e,"[49, 388, 144, 414]",I-education_institute
952,Ko,"[145, 388, 279, 414]",I-education_institute
953,##rom,"[145, 388, 279, 414]",I-education_institute
954,##be,"[145, 388, 279, 414]",I-education_institute
955,-,"[280, 388, 297, 414]",MISC
956,1989,"[299, 388, 375, 414]",MISC
957,-,"[376, 388, 393, 414]",MISC
958,BA,"[395, 388, 451, 414]",B-education_degree
959,##C,"[395, 388, 451, 414]",I-education_degree
960,-,"[453, 388, 470, 414]",MISC
961,Higher,"[472, 388, 587, 414]",B-education_course
962,level,"[587, 388, 682, 414]",I-education_course
963,general,"[683, 388, 817, 414]",I-education_course
964,education,"[818, 388, 989, 414]",I-education_course
965,-,"[991, 388, 992, 414]",MISC
966,NL,"[991, 388, 992, 414]",MISC
967,-,"[991, 388, 992, 414]",MISC
