,token,box,label
0,E,"[77, 69, 136, 86]",B-name
1,##kata,"[77, 69, 136, 86]",I-name
2,Mi,"[137, 69, 196, 86]",I-name
3,##tra,"[137, 69, 196, 86]",I-name
4,-,"[197, 69, 199, 86]",MISC
5,NL,"[197, 69, 199, 86]",MISC
6,-,"[197, 69, 199, 86]",MISC
7,Mobile,"[77, 84, 153, 100]",MISC
8,No,"[154, 84, 190, 100]",MISC
9,-,"[154, 84, 190, 100]",MISC
10,+,"[192, 84, 369, 100]",B-phones_phone
11,91,"[192, 84, 369, 100]",I-phones_phone
12,-,"[192, 84, 369, 100]",I-phones_phone
13,98,"[192, 84, 369, 100]",I-phones_phone
14,##7,"[192, 84, 369, 100]",I-phones_phone
15,##46,"[192, 84, 369, 100]",I-phones_phone
16,##0,"[192, 84, 369, 100]",I-phones_phone
17,##6,"[192, 84, 369, 100]",I-phones_phone
18,##21,"[192, 84, 369, 100]",I-phones_phone
19,##9,"[192, 84, 369, 100]",I-phones_phone
20,-,"[370, 84, 372, 100]",MISC
21,NL,"[370, 84, 372, 100]",MISC
22,-,"[370, 84, 372, 100]",MISC
23,Em,"[77, 117, 136, 131]",MISC
24,##ail,"[77, 117, 136, 131]",MISC
25,id,"[137, 117, 172, 131]",MISC
26,:,"[137, 117, 172, 131]",MISC
27,e,"[172, 117, 482, 131]",B-emails_email
28,##kata,"[172, 117, 482, 131]",I-emails_email
29,.,"[172, 117, 482, 131]",I-emails_email
30,ni,"[172, 117, 482, 131]",I-emails_email
31,##t,"[172, 117, 482, 131]",I-emails_email
32,##d,"[172, 117, 482, 131]",I-emails_email
33,##g,"[172, 117, 482, 131]",I-emails_email
34,##p,"[172, 117, 482, 131]",I-emails_email
35,##20,"[172, 117, 482, 131]",I-emails_email
36,##15,"[172, 117, 482, 131]",I-emails_email
37,@,"[172, 117, 482, 131]",I-emails_email
38,g,"[172, 117, 482, 131]",I-emails_email
39,##mail,"[172, 117, 482, 131]",I-emails_email
40,.,"[172, 117, 482, 131]",I-emails_email
41,com,"[172, 117, 482, 131]",I-emails_email
42,-,"[483, 117, 485, 131]",MISC
43,NL,"[483, 117, 485, 131]",MISC
44,-,"[483, 117, 485, 131]",MISC
45,O,"[77, 188, 193, 203]",B-summary_heading
46,##B,"[77, 188, 193, 203]",I-summary_heading
47,##J,"[77, 188, 193, 203]",I-summary_heading
48,##EC,"[77, 188, 193, 203]",I-summary_heading
49,##TI,"[77, 188, 193, 203]",I-summary_heading
50,##VE,"[77, 188, 193, 203]",I-summary_heading
51,:,"[77, 188, 193, 203]",I-summary_heading
52,-,"[193, 188, 195, 203]",MISC
53,NL,"[193, 188, 195, 203]",MISC
54,-,"[193, 188, 195, 203]",MISC
55,To,"[77, 216, 101, 232]",MISC
56,be,"[102, 216, 126, 232]",MISC
57,an,"[127, 216, 151, 232]",MISC
58,active,"[151, 216, 225, 232]",MISC
59,player,"[226, 216, 300, 232]",MISC
60,in,"[300, 216, 324, 232]",MISC
61,the,"[325, 216, 362, 232]",MISC
62,IT,"[363, 216, 387, 232]",MISC
63,field,"[387, 216, 448, 232]",MISC
64,where,"[449, 216, 510, 232]",MISC
65,I,"[512, 216, 523, 232]",MISC
66,can,"[524, 216, 561, 232]",MISC
67,pro,"[561, 216, 698, 232]",MISC
68,##active,"[561, 216, 698, 232]",MISC
69,##ly,"[561, 216, 698, 232]",MISC
70,contribute,"[698, 216, 821, 232]",MISC
71,my,"[822, 216, 846, 232]",MISC
72,knowledge,"[847, 216, 958, 232]",MISC
73,and,"[959, 216, 995, 232]",MISC
74,-,"[996, 216, 998, 232]",MISC
75,NL,"[996, 216, 998, 232]",MISC
76,-,"[996, 216, 998, 232]",MISC
77,expertise,"[77, 231, 186, 247]",MISC
78,in,"[186, 231, 210, 247]",MISC
79,order,"[210, 231, 269, 247]",MISC
80,to,"[271, 231, 295, 247]",MISC
81,meet,"[295, 231, 343, 247]",MISC
82,the,"[343, 231, 379, 247]",MISC
83,demands,"[380, 231, 463, 247]",MISC
84,of,"[465, 231, 489, 247]",MISC
85,my,"[489, 231, 513, 247]",MISC
86,professional,"[513, 231, 657, 247]",MISC
87,associates,"[658, 231, 778, 247]",MISC
88,namely,"[780, 231, 863, 247]",MISC
89,",","[780, 231, 863, 247]",MISC
90,my,"[864, 231, 888, 247]",MISC
91,employer,"[889, 231, 997, 247]",MISC
92,",","[889, 231, 997, 247]",MISC
93,-,"[998, 231, 1000, 247]",MISC
94,NL,"[998, 231, 1000, 247]",MISC
95,-,"[998, 231, 1000, 247]",MISC
96,customer,"[77, 247, 166, 262]",MISC
97,(,"[166, 247, 265, 262]",MISC
98,external,"[166, 247, 265, 262]",MISC
99,as,"[266, 247, 288, 262]",MISC
100,well,"[288, 247, 332, 262]",MISC
101,as,"[332, 247, 354, 262]",MISC
102,internal,"[354, 247, 465, 262]",MISC
103,),"[354, 247, 465, 262]",MISC
104,",","[354, 247, 465, 262]",MISC
105,and,"[465, 247, 498, 262]",MISC
106,colleagues,"[498, 247, 620, 262]",MISC
107,",","[498, 247, 620, 262]",MISC
108,and,"[621, 247, 654, 262]",MISC
109,to,"[654, 247, 676, 262]",MISC
110,continuously,"[676, 247, 809, 262]",MISC
111,learn,"[809, 247, 864, 262]",MISC
112,and,"[865, 247, 898, 262]",MISC
113,value,"[898, 247, 997, 262]",MISC
114,-,"[898, 247, 997, 262]",MISC
115,add,"[898, 247, 997, 262]",MISC
116,-,"[998, 247, 1000, 262]",MISC
117,NL,"[998, 247, 1000, 262]",MISC
118,-,"[998, 247, 1000, 262]",MISC
119,my,"[77, 262, 101, 278]",MISC
120,professional,"[102, 262, 247, 278]",MISC
121,skill,"[249, 262, 358, 278]",MISC
122,-,"[249, 262, 358, 278]",MISC
123,set,"[249, 262, 358, 278]",MISC
124,to,"[359, 262, 394, 278]",MISC
125,",","[359, 262, 394, 278]",MISC
126,further,"[396, 262, 542, 278]",MISC
127,##more,"[396, 262, 542, 278]",MISC
128,",","[396, 262, 542, 278]",MISC
129,meet,"[543, 262, 591, 278]",MISC
130,the,"[593, 262, 628, 278]",MISC
131,changing,"[629, 262, 727, 278]",MISC
132,demands,"[728, 262, 812, 278]",MISC
133,from,"[814, 262, 861, 278]",MISC
134,me,"[863, 262, 887, 278]",MISC
135,in,"[887, 262, 911, 278]",MISC
136,an,"[912, 262, 936, 278]",MISC
137,ever,"[936, 262, 997, 278]",MISC
138,-,"[936, 262, 997, 278]",MISC
139,-,"[998, 262, 1000, 278]",MISC
140,NL,"[998, 262, 1000, 278]",MISC
141,-,"[998, 262, 1000, 278]",MISC
142,changing,"[77, 277, 162, 293]",MISC
143,business,"[163, 277, 248, 293]",MISC
144,environment,"[249, 277, 376, 293]",MISC
145,.,"[249, 277, 376, 293]",MISC
146,-,"[378, 277, 380, 293]",MISC
147,NL,"[378, 277, 380, 293]",MISC
148,-,"[378, 277, 380, 293]",MISC
149,E,"[77, 321, 215, 337]",B-work_experience_heading
150,##MP,"[77, 321, 215, 337]",I-work_experience_heading
151,##L,"[77, 321, 215, 337]",I-work_experience_heading
152,##O,"[77, 321, 215, 337]",I-work_experience_heading
153,##Y,"[77, 321, 215, 337]",I-work_experience_heading
154,##ME,"[77, 321, 215, 337]",I-work_experience_heading
155,##NT,"[77, 321, 215, 337]",I-work_experience_heading
156,H,"[215, 321, 326, 337]",I-work_experience_heading
157,##IS,"[215, 321, 326, 337]",I-work_experience_heading
158,##TO,"[215, 321, 326, 337]",I-work_experience_heading
159,##R,"[215, 321, 326, 337]",I-work_experience_heading
160,##Y,"[215, 321, 326, 337]",I-work_experience_heading
161,:,"[215, 321, 326, 337]",I-work_experience_heading
162,-,"[326, 321, 328, 337]",MISC
163,NL,"[326, 321, 328, 337]",MISC
164,-,"[326, 321, 328, 337]",MISC
165,Company,"[86, 368, 193, 383]",MISC
166,-,"[195, 368, 210, 383]",MISC
167,Po,"[211, 368, 535, 383]",MISC
168,##si,"[211, 368, 535, 383]",MISC
169,##tion,"[211, 368, 535, 383]",MISC
170,/,"[211, 368, 535, 383]",MISC
171,Design,"[211, 368, 535, 383]",MISC
172,##ation,"[211, 368, 535, 383]",MISC
173,:,"[211, 368, 535, 383]",MISC
174,-,"[537, 368, 552, 383]",MISC
175,Date,"[552, 368, 613, 383]",MISC
176,of,"[614, 368, 644, 383]",MISC
177,Jo,"[646, 368, 753, 383]",MISC
178,##ining,"[646, 368, 753, 383]",MISC
179,-,"[754, 368, 769, 383]",MISC
180,Date,"[770, 368, 831, 383]",MISC
181,of,"[832, 368, 862, 383]",MISC
182,Leaving,"[863, 368, 970, 383]",MISC
183,-,"[972, 368, 974, 383]",MISC
184,NL,"[972, 368, 974, 383]",MISC
185,-,"[972, 368, 974, 383]",MISC
186,Co,"[86, 393, 188, 407]",B-employer_company_name
187,##gni,"[86, 393, 188, 407]",I-employer_company_name
188,##zan,"[86, 393, 188, 407]",I-employer_company_name
189,##t,"[86, 393, 188, 407]",I-employer_company_name
190,Technology,"[188, 393, 301, 407]",I-employer_company_name
191,Solutions,"[302, 393, 414, 407]",I-employer_company_name
192,",","[302, 393, 414, 407]",MISC
193,India,"[415, 393, 471, 407]",MISC
194,-,"[472, 393, 483, 407]",MISC
195,Consul,"[484, 393, 596, 407]",B-employer_role
196,##tant,"[484, 393, 596, 407]",I-employer_role
197,-,"[597, 393, 608, 407]",MISC
198,28th,"[608, 393, 653, 407]",MISC
199,October,"[654, 393, 789, 407]",MISC
200,",","[654, 393, 789, 407]",MISC
201,2011,"[654, 393, 789, 407]",MISC
202,-,"[790, 393, 801, 407]",MISC
203,14th,"[802, 393, 846, 407]",MISC
204,August,"[847, 393, 926, 407]",MISC
205,",","[847, 393, 926, 407]",MISC
206,2015,"[926, 393, 971, 407]",MISC
207,-,"[972, 393, 974, 407]",MISC
208,NL,"[972, 393, 974, 407]",MISC
209,-,"[972, 393, 974, 407]",MISC
210,Experience,"[77, 473, 206, 489]",MISC
211,:,"[77, 473, 206, 489]",MISC
212,46,"[207, 473, 301, 489]",MISC
213,##mont,"[207, 473, 301, 489]",MISC
214,##hs,"[207, 473, 301, 489]",MISC
215,-,"[302, 473, 304, 489]",MISC
216,NL,"[302, 473, 304, 489]",MISC
217,-,"[302, 473, 304, 489]",MISC
218,PR,"[77, 520, 164, 537]",MISC
219,##O,"[77, 520, 164, 537]",MISC
220,##J,"[77, 520, 164, 537]",MISC
221,##EC,"[77, 520, 164, 537]",MISC
222,##T,"[77, 520, 164, 537]",MISC
223,DE,"[165, 520, 264, 537]",MISC
224,##TA,"[165, 520, 264, 537]",MISC
225,##IL,"[165, 520, 264, 537]",MISC
226,##S,"[165, 520, 264, 537]",MISC
227,:,"[165, 520, 264, 537]",MISC
228,-,"[265, 520, 267, 537]",MISC
229,NL,"[265, 520, 267, 537]",MISC
230,-,"[265, 520, 267, 537]",MISC
231,Project,"[83, 551, 166, 567]",MISC
232,#,"[167, 551, 191, 567]",MISC
233,1,"[167, 551, 191, 567]",MISC
234,-,"[191, 551, 193, 567]",MISC
235,NL,"[191, 551, 193, 567]",MISC
236,-,"[191, 551, 193, 567]",MISC
237,C,"[77, 572, 162, 589]",MISC
238,##lient,"[77, 572, 162, 589]",MISC
239,:,"[77, 572, 162, 589]",MISC
240,Leading,"[162, 572, 247, 589]",MISC
241,Insurance,"[247, 572, 356, 589]",MISC
242,Pro,"[357, 572, 466, 589]",MISC
243,##vide,"[357, 572, 466, 589]",MISC
244,##r,"[357, 572, 466, 589]",MISC
245,",","[357, 572, 466, 589]",MISC
246,USA,"[467, 572, 502, 589]",MISC
247,-,"[503, 572, 505, 589]",MISC
248,NL,"[503, 572, 505, 589]",MISC
249,-,"[503, 572, 505, 589]",MISC
250,Du,"[136, 606, 249, 624]",MISC
251,##ration,"[136, 606, 249, 624]",MISC
252,:,"[136, 606, 249, 624]",MISC
253,January,"[249, 606, 349, 624]",MISC
254,",","[249, 606, 349, 624]",MISC
255,2015,"[349, 606, 399, 624]",MISC
256,–,"[400, 606, 411, 624]",MISC
257,Till,"[412, 606, 462, 624]",MISC
258,Date,"[462, 606, 512, 624]",MISC
259,-,"[512, 606, 514, 624]",MISC
260,NL,"[512, 606, 514, 624]",MISC
261,-,"[512, 606, 514, 624]",MISC
262,BP,"[140, 641, 180, 658]",MISC
263,##M,"[140, 641, 180, 658]",MISC
264,Suite,"[181, 641, 264, 658]",MISC
265,:,"[181, 641, 264, 658]",MISC
266,PR,"[265, 641, 320, 658]",MISC
267,##PC,"[265, 641, 320, 658]",MISC
268,v,"[320, 641, 376, 658]",MISC
269,##6,"[320, 641, 376, 658]",MISC
270,.,"[320, 641, 376, 658]",MISC
271,2,"[320, 641, 376, 658]",MISC
272,-,"[376, 641, 378, 658]",MISC
273,NL,"[376, 641, 378, 658]",MISC
274,-,"[376, 641, 378, 658]",MISC
275,Project,"[136, 675, 225, 693]",MISC
276,:,"[136, 675, 225, 693]",MISC
277,P,"[225, 675, 336, 693]",MISC
278,##rud,"[225, 675, 336, 693]",MISC
279,##ential,"[225, 675, 336, 693]",MISC
280,-,"[337, 675, 339, 693]",MISC
281,NL,"[337, 675, 339, 693]",MISC
282,-,"[337, 675, 339, 693]",MISC
283,This,"[136, 693, 182, 710]",MISC
284,project,"[184, 693, 267, 710]",MISC
285,involves,"[267, 693, 361, 710]",MISC
286,creating,"[362, 693, 456, 710]",MISC
287,an,"[456, 693, 479, 710]",MISC
288,internal,"[480, 693, 574, 710]",MISC
289,work,"[575, 693, 669, 710]",MISC
290,##flow,"[575, 693, 669, 710]",MISC
291,for,"[670, 693, 705, 710]",MISC
292,the,"[706, 693, 741, 710]",MISC
293,Field,"[741, 693, 800, 710]",MISC
294,Engineers,"[801, 693, 906, 710]",MISC
295,to,"[907, 693, 930, 710]",MISC
296,-,"[931, 693, 933, 710]",MISC
297,NL,"[931, 693, 933, 710]",MISC
298,-,"[931, 693, 933, 710]",MISC
299,create,"[136, 710, 210, 728]",MISC
300,a,"[211, 710, 311, 728]",MISC
301,##field,"[211, 710, 311, 728]",MISC
302,’,"[211, 710, 311, 728]",MISC
303,s,"[211, 710, 311, 728]",MISC
304,survey,"[311, 710, 385, 728]",MISC
305,assignment,"[386, 710, 509, 728]",MISC
306,which,"[510, 710, 571, 728]",MISC
307,would,"[573, 710, 634, 728]",MISC
308,from,"[635, 710, 685, 728]",MISC
309,Engineer,"[685, 710, 785, 728]",MISC
310,to,"[785, 710, 809, 728]",MISC
311,Under,"[810, 710, 947, 728]",MISC
312,##writer,"[810, 710, 947, 728]",MISC
313,and,"[947, 710, 984, 728]",MISC
314,-,"[985, 710, 987, 728]",MISC
315,NL,"[985, 710, 987, 728]",MISC
316,-,"[985, 710, 987, 728]",MISC
317,Review,"[136, 728, 234, 745]",MISC
318,##er,"[136, 728, 234, 745]",MISC
319,to,"[235, 728, 258, 745]",MISC
320,help,"[259, 728, 307, 745]",MISC
321,replace,"[308, 728, 393, 745]",MISC
322,the,"[395, 728, 431, 745]",MISC
323,manual,"[431, 728, 505, 745]",MISC
324,process,"[505, 728, 590, 745]",MISC
325,of,"[591, 728, 615, 745]",MISC
326,creating,"[616, 728, 714, 745]",MISC
327,reports,"[715, 728, 799, 745]",MISC
328,and,"[801, 728, 838, 745]",MISC
329,thus,"[838, 728, 886, 745]",MISC
330,fast,"[887, 728, 998, 745]",MISC
331,##ening,"[887, 728, 998, 745]",MISC
332,-,"[998, 728, 1000, 745]",MISC
333,NL,"[998, 728, 1000, 745]",MISC
334,-,"[998, 728, 1000, 745]",MISC
335,and,"[136, 745, 171, 761]",MISC
336,smooth,"[173, 745, 305, 761]",MISC
337,##ening,"[173, 745, 305, 761]",MISC
338,the,"[306, 745, 341, 761]",MISC
339,process,"[343, 745, 439, 761]",MISC
340,.,"[343, 745, 439, 761]",MISC
341,It,"[440, 745, 464, 761]",MISC
342,involves,"[465, 745, 560, 761]",MISC
343,up,"[562, 745, 671, 761]",MISC
344,##loading,"[562, 745, 671, 761]",MISC
345,do,"[671, 745, 841, 761]",MISC
346,##cs,"[671, 745, 841, 761]",MISC
347,/,"[671, 745, 841, 761]",MISC
348,snaps,"[671, 745, 841, 761]",MISC
349,##hot,"[671, 745, 841, 761]",MISC
350,##s,"[671, 745, 841, 761]",MISC
351,of,"[842, 745, 866, 761]",MISC
352,the,"[866, 745, 901, 761]",MISC
353,survey,"[903, 745, 974, 761]",MISC
354,-,"[976, 745, 977, 761]",MISC
355,NL,"[976, 745, 977, 761]",MISC
356,-,"[976, 745, 977, 761]",MISC
357,area,"[136, 761, 184, 779]",MISC
358,to,"[184, 761, 208, 779]",MISC
359,be,"[209, 761, 233, 779]",MISC
360,ins,"[233, 761, 316, 779]",MISC
361,##ured,"[233, 761, 316, 779]",MISC
362,and,"[318, 761, 353, 779]",MISC
363,generating,"[354, 761, 474, 779]",MISC
364,reports,"[475, 761, 558, 779]",MISC
365,for,"[560, 761, 595, 779]",MISC
366,accounts,"[596, 761, 692, 779]",MISC
367,in,"[693, 761, 717, 779]",MISC
368,a,"[717, 761, 729, 779]",MISC
369,particular,"[730, 761, 849, 779]",MISC
370,location,"[851, 761, 947, 779]",MISC
371,or,"[948, 761, 972, 779]",MISC
372,-,"[972, 761, 974, 779]",MISC
373,NL,"[972, 761, 974, 779]",MISC
374,-,"[972, 761, 974, 779]",MISC
375,across,"[136, 779, 199, 796]",MISC
376,",","[200, 779, 296, 796]",MISC
377,multiple,"[200, 779, 296, 796]",MISC
378,locations,"[297, 779, 404, 796]",MISC
379,.,"[297, 779, 404, 796]",MISC
380,-,"[404, 779, 405, 796]",MISC
381,NL,"[404, 779, 405, 796]",MISC
382,-,"[404, 779, 405, 796]",MISC
383,Role,"[136, 831, 190, 850]",MISC
384,&,"[190, 831, 203, 850]",MISC
385,Re,"[204, 831, 432, 850]",MISC
386,##sp,"[204, 831, 432, 850]",MISC
387,##ons,"[204, 831, 432, 850]",MISC
388,##ibi,"[204, 831, 432, 850]",MISC
389,##lities,"[204, 831, 432, 850]",MISC
390,:,"[204, 831, 432, 850]",MISC
391,-,"[433, 831, 435, 850]",MISC
392,NL,"[433, 831, 435, 850]",MISC
393,-,"[433, 831, 435, 850]",MISC
394,•,"[208, 869, 221, 886]",MISC
395,Pre,"[221, 869, 365, 886]",MISC
396,##par,"[221, 869, 365, 886]",MISC
397,##ation,"[221, 869, 365, 886]",MISC
398,of,"[366, 869, 392, 886]",MISC
399,the,"[392, 869, 431, 886]",MISC
400,Design,"[431, 869, 509, 886]",MISC
401,Doc,"[510, 869, 628, 886]",MISC
402,##ume,"[510, 869, 628, 886]",MISC
403,##nts,"[510, 869, 628, 886]",MISC
404,-,"[629, 869, 630, 886]",MISC
405,NL,"[629, 869, 630, 886]",MISC
406,-,"[629, 869, 630, 886]",MISC
407,•,"[208, 886, 219, 903]",MISC
408,Following,"[220, 886, 331, 903]",MISC
409,the,"[332, 886, 369, 903]",MISC
410,PR,"[369, 886, 417, 903]",MISC
411,##PC,"[369, 886, 417, 903]",MISC
412,guard,"[419, 886, 542, 903]",MISC
413,##rail,"[419, 886, 542, 903]",MISC
414,##s,"[419, 886, 542, 903]",MISC
415,and,"[542, 886, 579, 903]",MISC
416,restrict,"[580, 886, 714, 903]",MISC
417,##ing,"[580, 886, 714, 903]",MISC
418,it,"[716, 886, 740, 903]",MISC
419,to,"[741, 886, 765, 903]",MISC
420,its,"[765, 886, 802, 903]",MISC
421,procedures,"[803, 886, 926, 903]",MISC
422,for,"[926, 886, 963, 903]",MISC
423,up,"[964, 886, 988, 903]",MISC
424,-,"[988, 886, 990, 903]",MISC
425,NL,"[988, 886, 990, 903]",MISC
426,-,"[988, 886, 990, 903]",MISC
427,g,"[241, 903, 357, 920]",MISC
428,##rada,"[241, 903, 357, 920]",MISC
429,##tions,"[241, 903, 357, 920]",MISC
430,.,"[241, 903, 357, 920]",MISC
431,-,"[357, 903, 359, 920]",MISC
432,NL,"[357, 903, 359, 920]",MISC
433,-,"[357, 903, 359, 920]",MISC
434,•,"[208, 920, 219, 938]",MISC
435,Making,"[221, 920, 294, 938]",MISC
436,the,"[296, 920, 333, 938]",MISC
437,U,"[334, 920, 358, 938]",MISC
438,##I,"[334, 920, 358, 938]",MISC
439,for,"[359, 920, 396, 938]",MISC
440,functioning,"[397, 920, 533, 938]",MISC
441,and,"[535, 920, 572, 938]",MISC
442,designing,"[573, 920, 685, 938]",MISC
443,the,"[686, 920, 723, 938]",MISC
444,front,"[724, 920, 786, 938]",MISC
445,end,"[787, 920, 823, 938]",MISC
446,application,"[824, 920, 961, 938]",MISC
447,-,"[963, 920, 964, 938]",MISC
448,NL,"[963, 920, 964, 938]",MISC
449,-,"[963, 920, 964, 938]",MISC
450,•,"[208, 938, 221, 955]",MISC
451,Unit,"[221, 938, 275, 955]",MISC
452,Testing,"[275, 938, 367, 955]",MISC
453,-,"[369, 938, 370, 955]",MISC
454,NL,"[369, 938, 370, 955]",MISC
455,-,"[369, 938, 370, 955]",MISC
456,•,"[208, 955, 221, 973]",MISC
457,Report,"[221, 955, 341, 973]",MISC
458,##ing,"[221, 955, 341, 973]",MISC
459,-,"[343, 955, 345, 973]",MISC
460,NL,"[343, 955, 345, 973]",MISC
461,-,"[343, 955, 345, 973]",MISC
462,C,"[77, 982, 190, 999]",B-others_heading
463,##ur,"[77, 982, 190, 999]",I-others_heading
464,##ric,"[77, 982, 190, 999]",I-others_heading
465,##ulum,"[77, 982, 190, 999]",I-others_heading
466,Vita,"[190, 982, 246, 999]",I-others_heading
467,##e,"[190, 982, 246, 999]",I-others_heading
468,-,"[247, 982, 249, 999]",MISC
469,NL,"[247, 982, 249, 999]",MISC
470,-,"[247, 982, 249, 999]",MISC
471,Project,"[77, 173, 160, 189]",MISC
472,#,"[160, 173, 182, 189]",MISC
473,2,"[160, 173, 182, 189]",MISC
474,-,"[184, 173, 186, 189]",MISC
475,NL,"[184, 173, 186, 189]",MISC
476,-,"[184, 173, 186, 189]",MISC
477,C,"[136, 207, 221, 224]",MISC
478,##lient,"[136, 207, 221, 224]",MISC
479,:,"[136, 207, 221, 224]",MISC
480,Leading,"[222, 207, 307, 224]",MISC
481,Banking,"[308, 207, 393, 224]",MISC
482,and,"[394, 207, 429, 224]",MISC
483,Insurance,"[430, 207, 539, 224]",MISC
484,Pro,"[541, 207, 649, 224]",MISC
485,##vide,"[541, 207, 649, 224]",MISC
486,##r,"[541, 207, 649, 224]",MISC
487,",","[541, 207, 649, 224]",MISC
488,Asia,"[651, 207, 699, 224]",MISC
489,Pacific,"[700, 207, 785, 224]",MISC
490,and,"[786, 207, 821, 224]",MISC
491,Europe,"[823, 207, 895, 224]",MISC
492,-,"[896, 207, 898, 224]",MISC
493,NL,"[896, 207, 898, 224]",MISC
494,-,"[896, 207, 898, 224]",MISC
495,Du,"[136, 240, 247, 258]",MISC
496,##ration,"[136, 240, 247, 258]",MISC
497,:,"[136, 240, 247, 258]",MISC
498,July,"[248, 240, 372, 258]",MISC
499,",","[248, 240, 372, 258]",MISC
500,2014,"[248, 240, 372, 258]",MISC
501,–,"[248, 240, 372, 258]",MISC
502,Till,"[373, 240, 423, 258]",MISC
503,December,"[423, 240, 523, 258]",MISC
504,2014,"[523, 240, 573, 258]",MISC
505,-,"[573, 240, 575, 258]",MISC
506,NL,"[573, 240, 575, 258]",MISC
507,-,"[573, 240, 575, 258]",MISC
508,BP,"[140, 275, 180, 293]",MISC
509,##M,"[140, 275, 180, 293]",MISC
510,Suite,"[181, 275, 264, 293]",MISC
511,:,"[181, 275, 264, 293]",MISC
512,PR,"[265, 275, 320, 293]",MISC
513,##PC,"[265, 275, 320, 293]",MISC
514,v,"[320, 275, 376, 293]",MISC
515,##6,"[320, 275, 376, 293]",MISC
516,.,"[320, 275, 376, 293]",MISC
517,2,"[320, 275, 376, 293]",MISC
518,-,"[376, 275, 378, 293]",MISC
519,NL,"[376, 275, 378, 293]",MISC
520,-,"[376, 275, 378, 293]",MISC
521,Project,"[136, 310, 232, 328]",MISC
522,:,"[136, 310, 232, 328]",MISC
523,A,"[234, 310, 269, 328]",MISC
524,##X,"[234, 310, 269, 328]",MISC
525,##A,"[234, 310, 269, 328]",MISC
526,Digital,"[270, 310, 355, 328]",MISC
527,-,"[356, 310, 357, 328]",MISC
528,NL,"[356, 310, 357, 328]",MISC
529,-,"[356, 310, 357, 328]",MISC
530,Was,"[77, 344, 114, 362]",MISC
531,a,"[115, 344, 126, 362]",MISC
532,part,"[127, 344, 177, 362]",MISC
533,of,"[177, 344, 201, 362]",MISC
534,up,"[202, 344, 315, 362]",MISC
535,##grading,"[202, 344, 315, 362]",MISC
536,the,"[315, 344, 352, 362]",MISC
537,application,"[353, 344, 489, 362]",MISC
538,from,"[491, 344, 540, 362]",MISC
539,5,"[541, 344, 578, 362]",MISC
540,.,"[541, 344, 578, 362]",MISC
541,5,"[541, 344, 578, 362]",MISC
542,to,"[578, 344, 602, 362]",MISC
543,6,"[603, 344, 640, 362]",MISC
544,.,"[603, 344, 640, 362]",MISC
545,2,"[603, 344, 640, 362]",MISC
546,version,"[641, 344, 728, 362]",MISC
547,.,"[729, 344, 779, 362]",MISC
548,Its,"[729, 344, 779, 362]",MISC
549,a,"[779, 344, 790, 362]",MISC
550,huge,"[792, 344, 841, 362]",MISC
551,feat,"[842, 344, 891, 362]",MISC
552,",","[892, 344, 929, 362]",MISC
553,of,"[892, 344, 929, 362]",MISC
554,-,"[929, 344, 931, 362]",MISC
555,NL,"[929, 344, 931, 362]",MISC
556,-,"[929, 344, 931, 362]",MISC
557,successfully,"[77, 364, 219, 382]",MISC
558,up,"[220, 364, 327, 382]",MISC
559,##grading,"[220, 364, 327, 382]",MISC
560,the,"[328, 364, 363, 382]",MISC
561,application,"[364, 364, 495, 382]",MISC
562,and,"[495, 364, 530, 382]",MISC
563,delivering,"[531, 364, 649, 382]",MISC
564,the,"[650, 364, 685, 382]",MISC
565,product,"[686, 364, 769, 382]",MISC
566,with,"[770, 364, 816, 382]",MISC
567,high,"[817, 364, 864, 382]",MISC
568,customer,"[865, 364, 959, 382]",MISC
569,-,"[961, 364, 963, 382]",MISC
570,NL,"[961, 364, 963, 382]",MISC
571,-,"[961, 364, 963, 382]",MISC
572,satisfaction,"[77, 384, 234, 402]",MISC
573,.,"[77, 384, 234, 402]",MISC
574,This,"[234, 384, 282, 402]",MISC
575,application,"[283, 384, 416, 402]",MISC
576,was,"[416, 384, 451, 402]",MISC
577,built,"[452, 384, 512, 402]",MISC
578,on,"[513, 384, 537, 402]",MISC
579,CP,"[537, 384, 572, 402]",MISC
580,##M,"[537, 384, 572, 402]",MISC
581,framework,"[574, 384, 682, 402]",MISC
582,as,"[683, 384, 707, 402]",MISC
583,it,"[707, 384, 731, 402]",MISC
584,mainly,"[731, 384, 803, 402]",MISC
585,dealt,"[804, 384, 863, 402]",MISC
586,with,"[864, 384, 912, 402]",MISC
587,-,"[913, 384, 915, 402]",MISC
588,NL,"[913, 384, 915, 402]",MISC
589,-,"[913, 384, 915, 402]",MISC
590,different,"[77, 403, 190, 421]",MISC
591,stages,"[190, 403, 263, 421]",MISC
592,of,"[265, 403, 289, 421]",MISC
593,banking,"[290, 403, 377, 421]",MISC
594,process,"[377, 403, 464, 421]",MISC
595,and,"[465, 403, 502, 421]",MISC
596,in,"[503, 403, 527, 421]",MISC
597,the,"[528, 403, 565, 421]",MISC
598,second,"[565, 403, 639, 421]",MISC
599,phase,"[640, 403, 701, 421]",MISC
600,we,"[703, 403, 727, 421]",MISC
601,automated,"[728, 403, 841, 421]",MISC
602,processes,"[841, 403, 953, 421]",MISC
603,-,"[953, 403, 955, 421]",MISC
604,NL,"[953, 403, 955, 421]",MISC
605,-,"[953, 403, 955, 421]",MISC
606,related,"[77, 423, 162, 441]",MISC
607,to,"[163, 423, 187, 441]",MISC
608,customer,"[188, 423, 286, 441]",MISC
609,service,"[286, 423, 371, 441]",MISC
610,and,"[373, 423, 409, 441]",MISC
611,insurance,"[410, 423, 520, 441]",MISC
612,system,"[520, 423, 594, 441]",MISC
613,of,"[594, 423, 618, 441]",MISC
614,the,"[619, 423, 656, 441]",MISC
615,said,"[656, 423, 704, 441]",MISC
616,companies,"[705, 423, 827, 441]",MISC
617,.,"[705, 423, 827, 441]",MISC
618,All,"[828, 423, 865, 441]",MISC
619,the,"[865, 423, 902, 441]",MISC
620,banking,"[902, 423, 987, 441]",MISC
621,-,"[988, 423, 990, 441]",MISC
622,NL,"[988, 423, 990, 441]",MISC
623,-,"[988, 423, 990, 441]",MISC
624,functionality,"[77, 444, 230, 461]",MISC
625,is,"[232, 444, 254, 461]",MISC
626,in,"[256, 444, 339, 461]",MISC
627,##voked,"[256, 444, 339, 461]",MISC
628,at,"[339, 444, 361, 461]",MISC
629,a,"[363, 444, 374, 461]",MISC
630,later,"[375, 444, 434, 461]",MISC
631,stage,"[434, 444, 493, 461]",MISC
632,and,"[494, 444, 529, 461]",MISC
633,inter,"[530, 444, 683, 461]",MISC
634,##rel,"[530, 444, 683, 461]",MISC
635,##ation,"[530, 444, 683, 461]",MISC
636,between,"[684, 444, 767, 461]",MISC
637,banking,"[768, 444, 851, 461]",MISC
638,and,"[851, 444, 886, 461]",MISC
639,insurance,"[887, 444, 994, 461]",MISC
640,-,"[994, 444, 996, 461]",MISC
641,NL,"[994, 444, 996, 461]",MISC
642,-,"[994, 444, 996, 461]",MISC
643,is,"[77, 464, 97, 480]",MISC
644,established,"[98, 464, 221, 480]",MISC
645,.,"[98, 464, 221, 480]",MISC
646,-,"[223, 464, 225, 480]",MISC
647,NL,"[223, 464, 225, 480]",MISC
648,-,"[223, 464, 225, 480]",MISC
649,Role,"[136, 514, 190, 532]",MISC
650,&,"[190, 514, 203, 532]",MISC
651,Re,"[204, 514, 432, 532]",MISC
652,##sp,"[204, 514, 432, 532]",MISC
653,##ons,"[204, 514, 432, 532]",MISC
654,##ibi,"[204, 514, 432, 532]",MISC
655,##lities,"[204, 514, 432, 532]",MISC
656,:,"[204, 514, 432, 532]",MISC
657,-,"[433, 514, 435, 532]",MISC
658,NL,"[433, 514, 435, 532]",MISC
659,-,"[433, 514, 435, 532]",MISC
660,De,"[123, 555, 201, 569]",MISC
661,##fect,"[123, 555, 201, 569]",MISC
662,Management,"[201, 555, 330, 569]",MISC
663,application,"[330, 555, 485, 569]",MISC
664,.,"[330, 555, 485, 569]",MISC
665,-,"[485, 555, 487, 569]",MISC
666,NL,"[485, 555, 487, 569]",MISC
667,-,"[485, 555, 487, 569]",MISC
668,Analysis,"[122, 573, 220, 586]",MISC
669,of,"[220, 573, 244, 586]",MISC
670,business,"[245, 573, 343, 586]",MISC
671,requirements,"[343, 573, 489, 586]",MISC
672,and,"[490, 573, 525, 586]",MISC
673,op,"[526, 573, 635, 586]",MISC
674,##ti,"[526, 573, 635, 586]",MISC
675,##mized,"[526, 573, 635, 586]",MISC
676,data,"[637, 573, 685, 586]",MISC
677,structure,"[686, 573, 794, 586]",MISC
678,design,"[796, 573, 881, 586]",MISC
679,.,"[796, 573, 881, 586]",MISC
680,-,"[881, 573, 883, 586]",MISC
681,NL,"[881, 573, 883, 586]",MISC
682,-,"[881, 573, 883, 586]",MISC
683,E,"[123, 589, 248, 604]",MISC
684,##st,"[123, 589, 248, 604]",MISC
685,##imation,"[123, 589, 248, 604]",MISC
686,of,"[249, 589, 273, 604]",MISC
687,test,"[274, 589, 324, 604]",MISC
688,cases,"[324, 589, 387, 604]",MISC
689,-,"[387, 589, 389, 604]",MISC
690,NL,"[387, 589, 389, 604]",MISC
691,-,"[387, 589, 389, 604]",MISC
692,En,"[122, 606, 255, 620]",MISC
693,##han,"[122, 606, 255, 620]",MISC
694,##ce,"[122, 606, 255, 620]",MISC
695,##ment,"[122, 606, 255, 620]",MISC
696,of,"[257, 606, 281, 620]",MISC
697,the,"[281, 606, 316, 620]",MISC
698,existing,"[318, 606, 414, 620]",MISC
699,application,"[416, 606, 548, 620]",MISC
700,based,"[550, 606, 611, 620]",MISC
701,on,"[611, 606, 635, 620]",MISC
702,client,"[635, 606, 731, 620]",MISC
703,’,"[635, 606, 731, 620]",MISC
704,s,"[635, 606, 731, 620]",MISC
705,requirement,"[733, 606, 879, 620]",MISC
706,.,"[733, 606, 879, 620]",MISC
707,-,"[880, 606, 881, 620]",MISC
708,NL,"[880, 606, 881, 620]",MISC
709,-,"[880, 606, 881, 620]",MISC
710,Production,"[123, 624, 252, 637]",MISC
711,Support,"[253, 624, 344, 637]",MISC
712,-,"[345, 624, 346, 637]",MISC
713,NL,"[345, 624, 346, 637]",MISC
714,-,"[345, 624, 346, 637]",MISC
715,Application,"[121, 641, 243, 654]",MISC
716,functionality,"[243, 641, 387, 654]",MISC
717,Analysis,"[387, 641, 476, 654]",MISC
718,based,"[476, 641, 531, 654]",MISC
719,on,"[531, 641, 553, 654]",MISC
720,Trace,"[553, 641, 619, 654]",MISC
721,##r,"[553, 641, 619, 654]",MISC
722,and,"[619, 641, 653, 654]",MISC
723,C,"[653, 641, 752, 654]",MISC
724,##lip,"[653, 641, 752, 654]",MISC
725,##board,"[653, 641, 752, 654]",MISC
726,-,"[752, 641, 754, 654]",MISC
727,NL,"[752, 641, 754, 654]",MISC
728,-,"[752, 641, 754, 654]",MISC
729,Smoke,"[124, 658, 194, 671]",MISC
730,Testing,"[195, 658, 292, 671]",MISC
731,-,"[293, 658, 295, 671]",MISC
732,NL,"[293, 658, 295, 671]",MISC
733,-,"[293, 658, 295, 671]",MISC
734,Report,"[124, 674, 244, 689]",MISC
735,##ing,"[124, 674, 244, 689]",MISC
736,-,"[245, 674, 247, 689]",MISC
737,NL,"[245, 674, 247, 689]",MISC
738,-,"[245, 674, 247, 689]",MISC
739,Project,"[77, 722, 160, 738]",MISC
740,#,"[160, 722, 182, 738]",MISC
741,3,"[160, 722, 182, 738]",MISC
742,-,"[184, 722, 186, 738]",MISC
743,NL,"[184, 722, 186, 738]",MISC
744,-,"[184, 722, 186, 738]",MISC
745,C,"[136, 756, 215, 773]",MISC
746,##lient,"[136, 756, 215, 773]",MISC
747,:,"[136, 756, 215, 773]",MISC
748,Dai,"[217, 756, 296, 773]",MISC
749,##mler,"[217, 756, 296, 773]",MISC
750,Financial,"[298, 756, 401, 773]",MISC
751,Services,"[402, 756, 494, 773]",MISC
752,-,"[494, 756, 496, 773]",MISC
753,NL,"[494, 756, 496, 773]",MISC
754,-,"[494, 756, 496, 773]",MISC
755,Du,"[136, 791, 254, 808]",MISC
756,##ration,"[136, 791, 254, 808]",MISC
757,:,"[136, 791, 254, 808]",MISC
758,August,"[256, 791, 348, 808]",MISC
759,",","[256, 791, 348, 808]",MISC
760,2013,"[349, 791, 400, 808]",MISC
761,–,"[402, 791, 415, 808]",MISC
762,June,"[415, 791, 467, 808]",MISC
763,2014,"[468, 791, 520, 808]",MISC
764,-,"[522, 791, 523, 808]",MISC
765,NL,"[522, 791, 523, 808]",MISC
766,-,"[522, 791, 523, 808]",MISC
767,BP,"[140, 826, 180, 842]",MISC
768,##M,"[140, 826, 180, 842]",MISC
769,Suite,"[181, 826, 264, 842]",MISC
770,:,"[181, 826, 264, 842]",MISC
771,PR,"[265, 826, 320, 842]",MISC
772,##PC,"[265, 826, 320, 842]",MISC
773,v,"[320, 826, 376, 842]",MISC
774,##6,"[320, 826, 376, 842]",MISC
775,.,"[320, 826, 376, 842]",MISC
776,2,"[320, 826, 376, 842]",MISC
777,-,"[376, 826, 378, 842]",MISC
778,NL,"[376, 826, 378, 842]",MISC
779,-,"[376, 826, 378, 842]",MISC
780,Project,"[136, 861, 236, 878]",MISC
781,:,"[136, 861, 236, 878]",MISC
782,Mercedes,"[237, 861, 336, 878]",MISC
783,Benz,"[337, 861, 387, 878]",MISC
784,Auto,"[388, 861, 438, 878]",MISC
785,Finance,"[438, 861, 525, 878]",MISC
786,Digital,"[526, 861, 613, 878]",MISC
787,Program,"[614, 861, 701, 878]",MISC
788,-,"[702, 861, 704, 878]",MISC
789,NL,"[702, 861, 704, 878]",MISC
790,-,"[702, 861, 704, 878]",MISC
791,Project,"[136, 896, 223, 913]",MISC
792,A,"[223, 896, 334, 913]",MISC
793,##bs,"[223, 896, 334, 913]",MISC
794,##tract,"[223, 896, 334, 913]",MISC
795,:,"[223, 896, 334, 913]",MISC
796,The,"[334, 896, 371, 913]",MISC
797,project,"[372, 896, 458, 913]",MISC
798,was,"[458, 896, 495, 913]",MISC
799,very,"[496, 896, 544, 913]",MISC
800,challenging,"[545, 896, 680, 913]",MISC
801,in,"[682, 896, 706, 913]",MISC
802,terms,"[706, 896, 767, 913]",MISC
803,of,"[768, 896, 792, 913]",MISC
804,complex,"[793, 896, 880, 913]",MISC
805,business,"[880, 896, 978, 913]",MISC
806,-,"[979, 896, 981, 913]",MISC
807,NL,"[979, 896, 981, 913]",MISC
808,-,"[979, 896, 981, 913]",MISC
809,logic,"[136, 913, 195, 931]",MISC
810,and,"[197, 913, 232, 931]",MISC
811,string,"[233, 913, 342, 931]",MISC
812,##ent,"[233, 913, 342, 931]",MISC
813,timeline,"[342, 913, 451, 931]",MISC
814,.,"[342, 913, 451, 931]",MISC
815,Collection,"[452, 913, 572, 931]",MISC
816,of,"[573, 913, 597, 931]",MISC
817,Auto,"[598, 913, 645, 931]",MISC
818,loan,"[646, 913, 694, 931]",MISC
819,and,"[695, 913, 730, 931]",MISC
820,recovery,"[731, 913, 827, 931]",MISC
821,management,"[828, 913, 948, 931]",MISC
822,-,"[950, 913, 952, 931]",MISC
823,NL,"[950, 913, 952, 931]",MISC
824,-,"[950, 913, 952, 931]",MISC
825,with,"[136, 931, 180, 948]",MISC
826,third,"[182, 931, 237, 948]",MISC
827,party,"[239, 931, 294, 948]",MISC
828,like,"[296, 931, 340, 948]",MISC
829,agents,"[341, 931, 421, 948]",MISC
830,",","[341, 931, 421, 948]",MISC
831,litigation,"[421, 931, 534, 948]",MISC
832,authorities,"[535, 931, 659, 948]",MISC
833,is,"[661, 931, 683, 948]",MISC
834,effectively,"[683, 931, 807, 948]",MISC
835,deployed,"[809, 931, 899, 948]",MISC
836,in,"[900, 931, 922, 948]",MISC
837,CP,"[923, 931, 956, 948]",MISC
838,##M,"[923, 931, 956, 948]",MISC
839,-,"[957, 931, 959, 948]",MISC
840,NL,"[957, 931, 959, 948]",MISC
841,-,"[957, 931, 959, 948]",MISC
842,framework,"[136, 948, 247, 966]",MISC
843,.,"[247, 948, 258, 966]",MISC
844,Integration,"[259, 948, 394, 966]",MISC
845,process,"[395, 948, 480, 966]",MISC
846,like,"[481, 948, 529, 966]",MISC
847,In,"[531, 948, 615, 966]",MISC
848,##bound,"[531, 948, 615, 966]",MISC
849,/,"[617, 948, 628, 966]",MISC
850,Out,"[629, 948, 727, 966]",MISC
851,##bound,"[629, 948, 727, 966]",MISC
852,call,"[728, 948, 776, 966]",MISC
853,and,"[777, 948, 814, 966]",MISC
854,SMS,"[814, 948, 851, 966]",MISC
855,-,"[851, 948, 899, 966]",MISC
856,all,"[851, 948, 899, 966]",MISC
857,this,"[900, 948, 948, 966]",MISC
858,-,"[950, 948, 952, 966]",MISC
859,NL,"[950, 948, 952, 966]",MISC
860,-,"[950, 948, 952, 966]",MISC
861,C,"[77, 982, 190, 999]",B-others_heading
862,##ur,"[77, 982, 190, 999]",I-others_heading
863,##ric,"[77, 982, 190, 999]",I-others_heading
864,##ulum,"[77, 982, 190, 999]",I-others_heading
865,Vita,"[190, 982, 246, 999]",I-others_heading
866,##e,"[190, 982, 246, 999]",I-others_heading
867,-,"[247, 982, 249, 999]",MISC
868,NL,"[247, 982, 249, 999]",MISC
869,-,"[247, 982, 249, 999]",MISC
870,functionality,"[136, 69, 284, 87]",MISC
871,are,"[285, 69, 319, 87]",MISC
872,incorporated,"[320, 69, 456, 87]",MISC
873,at,"[458, 69, 480, 87]",MISC
874,a,"[481, 69, 492, 87]",MISC
875,later,"[492, 69, 550, 87]",MISC
876,stage,"[550, 69, 607, 87]",MISC
877,and,"[607, 69, 640, 87]",MISC
878,inter,"[642, 69, 789, 87]",MISC
879,##rel,"[642, 69, 789, 87]",MISC
880,##ation,"[642, 69, 789, 87]",MISC
881,between,"[791, 69, 871, 87]",MISC
882,collection,"[872, 69, 986, 87]",MISC
883,-,"[987, 69, 988, 87]",MISC
884,NL,"[987, 69, 988, 87]",MISC
885,-,"[987, 69, 988, 87]",MISC
886,and,"[136, 87, 173, 103]",MISC
887,Recovery,"[173, 87, 271, 103]",MISC
888,",","[271, 87, 406, 103]",MISC
889,Li,"[271, 87, 406, 103]",MISC
890,##ti,"[271, 87, 406, 103]",MISC
891,##gation,"[271, 87, 406, 103]",MISC
892,Management,"[407, 87, 528, 103]",MISC
893,was,"[530, 87, 567, 103]",MISC
894,in,"[567, 87, 591, 103]",MISC
895,successful,"[591, 87, 713, 103]",MISC
896,run,"[714, 87, 762, 103]",MISC
897,.,"[714, 87, 762, 103]",MISC
898,-,"[763, 87, 765, 103]",MISC
899,NL,"[763, 87, 765, 103]",MISC
900,-,"[763, 87, 765, 103]",MISC
901,The,"[136, 103, 173, 121]",MISC
902,Complete,"[173, 103, 271, 121]",MISC
903,process,"[272, 103, 357, 121]",MISC
904,was,"[359, 103, 396, 121]",MISC
905,automated,"[396, 103, 507, 121]",MISC
906,using,"[507, 103, 568, 121]",MISC
907,various,"[569, 103, 654, 121]",MISC
908,agents,"[656, 103, 741, 121]",MISC
909,",","[656, 103, 741, 121]",MISC
910,listeners,"[743, 103, 866, 121]",MISC
911,",","[743, 103, 866, 121]",MISC
912,web,"[866, 103, 903, 121]",MISC
913,-,"[904, 103, 905, 121]",MISC
914,NL,"[904, 103, 905, 121]",MISC
915,-,"[904, 103, 905, 121]",MISC
916,services,"[136, 121, 243, 138]",MISC
917,",","[136, 121, 243, 138]",MISC
918,store,"[244, 121, 303, 138]",MISC
919,procedures,"[304, 121, 435, 138]",MISC
920,",","[304, 121, 435, 138]",MISC
921,as,"[436, 121, 460, 138]",MISC
922,well,"[460, 121, 508, 138]",MISC
923,as,"[508, 121, 532, 138]",MISC
924,manual,"[532, 121, 604, 138]",MISC
925,processing,"[604, 121, 724, 138]",MISC
926,was,"[724, 121, 759, 138]",MISC
927,also,"[760, 121, 808, 138]",MISC
928,possible,"[808, 121, 904, 138]",MISC
929,for,"[904, 121, 939, 138]",MISC
930,-,"[940, 121, 942, 138]",MISC
931,NL,"[940, 121, 942, 138]",MISC
932,-,"[940, 121, 942, 138]",MISC
933,these,"[136, 138, 191, 156]",MISC
934,processes,"[193, 138, 305, 156]",MISC
935,.,"[193, 138, 305, 156]",MISC
936,-,"[306, 138, 308, 156]",MISC
937,NL,"[306, 138, 308, 156]",MISC
938,-,"[306, 138, 308, 156]",MISC
939,Role,"[136, 174, 190, 193]",MISC
940,&,"[190, 174, 203, 193]",MISC
941,Re,"[204, 174, 432, 193]",MISC
942,##sp,"[204, 174, 432, 193]",MISC
943,##ons,"[204, 174, 432, 193]",MISC
944,##ibi,"[204, 174, 432, 193]",MISC
945,##lities,"[204, 174, 432, 193]",MISC
946,:,"[204, 174, 432, 193]",MISC
947,-,"[433, 174, 435, 193]",MISC
948,NL,"[433, 174, 435, 193]",MISC
949,-,"[433, 174, 435, 193]",MISC
950,•,"[208, 212, 219, 230]",MISC
951,De,"[220, 212, 292, 230]",MISC
952,##fect,"[220, 212, 292, 230]",MISC
953,and,"[293, 212, 328, 230]",MISC
954,B,"[329, 212, 438, 230]",MISC
955,##ug,"[329, 212, 438, 230]",MISC
956,##fi,"[329, 212, 438, 230]",MISC
957,##xing,"[329, 212, 438, 230]",MISC
958,for,"[439, 212, 474, 230]",MISC
959,the,"[475, 212, 510, 230]",MISC
960,existing,"[511, 212, 607, 230]",MISC
961,application,"[608, 212, 752, 230]",MISC
962,.,"[608, 212, 752, 230]",MISC
963,-,"[754, 212, 756, 230]",MISC
964,NL,"[754, 212, 756, 230]",MISC
965,-,"[754, 212, 756, 230]",MISC
966,•,"[208, 230, 219, 247]",MISC
967,Writing,"[220, 230, 305, 247]",MISC
968,detailed,"[305, 230, 401, 247]",MISC
969,test,"[403, 230, 451, 247]",MISC
970,cases,"[452, 230, 512, 247]",MISC
971,and,"[512, 230, 547, 247]",MISC
972,Unit,"[549, 230, 597, 247]",MISC
973,testing,"[598, 230, 694, 247]",MISC
974,.,"[598, 230, 694, 247]",MISC
975,-,"[695, 230, 697, 247]",MISC
976,NL,"[695, 230, 697, 247]",MISC
977,-,"[695, 230, 697, 247]",MISC
978,•,"[208, 247, 221, 265]",MISC
979,Production,"[221, 247, 350, 265]",MISC
980,Support,"[351, 247, 442, 265]",MISC
981,-,"[442, 247, 444, 265]",MISC
982,NL,"[442, 247, 444, 265]",MISC
983,-,"[442, 247, 444, 265]",MISC
984,•,"[208, 265, 219, 281]",MISC
985,Reg,"[221, 265, 346, 281]",MISC
986,##ression,"[221, 265, 346, 281]",MISC
987,Testing,"[348, 265, 436, 281]",MISC
988,-,"[437, 265, 439, 281]",MISC
989,NL,"[437, 265, 439, 281]",MISC
990,-,"[437, 265, 439, 281]",MISC
991,•,"[208, 281, 221, 298]",MISC
992,Working,"[222, 281, 320, 298]",MISC
993,on,"[320, 281, 348, 298]",MISC
994,Reports,"[348, 281, 446, 298]",MISC
995,-,"[446, 281, 448, 298]",MISC
996,NL,"[446, 281, 448, 298]",MISC
997,-,"[446, 281, 448, 298]",MISC
998,•,"[208, 298, 221, 316]",MISC
999,Unit,"[221, 298, 275, 316]",MISC
1000,Testing,"[275, 298, 367, 316]",MISC
1001,-,"[369, 298, 370, 316]",MISC
1002,NL,"[369, 298, 370, 316]",MISC
1003,-,"[369, 298, 370, 316]",MISC
1004,•,"[208, 316, 221, 333]",MISC
1005,Smoke,"[222, 316, 292, 333]",MISC
1006,Testing,"[293, 316, 391, 333]",MISC
1007,-,"[392, 316, 394, 333]",MISC
1008,NL,"[392, 316, 394, 333]",MISC
1009,-,"[392, 316, 394, 333]",MISC
1010,Project,"[77, 390, 160, 405]",MISC
1011,#,"[160, 390, 182, 405]",MISC
1012,4,"[160, 390, 182, 405]",MISC
1013,-,"[184, 390, 186, 405]",MISC
1014,NL,"[184, 390, 186, 405]",MISC
1015,-,"[184, 390, 186, 405]",MISC
1016,C,"[136, 421, 226, 438]",MISC
1017,##lient,"[136, 421, 226, 438]",MISC
1018,:,"[136, 421, 226, 438]",MISC
1019,Marsh,"[227, 421, 292, 438]",MISC
1020,&,"[293, 421, 306, 438]",MISC
1021,M,"[306, 421, 409, 438]",MISC
1022,##c,"[306, 421, 409, 438]",MISC
1023,##L,"[306, 421, 409, 438]",MISC
1024,##en,"[306, 421, 409, 438]",MISC
1025,##nan,"[306, 421, 409, 438]",MISC
1026,Companies,"[410, 421, 539, 438]",MISC
1027,",","[410, 421, 539, 438]",MISC
1028,Healthcare,"[541, 421, 670, 438]",MISC
1029,-,"[671, 421, 673, 438]",MISC
1030,NL,"[671, 421, 673, 438]",MISC
1031,-,"[671, 421, 673, 438]",MISC
1032,Du,"[136, 456, 249, 473]",MISC
1033,##ration,"[136, 456, 249, 473]",MISC
1034,:,"[136, 456, 249, 473]",MISC
1035,February,"[250, 456, 362, 473]",MISC
1036,",","[250, 456, 362, 473]",MISC
1037,2013,"[363, 456, 426, 473]",MISC
1038,-,"[363, 456, 426, 473]",MISC
1039,July,"[426, 456, 476, 473]",MISC
1040,2013,"[477, 456, 527, 473]",MISC
1041,-,"[527, 456, 529, 473]",MISC
1042,NL,"[527, 456, 529, 473]",MISC
1043,-,"[527, 456, 529, 473]",MISC
1044,BP,"[140, 491, 180, 507]",MISC
1045,##M,"[140, 491, 180, 507]",MISC
1046,Suite,"[181, 491, 264, 507]",MISC
1047,:,"[181, 491, 264, 507]",MISC
1048,PR,"[265, 491, 320, 507]",MISC
1049,##PC,"[265, 491, 320, 507]",MISC
1050,v,"[320, 491, 376, 507]",MISC
1051,##6,"[320, 491, 376, 507]",MISC
1052,.,"[320, 491, 376, 507]",MISC
1053,1,"[320, 491, 376, 507]",MISC
1054,-,"[376, 491, 378, 507]",MISC
1055,NL,"[376, 491, 378, 507]",MISC
1056,-,"[376, 491, 378, 507]",MISC
1057,Project,"[136, 526, 236, 543]",MISC
1058,:,"[136, 526, 236, 543]",MISC
1059,MA,"[237, 526, 299, 543]",MISC
1060,##RS,"[237, 526, 299, 543]",MISC
1061,##H,"[237, 526, 299, 543]",MISC
1062,–,"[300, 526, 386, 543]",MISC
1063,United,"[300, 526, 386, 543]",MISC
1064,state,"[388, 526, 450, 543]",MISC
1065,Digital,"[451, 526, 537, 543]",MISC
1066,Program,"[539, 526, 625, 543]",MISC
1067,-,"[627, 526, 629, 543]",MISC
1068,NL,"[627, 526, 629, 543]",MISC
1069,-,"[627, 526, 629, 543]",MISC
1070,Project,"[101, 561, 188, 578]",MISC
1071,A,"[188, 561, 298, 578]",MISC
1072,##bs,"[188, 561, 298, 578]",MISC
1073,##tract,"[188, 561, 298, 578]",MISC
1074,:,"[188, 561, 298, 578]",MISC
1075,The,"[299, 561, 336, 578]",MISC
1076,priority,"[336, 561, 434, 578]",MISC
1077,of,"[436, 561, 460, 578]",MISC
1078,the,"[460, 561, 497, 578]",MISC
1079,Project,"[498, 561, 584, 578]",MISC
1080,is,"[584, 561, 608, 578]",MISC
1081,to,"[609, 561, 633, 578]",MISC
1082,provide,"[634, 561, 721, 578]",MISC
1083,new,"[721, 561, 758, 578]",MISC
1084,enhance,"[758, 561, 906, 578]",MISC
1085,##ments,"[758, 561, 906, 578]",MISC
1086,for,"[907, 561, 944, 578]",MISC
1087,the,"[944, 561, 981, 578]",MISC
1088,-,"[981, 561, 983, 578]",MISC
1089,NL,"[981, 561, 983, 578]",MISC
1090,-,"[981, 561, 983, 578]",MISC
1091,existing,"[101, 581, 193, 598]",MISC
1092,application,"[194, 581, 321, 598]",MISC
1093,and,"[321, 581, 355, 598]",MISC
1094,to,"[356, 581, 378, 598]",MISC
1095,provide,"[379, 581, 461, 598]",MISC
1096,the,"[461, 581, 494, 598]",MISC
1097,essential,"[496, 581, 599, 598]",MISC
1098,support,"[600, 581, 681, 598]",MISC
1099,to,"[681, 581, 703, 598]",MISC
1100,the,"[704, 581, 738, 598]",MISC
1101,existing,"[739, 581, 831, 598]",MISC
1102,application,"[832, 581, 959, 598]",MISC
1103,in,"[960, 581, 982, 598]",MISC
1104,-,"[983, 581, 985, 598]",MISC
1105,NL,"[983, 581, 985, 598]",MISC
1106,-,"[983, 581, 985, 598]",MISC
1107,the,"[101, 602, 136, 620]",MISC
1108,production,"[137, 602, 270, 620]",MISC
1109,.,"[137, 602, 270, 620]",MISC
1110,The,"[270, 602, 305, 620]",MISC
1111,main,"[307, 602, 355, 620]",MISC
1112,objective,"[355, 602, 462, 620]",MISC
1113,was,"[464, 602, 499, 620]",MISC
1114,to,"[500, 602, 524, 620]",MISC
1115,allow,"[524, 602, 583, 620]",MISC
1116,several,"[585, 602, 668, 620]",MISC
1117,teams,"[669, 602, 728, 620]",MISC
1118,to,"[730, 602, 754, 620]",MISC
1119,work,"[754, 602, 802, 620]",MISC
1120,online,"[802, 602, 885, 620]",MISC
1121,.,"[802, 602, 885, 620]",MISC
1122,-,"[887, 602, 889, 620]",MISC
1123,NL,"[887, 602, 889, 620]",MISC
1124,-,"[887, 602, 889, 620]",MISC
1125,Additionally,"[101, 624, 230, 641]",MISC
1126,",","[101, 624, 230, 641]",MISC
1127,it,"[232, 624, 250, 641]",MISC
1128,uses,"[252, 624, 291, 641]",MISC
1129,time,"[292, 624, 383, 641]",MISC
1130,-,"[292, 624, 383, 641]",MISC
1131,zone,"[292, 624, 383, 641]",MISC
1132,management,"[383, 624, 483, 641]",MISC
1133,to,"[484, 624, 502, 641]",MISC
1134,facilitate,"[504, 624, 603, 641]",MISC
1135,easy,"[604, 624, 643, 641]",MISC
1136,co,"[645, 624, 774, 641]",MISC
1137,-,"[645, 624, 774, 641]",MISC
1138,ordination,"[645, 624, 774, 641]",MISC
1139,of,"[776, 624, 794, 641]",MISC
1140,implementation,"[796, 624, 936, 641]",MISC
1141,-,"[937, 624, 939, 641]",MISC
1142,NL,"[937, 624, 939, 641]",MISC
1143,-,"[937, 624, 939, 641]",MISC
1144,activities,"[101, 646, 201, 663]",MISC
1145,like,"[202, 646, 241, 663]",MISC
1146,automatic,"[243, 646, 333, 663]",MISC
1147,document,"[334, 646, 413, 663]",MISC
1148,generation,"[415, 646, 515, 663]",MISC
1149,which,"[517, 646, 566, 663]",MISC
1150,maintains,"[567, 646, 658, 663]",MISC
1151,archive,"[658, 646, 729, 663]",MISC
1152,of,"[729, 646, 748, 663]",MISC
1153,old,"[750, 646, 779, 663]",MISC
1154,implementation,"[780, 646, 941, 663]",MISC
1155,##s,"[780, 646, 941, 663]",MISC
1156,",","[780, 646, 941, 663]",MISC
1157,-,"[942, 646, 944, 663]",MISC
1158,NL,"[942, 646, 944, 663]",MISC
1159,-,"[942, 646, 944, 663]",MISC
1160,applying,"[101, 666, 184, 685]",MISC
1161,appropriate,"[185, 666, 299, 685]",MISC
1162,version,"[299, 666, 371, 685]",MISC
1163,control,"[372, 666, 444, 685]",MISC
1164,on,"[446, 666, 466, 685]",MISC
1165,documents,"[466, 666, 559, 685]",MISC
1166,.,"[560, 666, 590, 685]",MISC
1167,It,"[560, 666, 590, 685]",MISC
1168,also,"[592, 666, 632, 685]",MISC
1169,displays,"[633, 666, 716, 685]",MISC
1170,dash,"[717, 666, 809, 685]",MISC
1171,##board,"[717, 666, 809, 685]",MISC
1172,summary,"[811, 666, 883, 685]",MISC
1173,with,"[884, 666, 925, 685]",MISC
1174,search,"[926, 666, 987, 685]",MISC
1175,-,"[988, 666, 990, 685]",MISC
1176,NL,"[988, 666, 990, 685]",MISC
1177,-,"[988, 666, 990, 685]",MISC
1178,facility,"[101, 687, 169, 706]",MISC
1179,.,"[101, 687, 169, 706]",MISC
1180,-,"[169, 687, 171, 706]",MISC
1181,NL,"[169, 687, 171, 706]",MISC
1182,-,"[169, 687, 171, 706]",MISC
1183,Role,"[136, 776, 190, 795]",MISC
1184,&,"[190, 776, 203, 795]",MISC
1185,Re,"[204, 776, 432, 795]",MISC
1186,##sp,"[204, 776, 432, 795]",MISC
1187,##ons,"[204, 776, 432, 795]",MISC
1188,##ibi,"[204, 776, 432, 795]",MISC
1189,##lities,"[204, 776, 432, 795]",MISC
1190,:,"[204, 776, 432, 795]",MISC
1191,-,"[433, 776, 435, 795]",MISC
1192,NL,"[433, 776, 435, 795]",MISC
1193,-,"[433, 776, 435, 795]",MISC
1194,•,"[208, 814, 221, 831]",MISC
1195,Pre,"[222, 814, 322, 831]",MISC
1196,-,"[222, 814, 322, 831]",MISC
1197,S,"[222, 814, 322, 831]",MISC
1198,##IT,"[222, 814, 322, 831]",MISC
1199,Team,"[324, 814, 381, 831]",MISC
1200,-,"[381, 814, 383, 831]",MISC
1201,NL,"[381, 814, 383, 831]",MISC
1202,-,"[381, 814, 383, 831]",MISC
1203,•,"[208, 831, 221, 847]",MISC
1204,Performance,"[221, 831, 363, 847]",MISC
1205,Testing,"[364, 831, 455, 847]",MISC
1206,-,"[455, 831, 457, 847]",MISC
1207,NL,"[455, 831, 457, 847]",MISC
1208,-,"[455, 831, 457, 847]",MISC
1209,•,"[208, 847, 219, 865]",MISC
1210,Unit,"[220, 847, 268, 865]",MISC
1211,testing,"[270, 847, 368, 865]",MISC
1212,.,"[270, 847, 368, 865]",MISC
1213,-,"[369, 847, 370, 865]",MISC
1214,NL,"[369, 847, 370, 865]",MISC
1215,-,"[369, 847, 370, 865]",MISC
1216,•,"[208, 865, 219, 882]",MISC
1217,Reg,"[221, 865, 346, 882]",MISC
1218,##ression,"[221, 865, 346, 882]",MISC
1219,Testing,"[348, 865, 436, 882]",MISC
1220,-,"[437, 865, 439, 882]",MISC
1221,NL,"[437, 865, 439, 882]",MISC
1222,-,"[437, 865, 439, 882]",MISC
1223,•,"[208, 882, 219, 900]",MISC
1224,Production,"[221, 882, 348, 900]",MISC
1225,support,"[349, 882, 437, 900]",MISC
1226,-,"[439, 882, 440, 900]",MISC
1227,NL,"[439, 882, 440, 900]",MISC
1228,-,"[439, 882, 440, 900]",MISC
1229,•,"[208, 900, 219, 917]",MISC
1230,De,"[221, 900, 372, 917]",MISC
1231,##fect,"[221, 900, 372, 917]",MISC
1232,##fi,"[221, 900, 372, 917]",MISC
1233,##xing,"[221, 900, 372, 917]",MISC
1234,-,"[372, 900, 374, 917]",MISC
1235,NL,"[372, 900, 374, 917]",MISC
1236,-,"[372, 900, 374, 917]",MISC
1237,•,"[208, 917, 221, 934]",MISC
1238,Reports,"[222, 917, 320, 934]",MISC
1239,-,"[321, 917, 322, 934]",MISC
1240,NL,"[321, 917, 322, 934]",MISC
1241,-,"[321, 917, 322, 934]",MISC
1242,C,"[77, 982, 190, 999]",B-others_heading
1243,##ur,"[77, 982, 190, 999]",I-others_heading
1244,##ric,"[77, 982, 190, 999]",I-others_heading
1245,##ulum,"[77, 982, 190, 999]",I-others_heading
1246,Vita,"[190, 982, 246, 999]",I-others_heading
1247,##e,"[190, 982, 246, 999]",I-others_heading
1248,-,"[247, 982, 249, 999]",MISC
1249,NL,"[247, 982, 249, 999]",MISC
1250,-,"[247, 982, 249, 999]",MISC
1251,Project,"[77, 100, 160, 117]",MISC
1252,#,"[160, 100, 182, 117]",MISC
1253,5,"[160, 100, 182, 117]",MISC
1254,-,"[184, 100, 186, 117]",MISC
1255,NL,"[184, 100, 186, 117]",MISC
1256,-,"[184, 100, 186, 117]",MISC
1257,C,"[77, 135, 134, 152]",MISC
1258,##lient,"[77, 135, 134, 152]",MISC
1259,-,"[134, 135, 136, 152]",MISC
1260,NL,"[134, 135, 136, 152]",MISC
1261,-,"[134, 135, 136, 152]",MISC
1262,Leading,"[280, 135, 367, 152]",MISC
1263,Insurance,"[367, 135, 477, 152]",MISC
1264,Group,"[478, 135, 552, 152]",MISC
1265,",","[478, 135, 552, 152]",MISC
1266,USA,"[553, 135, 590, 152]",MISC
1267,-,"[590, 135, 592, 152]",MISC
1268,NL,"[590, 135, 592, 152]",MISC
1269,-,"[590, 135, 592, 152]",MISC
1270,Project,"[77, 170, 169, 187]",MISC
1271,Name,"[171, 170, 224, 187]",MISC
1272,-,"[225, 170, 226, 187]",MISC
1273,NL,"[225, 170, 226, 187]",MISC
1274,-,"[225, 170, 226, 187]",MISC
1275,American,"[295, 170, 394, 187]",MISC
1276,Insurance,"[395, 170, 508, 187]",MISC
1277,Group,"[509, 170, 571, 187]",MISC
1278,-,"[571, 170, 573, 187]",MISC
1279,NL,"[571, 170, 573, 187]",MISC
1280,-,"[571, 170, 573, 187]",MISC
1281,Operating,"[77, 205, 212, 224]",MISC
1282,System,"[213, 205, 304, 224]",MISC
1283,Windows,"[304, 205, 410, 224]",MISC
1284,7,"[411, 205, 425, 224]",MISC
1285,-,"[426, 205, 428, 224]",MISC
1286,NL,"[426, 205, 428, 224]",MISC
1287,-,"[426, 205, 428, 224]",MISC
1288,Too,"[77, 243, 130, 261]",MISC
1289,##ls,"[77, 243, 130, 261]",MISC
1290,-,"[130, 243, 132, 261]",MISC
1291,NL,"[130, 243, 132, 261]",MISC
1292,-,"[130, 243, 132, 261]",MISC
1293,P,"[276, 243, 326, 261]",MISC
1294,##eg,"[276, 243, 326, 261]",MISC
1295,##a,"[276, 243, 326, 261]",MISC
1296,(,"[326, 243, 387, 261]",MISC
1297,PR,"[326, 243, 387, 261]",MISC
1298,##PC,"[326, 243, 387, 261]",MISC
1299,6,"[389, 243, 438, 261]",MISC
1300,.,"[389, 243, 438, 261]",MISC
1301,1,"[389, 243, 438, 261]",MISC
1302,),"[389, 243, 438, 261]",MISC
1303,-,"[439, 243, 440, 261]",MISC
1304,NL,"[439, 243, 440, 261]",MISC
1305,-,"[439, 243, 440, 261]",MISC
1306,Role,"[77, 277, 118, 293]",MISC
1307,-,"[118, 277, 119, 293]",MISC
1308,NL,"[118, 277, 119, 293]",MISC
1309,-,"[118, 277, 119, 293]",MISC
1310,Technical,"[276, 277, 363, 293]",MISC
1311,Architect,"[364, 277, 451, 293]",MISC
1312,-,"[452, 277, 453, 293]",MISC
1313,NL,"[452, 277, 453, 293]",MISC
1314,-,"[452, 277, 453, 293]",MISC
1315,Period,"[77, 293, 134, 308]",MISC
1316,-,"[134, 293, 136, 308]",MISC
1317,NL,"[134, 293, 136, 308]",MISC
1318,-,"[134, 293, 136, 308]",MISC
1319,August,"[285, 293, 350, 308]",MISC
1320,2012,"[351, 293, 524, 308]",MISC
1321,-,"[351, 293, 524, 308]",MISC
1322,January,"[351, 293, 524, 308]",MISC
1323,##20,"[351, 293, 524, 308]",MISC
1324,##13,"[351, 293, 524, 308]",MISC
1325,-,"[525, 293, 527, 308]",MISC
1326,NL,"[525, 293, 527, 308]",MISC
1327,-,"[525, 293, 527, 308]",MISC
1328,Project,"[77, 325, 167, 343]",MISC
1329,Des,"[168, 325, 323, 343]",MISC
1330,##cription,"[168, 325, 323, 343]",MISC
1331,:,"[168, 325, 323, 343]",MISC
1332,This,"[325, 325, 377, 343]",MISC
1333,project,"[377, 325, 468, 343]",MISC
1334,deals,"[468, 325, 533, 343]",MISC
1335,with,"[534, 325, 585, 343]",MISC
1336,the,"[586, 325, 625, 343]",MISC
1337,under,"[625, 325, 780, 343]",MISC
1338,##writing,"[625, 325, 780, 343]",MISC
1339,of,"[782, 325, 807, 343]",MISC
1340,the,"[808, 325, 846, 343]",MISC
1341,cards,"[847, 325, 911, 343]",MISC
1342,of,"[912, 325, 938, 343]",MISC
1343,the,"[938, 325, 977, 343]",MISC
1344,-,"[977, 325, 979, 343]",MISC
1345,NL,"[977, 325, 979, 343]",MISC
1346,-,"[977, 325, 979, 343]",MISC
1347,customers,"[77, 343, 193, 362]",MISC
1348,and,"[194, 343, 232, 362]",MISC
1349,business,"[233, 343, 349, 362]",MISC
1350,.,"[233, 343, 349, 362]",MISC
1351,Basic,"[349, 343, 466, 362]",MISC
1352,##ally,"[349, 343, 466, 362]",MISC
1353,this,"[466, 343, 518, 362]",MISC
1354,project,"[518, 343, 608, 362]",MISC
1355,De,"[609, 343, 686, 362]",MISC
1356,##p,"[609, 343, 686, 362]",MISC
1357,##loy,"[609, 343, 686, 362]",MISC
1358,the,"[687, 343, 725, 362]",MISC
1359,next,"[726, 343, 777, 362]",MISC
1360,generation,"[778, 343, 907, 362]",MISC
1361,-,"[907, 343, 909, 362]",MISC
1362,NL,"[907, 343, 909, 362]",MISC
1363,-,"[907, 343, 909, 362]",MISC
1364,platform,"[77, 362, 182, 380]",MISC
1365,for,"[183, 362, 222, 380]",MISC
1366,CR,"[222, 362, 287, 380]",MISC
1367,##US,"[222, 362, 287, 380]",MISC
1368,##E,"[222, 362, 287, 380]",MISC
1369,with,"[289, 362, 340, 380]",MISC
1370,functionality,"[341, 362, 513, 380]",MISC
1371,and,"[513, 362, 552, 380]",MISC
1372,capabilities,"[553, 362, 712, 380]",MISC
1373,that,"[712, 362, 763, 380]",MISC
1374,will,"[765, 362, 816, 380]",MISC
1375,enable,"[817, 362, 897, 380]",MISC
1376,AM,"[897, 362, 948, 380]",MISC
1377,##EX,"[897, 362, 948, 380]",MISC
1378,-,"[950, 362, 952, 380]",MISC
1379,NL,"[950, 362, 952, 380]",MISC
1380,-,"[950, 362, 952, 380]",MISC
1381,credit,"[77, 380, 153, 399]",MISC
1382,operations,"[154, 380, 282, 399]",MISC
1383,to,"[283, 380, 307, 399]",MISC
1384,meet,"[309, 380, 359, 399]",MISC
1385,business,"[361, 380, 462, 399]",MISC
1386,demands,"[464, 380, 565, 399]",MISC
1387,.,"[464, 380, 565, 399]",MISC
1388,Key,"[567, 380, 604, 399]",MISC
1389,platform,"[605, 380, 707, 399]",MISC
1390,functionality,"[708, 380, 875, 399]",MISC
1391,will,"[876, 380, 926, 399]",MISC
1392,-,"[928, 380, 929, 399]",MISC
1393,NL,"[928, 380, 929, 399]",MISC
1394,-,"[928, 380, 929, 399]",MISC
1395,include,"[77, 399, 166, 418]",MISC
1396,:,"[77, 399, 166, 418]",MISC
1397,-,"[166, 399, 167, 418]",MISC
1398,NL,"[166, 399, 167, 418]",MISC
1399,-,"[166, 399, 167, 418]",MISC
1400,•,"[77, 422, 90, 440]",MISC
1401,Next,"[90, 422, 142, 440]",MISC
1402,generation,"[142, 422, 271, 440]",MISC
1403,case,"[271, 422, 322, 440]",MISC
1404,management,"[322, 422, 452, 440]",MISC
1405,system,"[452, 422, 529, 440]",MISC
1406,to,"[529, 422, 555, 440]",MISC
1407,support,"[555, 422, 645, 440]",MISC
1408,-,"[645, 422, 647, 440]",MISC
1409,NL,"[645, 422, 647, 440]",MISC
1410,-,"[645, 422, 647, 440]",MISC
1411,a,"[77, 456, 99, 473]",MISC
1412,.,"[77, 456, 99, 473]",MISC
1413,F,"[100, 456, 193, 473]",MISC
1414,##lex,"[100, 456, 193, 473]",MISC
1415,##ible,"[100, 456, 193, 473]",MISC
1416,ID,"[194, 456, 216, 473]",MISC
1417,neutral,"[217, 456, 298, 473]",MISC
1418,cases,"[299, 456, 356, 473]",MISC
1419,-,"[357, 456, 359, 473]",MISC
1420,NL,"[357, 456, 359, 473]",MISC
1421,-,"[357, 456, 359, 473]",MISC
1422,b,"[77, 489, 101, 506]",MISC
1423,.,"[77, 489, 101, 506]",MISC
1424,Multiple,"[101, 489, 197, 506]",MISC
1425,parallel,"[199, 489, 295, 506]",MISC
1426,case,"[296, 489, 344, 506]",MISC
1427,types,"[345, 489, 404, 506]",MISC
1428,for,"[405, 489, 440, 506]",MISC
1429,the,"[442, 489, 477, 506]",MISC
1430,same,"[478, 489, 526, 506]",MISC
1431,customer,"[527, 489, 623, 506]",MISC
1432,/,"[624, 489, 635, 506]",MISC
1433,business,"[637, 489, 732, 506]",MISC
1434,-,"[734, 489, 736, 506]",MISC
1435,NL,"[734, 489, 736, 506]",MISC
1436,-,"[734, 489, 736, 506]",MISC
1437,c,"[77, 522, 101, 539]",MISC
1438,.,"[77, 522, 101, 539]",MISC
1439,Tier,"[101, 522, 173, 539]",MISC
1440,##ed,"[101, 522, 173, 539]",MISC
1441,under,"[175, 522, 321, 539]",MISC
1442,##writing,"[175, 522, 321, 539]",MISC
1443,to,"[322, 522, 346, 539]",MISC
1444,support,"[347, 522, 431, 539]",MISC
1445,different,"[432, 522, 541, 539]",MISC
1446,under,"[543, 522, 688, 539]",MISC
1447,##writing,"[543, 522, 688, 539]",MISC
1448,process,"[690, 522, 774, 539]",MISC
1449,depending,"[775, 522, 884, 539]",MISC
1450,on,"[886, 522, 910, 539]",MISC
1451,the,"[910, 522, 945, 539]",MISC
1452,risk,"[947, 522, 995, 539]",MISC
1453,-,"[996, 522, 998, 539]",MISC
1454,NL,"[996, 522, 998, 539]",MISC
1455,-,"[996, 522, 998, 539]",MISC
1456,level,"[77, 542, 125, 559]",MISC
1457,-,"[125, 542, 127, 559]",MISC
1458,NL,"[125, 542, 127, 559]",MISC
1459,-,"[125, 542, 127, 559]",MISC
1460,•,"[77, 576, 90, 593]",MISC
1461,I,"[90, 576, 193, 593]",MISC
1462,##mp,"[90, 576, 193, 593]",MISC
1463,##roved,"[90, 576, 193, 593]",MISC
1464,end,"[195, 576, 298, 593]",MISC
1465,-,"[195, 576, 298, 593]",MISC
1466,user,"[195, 576, 298, 593]",MISC
1467,em,"[300, 576, 444, 593]",MISC
1468,##powerment,"[300, 576, 444, 593]",MISC
1469,-,"[444, 576, 446, 593]",MISC
1470,NL,"[444, 576, 446, 593]",MISC
1471,-,"[444, 576, 446, 593]",MISC
1472,•,"[77, 608, 90, 625]",MISC
1473,Red,"[90, 608, 181, 625]",MISC
1474,##uce,"[90, 608, 181, 625]",MISC
1475,##d,"[90, 608, 181, 625]",MISC
1476,operational,"[182, 608, 326, 625]",MISC
1477,costs,"[326, 608, 391, 625]",MISC
1478,by,"[392, 608, 418, 625]",MISC
1479,focusing,"[418, 608, 522, 625]",MISC
1480,on,"[523, 608, 549, 625]",MISC
1481,process,"[550, 608, 640, 625]",MISC
1482,e,"[641, 608, 798, 625]",MISC
1483,##ff,"[641, 608, 798, 625]",MISC
1484,##ici,"[641, 608, 798, 625]",MISC
1485,##encies,"[641, 608, 798, 625]",MISC
1486,and,"[799, 608, 838, 625]",MISC
1487,improving,"[838, 608, 956, 625]",MISC
1488,360,"[956, 608, 995, 625]",MISC
1489,-,"[996, 608, 998, 625]",MISC
1490,NL,"[996, 608, 998, 625]",MISC
1491,-,"[996, 608, 998, 625]",MISC
1492,degree,"[77, 628, 143, 646]",MISC
1493,quality,"[145, 628, 224, 646]",MISC
1494,-,"[225, 628, 226, 646]",MISC
1495,NL,"[225, 628, 226, 646]",MISC
1496,-,"[225, 628, 226, 646]",MISC
1497,Role,"[77, 662, 127, 679]",MISC
1498,and,"[127, 662, 164, 679]",MISC
1499,Re,"[165, 662, 364, 679]",MISC
1500,##sp,"[165, 662, 364, 679]",MISC
1501,##ons,"[165, 662, 364, 679]",MISC
1502,##ibi,"[165, 662, 364, 679]",MISC
1503,##lities,"[165, 662, 364, 679]",MISC
1504,-,"[365, 662, 367, 679]",MISC
1505,NL,"[365, 662, 367, 679]",MISC
1506,-,"[365, 662, 367, 679]",MISC
1507,Re,"[223, 698, 365, 711]",MISC
1508,##quire,"[223, 698, 365, 711]",MISC
1509,##ment,"[223, 698, 365, 711]",MISC
1510,Analysis,"[365, 698, 468, 711]",MISC
1511,-,"[468, 698, 470, 711]",MISC
1512,NL,"[468, 698, 470, 711]",MISC
1513,-,"[468, 698, 470, 711]",MISC
1514,Test,"[224, 716, 279, 729]",MISC
1515,Case,"[279, 716, 335, 729]",MISC
1516,Design,"[335, 716, 418, 729]",MISC
1517,-,"[418, 716, 420, 729]",MISC
1518,NL,"[418, 716, 420, 729]",MISC
1519,-,"[418, 716, 420, 729]",MISC
1520,Performance,"[223, 733, 365, 746]",MISC
1521,Testing,"[365, 733, 455, 746]",MISC
1522,-,"[455, 733, 457, 746]",MISC
1523,NL,"[455, 733, 457, 746]",MISC
1524,-,"[455, 733, 457, 746]",MISC
1525,De,"[224, 751, 309, 764]",MISC
1526,##fect,"[224, 751, 309, 764]",MISC
1527,Management,"[309, 751, 451, 764]",MISC
1528,-,"[452, 751, 453, 764]",MISC
1529,NL,"[452, 751, 453, 764]",MISC
1530,-,"[452, 751, 453, 764]",MISC
1531,RCA,"[223, 767, 262, 781]",MISC
1532,(,"[263, 767, 330, 781]",MISC
1533,Root,"[263, 767, 330, 781]",MISC
1534,Cause,"[330, 767, 397, 781]",MISC
1535,Analysis,"[397, 767, 517, 781]",MISC
1536,),"[397, 767, 517, 781]",MISC
1537,-,"[518, 767, 520, 781]",MISC
1538,NL,"[518, 767, 520, 781]",MISC
1539,-,"[518, 767, 520, 781]",MISC
1540,T,"[77, 850, 210, 868]",B-skills_heading
1541,##EC,"[77, 850, 210, 868]",I-skills_heading
1542,##H,"[77, 850, 210, 868]",I-skills_heading
1543,##NI,"[77, 850, 210, 868]",I-skills_heading
1544,##CA,"[77, 850, 210, 868]",I-skills_heading
1545,##L,"[77, 850, 210, 868]",I-skills_heading
1546,SK,"[211, 850, 314, 868]",I-skills_heading
1547,##IL,"[211, 850, 314, 868]",I-skills_heading
1548,##LS,"[211, 850, 314, 868]",I-skills_heading
1549,:,"[211, 850, 314, 868]",I-skills_heading
1550,-,"[315, 850, 317, 868]",MISC
1551,NL,"[315, 850, 317, 868]",MISC
1552,-,"[315, 850, 317, 868]",MISC
1553,BP,"[119, 916, 164, 934]",MISC
1554,##M,"[119, 916, 164, 934]",MISC
1555,Suite,"[165, 916, 241, 934]",MISC
1556,-,"[241, 916, 243, 934]",MISC
1557,NL,"[241, 916, 243, 934]",MISC
1558,-,"[241, 916, 243, 934]",MISC
1559,P,"[433, 916, 485, 934]",MISC
1560,##eg,"[433, 916, 485, 934]",MISC
1561,##a,"[433, 916, 485, 934]",MISC
1562,Rules,"[486, 916, 550, 934]",MISC
1563,Process,"[551, 916, 642, 934]",MISC
1564,Commander,"[643, 916, 761, 934]",MISC
1565,-,"[761, 916, 763, 934]",MISC
1566,NL,"[761, 916, 763, 934]",MISC
1567,-,"[761, 916, 763, 934]",MISC
1568,Operating,"[119, 938, 239, 955]",MISC
1569,Systems,"[240, 938, 332, 955]",MISC
1570,-,"[333, 938, 335, 955]",MISC
1571,NL,"[333, 938, 335, 955]",MISC
1572,-,"[333, 938, 335, 955]",MISC
1573,Windows,"[428, 938, 516, 954]",MISC
1574,X,"[517, 938, 554, 954]",MISC
1575,##P,"[517, 938, 554, 954]",MISC
1576,",","[517, 938, 554, 954]",MISC
1577,Vista,"[555, 938, 631, 954]",MISC
1578,",","[555, 938, 631, 954]",MISC
1579,Windows,"[632, 938, 746, 954]",MISC
1580,-,"[632, 938, 746, 954]",MISC
1581,7,"[632, 938, 746, 954]",MISC
1582,-,"[747, 938, 749, 954]",MISC
1583,NL,"[747, 938, 749, 954]",MISC
1584,-,"[747, 938, 749, 954]",MISC
1585,Languages,"[119, 958, 243, 975]",B-others_heading
1586,-,"[243, 958, 245, 975]",MISC
1587,NL,"[243, 958, 245, 975]",MISC
1588,-,"[243, 958, 245, 975]",MISC
1589,C,"[428, 958, 514, 975]",MISC
1590,",","[428, 958, 514, 975]",MISC
1591,H,"[428, 958, 514, 975]",MISC
1592,##TM,"[428, 958, 514, 975]",MISC
1593,##L,"[428, 958, 514, 975]",MISC
1594,-,"[514, 958, 516, 975]",MISC
1595,NL,"[514, 958, 516, 975]",MISC
1596,-,"[514, 958, 516, 975]",MISC
1597,C,"[77, 982, 190, 999]",B-others_heading
1598,##ur,"[77, 982, 190, 999]",I-others_heading
1599,##ric,"[77, 982, 190, 999]",I-others_heading
1600,##ulum,"[77, 982, 190, 999]",I-others_heading
1601,Vita,"[190, 982, 246, 999]",I-others_heading
1602,##e,"[190, 982, 246, 999]",I-others_heading
1603,-,"[247, 982, 249, 999]",MISC
1604,NL,"[247, 982, 249, 999]",MISC
1605,-,"[247, 982, 249, 999]",MISC
1606,Database,"[119, 72, 225, 90]",MISC
1607,-,"[225, 72, 226, 90]",MISC
1608,NL,"[225, 72, 226, 90]",MISC
1609,-,"[225, 72, 226, 90]",MISC
1610,Oracle,"[428, 72, 584, 90]",MISC
1611,##10,"[428, 72, 584, 90]",MISC
1612,##g,"[428, 72, 584, 90]",MISC
1613,",","[428, 72, 584, 90]",MISC
1614,DB,"[428, 72, 584, 90]",MISC
1615,##2,"[428, 72, 584, 90]",MISC
1616,-,"[584, 72, 586, 90]",MISC
1617,NL,"[584, 72, 586, 90]",MISC
1618,-,"[584, 72, 586, 90]",MISC
1619,Too,"[119, 94, 180, 111]",MISC
1620,##ls,"[119, 94, 180, 111]",MISC
1621,-,"[180, 94, 182, 111]",MISC
1622,NL,"[180, 94, 182, 111]",MISC
1623,-,"[180, 94, 182, 111]",MISC
1624,HP,"[428, 94, 492, 111]",MISC
1625,##Q,"[428, 94, 492, 111]",MISC
1626,##C,"[428, 94, 492, 111]",MISC
1627,",","[428, 94, 492, 111]",MISC
1628,Se,"[494, 94, 599, 111]",MISC
1629,##len,"[494, 94, 599, 111]",MISC
1630,##ium,"[494, 94, 599, 111]",MISC
1631,-,"[599, 94, 601, 111]",MISC
1632,NL,"[599, 94, 601, 111]",MISC
1633,-,"[599, 94, 601, 111]",MISC
1634,Process,"[119, 114, 210, 131]",MISC
1635,Model,"[212, 114, 317, 131]",MISC
1636,##ler,"[212, 114, 317, 131]",MISC
1637,-,"[317, 114, 319, 131]",MISC
1638,NL,"[317, 114, 319, 131]",MISC
1639,-,"[317, 114, 319, 131]",MISC
1640,Microsoft,"[428, 114, 527, 131]",MISC
1641,V,"[527, 114, 583, 131]",MISC
1642,##isi,"[527, 114, 583, 131]",MISC
1643,##o,"[527, 114, 583, 131]",MISC
1644,-,"[583, 114, 584, 131]",MISC
1645,NL,"[583, 114, 584, 131]",MISC
1646,-,"[583, 114, 584, 131]",MISC
1647,CE,"[79, 184, 280, 201]",B-others_heading
1648,##RT,"[79, 184, 280, 201]",I-others_heading
1649,##IF,"[79, 184, 280, 201]",I-others_heading
1650,##IC,"[79, 184, 280, 201]",I-others_heading
1651,##AT,"[79, 184, 280, 201]",I-others_heading
1652,##ION,"[79, 184, 280, 201]",I-others_heading
1653,##S,"[79, 184, 280, 201]",I-others_heading
1654,&,"[280, 184, 293, 201]",I-others_heading
1655,Achievement,"[294, 184, 481, 201]",I-others_heading
1656,##s,"[294, 184, 481, 201]",I-others_heading
1657,:,"[294, 184, 481, 201]",I-others_heading
1658,-,"[481, 184, 483, 201]",MISC
1659,NL,"[481, 184, 483, 201]",MISC
1660,-,"[481, 184, 483, 201]",MISC
1661,2012,"[124, 218, 175, 231]",MISC
1662,–,"[177, 218, 190, 231]",MISC
1663,PR,"[190, 218, 242, 231]",MISC
1664,##PC,"[190, 218, 242, 231]",MISC
1665,Co,"[243, 218, 361, 231]",MISC
1666,##gni,"[243, 218, 361, 231]",MISC
1667,##zan,"[243, 218, 361, 231]",MISC
1668,##t,"[243, 218, 361, 231]",MISC
1669,Certified,"[363, 218, 481, 231]",MISC
1670,Programme,"[483, 218, 616, 231]",MISC
1671,##r,"[483, 218, 616, 231]",MISC
1672,v,"[616, 218, 668, 231]",MISC
1673,##6,"[616, 218, 668, 231]",MISC
1674,.,"[616, 218, 668, 231]",MISC
1675,1,"[616, 218, 668, 231]",MISC
1676,-,"[669, 218, 671, 231]",MISC
1677,NL,"[669, 218, 671, 231]",MISC
1678,-,"[669, 218, 671, 231]",MISC
1679,2013,"[123, 232, 237, 246]",MISC
1680,-,"[123, 232, 237, 246]",MISC
1681,PR,"[123, 232, 237, 246]",MISC
1682,##PC,"[123, 232, 237, 246]",MISC
1683,Certified,"[238, 232, 352, 246]",MISC
1684,Method,"[353, 232, 493, 246]",MISC
1685,##ology,"[353, 232, 493, 246]",MISC
1686,Black,"[493, 232, 556, 246]",MISC
1687,Belt,"[557, 232, 607, 246]",MISC
1688,-,"[608, 232, 610, 246]",MISC
1689,NL,"[608, 232, 610, 246]",MISC
1690,-,"[608, 232, 610, 246]",MISC
1691,Certified,"[123, 247, 237, 261]",MISC
1692,as,"[238, 247, 262, 261]",MISC
1693,the,"[264, 247, 300, 261]",MISC
1694,“,"[302, 247, 378, 261]",MISC
1695,Going,"[302, 247, 378, 261]",MISC
1696,Extra,"[379, 247, 441, 261]",MISC
1697,Mile,"[442, 247, 505, 261]",MISC
1698,”,"[442, 247, 505, 261]",MISC
1699,for,"[506, 247, 543, 261]",MISC
1700,Q,"[545, 247, 633, 261]",MISC
1701,##4,"[545, 247, 633, 261]",MISC
1702,",","[545, 247, 633, 261]",MISC
1703,2013,"[545, 247, 633, 261]",MISC
1704,-,"[634, 247, 636, 261]",MISC
1705,NL,"[634, 247, 636, 261]",MISC
1706,-,"[634, 247, 636, 261]",MISC
1707,Award,"[124, 263, 216, 277]",MISC
1708,##ed,"[124, 263, 216, 277]",MISC
1709,as,"[217, 263, 243, 277]",MISC
1710,the,"[244, 263, 282, 277]",MISC
1711,“,"[283, 263, 350, 277]",MISC
1712,Best,"[283, 263, 350, 277]",MISC
1713,Project,"[350, 263, 455, 277]",MISC
1714,”,"[350, 263, 455, 277]",MISC
1715,from,"[457, 263, 508, 277]",MISC
1716,the,"[510, 263, 549, 277]",MISC
1717,account,"[550, 263, 642, 277]",MISC
1718,-,"[643, 263, 645, 277]",MISC
1719,NL,"[643, 263, 645, 277]",MISC
1720,-,"[643, 263, 645, 277]",MISC
1721,P,"[81, 329, 206, 347]",B-personal_details_heading
1722,##ER,"[81, 329, 206, 347]",I-personal_details_heading
1723,##SO,"[81, 329, 206, 347]",I-personal_details_heading
1724,##NA,"[81, 329, 206, 347]",I-personal_details_heading
1725,##L,"[81, 329, 206, 347]",I-personal_details_heading
1726,B,"[208, 329, 366, 347]",I-personal_details_heading
1727,##IO,"[208, 329, 366, 347]",I-personal_details_heading
1728,##GR,"[208, 329, 366, 347]",I-personal_details_heading
1729,##AP,"[208, 329, 366, 347]",I-personal_details_heading
1730,##H,"[208, 329, 366, 347]",I-personal_details_heading
1731,##Y,"[208, 329, 366, 347]",I-personal_details_heading
1732,:,"[208, 329, 366, 347]",I-personal_details_heading
1733,-,"[367, 329, 369, 347]",MISC
1734,NL,"[367, 329, 369, 347]",MISC
1735,-,"[367, 329, 369, 347]",MISC
1736,Date,"[79, 388, 127, 405]",MISC
1737,of,"[127, 388, 151, 405]",MISC
1738,Birth,"[151, 388, 210, 405]",MISC
1739,-,"[212, 388, 214, 405]",MISC
1740,NL,"[212, 388, 214, 405]",MISC
1741,-,"[212, 388, 214, 405]",MISC
1742,16th,"[285, 388, 332, 405]",MISC
1743,January,"[333, 388, 427, 405]",MISC
1744,",","[333, 388, 427, 405]",MISC
1745,1989,"[427, 388, 473, 405]",MISC
1746,-,"[474, 388, 476, 405]",MISC
1747,NL,"[474, 388, 476, 405]",MISC
1748,-,"[474, 388, 476, 405]",MISC
1749,Sex,"[79, 410, 116, 426]",MISC
1750,-,"[116, 410, 118, 426]",MISC
1751,NL,"[116, 410, 118, 426]",MISC
1752,-,"[116, 410, 118, 426]",MISC
1753,Female,"[285, 410, 361, 426]",MISC
1754,-,"[361, 410, 363, 426]",MISC
1755,NL,"[361, 410, 363, 426]",MISC
1756,-,"[361, 410, 363, 426]",MISC
1757,Mari,"[79, 432, 158, 448]",MISC
1758,##tal,"[79, 432, 158, 448]",MISC
1759,Status,"[158, 432, 225, 448]",MISC
1760,-,"[226, 432, 228, 448]",MISC
1761,NL,"[226, 432, 228, 448]",MISC
1762,-,"[226, 432, 228, 448]",MISC
1763,Single,"[285, 432, 350, 448]",MISC
1764,-,"[350, 432, 352, 448]",MISC
1765,NL,"[350, 432, 352, 448]",MISC
1766,-,"[350, 432, 352, 448]",MISC
1767,PA,"[79, 453, 123, 469]",MISC
1768,##N,"[79, 453, 123, 469]",MISC
1769,Number,"[124, 453, 215, 469]",MISC
1770,-,"[215, 453, 217, 469]",MISC
1771,NL,"[215, 453, 217, 469]",MISC
1772,-,"[215, 453, 217, 469]",MISC
1773,AT,"[285, 453, 422, 469]",MISC
1774,##IP,"[285, 453, 422, 469]",MISC
1775,##M,"[285, 453, 422, 469]",MISC
1776,##0,"[285, 453, 422, 469]",MISC
1777,##53,"[285, 453, 422, 469]",MISC
1778,##7,"[285, 453, 422, 469]",MISC
1779,##F,"[285, 453, 422, 469]",MISC
1780,-,"[422, 453, 424, 469]",MISC
1781,NL,"[422, 453, 424, 469]",MISC
1782,-,"[422, 453, 424, 469]",MISC
1783,Current,"[77, 484, 169, 502]",MISC
1784,Ad,"[170, 484, 262, 502]",MISC
1785,##dress,"[170, 484, 262, 502]",MISC
1786,R,"[262, 484, 288, 502]",MISC
1787,##D,"[262, 484, 288, 502]",MISC
1788,4,"[289, 484, 606, 502]",MISC
1789,/,"[289, 484, 606, 502]",MISC
1790,5,"[289, 484, 606, 502]",MISC
1791,",","[289, 484, 606, 502]",MISC
1792,Ra,"[289, 484, 606, 502]",MISC
1793,##gh,"[289, 484, 606, 502]",MISC
1794,##una,"[289, 484, 606, 502]",MISC
1795,##th,"[289, 484, 606, 502]",MISC
1796,##pur,"[289, 484, 606, 502]",MISC
1797,",","[289, 484, 606, 502]",MISC
1798,Kolkata,"[289, 484, 606, 502]",MISC
1799,700,"[606, 484, 686, 502]",MISC
1800,##0,"[606, 484, 686, 502]",MISC
1801,##5,"[606, 484, 686, 502]",MISC
1802,##9,"[606, 484, 686, 502]",MISC
1803,-,"[686, 484, 688, 502]",MISC
1804,NL,"[686, 484, 688, 502]",MISC
1805,-,"[686, 484, 688, 502]",MISC
1806,Pre,"[77, 503, 177, 519]",MISC
1807,##ferred,"[77, 503, 177, 519]",MISC
1808,-,"[177, 503, 178, 519]",MISC
1809,NL,"[177, 503, 178, 519]",MISC
1810,-,"[177, 503, 178, 519]",MISC
1811,Location,"[77, 519, 166, 537]",MISC
1812,-,"[166, 519, 167, 537]",MISC
1813,NL,"[166, 519, 167, 537]",MISC
1814,-,"[166, 519, 167, 537]",MISC
1815,Kolkata,"[291, 519, 370, 537]",MISC
1816,-,"[370, 519, 372, 537]",MISC
1817,NL,"[370, 519, 372, 537]",MISC
1818,-,"[370, 519, 372, 537]",MISC
1819,C,"[77, 555, 201, 572]",B-others_heading
1820,##ur,"[77, 555, 201, 572]",I-others_heading
1821,##ric,"[77, 555, 201, 572]",I-others_heading
1822,##ulum,"[77, 555, 201, 572]",I-others_heading
1823,Det,"[202, 555, 302, 572]",I-others_heading
1824,##ails,"[202, 555, 302, 572]",I-others_heading
1825,:,"[202, 555, 302, 572]",I-others_heading
1826,-,"[302, 555, 304, 572]",MISC
1827,NL,"[302, 555, 304, 572]",MISC
1828,-,"[302, 555, 304, 572]",MISC
1829,Ex,"[86, 573, 228, 590]",MISC
1830,##ami,"[86, 573, 228, 590]",MISC
1831,##nat,"[86, 573, 228, 590]",MISC
1832,##io,"[86, 573, 228, 590]",MISC
1833,Year,"[230, 573, 287, 590]",MISC
1834,Institut,"[287, 573, 429, 590]",MISC
1835,##io,"[287, 573, 429, 590]",MISC
1836,Per,"[431, 573, 560, 590]",MISC
1837,##cent,"[431, 573, 560, 590]",MISC
1838,##ag,"[431, 573, 560, 590]",MISC
1839,-,"[560, 573, 562, 590]",MISC
1840,NL,"[560, 573, 562, 590]",MISC
1841,-,"[560, 573, 562, 590]",MISC
1842,n,"[86, 590, 127, 608]",MISC
1843,Pass,"[127, 590, 292, 608]",MISC
1844,n,"[292, 590, 333, 608]",MISC
1845,e,"[333, 590, 497, 608]",MISC
1846,(,"[333, 590, 497, 608]",MISC
1847,%,"[333, 590, 497, 608]",MISC
1848,),"[333, 590, 497, 608]",MISC
1849,-,"[498, 590, 500, 608]",MISC
1850,NL,"[498, 590, 500, 608]",MISC
1851,-,"[498, 590, 500, 608]",MISC
1852,ed,"[239, 608, 267, 625]",MISC
1853,-,"[267, 608, 269, 625]",MISC
1854,NL,"[267, 608, 269, 625]",MISC
1855,-,"[267, 608, 269, 625]",MISC
1856,Master,"[86, 625, 160, 643]",MISC
1857,of,"[161, 625, 185, 643]",MISC
1858,-,"[186, 625, 188, 643]",MISC
1859,NL,"[186, 625, 188, 643]",MISC
1860,-,"[186, 625, 188, 643]",MISC
1861,2017,"[239, 625, 308, 643]",MISC
1862,N,"[309, 625, 361, 643]",MISC
1863,##IT,"[309, 625, 361, 643]",MISC
1864,-,"[361, 625, 363, 643]",MISC
1865,NL,"[361, 625, 363, 643]",MISC
1866,-,"[361, 625, 363, 643]",MISC
1867,9,"[446, 625, 570, 643]",MISC
1868,.,"[446, 625, 570, 643]",MISC
1869,57,"[446, 625, 570, 643]",MISC
1870,(,"[446, 625, 570, 643]",MISC
1871,D,"[446, 625, 570, 643]",MISC
1872,##GP,"[446, 625, 570, 643]",MISC
1873,##A,"[446, 625, 570, 643]",MISC
1874,-,"[570, 625, 571, 643]",MISC
1875,NL,"[570, 625, 571, 643]",MISC
1876,-,"[570, 625, 571, 643]",MISC
1877,Technology,"[86, 643, 204, 660]",MISC
1878,-,"[204, 643, 206, 660]",MISC
1879,NL,"[204, 643, 206, 660]",MISC
1880,-,"[204, 643, 206, 660]",MISC
1881,Du,"[317, 643, 437, 660]",MISC
1882,##rga,"[317, 643, 437, 660]",MISC
1883,##pu,"[317, 643, 437, 660]",MISC
1884,),"[438, 643, 455, 660]",MISC
1885,-,"[455, 643, 457, 660]",MISC
1886,NL,"[455, 643, 457, 660]",MISC
1887,-,"[455, 643, 457, 660]",MISC
1888,in,"[86, 660, 107, 676]",MISC
1889,-,"[107, 660, 108, 676]",MISC
1890,NL,"[107, 660, 108, 676]",MISC
1891,-,"[107, 660, 108, 676]",MISC
1892,r,"[317, 660, 328, 678]",MISC
1893,-,"[328, 660, 330, 678]",MISC
1894,NL,"[328, 660, 330, 678]",MISC
1895,-,"[328, 660, 330, 678]",MISC
1896,Electronics,"[86, 676, 202, 694]",MISC
1897,-,"[202, 676, 204, 694]",MISC
1898,NL,"[202, 676, 204, 694]",MISC
1899,-,"[202, 676, 204, 694]",MISC
1900,and,"[86, 694, 125, 711]",MISC
1901,-,"[125, 694, 127, 711]",MISC
1902,NL,"[125, 694, 127, 711]",MISC
1903,-,"[125, 694, 127, 711]",MISC
1904,Co,"[86, 711, 217, 729]",MISC
1905,##mm,"[86, 711, 217, 729]",MISC
1906,##uni,"[86, 711, 217, 729]",MISC
1907,##cat,"[86, 711, 217, 729]",MISC
1908,-,"[217, 711, 219, 729]",MISC
1909,NL,"[217, 711, 219, 729]",MISC
1910,-,"[217, 711, 219, 729]",MISC
1911,ion,"[86, 729, 118, 746]",MISC
1912,-,"[118, 729, 119, 746]",MISC
1913,NL,"[118, 729, 119, 746]",MISC
1914,-,"[118, 729, 119, 746]",MISC
1915,Engineering,"[86, 746, 214, 763]",MISC
1916,-,"[214, 746, 215, 763]",MISC
1917,NL,"[214, 746, 215, 763]",MISC
1918,-,"[214, 746, 215, 763]",MISC
1919,.,"[86, 763, 94, 780]",MISC
1920,-,"[94, 763, 95, 780]",MISC
1921,NL,"[94, 763, 95, 780]",MISC
1922,-,"[94, 763, 95, 780]",MISC
1923,Bachelor,"[86, 781, 217, 799]",MISC
1924,of,"[218, 781, 250, 799]",MISC
1925,2011,"[251, 781, 316, 799]",MISC
1926,RC,"[317, 781, 365, 799]",MISC
1927,##C,"[317, 781, 365, 799]",MISC
1928,-,"[367, 781, 369, 799]",MISC
1929,NL,"[367, 781, 369, 799]",MISC
1930,-,"[367, 781, 369, 799]",MISC
1931,8,"[446, 781, 570, 799]",MISC
1932,.,"[446, 781, 570, 799]",MISC
1933,31,"[446, 781, 570, 799]",MISC
1934,(,"[446, 781, 570, 799]",MISC
1935,D,"[446, 781, 570, 799]",MISC
1936,##GP,"[446, 781, 570, 799]",MISC
1937,##A,"[446, 781, 570, 799]",MISC
1938,-,"[570, 781, 571, 799]",MISC
1939,NL,"[570, 781, 571, 799]",MISC
1940,-,"[570, 781, 571, 799]",MISC
1941,Technology,"[86, 799, 204, 815]",MISC
1942,-,"[204, 799, 206, 815]",MISC
1943,NL,"[204, 799, 206, 815]",MISC
1944,-,"[204, 799, 206, 815]",MISC
1945,Institute,"[317, 799, 440, 816]",MISC
1946,),"[441, 799, 454, 816]",MISC
1947,-,"[455, 799, 457, 816]",MISC
1948,NL,"[455, 799, 457, 816]",MISC
1949,-,"[455, 799, 457, 816]",MISC
1950,in,"[86, 815, 107, 833]",MISC
1951,-,"[107, 815, 108, 833]",MISC
1952,NL,"[107, 815, 108, 833]",MISC
1953,-,"[107, 815, 108, 833]",MISC
1954,of,"[317, 815, 339, 834]",MISC
1955,-,"[339, 815, 341, 834]",MISC
1956,NL,"[339, 815, 341, 834]",MISC
1957,-,"[339, 815, 341, 834]",MISC
1958,Electronics,"[86, 833, 202, 850]",MISC
1959,-,"[202, 833, 204, 850]",MISC
1960,NL,"[202, 833, 204, 850]",MISC
1961,-,"[202, 833, 204, 850]",MISC
1962,In,"[317, 833, 418, 850]",MISC
1963,##form,"[317, 833, 418, 850]",MISC
1964,##at,"[317, 833, 418, 850]",MISC
1965,-,"[418, 833, 420, 850]",MISC
1966,NL,"[418, 833, 420, 850]",MISC
1967,-,"[418, 833, 420, 850]",MISC
1968,and,"[86, 850, 125, 868]",MISC
1969,-,"[125, 850, 127, 868]",MISC
1970,NL,"[125, 850, 127, 868]",MISC
1971,-,"[125, 850, 127, 868]",MISC
1972,ion,"[317, 850, 354, 868]",MISC
1973,-,"[354, 850, 356, 868]",MISC
1974,NL,"[354, 850, 356, 868]",MISC
1975,-,"[354, 850, 356, 868]",MISC
1976,Co,"[86, 868, 217, 885]",MISC
1977,##mm,"[86, 868, 217, 885]",MISC
1978,##uni,"[86, 868, 217, 885]",MISC
1979,##cat,"[86, 868, 217, 885]",MISC
1980,-,"[217, 868, 219, 885]",MISC
1981,NL,"[217, 868, 219, 885]",MISC
1982,-,"[217, 868, 219, 885]",MISC
1983,Tech,"[317, 868, 422, 885]",MISC
1984,##no,"[317, 868, 422, 885]",MISC
1985,##lo,"[317, 868, 422, 885]",MISC
1986,-,"[422, 868, 424, 885]",MISC
1987,NL,"[422, 868, 424, 885]",MISC
1988,-,"[422, 868, 424, 885]",MISC
1989,ion,"[86, 885, 118, 901]",MISC
1990,-,"[118, 885, 119, 901]",MISC
1991,NL,"[118, 885, 119, 901]",MISC
1992,-,"[118, 885, 119, 901]",MISC
1993,g,"[317, 885, 343, 903]",MISC
1994,##y,"[317, 885, 343, 903]",MISC
1995,-,"[343, 885, 345, 903]",MISC
1996,NL,"[343, 885, 345, 903]",MISC
1997,-,"[343, 885, 345, 903]",MISC
1998,Engineering,"[86, 901, 214, 919]",MISC
1999,-,"[214, 901, 215, 919]",MISC
2000,NL,"[214, 901, 215, 919]",MISC
2001,-,"[214, 901, 215, 919]",MISC
2002,.,"[86, 919, 94, 936]",MISC
2003,-,"[94, 919, 95, 936]",MISC
2004,NL,"[94, 919, 95, 936]",MISC
2005,-,"[94, 919, 95, 936]",MISC
2006,Class,"[86, 936, 142, 954]",MISC
2007,-,"[142, 936, 143, 954]",MISC
2008,NL,"[142, 936, 143, 954]",MISC
2009,-,"[142, 936, 143, 954]",MISC
2010,2007,"[239, 936, 317, 954]",MISC
2011,LA,"[317, 936, 434, 954]",MISC
2012,##KE,"[317, 936, 434, 954]",MISC
2013,##TO,"[317, 936, 434, 954]",MISC
2014,73,"[435, 936, 473, 954]",MISC
2015,-,"[474, 936, 476, 954]",MISC
2016,NL,"[474, 936, 476, 954]",MISC
2017,-,"[474, 936, 476, 954]",MISC
2018,XII,"[86, 954, 214, 971]",B-education_degree
2019,(,"[86, 954, 214, 971]",MISC
2020,W,"[86, 954, 214, 971]",MISC
2021,.,"[86, 954, 214, 971]",MISC
2022,B,"[86, 954, 214, 971]",MISC
2023,.,"[86, 954, 214, 971]",MISC
2024,C,"[86, 954, 214, 971]",MISC
2025,.,"[86, 954, 214, 971]",MISC
2026,H,"[86, 954, 214, 971]",MISC
2027,-,"[214, 954, 215, 971]",MISC
2028,NL,"[214, 954, 215, 971]",MISC
2029,-,"[214, 954, 215, 971]",MISC
2030,W,"[317, 954, 359, 971]",MISC
2031,##N,"[317, 954, 359, 971]",MISC
2032,-,"[359, 954, 361, 971]",MISC
2033,NL,"[359, 954, 361, 971]",MISC
2034,-,"[359, 954, 361, 971]",MISC
2035,C,"[77, 982, 190, 999]",MISC
2036,##ur,"[77, 982, 190, 999]",MISC
2037,##ric,"[77, 982, 190, 999]",MISC
2038,##ulum,"[77, 982, 190, 999]",MISC
2039,Vita,"[190, 982, 246, 999]",MISC
2040,##e,"[190, 982, 246, 999]",MISC
2041,-,"[247, 982, 249, 999]",MISC
2042,NL,"[247, 982, 249, 999]",MISC
2043,-,"[247, 982, 249, 999]",MISC
2044,.,"[86, 69, 136, 87]",MISC
2045,S,"[86, 69, 136, 87]",MISC
2046,.,"[86, 69, 136, 87]",MISC
2047,E,"[86, 69, 136, 87]",MISC
2048,),"[86, 69, 136, 87]",MISC
2049,-,"[136, 69, 138, 87]",MISC
2050,NL,"[136, 69, 138, 87]",MISC
2051,-,"[136, 69, 138, 87]",MISC
2052,GO,"[317, 69, 391, 87]",MISC
2053,##V,"[317, 69, 391, 87]",MISC
2054,##T,"[317, 69, 391, 87]",MISC
2055,.,"[317, 69, 391, 87]",MISC
2056,-,"[391, 69, 392, 87]",MISC
2057,NL,"[391, 69, 392, 87]",MISC
2058,-,"[391, 69, 392, 87]",MISC
2059,SP,"[317, 87, 398, 104]",MISC
2060,##ON,"[317, 87, 398, 104]",MISC
2061,##S,"[317, 87, 398, 104]",MISC
2062,-,"[398, 87, 400, 104]",MISC
2063,NL,"[398, 87, 400, 104]",MISC
2064,-,"[398, 87, 400, 104]",MISC
2065,G,"[317, 104, 391, 122]",MISC
2066,##IR,"[317, 104, 391, 122]",MISC
2067,##LS,"[317, 104, 391, 122]",MISC
2068,-,"[391, 104, 392, 122]",MISC
2069,NL,"[391, 104, 392, 122]",MISC
2070,-,"[391, 104, 392, 122]",MISC
2071,H,"[317, 122, 383, 139]",MISC
2072,##IG,"[317, 122, 383, 139]",MISC
2073,##H,"[317, 122, 383, 139]",MISC
2074,-,"[383, 122, 385, 139]",MISC
2075,NL,"[383, 122, 385, 139]",MISC
2076,-,"[383, 122, 385, 139]",MISC
2077,SC,"[317, 139, 416, 157]",MISC
2078,##H,"[317, 139, 416, 157]",MISC
2079,##O,"[317, 139, 416, 157]",MISC
2080,##OL,"[317, 139, 416, 157]",MISC
2081,-,"[416, 139, 418, 157]",MISC
2082,NL,"[416, 139, 418, 157]",MISC
2083,-,"[416, 139, 418, 157]",MISC
2084,Class,"[86, 157, 142, 174]",MISC
2085,-,"[142, 157, 143, 174]",MISC
2086,NL,"[142, 157, 143, 174]",MISC
2087,-,"[142, 157, 143, 174]",MISC
2088,2005,"[239, 157, 313, 174]",MISC
2089,R,"[314, 157, 388, 174]",MISC
2090,##KS,"[314, 157, 388, 174]",MISC
2091,##M,"[314, 157, 388, 174]",MISC
2092,-,"[389, 157, 391, 174]",MISC
2093,NL,"[389, 157, 391, 174]",MISC
2094,-,"[389, 157, 391, 174]",MISC
2095,82,"[446, 157, 474, 174]",MISC
2096,-,"[474, 157, 476, 174]",MISC
2097,NL,"[474, 157, 476, 174]",MISC
2098,-,"[474, 157, 476, 174]",MISC
2099,X,"[86, 174, 214, 192]",B-education_degree
2100,(,"[86, 174, 214, 192]",MISC
2101,W,"[86, 174, 214, 192]",MISC
2102,.,"[86, 174, 214, 192]",MISC
2103,B,"[86, 174, 214, 192]",MISC
2104,.,"[86, 174, 214, 192]",MISC
2105,B,"[86, 174, 214, 192]",MISC
2106,.,"[86, 174, 214, 192]",MISC
2107,S,"[86, 174, 214, 192]",MISC
2108,.,"[86, 174, 214, 192]",MISC
2109,E,"[86, 174, 214, 192]",MISC
2110,-,"[214, 174, 215, 192]",MISC
2111,NL,"[214, 174, 215, 192]",MISC
2112,-,"[214, 174, 215, 192]",MISC
2113,S,"[317, 174, 404, 192]",MISC
2114,##IS,"[317, 174, 404, 192]",MISC
2115,##TE,"[317, 174, 404, 192]",MISC
2116,##R,"[317, 174, 404, 192]",MISC
2117,-,"[404, 174, 405, 192]",MISC
2118,NL,"[404, 174, 405, 192]",MISC
2119,-,"[404, 174, 405, 192]",MISC
2120,),"[86, 192, 127, 209]",MISC
2121,N,"[128, 192, 417, 209]",MISC
2122,##IVE,"[128, 192, 417, 209]",MISC
2123,##DI,"[128, 192, 417, 209]",MISC
2124,##T,"[128, 192, 417, 209]",MISC
2125,-,"[418, 192, 420, 209]",MISC
2126,NL,"[418, 192, 420, 209]",MISC
2127,-,"[418, 192, 420, 209]",MISC
2128,A,"[317, 209, 332, 227]",MISC
2129,G,"[333, 209, 412, 227]",MISC
2130,##IR,"[333, 209, 412, 227]",MISC
2131,##LS,"[333, 209, 412, 227]",MISC
2132,-,"[413, 209, 415, 227]",MISC
2133,NL,"[413, 209, 415, 227]",MISC
2134,-,"[413, 209, 415, 227]",MISC
2135,SC,"[317, 227, 416, 244]",MISC
2136,##H,"[317, 227, 416, 244]",MISC
2137,##O,"[317, 227, 416, 244]",MISC
2138,##OL,"[317, 227, 416, 244]",MISC
2139,-,"[416, 227, 418, 244]",MISC
2140,NL,"[416, 227, 418, 244]",MISC
2141,-,"[416, 227, 418, 244]",MISC
2142,DE,"[77, 279, 228, 297]",MISC
2143,##CL,"[77, 279, 228, 297]",MISC
2144,##AR,"[77, 279, 228, 297]",MISC
2145,##AT,"[77, 279, 228, 297]",MISC
2146,##ION,"[77, 279, 228, 297]",MISC
2147,:,"[77, 279, 228, 297]",MISC
2148,I,"[229, 279, 240, 297]",MISC
2149,here,"[242, 279, 318, 297]",MISC
2150,##by,"[242, 279, 318, 297]",MISC
2151,declare,"[318, 279, 407, 297]",MISC
2152,that,"[407, 279, 457, 297]",MISC
2153,the,"[458, 279, 494, 297]",MISC
2154,information,"[496, 279, 660, 297]",MISC
2155,’,"[496, 279, 660, 297]",MISC
2156,s,"[496, 279, 660, 297]",MISC
2157,furnished,"[660, 279, 773, 297]",MISC
2158,above,"[775, 279, 837, 297]",MISC
2159,are,"[838, 279, 875, 297]",MISC
2160,true,"[876, 279, 926, 297]",MISC
2161,to,"[927, 279, 951, 297]",MISC
2162,the,"[952, 279, 989, 297]",MISC
2163,-,"[990, 279, 992, 297]",MISC
2164,NL,"[990, 279, 992, 297]",MISC
2165,-,"[990, 279, 992, 297]",MISC
2166,best,"[77, 297, 127, 314]",MISC
2167,of,"[128, 297, 152, 314]",MISC
2168,my,"[154, 297, 178, 314]",MISC
2169,knowledge,"[179, 297, 307, 314]",MISC
2170,.,"[179, 297, 307, 314]",MISC
2171,-,"[308, 297, 309, 314]",MISC
2172,NL,"[308, 297, 309, 314]",MISC
2173,-,"[308, 297, 309, 314]",MISC
2174,E,"[863, 347, 931, 364]",B-name
2175,##kata,"[863, 347, 931, 364]",I-name
2176,Mi,"[931, 347, 1000, 364]",I-name
2177,##tra,"[931, 347, 1000, 364]",I-name
2178,-,"[1000, 347, 1001, 364]",MISC
2179,NL,"[1000, 347, 1001, 364]",MISC
2180,-,"[1000, 347, 1001, 364]",MISC
2181,C,"[77, 982, 190, 999]",MISC
2182,##ur,"[77, 982, 190, 999]",MISC
2183,##ric,"[77, 982, 190, 999]",MISC
2184,##ulum,"[77, 982, 190, 999]",MISC
2185,Vita,"[190, 982, 246, 999]",MISC
2186,##e,"[190, 982, 246, 999]",MISC
2187,-,"[247, 982, 249, 999]",MISC
2188,NL,"[247, 982, 249, 999]",MISC
2189,-,"[247, 982, 249, 999]",MISC
