,token,box,label
0,AM,"[88, 260, 218, 275]",B-name
1,##R,"[88, 260, 218, 275]",I-name
2,##UT,"[88, 260, 218, 275]",I-name
3,##H,"[88, 260, 218, 275]",I-name
4,##ES,"[88, 260, 218, 275]",I-name
5,##H,"[88, 260, 218, 275]",I-name
6,.,"[88, 260, 218, 275]",I-name
7,G,"[88, 260, 218, 275]",I-name
8,-,"[218, 260, 220, 275]",MISC
9,NL,"[218, 260, 220, 275]",MISC
10,-,"[218, 260, 220, 275]",MISC
11,Mail,"[83, 282, 107, 292]",MISC
12,to,"[108, 282, 125, 292]",MISC
13,:,"[108, 282, 125, 292]",MISC
14,am,"[127, 282, 264, 292]",B-emails_email
15,##ru,"[127, 282, 264, 292]",I-emails_email
16,##th,"[127, 282, 264, 292]",I-emails_email
17,##0,"[127, 282, 264, 292]",I-emails_email
18,##8,"[127, 282, 264, 292]",I-emails_email
19,##am,"[127, 282, 264, 292]",I-emails_email
20,##mu,"[127, 282, 264, 292]",I-emails_email
21,@,"[127, 282, 264, 292]",I-emails_email
22,g,"[127, 282, 264, 292]",I-emails_email
23,##mail,"[127, 282, 264, 292]",I-emails_email
24,.,"[127, 282, 264, 292]",I-emails_email
25,com,"[127, 282, 264, 292]",I-emails_email
26,-,"[265, 282, 266, 292]",MISC
27,NL,"[265, 282, 266, 292]",MISC
28,-,"[265, 282, 266, 292]",MISC
29,Call,"[83, 307, 121, 322]",MISC
30,to,"[121, 307, 149, 322]",MISC
31,:,"[121, 307, 149, 322]",MISC
32,+,"[149, 307, 272, 322]",B-phones_phone
33,91,"[149, 307, 272, 322]",I-phones_phone
34,##9,"[149, 307, 272, 322]",I-phones_phone
35,##48,"[149, 307, 272, 322]",I-phones_phone
36,##20,"[149, 307, 272, 322]",I-phones_phone
37,##6,"[149, 307, 272, 322]",I-phones_phone
38,##7,"[149, 307, 272, 322]",I-phones_phone
39,##26,"[149, 307, 272, 322]",I-phones_phone
40,##9,"[149, 307, 272, 322]",I-phones_phone
41,-,"[273, 307, 275, 322]",MISC
42,NL,"[273, 307, 275, 322]",MISC
43,-,"[273, 307, 275, 322]",MISC
44,PP,"[83, 340, 124, 352]",B-personal_details_heading
45,##ER,"[83, 340, 124, 352]",I-personal_details_heading
46,##SO,"[83, 340, 124, 352]",I-personal_details_heading
47,##NA,"[83, 340, 124, 352]",I-personal_details_heading
48,##L,"[83, 340, 124, 352]",I-personal_details_heading
49,ER,"[126, 340, 159, 352]",I-personal_details_heading
50,##SO,"[126, 340, 159, 352]",I-personal_details_heading
51,##NA,"[126, 340, 159, 352]",I-personal_details_heading
52,##L,"[126, 340, 159, 352]",I-personal_details_heading
53,PR,"[159, 340, 192, 352]",I-personal_details_heading
54,##O,"[159, 340, 192, 352]",I-personal_details_heading
55,##FI,"[159, 340, 192, 352]",I-personal_details_heading
56,##LE,"[159, 340, 192, 352]",I-personal_details_heading
57,PR,"[192, 340, 234, 352]",I-personal_details_heading
58,##O,"[192, 340, 234, 352]",I-personal_details_heading
59,##FI,"[192, 340, 234, 352]",I-personal_details_heading
60,##LE,"[192, 340, 234, 352]",I-personal_details_heading
61,:,"[192, 340, 234, 352]",I-personal_details_heading
62,:,"[192, 340, 234, 352]",I-personal_details_heading
63,-,"[235, 340, 237, 352]",MISC
64,NL,"[235, 340, 237, 352]",MISC
65,-,"[235, 340, 237, 352]",MISC
66,Educational,"[83, 375, 181, 390]",B-education_heading
67,Det,"[182, 375, 244, 390]",I-education_heading
68,##ails,"[182, 375, 244, 390]",I-education_heading
69,:,"[245, 375, 254, 390]",I-education_heading
70,-,"[254, 375, 256, 390]",MISC
71,NL,"[254, 375, 256, 390]",MISC
72,-,"[254, 375, 256, 390]",MISC
73,B,"[125, 408, 203, 423]",B-education_degree
74,.,"[125, 408, 203, 423]",I-education_degree
75,E,"[125, 408, 203, 423]",I-education_degree
76,(,"[125, 408, 203, 423]",MISC
77,CS,"[125, 408, 203, 423]",B-education_course
78,),"[125, 408, 203, 423]",MISC
79,2012,"[203, 408, 259, 423]",MISC
80,:,"[203, 408, 259, 423]",MISC
81,-,"[259, 408, 261, 423]",MISC
82,NL,"[259, 408, 261, 423]",MISC
83,-,"[259, 408, 261, 423]",MISC
84,V,"[145, 420, 181, 439]",MISC
85,##TU,"[145, 420, 181, 439]",MISC
86,66,"[181, 420, 254, 439]",MISC
87,.,"[181, 420, 254, 439]",MISC
88,36,"[181, 420, 254, 439]",MISC
89,%,"[181, 420, 254, 439]",MISC
90,-,"[254, 420, 256, 439]",MISC
91,NL,"[254, 420, 256, 439]",MISC
92,-,"[254, 420, 256, 439]",MISC
93,P,"[130, 458, 179, 470]",B-education_degree
94,##UC,"[130, 458, 179, 470]",I-education_degree
95,2008,"[179, 458, 243, 470]",MISC
96,:,"[243, 458, 259, 470]",MISC
97,-,"[259, 458, 261, 470]",MISC
98,NL,"[259, 458, 261, 470]",MISC
99,-,"[259, 458, 261, 470]",MISC
100,K,"[145, 470, 181, 486]",MISC
101,##P,"[145, 470, 181, 486]",MISC
102,##B,"[145, 470, 181, 486]",MISC
103,61,"[182, 470, 255, 486]",MISC
104,.,"[182, 470, 255, 486]",MISC
105,33,"[182, 470, 255, 486]",MISC
106,%,"[182, 470, 255, 486]",MISC
107,-,"[256, 470, 258, 486]",MISC
108,NL,"[256, 470, 258, 486]",MISC
109,-,"[256, 470, 258, 486]",MISC
110,SS,"[128, 505, 186, 518]",B-education_degree
111,##LC,"[128, 505, 186, 518]",I-education_degree
112,2006,"[187, 505, 259, 518]",MISC
113,:,"[187, 505, 259, 518]",MISC
114,-,"[259, 505, 261, 518]",MISC
115,NL,"[259, 505, 261, 518]",MISC
116,-,"[259, 505, 261, 518]",MISC
117,K,"[145, 518, 201, 534]",MISC
118,##SE,"[145, 518, 201, 534]",MISC
119,##E,"[145, 518, 201, 534]",MISC
120,##B,"[145, 518, 201, 534]",MISC
121,89,"[202, 518, 269, 534]",MISC
122,.,"[202, 518, 269, 534]",MISC
123,44,"[202, 518, 269, 534]",MISC
124,%,"[202, 518, 269, 534]",MISC
125,-,"[270, 518, 272, 534]",MISC
126,NL,"[270, 518, 272, 534]",MISC
127,-,"[270, 518, 272, 534]",MISC
128,Personal,"[83, 549, 152, 565]",B-personal_details_heading
129,Data,"[152, 549, 195, 565]",I-personal_details_heading
130,:,"[152, 549, 195, 565]",I-personal_details_heading
131,-,"[195, 549, 197, 565]",MISC
132,NL,"[195, 549, 197, 565]",MISC
133,-,"[195, 549, 197, 565]",MISC
134,Age,"[128, 584, 183, 596]",MISC
135,:,"[128, 584, 183, 596]",MISC
136,-,"[183, 584, 185, 596]",MISC
137,NL,"[183, 584, 185, 596]",MISC
138,-,"[183, 584, 185, 596]",MISC
139,27,"[145, 596, 162, 613]",MISC
140,years,"[163, 596, 208, 613]",MISC
141,-,"[209, 596, 211, 613]",MISC
142,NL,"[209, 596, 211, 613]",MISC
143,-,"[209, 596, 211, 613]",MISC
144,National,"[123, 632, 236, 644]",MISC
145,##ity,"[123, 632, 236, 644]",MISC
146,:,"[123, 632, 236, 644]",MISC
147,-,"[237, 632, 239, 644]",MISC
148,NL,"[237, 632, 239, 644]",MISC
149,-,"[237, 632, 239, 644]",MISC
150,Indian,"[145, 644, 194, 659]",MISC
151,-,"[194, 644, 195, 659]",MISC
152,NL,"[194, 644, 195, 659]",MISC
153,-,"[194, 644, 195, 659]",MISC
154,Pass,"[125, 679, 211, 692]",MISC
155,##port,"[125, 679, 211, 692]",MISC
156,No,"[211, 679, 243, 692]",MISC
157,:,"[211, 679, 243, 692]",MISC
158,-,"[244, 679, 246, 692]",MISC
159,NL,"[244, 679, 246, 692]",MISC
160,-,"[244, 679, 246, 692]",MISC
161,K,"[145, 692, 227, 707]",MISC
162,##5,"[145, 692, 227, 707]",MISC
163,##7,"[145, 692, 227, 707]",MISC
164,##8,"[145, 692, 227, 707]",MISC
165,##46,"[145, 692, 227, 707]",MISC
166,##28,"[145, 692, 227, 707]",MISC
167,-,"[227, 692, 228, 707]",MISC
168,NL,"[227, 692, 228, 707]",MISC
169,-,"[227, 692, 228, 707]",MISC
170,Current,"[124, 727, 191, 739]",MISC
171,Location,"[193, 727, 281, 739]",MISC
172,:,"[193, 727, 281, 739]",MISC
173,-,"[282, 727, 284, 739]",MISC
174,NL,"[282, 727, 284, 739]",MISC
175,-,"[282, 727, 284, 739]",MISC
176,Bangalore,"[145, 739, 230, 754]",MISC
177,",","[145, 739, 230, 754]",MISC
178,India,"[231, 739, 272, 754]",MISC
179,-,"[273, 739, 275, 754]",MISC
180,NL,"[273, 739, 275, 754]",MISC
181,-,"[273, 739, 275, 754]",MISC
182,Mari,"[123, 774, 189, 787]",MISC
183,##tal,"[123, 774, 189, 787]",MISC
184,Status,"[191, 774, 256, 787]",MISC
185,:,"[191, 774, 256, 787]",MISC
186,-,"[258, 774, 259, 787]",MISC
187,NL,"[258, 774, 259, 787]",MISC
188,-,"[258, 774, 259, 787]",MISC
189,Single,"[150, 787, 199, 802]",MISC
190,-,"[199, 787, 201, 802]",MISC
191,NL,"[199, 787, 201, 802]",MISC
192,-,"[199, 787, 201, 802]",MISC
193,Gender,"[126, 822, 207, 834]",MISC
194,:,"[126, 822, 207, 834]",MISC
195,-,"[207, 822, 209, 834]",MISC
196,NL,"[207, 822, 209, 834]",MISC
197,-,"[207, 822, 209, 834]",MISC
198,Male,"[145, 834, 185, 849]",MISC
199,-,"[185, 834, 187, 849]",MISC
200,NL,"[185, 834, 187, 849]",MISC
201,-,"[185, 834, 187, 849]",MISC
202,T,"[102, 80, 162, 97]",MISC
203,##TE,"[102, 80, 162, 97]",MISC
204,##CH,"[102, 80, 162, 97]",MISC
205,##NI,"[102, 80, 162, 97]",MISC
206,##CA,"[102, 80, 162, 97]",MISC
207,##L,"[102, 80, 162, 97]",MISC
208,EC,"[162, 80, 211, 97]",MISC
209,##H,"[162, 80, 211, 97]",MISC
210,##NI,"[162, 80, 211, 97]",MISC
211,##CA,"[162, 80, 211, 97]",MISC
212,##L,"[162, 80, 211, 97]",MISC
213,E,"[211, 80, 216, 97]",MISC
214,E,"[217, 80, 271, 97]",MISC
215,##X,"[217, 80, 271, 97]",MISC
216,##P,"[217, 80, 271, 97]",MISC
217,##ER,"[217, 80, 271, 97]",MISC
218,##TI,"[217, 80, 271, 97]",MISC
219,##SE,"[217, 80, 271, 97]",MISC
220,X,"[272, 80, 320, 97]",MISC
221,##P,"[272, 80, 320, 97]",MISC
222,##ER,"[272, 80, 320, 97]",MISC
223,##TI,"[272, 80, 320, 97]",MISC
224,##SE,"[272, 80, 320, 97]",MISC
225,:,"[320, 80, 332, 97]",MISC
226,:,"[320, 80, 332, 97]",MISC
227,-,"[332, 80, 334, 97]",MISC
228,NL,"[332, 80, 334, 97]",MISC
229,-,"[332, 80, 334, 97]",MISC
230,Too,"[114, 123, 187, 137]",MISC
231,##ls,"[114, 123, 187, 137]",MISC
232,:,"[114, 123, 187, 137]",MISC
233,-,"[188, 123, 190, 137]",MISC
234,NL,"[188, 123, 190, 137]",MISC
235,-,"[188, 123, 190, 137]",MISC
236,Q,"[175, 146, 196, 161]",MISC
237,##C,"[175, 146, 196, 161]",MISC
238,-,"[196, 146, 323, 161]",MISC
239,10,"[196, 146, 323, 161]",MISC
240,.,"[196, 146, 323, 161]",MISC
241,00,"[196, 146, 323, 161]",MISC
242,",","[196, 146, 323, 161]",MISC
243,11,"[196, 146, 323, 161]",MISC
244,.,"[196, 146, 323, 161]",MISC
245,00,"[196, 146, 323, 161]",MISC
246,-,"[324, 146, 325, 161]",MISC
247,NL,"[324, 146, 325, 161]",MISC
248,-,"[324, 146, 325, 161]",MISC
249,Test,"[175, 172, 258, 185]",MISC
250,##link,"[175, 172, 258, 185]",MISC
251,-,"[258, 172, 259, 185]",MISC
252,NL,"[258, 172, 259, 185]",MISC
253,-,"[258, 172, 259, 185]",MISC
254,Red,"[177, 196, 263, 209]",MISC
255,##mine,"[177, 196, 263, 209]",MISC
256,-,"[265, 196, 266, 209]",MISC
257,NL,"[265, 196, 266, 209]",MISC
258,-,"[265, 196, 266, 209]",MISC
259,In,"[175, 220, 297, 232]",MISC
260,##form,"[175, 220, 297, 232]",MISC
261,##atic,"[175, 220, 297, 232]",MISC
262,##a,"[175, 220, 297, 232]",MISC
263,Power,"[297, 220, 353, 232]",MISC
264,-,"[353, 220, 355, 232]",MISC
265,NL,"[353, 220, 355, 232]",MISC
266,-,"[353, 220, 355, 232]",MISC
267,Center,"[195, 241, 247, 256]",MISC
268,-,"[247, 241, 249, 256]",MISC
269,NL,"[247, 241, 249, 256]",MISC
270,-,"[247, 241, 249, 256]",MISC
271,Te,"[175, 267, 262, 280]",MISC
272,##rada,"[175, 267, 262, 280]",MISC
273,##ta,"[175, 267, 262, 280]",MISC
274,-,"[263, 267, 265, 280]",MISC
275,NL,"[263, 267, 265, 280]",MISC
276,-,"[263, 267, 265, 280]",MISC
277,S,"[318, 267, 353, 280]",MISC
278,##QL,"[318, 267, 353, 280]",MISC
279,-,"[353, 267, 355, 280]",MISC
280,NL,"[353, 267, 355, 280]",MISC
281,-,"[353, 267, 355, 280]",MISC
282,Assistance,"[195, 289, 277, 304]",MISC
283,-,"[277, 289, 279, 304]",MISC
284,NL,"[277, 289, 279, 304]",MISC
285,-,"[277, 289, 279, 304]",MISC
286,Oracle,"[176, 315, 247, 327]",MISC
287,-,"[247, 315, 249, 327]",MISC
288,NL,"[247, 315, 249, 327]",MISC
289,-,"[247, 315, 249, 327]",MISC
290,S,"[317, 315, 353, 327]",MISC
291,##QL,"[317, 315, 353, 327]",MISC
292,-,"[353, 315, 355, 327]",MISC
293,NL,"[353, 315, 355, 327]",MISC
294,-,"[353, 315, 355, 327]",MISC
295,Dev,"[195, 336, 275, 351]",MISC
296,##elo,"[195, 336, 275, 351]",MISC
297,##per,"[195, 336, 275, 351]",MISC
298,-,"[275, 336, 277, 351]",MISC
299,NL,"[275, 336, 277, 351]",MISC
300,-,"[275, 336, 277, 351]",MISC
301,To,"[177, 362, 227, 375]",MISC
302,##ad,"[177, 362, 227, 375]",MISC
303,(,"[227, 362, 239, 375]",MISC
304,S,"[240, 362, 276, 375]",MISC
305,##QL,"[240, 362, 276, 375]",MISC
306,Server,"[277, 362, 352, 375]",MISC
307,-,"[353, 362, 355, 375]",MISC
308,NL,"[353, 362, 355, 375]",MISC
309,-,"[353, 362, 355, 375]",MISC
310,Free,"[195, 381, 265, 399]",MISC
311,##ware,"[195, 381, 265, 399]",MISC
312,6,"[266, 381, 300, 399]",MISC
313,.,"[266, 381, 300, 399]",MISC
314,6,"[266, 381, 300, 399]",MISC
315,),"[266, 381, 300, 399]",MISC
316,-,"[301, 381, 303, 399]",MISC
317,NL,"[301, 381, 303, 399]",MISC
318,-,"[301, 381, 303, 399]",MISC
319,S,"[176, 410, 213, 423]",MISC
320,##QL,"[176, 410, 213, 423]",MISC
321,Server,"[213, 410, 285, 423]",MISC
322,-,"[285, 410, 287, 423]",MISC
323,NL,"[285, 410, 287, 423]",MISC
324,-,"[285, 410, 287, 423]",MISC
325,Se,"[176, 434, 268, 446]",MISC
326,##len,"[176, 434, 268, 446]",MISC
327,##ium,"[176, 434, 268, 446]",MISC
328,-,"[268, 434, 270, 446]",MISC
329,NL,"[268, 434, 270, 446]",MISC
330,-,"[268, 434, 270, 446]",MISC
331,Test,"[176, 458, 223, 470]",MISC
332,Magic,"[223, 458, 282, 470]",MISC
333,-,"[282, 458, 284, 470]",MISC
334,NL,"[282, 458, 284, 470]",MISC
335,-,"[282, 458, 284, 470]",MISC
336,Mac,"[177, 481, 251, 494]",MISC
337,##ros,"[177, 481, 251, 494]",MISC
338,-,"[253, 481, 254, 494]",MISC
339,NL,"[253, 481, 254, 494]",MISC
340,-,"[253, 481, 254, 494]",MISC
341,Ji,"[176, 505, 223, 518]",MISC
342,##ra,"[176, 505, 223, 518]",MISC
343,-,"[223, 505, 225, 518]",MISC
344,NL,"[223, 505, 225, 518]",MISC
345,-,"[223, 505, 225, 518]",MISC
346,Languages,"[114, 553, 235, 566]",B-others_heading
347,:,"[114, 553, 235, 566]",I-others_heading
348,-,"[237, 553, 239, 566]",MISC
349,NL,"[237, 553, 239, 566]",MISC
350,-,"[237, 553, 239, 566]",MISC
351,S,"[191, 573, 231, 591]",MISC
352,##QL,"[191, 573, 231, 591]",MISC
353,-,"[232, 573, 233, 591]",MISC
354,NL,"[232, 573, 233, 591]",MISC
355,-,"[232, 573, 233, 591]",MISC
356,H,"[192, 599, 248, 615]",MISC
357,##TM,"[192, 599, 248, 615]",MISC
358,##L,"[192, 599, 248, 615]",MISC
359,-,"[249, 599, 251, 615]",MISC
360,NL,"[249, 599, 251, 615]",MISC
361,-,"[249, 599, 251, 615]",MISC
362,Java,"[183, 623, 274, 638]",MISC
363,##Script,"[183, 623, 274, 638]",MISC
364,-,"[275, 623, 277, 638]",MISC
365,NL,"[275, 623, 277, 638]",MISC
366,-,"[275, 623, 277, 638]",MISC
367,V,"[193, 644, 234, 662]",MISC
368,##BA,"[193, 644, 234, 662]",MISC
369,-,"[235, 644, 237, 662]",MISC
370,NL,"[235, 644, 237, 662]",MISC
371,-,"[235, 644, 237, 662]",MISC
372,PP,"[71, 695, 143, 709]",B-skills_heading
373,##ER,"[71, 695, 143, 709]",I-skills_heading
374,##SO,"[71, 695, 143, 709]",I-skills_heading
375,##NA,"[71, 695, 143, 709]",I-skills_heading
376,##L,"[71, 695, 143, 709]",I-skills_heading
377,ER,"[145, 695, 202, 709]",I-skills_heading
378,##SO,"[145, 695, 202, 709]",I-skills_heading
379,##NA,"[145, 695, 202, 709]",I-skills_heading
380,##L,"[145, 695, 202, 709]",I-skills_heading
381,ST,"[203, 695, 284, 709]",I-skills_heading
382,##RE,"[203, 695, 284, 709]",I-skills_heading
383,##NG,"[203, 695, 284, 709]",I-skills_heading
384,##TH,"[203, 695, 284, 709]",I-skills_heading
385,##S,"[203, 695, 284, 709]",I-skills_heading
386,:,"[203, 695, 284, 709]",I-skills_heading
387,-,"[285, 695, 287, 709]",MISC
388,NL,"[285, 695, 287, 709]",MISC
389,-,"[285, 695, 287, 709]",MISC
390,Good,"[111, 740, 148, 753]",MISC
391,Technical,"[149, 740, 243, 753]",MISC
392,",","[149, 740, 243, 753]",MISC
393,analytical,"[244, 740, 338, 753]",MISC
394,-,"[339, 740, 341, 753]",MISC
395,NL,"[339, 740, 341, 753]",MISC
396,-,"[339, 740, 341, 753]",MISC
397,&,"[133, 754, 140, 769]",MISC
398,presentation,"[141, 754, 238, 769]",MISC
399,skills,"[239, 754, 294, 769]",MISC
400,.,"[239, 754, 294, 769]",MISC
401,-,"[296, 754, 298, 769]",MISC
402,NL,"[296, 754, 298, 769]",MISC
403,-,"[296, 754, 298, 769]",MISC
404,Will,"[111, 793, 217, 806]",MISC
405,##ing,"[111, 793, 217, 806]",MISC
406,##ness,"[111, 793, 217, 806]",MISC
407,to,"[219, 793, 238, 806]",MISC
408,explore,"[238, 793, 306, 806]",MISC
409,-,"[306, 793, 308, 806]",MISC
410,NL,"[306, 793, 308, 806]",MISC
411,-,"[306, 793, 308, 806]",MISC
412,advance,"[133, 809, 199, 822]",MISC
413,techniques,"[199, 809, 293, 822]",MISC
414,and,"[294, 809, 322, 822]",MISC
415,new,"[323, 809, 351, 822]",MISC
416,-,"[351, 809, 353, 822]",MISC
417,NL,"[351, 809, 353, 822]",MISC
418,-,"[351, 809, 353, 822]",MISC
419,technologies,"[133, 822, 233, 837]",MISC
420,.,"[133, 822, 233, 837]",MISC
421,-,"[233, 822, 235, 837]",MISC
422,NL,"[233, 822, 235, 837]",MISC
423,-,"[233, 822, 235, 837]",MISC
424,Professional,"[111, 862, 226, 874]",MISC
425,approach,"[226, 862, 302, 874]",MISC
426,-,"[303, 862, 305, 874]",MISC
427,NL,"[303, 862, 305, 874]",MISC
428,-,"[303, 862, 305, 874]",MISC
429,towards,"[133, 876, 188, 889]",MISC
430,results,"[189, 876, 251, 889]",MISC
431,.,"[189, 876, 251, 889]",MISC
432,-,"[253, 876, 254, 889]",MISC
433,NL,"[253, 876, 254, 889]",MISC
434,-,"[253, 876, 254, 889]",MISC
435,Team,"[112, 914, 154, 927]",MISC
436,player,"[154, 914, 217, 927]",MISC
437,capable,"[217, 914, 290, 927]",MISC
438,to,"[290, 914, 311, 927]",MISC
439,-,"[311, 914, 313, 927]",MISC
440,NL,"[311, 914, 313, 927]",MISC
441,-,"[311, 914, 313, 927]",MISC
442,interact,"[133, 927, 195, 942]",MISC
443,effectively,"[196, 927, 283, 942]",MISC
444,with,"[283, 927, 314, 942]",MISC
445,-,"[315, 927, 317, 942]",MISC
446,NL,"[315, 927, 317, 942]",MISC
447,-,"[315, 927, 317, 942]",MISC
448,groups,"[133, 943, 183, 958]",MISC
449,and,"[184, 943, 208, 958]",MISC
450,individuals,"[209, 943, 310, 958]",MISC
451,.,"[209, 943, 310, 958]",MISC
452,-,"[311, 943, 313, 958]",MISC
453,NL,"[311, 943, 313, 958]",MISC
454,-,"[311, 943, 313, 958]",MISC
455,CC,"[369, 43, 402, 57]",MISC
456,##AR,"[369, 43, 402, 57]",MISC
457,##EE,"[369, 43, 402, 57]",MISC
458,##R,"[369, 43, 402, 57]",MISC
459,AR,"[402, 43, 425, 57]",MISC
460,##EE,"[402, 43, 425, 57]",MISC
461,##R,"[402, 43, 425, 57]",MISC
462,O,"[426, 43, 470, 57]",MISC
463,##B,"[426, 43, 470, 57]",MISC
464,##J,"[426, 43, 470, 57]",MISC
465,##EC,"[426, 43, 470, 57]",MISC
466,##TI,"[426, 43, 470, 57]",MISC
467,##VE,"[426, 43, 470, 57]",MISC
468,O,"[470, 43, 522, 57]",MISC
469,##B,"[470, 43, 522, 57]",MISC
470,##J,"[470, 43, 522, 57]",MISC
471,##EC,"[470, 43, 522, 57]",MISC
472,##TI,"[470, 43, 522, 57]",MISC
473,##VE,"[470, 43, 522, 57]",MISC
474,:,"[470, 43, 522, 57]",MISC
475,:,"[470, 43, 522, 57]",MISC
476,-,"[523, 43, 525, 57]",MISC
477,NL,"[523, 43, 525, 57]",MISC
478,-,"[523, 43, 525, 57]",MISC
479,To,"[409, 86, 426, 97]",MISC
480,work,"[427, 86, 462, 97]",MISC
481,with,"[463, 86, 498, 97]",MISC
482,an,"[500, 86, 517, 97]",MISC
483,organization,"[518, 86, 625, 97]",MISC
484,with,"[626, 86, 661, 97]",MISC
485,technological,"[663, 86, 779, 97]",MISC
486,excellence,"[780, 86, 870, 97]",MISC
487,in,"[871, 86, 888, 97]",MISC
488,its,"[889, 86, 915, 97]",MISC
489,field,"[916, 86, 961, 97]",MISC
490,with,"[962, 86, 996, 97]",MISC
491,-,"[998, 86, 1000, 97]",MISC
492,NL,"[998, 86, 1000, 97]",MISC
493,-,"[998, 86, 1000, 97]",MISC
494,dedication,"[431, 97, 514, 111]",MISC
495,",","[431, 97, 514, 111]",MISC
496,focus,"[514, 97, 559, 111]",MISC
497,",","[514, 97, 559, 111]",MISC
498,pro,"[560, 97, 627, 111]",MISC
499,##active,"[560, 97, 627, 111]",MISC
500,approach,"[628, 97, 696, 111]",MISC
501,",","[628, 97, 696, 111]",MISC
502,positive,"[696, 97, 755, 111]",MISC
503,attitude,"[757, 97, 816, 111]",MISC
504,and,"[817, 97, 840, 111]",MISC
505,passion,"[840, 97, 899, 111]",MISC
506,.,"[840, 97, 899, 111]",MISC
507,-,"[901, 97, 902, 111]",MISC
508,NL,"[901, 97, 902, 111]",MISC
509,-,"[901, 97, 902, 111]",MISC
510,To,"[409, 116, 426, 127]",MISC
511,pursue,"[428, 116, 481, 127]",MISC
512,a,"[483, 116, 492, 127]",MISC
513,successful,"[492, 116, 593, 127]",MISC
514,",","[492, 116, 593, 127]",MISC
515,challenging,"[594, 116, 694, 127]",MISC
516,and,"[695, 116, 721, 127]",MISC
517,exciting,"[723, 116, 796, 127]",MISC
518,career,"[797, 116, 850, 127]",MISC
519,while,"[852, 116, 897, 127]",MISC
520,being,"[898, 116, 943, 127]",MISC
521,able,"[944, 116, 981, 127]",MISC
522,to,"[981, 116, 998, 127]",MISC
523,-,"[1000, 116, 1001, 127]",MISC
524,NL,"[1000, 116, 1001, 127]",MISC
525,-,"[1000, 116, 1001, 127]",MISC
526,di,"[431, 127, 502, 141]",MISC
527,##spense,"[431, 127, 502, 141]",MISC
528,my,"[502, 127, 519, 141]",MISC
529,maximum,"[520, 127, 581, 141]",MISC
530,potential,"[582, 127, 662, 141]",MISC
531,to,"[662, 127, 679, 141]",MISC
532,the,"[680, 127, 706, 141]",MISC
533,benefit,"[706, 127, 767, 141]",MISC
534,of,"[769, 127, 786, 141]",MISC
535,the,"[786, 127, 812, 141]",MISC
536,organization,"[813, 127, 919, 141]",MISC
537,and,"[920, 127, 954, 141]",MISC
538,",","[920, 127, 954, 141]",MISC
539,at,"[955, 127, 972, 141]",MISC
540,the,"[973, 127, 999, 141]",MISC
541,-,"[1000, 127, 1001, 141]",MISC
542,NL,"[1000, 127, 1001, 141]",MISC
543,-,"[1000, 127, 1001, 141]",MISC
544,same,"[431, 142, 464, 156]",MISC
545,time,"[465, 142, 506, 156]",MISC
546,",","[465, 142, 506, 156]",MISC
547,acquiring,"[507, 142, 581, 156]",MISC
548,knowledge,"[582, 142, 657, 156]",MISC
549,on,"[658, 142, 673, 156]",MISC
550,the,"[675, 142, 699, 156]",MISC
551,road,"[700, 142, 733, 156]",MISC
552,to,"[734, 142, 749, 156]",MISC
553,success,"[750, 142, 816, 156]",MISC
554,.,"[750, 142, 816, 156]",MISC
555,-,"[818, 142, 819, 156]",MISC
556,NL,"[818, 142, 819, 156]",MISC
557,-,"[818, 142, 819, 156]",MISC
558,W,"[365, 176, 369, 187]",B-work_experience_heading
559,W,"[370, 176, 389, 187]",I-work_experience_heading
560,##OR,"[370, 176, 389, 187]",I-work_experience_heading
561,##K,"[370, 176, 389, 187]",I-work_experience_heading
562,OR,"[391, 176, 404, 187]",I-work_experience_heading
563,##K,"[391, 176, 404, 187]",I-work_experience_heading
564,E,"[406, 176, 456, 187]",I-work_experience_heading
565,##X,"[406, 176, 456, 187]",I-work_experience_heading
566,##P,"[406, 176, 456, 187]",I-work_experience_heading
567,##ER,"[406, 176, 456, 187]",I-work_experience_heading
568,##IE,"[406, 176, 456, 187]",I-work_experience_heading
569,##NC,"[406, 176, 456, 187]",I-work_experience_heading
570,##E,"[406, 176, 456, 187]",I-work_experience_heading
571,E,"[457, 176, 517, 187]",I-work_experience_heading
572,##X,"[457, 176, 517, 187]",I-work_experience_heading
573,##P,"[457, 176, 517, 187]",I-work_experience_heading
574,##ER,"[457, 176, 517, 187]",I-work_experience_heading
575,##IE,"[457, 176, 517, 187]",I-work_experience_heading
576,##NC,"[457, 176, 517, 187]",I-work_experience_heading
577,##E,"[457, 176, 517, 187]",I-work_experience_heading
578,:,"[457, 176, 517, 187]",I-work_experience_heading
579,:,"[457, 176, 517, 187]",I-work_experience_heading
580,-,"[518, 176, 519, 187]",MISC
581,NL,"[518, 176, 519, 187]",MISC
582,-,"[518, 176, 519, 187]",MISC
583,Organization,"[379, 202, 495, 217]",MISC
584,-,"[495, 202, 497, 217]",MISC
585,NL,"[495, 202, 497, 217]",MISC
586,-,"[495, 202, 497, 217]",MISC
587,Design,"[580, 202, 689, 217]",MISC
588,##ation,"[580, 202, 689, 217]",MISC
589,-,"[689, 202, 691, 217]",MISC
590,NL,"[689, 202, 691, 217]",MISC
591,-,"[689, 202, 691, 217]",MISC
592,Du,"[753, 202, 831, 217]",MISC
593,##ration,"[753, 202, 831, 217]",MISC
594,-,"[831, 202, 833, 217]",MISC
595,NL,"[831, 202, 833, 217]",MISC
596,-,"[831, 202, 833, 217]",MISC
597,Prime,"[379, 225, 426, 241]",MISC
598,Focus,"[427, 225, 474, 241]",MISC
599,-,"[474, 225, 476, 241]",MISC
600,NL,"[474, 225, 476, 241]",MISC
601,-,"[474, 225, 476, 241]",MISC
602,Senior,"[580, 225, 636, 241]",B-employer_role
603,Test,"[636, 225, 673, 241]",I-employer_role
604,Engineer,"[674, 225, 748, 241]",I-employer_role
605,July,"[749, 225, 785, 241]",MISC
606,2017,"[786, 225, 822, 241]",MISC
607,to,"[823, 225, 841, 241]",MISC
608,Present,"[842, 225, 906, 241]",MISC
609,-,"[908, 225, 909, 241]",MISC
610,NL,"[908, 225, 909, 241]",MISC
611,-,"[908, 225, 909, 241]",MISC
612,Technologies,"[379, 241, 481, 256]",MISC
613,-,"[481, 241, 483, 256]",MISC
614,NL,"[481, 241, 483, 256]",MISC
615,-,"[481, 241, 483, 256]",MISC
616,Prime,"[379, 264, 426, 279]",MISC
617,Focus,"[427, 264, 474, 279]",MISC
618,-,"[474, 264, 476, 279]",MISC
619,NL,"[474, 264, 476, 279]",MISC
620,-,"[474, 264, 476, 279]",MISC
621,Software,"[580, 264, 651, 279]",MISC
622,Test,"[652, 264, 686, 279]",MISC
623,-,"[688, 264, 689, 279]",MISC
624,NL,"[688, 264, 689, 279]",MISC
625,-,"[688, 264, 689, 279]",MISC
626,March,"[753, 264, 804, 279]",MISC
627,2016,"[804, 264, 844, 279]",MISC
628,to,"[845, 264, 864, 279]",MISC
629,June,"[866, 264, 906, 279]",MISC
630,2017,"[907, 264, 947, 279]",MISC
631,-,"[948, 264, 949, 279]",MISC
632,NL,"[948, 264, 949, 279]",MISC
633,-,"[948, 264, 949, 279]",MISC
634,Technologies,"[379, 280, 481, 295]",MISC
635,-,"[481, 280, 483, 295]",MISC
636,NL,"[481, 280, 483, 295]",MISC
637,-,"[481, 280, 483, 295]",MISC
638,Engineer,"[580, 280, 649, 295]",MISC
639,-,"[649, 280, 651, 295]",MISC
640,NL,"[649, 280, 651, 295]",MISC
641,-,"[649, 280, 651, 295]",MISC
642,SL,"[379, 302, 409, 317]",MISC
643,##K,"[379, 302, 409, 317]",MISC
644,Software,"[409, 302, 487, 317]",MISC
645,Services,"[489, 302, 567, 317]",MISC
646,Test,"[568, 302, 606, 317]",B-employer_role
647,Engineer,"[608, 302, 686, 317]",I-employer_role
648,-,"[688, 302, 689, 317]",MISC
649,NL,"[688, 302, 689, 317]",MISC
650,-,"[688, 302, 689, 317]",MISC
651,April,"[753, 302, 802, 317]",MISC
652,2015,"[803, 302, 843, 317]",MISC
653,to,"[843, 302, 862, 317]",MISC
654,March,"[863, 302, 912, 317]",MISC
655,2016,"[913, 302, 953, 317]",MISC
656,-,"[953, 302, 954, 317]",MISC
657,NL,"[953, 302, 954, 317]",MISC
658,-,"[953, 302, 954, 317]",MISC
659,P,"[379, 319, 415, 334]",MISC
660,##v,"[379, 319, 415, 334]",MISC
661,##t,"[379, 319, 415, 334]",MISC
662,.,"[379, 319, 415, 334]",MISC
663,",","[379, 319, 415, 334]",MISC
664,Ltd,"[416, 319, 453, 334]",MISC
665,.,"[416, 319, 453, 334]",MISC
666,",","[416, 319, 453, 334]",MISC
667,-,"[454, 319, 455, 334]",MISC
668,NL,"[454, 319, 455, 334]",MISC
669,-,"[454, 319, 455, 334]",MISC
670,SL,"[379, 340, 402, 372]",MISC
671,##K,"[379, 340, 402, 372]",MISC
672,Software,"[403, 340, 465, 372]",MISC
673,Services,"[465, 340, 528, 372]",MISC
674,Associate,"[528, 340, 597, 372]",B-employer_role
675,Test,"[599, 340, 630, 372]",I-employer_role
676,Engineer,"[630, 340, 692, 372]",I-employer_role
677,-,"[693, 340, 694, 372]",MISC
678,NL,"[693, 340, 694, 372]",MISC
679,-,"[693, 340, 694, 372]",MISC
680,September,"[753, 340, 842, 356]",MISC
681,2013,"[842, 340, 880, 356]",MISC
682,to,"[882, 340, 901, 356]",MISC
683,March,"[902, 340, 950, 356]",MISC
684,-,"[951, 340, 953, 356]",MISC
685,NL,"[951, 340, 953, 356]",MISC
686,-,"[951, 340, 953, 356]",MISC
687,P,"[379, 357, 415, 372]",MISC
688,##v,"[379, 357, 415, 372]",MISC
689,##t,"[379, 357, 415, 372]",MISC
690,.,"[379, 357, 415, 372]",MISC
691,",","[379, 357, 415, 372]",MISC
692,Ltd,"[416, 357, 453, 372]",MISC
693,.,"[416, 357, 453, 372]",MISC
694,",","[416, 357, 453, 372]",MISC
695,-,"[454, 357, 455, 372]",MISC
696,NL,"[454, 357, 455, 372]",MISC
697,-,"[454, 357, 455, 372]",MISC
698,2015,"[753, 357, 792, 372]",MISC
699,-,"[792, 357, 793, 372]",MISC
700,NL,"[792, 357, 793, 372]",MISC
701,-,"[792, 357, 793, 372]",MISC
702,E,"[369, 392, 480, 406]",MISC
703,##X,"[369, 392, 480, 406]",MISC
704,##P,"[369, 392, 480, 406]",MISC
705,##ER,"[369, 392, 480, 406]",MISC
706,##IE,"[369, 392, 480, 406]",MISC
707,##NC,"[369, 392, 480, 406]",MISC
708,##E,"[369, 392, 480, 406]",MISC
709,L,"[480, 392, 546, 406]",MISC
710,##E,"[480, 392, 546, 406]",MISC
711,##VE,"[480, 392, 546, 406]",MISC
712,##L,"[480, 392, 546, 406]",MISC
713,:,"[480, 392, 546, 406]",MISC
714,-,"[547, 392, 549, 406]",MISC
715,NL,"[547, 392, 549, 406]",MISC
716,-,"[547, 392, 549, 406]",MISC
717,Five,"[369, 408, 402, 421]",MISC
718,Years,"[402, 408, 441, 421]",MISC
719,of,"[443, 408, 458, 421]",MISC
720,experience,"[459, 408, 541, 421]",MISC
721,in,"[542, 408, 557, 421]",MISC
722,Banking,"[558, 408, 615, 421]",MISC
723,and,"[616, 408, 640, 421]",MISC
724,Financial,"[640, 408, 713, 421]",MISC
725,Services,"[714, 408, 780, 421]",MISC
726,Institution,"[780, 408, 870, 421]",MISC
727,(,"[871, 408, 952, 421]",MISC
728,B,"[871, 408, 952, 421]",MISC
729,##FS,"[871, 408, 952, 421]",MISC
730,##I,"[871, 408, 952, 421]",MISC
731,),"[871, 408, 952, 421]",MISC
732,(,"[871, 408, 952, 421]",MISC
733,Two,"[871, 408, 952, 421]",MISC
734,years,"[953, 408, 993, 421]",MISC
735,-,"[994, 408, 996, 421]",MISC
736,NL,"[994, 408, 996, 421]",MISC
737,-,"[994, 408, 996, 421]",MISC
738,and,"[369, 420, 395, 434]",MISC
739,Six,"[396, 420, 422, 434]",MISC
740,months,"[424, 420, 486, 434]",MISC
741,),"[424, 420, 486, 434]",MISC
742,and,"[488, 420, 514, 434]",MISC
743,Media,"[515, 420, 597, 434]",MISC
744,(,"[515, 420, 597, 434]",MISC
745,Two,"[515, 420, 597, 434]",MISC
746,Years,"[597, 420, 642, 434]",MISC
747,and,"[643, 420, 669, 434]",MISC
748,Six,"[671, 420, 697, 434]",MISC
749,months,"[698, 420, 760, 434]",MISC
750,),"[698, 420, 760, 434]",MISC
751,domain,"[762, 420, 825, 434]",MISC
752,.,"[762, 420, 825, 434]",MISC
753,-,"[826, 420, 828, 434]",MISC
754,NL,"[826, 420, 828, 434]",MISC
755,-,"[826, 420, 828, 434]",MISC
756,J,"[369, 453, 402, 466]",MISC
757,##O,"[369, 453, 402, 466]",MISC
758,##B,"[369, 453, 402, 466]",MISC
759,PR,"[402, 453, 488, 466]",MISC
760,##O,"[402, 453, 488, 466]",MISC
761,##FI,"[402, 453, 488, 466]",MISC
762,##LE,"[402, 453, 488, 466]",MISC
763,:,"[402, 453, 488, 466]",MISC
764,-,"[490, 453, 492, 466]",MISC
765,NL,"[490, 453, 492, 466]",MISC
766,-,"[490, 453, 492, 466]",MISC
767,Analysis,"[409, 486, 478, 498]",MISC
768,and,"[478, 486, 502, 498]",MISC
769,understanding,"[504, 486, 616, 498]",MISC
770,of,"[616, 486, 634, 498]",MISC
771,requirement,"[634, 486, 729, 498]",MISC
772,document,"[729, 486, 807, 498]",MISC
773,.,"[729, 486, 807, 498]",MISC
774,-,"[807, 486, 809, 498]",MISC
775,NL,"[807, 486, 809, 498]",MISC
776,-,"[807, 486, 809, 498]",MISC
777,Gap,"[409, 501, 435, 513]",MISC
778,Analysis,"[435, 501, 504, 513]",MISC
779,and,"[505, 501, 531, 513]",MISC
780,Trace,"[532, 501, 644, 513]",MISC
781,##ability,"[532, 501, 644, 513]",MISC
782,.,"[532, 501, 644, 513]",MISC
783,-,"[646, 501, 648, 513]",MISC
784,NL,"[646, 501, 648, 513]",MISC
785,-,"[646, 501, 648, 513]",MISC
786,Creation,"[409, 515, 478, 526]",MISC
787,of,"[478, 515, 495, 526]",MISC
788,Test,"[495, 515, 530, 526]",MISC
789,scenarios,"[530, 515, 608, 526]",MISC
790,and,"[608, 515, 634, 526]",MISC
791,Test,"[634, 515, 668, 526]",MISC
792,cases,"[668, 515, 720, 526]",MISC
793,.,"[668, 515, 720, 526]",MISC
794,-,"[720, 515, 722, 526]",MISC
795,NL,"[720, 515, 722, 526]",MISC
796,-,"[720, 515, 722, 526]",MISC
797,Review,"[409, 530, 463, 541]",MISC
798,of,"[463, 530, 480, 541]",MISC
799,Test,"[481, 530, 516, 541]",MISC
800,scenarios,"[517, 530, 597, 541]",MISC
801,and,"[598, 530, 624, 541]",MISC
802,Test,"[625, 530, 660, 541]",MISC
803,cases,"[661, 530, 715, 541]",MISC
804,.,"[661, 530, 715, 541]",MISC
805,-,"[715, 530, 717, 541]",MISC
806,NL,"[715, 530, 717, 541]",MISC
807,-,"[715, 530, 717, 541]",MISC
808,Walk,"[409, 544, 513, 556]",MISC
809,##th,"[409, 544, 513, 556]",MISC
810,##rough,"[409, 544, 513, 556]",MISC
811,of,"[514, 544, 531, 556]",MISC
812,Test,"[533, 544, 569, 556]",MISC
813,Case,"[571, 544, 618, 556]",MISC
814,##s,"[571, 544, 618, 556]",MISC
815,with,"[619, 544, 655, 556]",MISC
816,BA,"[657, 544, 674, 556]",MISC
817,group,"[676, 544, 731, 556]",MISC
818,.,"[676, 544, 731, 556]",MISC
819,-,"[733, 544, 734, 556]",MISC
820,NL,"[733, 544, 734, 556]",MISC
821,-,"[733, 544, 734, 556]",MISC
822,Test,"[409, 559, 443, 570]",MISC
823,data,"[443, 559, 478, 570]",MISC
824,conditioning,"[478, 559, 590, 570]",MISC
825,.,"[478, 559, 590, 570]",MISC
826,-,"[590, 559, 592, 570]",MISC
827,NL,"[590, 559, 592, 570]",MISC
828,-,"[590, 559, 592, 570]",MISC
829,In,"[409, 574, 478, 585]",MISC
830,##volved,"[409, 574, 478, 585]",MISC
831,in,"[478, 574, 496, 585]",MISC
832,preparation,"[496, 574, 591, 585]",MISC
833,of,"[591, 574, 609, 585]",MISC
834,Test,"[609, 574, 643, 585]",MISC
835,plan,"[644, 574, 678, 585]",MISC
836,and,"[678, 574, 704, 585]",MISC
837,Test,"[704, 574, 739, 585]",MISC
838,Report,"[739, 574, 800, 585]",MISC
839,.,"[739, 574, 800, 585]",MISC
840,-,"[800, 574, 802, 585]",MISC
841,NL,"[800, 574, 802, 585]",MISC
842,-,"[800, 574, 802, 585]",MISC
843,Experience,"[408, 588, 493, 599]",MISC
844,in,"[494, 588, 510, 599]",MISC
845,writing,"[511, 588, 570, 599]",MISC
846,S,"[571, 588, 674, 599]",MISC
847,##QL,"[571, 588, 674, 599]",MISC
848,/,"[571, 588, 674, 599]",MISC
849,Te,"[571, 588, 674, 599]",MISC
850,##rada,"[571, 588, 674, 599]",MISC
851,##ta,"[571, 588, 674, 599]",MISC
852,que,"[674, 588, 742, 599]",MISC
853,##ries,"[674, 588, 742, 599]",MISC
854,.,"[674, 588, 742, 599]",MISC
855,-,"[743, 588, 745, 599]",MISC
856,NL,"[743, 588, 745, 599]",MISC
857,-,"[743, 588, 745, 599]",MISC
858,Good,"[409, 603, 448, 614]",MISC
859,knowledge,"[448, 603, 533, 614]",MISC
860,on,"[534, 603, 553, 614]",MISC
861,D,"[553, 603, 591, 614]",MISC
862,##W,"[553, 603, 591, 614]",MISC
863,##H,"[553, 603, 591, 614]",MISC
864,",","[553, 603, 591, 614]",MISC
865,Data,"[591, 603, 629, 614]",MISC
866,Model,"[629, 603, 706, 614]",MISC
867,##ing,"[629, 603, 706, 614]",MISC
868,and,"[706, 603, 734, 614]",MISC
869,Main,"[735, 603, 830, 614]",MISC
870,##frame,"[735, 603, 830, 614]",MISC
871,##s,"[735, 603, 830, 614]",MISC
872,concepts,"[830, 603, 915, 614]",MISC
873,.,"[830, 603, 915, 614]",MISC
874,-,"[916, 603, 918, 614]",MISC
875,NL,"[916, 603, 918, 614]",MISC
876,-,"[916, 603, 918, 614]",MISC
877,Knowledge,"[409, 617, 490, 628]",MISC
878,of,"[492, 617, 509, 628]",MISC
879,media,"[510, 617, 555, 628]",MISC
880,domain,"[556, 617, 610, 628]",MISC
881,term,"[611, 617, 729, 628]",MISC
882,##ino,"[611, 617, 729, 628]",MISC
883,##logies,"[611, 617, 729, 628]",MISC
884,and,"[731, 617, 757, 628]",MISC
885,end,"[758, 617, 784, 628]",MISC
886,to,"[786, 617, 803, 628]",MISC
887,end,"[804, 617, 830, 628]",MISC
888,work,"[832, 617, 913, 628]",MISC
889,##flow,"[832, 617, 913, 628]",MISC
890,.,"[832, 617, 913, 628]",MISC
891,-,"[915, 617, 916, 628]",MISC
892,NL,"[915, 617, 916, 628]",MISC
893,-,"[915, 617, 916, 628]",MISC
894,Hand,"[408, 632, 474, 643]",MISC
895,##ling,"[408, 632, 474, 643]",MISC
896,the,"[474, 632, 498, 643]",MISC
897,multiple,"[499, 632, 564, 643]",MISC
898,projects,"[564, 632, 630, 643]",MISC
899,or,"[630, 632, 646, 643]",MISC
900,tenants,"[647, 632, 704, 643]",MISC
901,simultaneously,"[704, 632, 827, 643]",MISC
902,.,"[704, 632, 827, 643]",MISC
903,-,"[828, 632, 830, 643]",MISC
904,NL,"[828, 632, 830, 643]",MISC
905,-,"[828, 632, 830, 643]",MISC
906,PR,"[369, 685, 464, 699]",MISC
907,##O,"[369, 685, 464, 699]",MISC
908,##J,"[369, 685, 464, 699]",MISC
909,##EC,"[369, 685, 464, 699]",MISC
910,##TS,"[369, 685, 464, 699]",MISC
911,S,"[465, 685, 560, 699]",MISC
912,##UM,"[465, 685, 560, 699]",MISC
913,##MA,"[465, 685, 560, 699]",MISC
914,##R,"[465, 685, 560, 699]",MISC
915,##Y,"[465, 685, 560, 699]",MISC
916,:,"[465, 685, 560, 699]",MISC
917,-,"[561, 685, 563, 699]",MISC
918,NL,"[561, 685, 563, 699]",MISC
919,-,"[561, 685, 563, 699]",MISC
920,Project,"[369, 713, 433, 728]",MISC
921,#,"[433, 713, 442, 728]",MISC
922,1,"[442, 713, 459, 728]",MISC
923,:,"[442, 713, 459, 728]",MISC
924,-,"[461, 713, 462, 728]",MISC
925,NL,"[461, 713, 462, 728]",MISC
926,-,"[461, 713, 462, 728]",MISC
927,Title,"[369, 748, 511, 762]",MISC
928,:,"[512, 748, 540, 762]",MISC
929,C,"[541, 748, 683, 762]",B-project_title
930,##LE,"[541, 748, 683, 762]",I-project_title
931,##AR,"[541, 748, 683, 762]",I-project_title
932,-,"[684, 748, 686, 762]",MISC
933,NL,"[684, 748, 686, 762]",MISC
934,-,"[684, 748, 686, 762]",MISC
935,C,"[369, 763, 535, 777]",MISC
936,##lient,"[369, 763, 535, 777]",MISC
937,:,"[535, 763, 563, 777]",MISC
938,T,"[563, 763, 674, 777]",B-project_company_name
939,##ER,"[563, 763, 674, 777]",I-project_company_name
940,##N,"[563, 763, 674, 777]",I-project_company_name
941,-,"[674, 763, 675, 777]",MISC
942,NL,"[674, 763, 675, 777]",MISC
943,-,"[674, 763, 675, 777]",MISC
944,Too,"[369, 777, 433, 790]",MISC
945,##ls,"[369, 777, 433, 790]",MISC
946,Used,"[433, 777, 484, 790]",MISC
947,:,"[485, 777, 497, 790]",MISC
948,To,"[498, 777, 562, 790]",MISC
949,##ad,"[498, 777, 562, 790]",MISC
950,",","[498, 777, 562, 790]",MISC
951,G,"[563, 777, 653, 790]",MISC
952,##u,"[563, 777, 653, 790]",MISC
953,##v,"[563, 777, 653, 790]",MISC
954,##nor,"[563, 777, 653, 790]",MISC
955,",","[563, 777, 653, 790]",MISC
956,Test,"[654, 777, 770, 790]",MISC
957,##link,"[654, 777, 770, 790]",MISC
958,",","[654, 777, 770, 790]",MISC
959,Red,"[770, 777, 860, 790]",MISC
960,##mine,"[770, 777, 860, 790]",MISC
961,-,"[861, 777, 863, 790]",MISC
962,NL,"[861, 777, 863, 790]",MISC
963,-,"[861, 777, 863, 790]",MISC
964,Database,"[369, 792, 516, 806]",MISC
965,:,"[517, 792, 534, 806]",MISC
966,My,"[536, 792, 572, 806]",MISC
967,S,"[573, 792, 628, 806]",MISC
968,##QL,"[573, 792, 628, 806]",MISC
969,Server,"[628, 792, 739, 806]",MISC
970,-,"[740, 792, 741, 806]",MISC
971,NL,"[740, 792, 741, 806]",MISC
972,-,"[740, 792, 741, 806]",MISC
973,Du,"[369, 806, 511, 819]",MISC
974,##ration,"[369, 806, 511, 819]",MISC
975,:,"[512, 806, 529, 819]",MISC
976,MA,"[530, 806, 584, 819]",MISC
977,##R,"[530, 806, 584, 819]",MISC
978,2016,"[584, 806, 655, 819]",MISC
979,–,"[655, 806, 673, 819]",MISC
980,PR,"[673, 806, 798, 819]",MISC
981,##ES,"[673, 806, 798, 819]",MISC
982,##EN,"[673, 806, 798, 819]",MISC
983,##T,"[673, 806, 798, 819]",MISC
984,-,"[798, 806, 800, 819]",MISC
985,NL,"[798, 806, 800, 819]",MISC
986,-,"[798, 806, 800, 819]",MISC
987,Des,"[369, 839, 461, 853]",MISC
988,##cription,"[369, 839, 461, 853]",MISC
989,:,"[369, 839, 461, 853]",MISC
990,-,"[461, 839, 462, 853]",MISC
991,NL,"[461, 839, 462, 853]",MISC
992,-,"[461, 839, 462, 853]",MISC
993,C,"[369, 857, 415, 871]",B-project_title
994,##LE,"[369, 857, 415, 871]",I-project_title
995,##AR,"[369, 857, 415, 871]",I-project_title
996,is,"[416, 857, 435, 871]",MISC
997,a,"[435, 857, 444, 871]",MISC
998,Digital,"[445, 857, 511, 871]",MISC
999,As,"[512, 857, 558, 871]",MISC
1000,##set,"[512, 857, 558, 871]",MISC
1001,Management,"[559, 857, 655, 871]",MISC
1002,(,"[655, 857, 701, 871]",MISC
1003,D,"[655, 857, 701, 871]",MISC
1004,##AM,"[655, 857, 701, 871]",MISC
1005,),"[655, 857, 701, 871]",MISC
1006,platform,"[702, 857, 779, 871]",MISC
1007,which,"[779, 857, 825, 871]",MISC
1008,also,"[826, 857, 864, 871]",MISC
1009,involved,"[864, 857, 941, 871]",MISC
1010,-,"[941, 857, 942, 871]",MISC
1011,NL,"[941, 857, 942, 871]",MISC
1012,-,"[941, 857, 942, 871]",MISC
1013,content,"[369, 871, 426, 884]",MISC
1014,operation,"[427, 871, 501, 884]",MISC
1015,like,"[502, 871, 535, 884]",MISC
1016,performing,"[535, 871, 618, 884]",MISC
1017,reviews,"[618, 871, 684, 884]",MISC
1018,",","[618, 871, 684, 884]",MISC
1019,delivery,"[685, 871, 751, 884]",MISC
1020,to,"[752, 871, 767, 884]",MISC
1021,TX,"[768, 871, 792, 884]",MISC
1022,",","[768, 871, 792, 884]",MISC
1023,arch,"[793, 871, 876, 884]",MISC
1024,##iving,"[793, 871, 876, 884]",MISC
1025,",","[793, 871, 876, 884]",MISC
1026,restoring,"[876, 871, 960, 884]",MISC
1027,",","[876, 871, 960, 884]",MISC
1028,-,"[960, 871, 961, 884]",MISC
1029,NL,"[960, 871, 961, 884]",MISC
1030,-,"[960, 871, 961, 884]",MISC
1031,catalog,"[369, 886, 464, 899]",MISC
1032,##ing,"[369, 886, 464, 899]",MISC
1033,",","[369, 886, 464, 899]",MISC
1034,s,"[465, 886, 569, 899]",MISC
1035,##yn,"[465, 886, 569, 899]",MISC
1036,##dication,"[465, 886, 569, 899]",MISC
1037,",","[465, 886, 569, 899]",MISC
1038,adaptive,"[570, 886, 640, 899]",MISC
1039,streaming,"[640, 886, 727, 899]",MISC
1040,",","[640, 886, 727, 899]",MISC
1041,publishes,"[728, 886, 806, 899]",MISC
1042,to,"[807, 886, 824, 899]",MISC
1043,new,"[825, 886, 851, 899]",MISC
1044,media,"[851, 886, 894, 899]",MISC
1045,and,"[895, 886, 921, 899]",MISC
1046,etc,"[921, 886, 956, 899]",MISC
1047,.,"[921, 886, 956, 899]",MISC
1048,-,"[956, 886, 958, 899]",MISC
1049,NL,"[956, 886, 958, 899]",MISC
1050,-,"[956, 886, 958, 899]",MISC
1051,C,"[369, 899, 414, 913]",B-project_title
1052,##LE,"[369, 899, 414, 913]",I-project_title
1053,##AR,"[369, 899, 414, 913]",I-project_title
1054,is,"[415, 899, 432, 913]",MISC
1055,an,"[433, 899, 450, 913]",MISC
1056,industry,"[452, 899, 524, 913]",MISC
1057,F,"[525, 899, 570, 913]",MISC
1058,##IR,"[525, 899, 570, 913]",MISC
1059,##ST,"[525, 899, 570, 913]",MISC
1060,tape,"[571, 899, 644, 913]",MISC
1061,##less,"[571, 899, 644, 913]",MISC
1062,end,"[645, 899, 737, 913]",MISC
1063,-,"[645, 899, 737, 913]",MISC
1064,to,"[645, 899, 737, 913]",MISC
1065,-,"[645, 899, 737, 913]",MISC
1066,end,"[645, 899, 737, 913]",MISC
1067,work,"[737, 899, 810, 913]",MISC
1068,##flow,"[737, 899, 810, 913]",MISC
1069,that,"[811, 899, 847, 913]",MISC
1070,is,"[848, 899, 865, 913]",MISC
1071,extremely,"[866, 899, 947, 913]",MISC
1072,safe,"[949, 899, 985, 913]",MISC
1073,-,"[986, 899, 987, 913]",MISC
1074,NL,"[986, 899, 987, 913]",MISC
1075,-,"[986, 899, 987, 913]",MISC
1076,and,"[369, 914, 395, 928]",MISC
1077,cost,"[395, 914, 516, 928]",MISC
1078,-,"[395, 914, 516, 928]",MISC
1079,effective,"[395, 914, 516, 928]",MISC
1080,solution,"[516, 914, 585, 928]",MISC
1081,for,"[585, 914, 611, 928]",MISC
1082,HD,"[611, 914, 629, 928]",MISC
1083,and,"[629, 914, 655, 928]",MISC
1084,SD,"[655, 914, 672, 928]",MISC
1085,digital,"[672, 914, 733, 928]",MISC
1086,media,"[733, 914, 776, 928]",MISC
1087,distribution,"[776, 914, 889, 928]",MISC
1088,.,"[776, 914, 889, 928]",MISC
1089,The,"[889, 914, 915, 928]",MISC
1090,platform,"[915, 914, 984, 928]",MISC
1091,-,"[984, 914, 986, 928]",MISC
1092,NL,"[984, 914, 986, 928]",MISC
1093,-,"[984, 914, 986, 928]",MISC
1094,enables,"[369, 928, 429, 942]",MISC
1095,high,"[431, 928, 517, 942]",MISC
1096,-,"[431, 928, 517, 942]",MISC
1097,speed,"[431, 928, 517, 942]",MISC
1098,content,"[519, 928, 580, 942]",MISC
1099,delivery,"[581, 928, 650, 942]",MISC
1100,for,"[651, 928, 677, 942]",MISC
1101,broadcasting,"[678, 928, 784, 942]",MISC
1102,and,"[784, 928, 810, 942]",MISC
1103,also,"[810, 928, 845, 942]",MISC
1104,streaming,"[846, 928, 924, 942]",MISC
1105,to,"[925, 928, 943, 942]",MISC
1106,global,"[943, 928, 995, 942]",MISC
1107,-,"[996, 928, 998, 942]",MISC
1108,NL,"[996, 928, 998, 942]",MISC
1109,-,"[996, 928, 998, 942]",MISC
1110,locations,"[369, 943, 445, 957]",MISC
1111,like,"[445, 943, 478, 957]",MISC
1112,Yahoo,"[479, 943, 530, 957]",MISC
1113,",","[479, 943, 530, 957]",MISC
1114,YouTube,"[530, 943, 598, 957]",MISC
1115,",","[530, 943, 598, 957]",MISC
1116,Hot,"[599, 943, 666, 957]",MISC
1117,##S,"[599, 943, 666, 957]",MISC
1118,##tar,"[599, 943, 666, 957]",MISC
1119,",","[599, 943, 666, 957]",MISC
1120,Net,"[667, 943, 863, 957]",MISC
1121,##F,"[667, 943, 863, 957]",MISC
1122,##lix,"[667, 943, 863, 957]",MISC
1123,",","[667, 943, 863, 957]",MISC
1124,Star,"[667, 943, 863, 957]",MISC
1125,##S,"[667, 943, 863, 957]",MISC
1126,##ports,"[667, 943, 863, 957]",MISC
1127,.,"[667, 943, 863, 957]",MISC
1128,com,"[667, 943, 863, 957]",MISC
1129,",","[667, 943, 863, 957]",MISC
1130,-,"[863, 943, 864, 957]",MISC
1131,NL,"[863, 943, 864, 957]",MISC
1132,-,"[863, 943, 864, 957]",MISC
1133,Daily,"[369, 957, 523, 971]",MISC
1134,##M,"[369, 957, 523, 971]",MISC
1135,##otion,"[369, 957, 523, 971]",MISC
1136,.,"[369, 957, 523, 971]",MISC
1137,.,"[369, 957, 523, 971]",MISC
1138,.,"[369, 957, 523, 971]",MISC
1139,etc,"[369, 957, 523, 971]",MISC
1140,.,"[369, 957, 523, 971]",MISC
1141,The,"[523, 957, 548, 971]",MISC
1142,application,"[549, 957, 643, 971]",MISC
1143,is,"[644, 957, 659, 971]",MISC
1144,exclusively,"[661, 957, 754, 971]",MISC
1145,web,"[755, 957, 779, 971]",MISC
1146,based,"[781, 957, 823, 971]",MISC
1147,and,"[824, 957, 848, 971]",MISC
1148,is,"[850, 957, 865, 971]",MISC
1149,built,"[867, 957, 908, 971]",MISC
1150,using,"[910, 957, 951, 971]",MISC
1151,-,"[953, 957, 954, 971]",MISC
1152,NL,"[953, 957, 954, 971]",MISC
1153,-,"[953, 957, 954, 971]",MISC
1154,client,"[369, 972, 478, 986]",MISC
1155,–,"[369, 972, 478, 986]",MISC
1156,server,"[369, 972, 478, 986]",MISC
1157,architecture,"[478, 972, 587, 986]",MISC
1158,.,"[478, 972, 587, 986]",MISC
1159,Dev,"[588, 972, 671, 986]",MISC
1160,##elo,"[588, 972, 671, 986]",MISC
1161,##ping,"[588, 972, 671, 986]",MISC
1162,As,"[672, 972, 714, 986]",MISC
1163,##set,"[672, 972, 714, 986]",MISC
1164,Det,"[714, 972, 773, 986]",MISC
1165,##ails,"[714, 972, 773, 986]",MISC
1166,in,"[773, 972, 789, 986]",MISC
1167,which,"[790, 972, 832, 986]",MISC
1168,all,"[832, 972, 857, 986]",MISC
1169,U,"[858, 972, 873, 986]",MISC
1170,##I,"[858, 972, 873, 986]",MISC
1171,is,"[875, 972, 890, 986]",MISC
1172,built,"[891, 972, 933, 986]",MISC
1173,through,"[934, 972, 992, 986]",MISC
1174,-,"[993, 972, 994, 986]",MISC
1175,NL,"[993, 972, 994, 986]",MISC
1176,-,"[993, 972, 994, 986]",MISC
1177,table,"[369, 986, 419, 1000]",MISC
1178,",","[369, 986, 419, 1000]",MISC
1179,adding,"[419, 986, 469, 1000]",MISC
1180,column,"[470, 986, 520, 1000]",MISC
1181,in,"[520, 986, 536, 1000]",MISC
1182,a,"[537, 986, 544, 1000]",MISC
1183,table,"[546, 986, 587, 1000]",MISC
1184,will,"[588, 986, 621, 1000]",MISC
1185,reflect,"[621, 986, 680, 1000]",MISC
1186,directly,"[680, 986, 746, 1000]",MISC
1187,in,"[748, 986, 763, 1000]",MISC
1188,U,"[765, 986, 789, 1000]",MISC
1189,##I,"[765, 986, 789, 1000]",MISC
1190,.,"[765, 986, 789, 1000]",MISC
1191,-,"[790, 986, 792, 1000]",MISC
1192,NL,"[790, 986, 792, 1000]",MISC
1193,-,"[790, 986, 792, 1000]",MISC
1194,There,"[383, 102, 429, 116]",MISC
1195,are,"[430, 102, 458, 116]",MISC
1196,different,"[458, 102, 543, 116]",MISC
1197,modules,"[544, 102, 610, 116]",MISC
1198,in,"[610, 102, 627, 116]",MISC
1199,the,"[629, 102, 657, 116]",MISC
1200,C,"[657, 102, 704, 116]",B-project_title
1201,##LE,"[657, 102, 704, 116]",I-project_title
1202,##AR,"[657, 102, 704, 116]",I-project_title
1203,-,"[705, 102, 707, 116]",MISC
1204,NL,"[705, 102, 707, 116]",MISC
1205,-,"[705, 102, 707, 116]",MISC
1206,Broadcast,"[383, 131, 467, 145]",MISC
1207,[,"[469, 131, 545, 145]",MISC
1208,Content,"[469, 131, 545, 145]",MISC
1209,Management,"[545, 131, 641, 145]",MISC
1210,System,"[641, 131, 707, 145]",MISC
1211,],"[641, 131, 707, 145]",MISC
1212,-,"[708, 131, 710, 145]",MISC
1213,NL,"[708, 131, 710, 145]",MISC
1214,-,"[708, 131, 710, 145]",MISC
1215,Quality,"[383, 146, 445, 160]",MISC
1216,Check,"[445, 146, 489, 160]",MISC
1217,-,"[490, 146, 492, 160]",MISC
1218,NL,"[490, 146, 492, 160]",MISC
1219,-,"[490, 146, 492, 160]",MISC
1220,Clear,"[383, 160, 429, 173]",MISC
1221,Edge,"[431, 160, 469, 173]",MISC
1222,-,"[469, 160, 471, 173]",MISC
1223,NL,"[469, 160, 471, 173]",MISC
1224,-,"[469, 160, 471, 173]",MISC
1225,T,"[383, 191, 415, 205]",B-project_company_name
1226,##ER,"[383, 191, 415, 205]",I-project_company_name
1227,##N,"[383, 191, 415, 205]",I-project_company_name
1228,is,"[417, 191, 433, 205]",MISC
1229,a,"[434, 191, 441, 205]",MISC
1230,4,"[443, 191, 458, 205]",MISC
1231,##K,"[443, 191, 458, 205]",MISC
1232,broadcaster,"[460, 191, 554, 205]",MISC
1233,based,"[555, 191, 596, 205]",MISC
1234,in,"[598, 191, 613, 205]",MISC
1235,Hi,"[615, 191, 700, 205]",MISC
1236,##lve,"[615, 191, 700, 205]",MISC
1237,##rs,"[615, 191, 700, 205]",MISC
1238,##um,"[615, 191, 700, 205]",MISC
1239,",","[615, 191, 700, 205]",MISC
1240,Netherlands,"[701, 191, 803, 205]",MISC
1241,.,"[701, 191, 803, 205]",MISC
1242,T,"[805, 191, 837, 205]",B-project_company_name
1243,##ER,"[805, 191, 837, 205]",I-project_company_name
1244,##N,"[805, 191, 837, 205]",I-project_company_name
1245,is,"[839, 191, 855, 205]",MISC
1246,partner,"[856, 191, 941, 205]",MISC
1247,##ing,"[856, 191, 941, 205]",MISC
1248,-,"[942, 191, 944, 205]",MISC
1249,NL,"[942, 191, 944, 205]",MISC
1250,-,"[942, 191, 944, 205]",MISC
1251,with,"[383, 206, 417, 220]",MISC
1252,P,"[419, 206, 445, 220]",MISC
1253,##FT,"[419, 206, 445, 220]",MISC
1254,to,"[446, 206, 463, 220]",MISC
1255,setup,"[464, 206, 507, 220]",MISC
1256,a,"[509, 206, 517, 220]",MISC
1257,C,"[518, 206, 561, 220]",B-project_title
1258,##LE,"[518, 206, 561, 220]",I-project_title
1259,##AR,"[518, 206, 561, 220]",I-project_title
1260,Broadcast,"[563, 206, 642, 220]",MISC
1261,Cloud,"[644, 206, 687, 220]",MISC
1262,based,"[689, 206, 732, 220]",MISC
1263,content,"[734, 206, 796, 220]",MISC
1264,work,"[797, 206, 868, 220]",MISC
1265,##flow,"[797, 206, 868, 220]",MISC
1266,system,"[869, 206, 922, 220]",MISC
1267,to,"[923, 206, 940, 220]",MISC
1268,-,"[941, 206, 942, 220]",MISC
1269,NL,"[941, 206, 942, 220]",MISC
1270,-,"[941, 206, 942, 220]",MISC
1271,connect,"[383, 220, 440, 234]",MISC
1272,production,"[440, 220, 521, 234]",MISC
1273,partners,"[522, 220, 586, 234]",MISC
1274,with,"[588, 220, 619, 234]",MISC
1275,T,"[620, 220, 669, 234]",B-project_company_name
1276,##ER,"[620, 220, 669, 234]",I-project_company_name
1277,##N,"[620, 220, 669, 234]",I-project_company_name
1278,’,"[620, 220, 669, 234]",MISC
1279,s,"[620, 220, 669, 234]",MISC
1280,in,"[670, 220, 685, 234]",MISC
1281,house,"[686, 220, 726, 234]",MISC
1282,teams,"[727, 220, 775, 234]",MISC
1283,",","[727, 220, 775, 234]",MISC
1284,stream,"[776, 220, 873, 234]",MISC
1285,##lining,"[776, 220, 873, 234]",MISC
1286,content,"[875, 220, 932, 234]",MISC
1287,-,"[932, 220, 934, 234]",MISC
1288,NL,"[932, 220, 934, 234]",MISC
1289,-,"[932, 220, 934, 234]",MISC
1290,pre,"[383, 235, 414, 249]",MISC
1291,##p,"[383, 235, 414, 249]",MISC
1292,ready,"[415, 235, 455, 249]",MISC
1293,for,"[455, 235, 478, 249]",MISC
1294,delivery,"[479, 235, 550, 249]",MISC
1295,.,"[479, 235, 550, 249]",MISC
1296,C,"[552, 235, 592, 249]",B-project_title
1297,##LE,"[552, 235, 592, 249]",I-project_title
1298,##AR,"[552, 235, 592, 249]",I-project_title
1299,shall,"[592, 235, 632, 249]",MISC
1300,also,"[633, 235, 664, 249]",MISC
1301,enable,"[665, 235, 712, 249]",MISC
1302,the,"[713, 235, 736, 249]",MISC
1303,content,"[738, 235, 793, 249]",MISC
1304,acquisition,"[794, 235, 883, 249]",MISC
1305,process,"[883, 235, 947, 249]",MISC
1306,",","[883, 235, 947, 249]",MISC
1307,-,"[948, 235, 949, 249]",MISC
1308,NL,"[948, 235, 949, 249]",MISC
1309,-,"[948, 235, 949, 249]",MISC
1310,orchestra,"[383, 249, 487, 264]",MISC
1311,##ting,"[383, 249, 487, 264]",MISC
1312,the,"[487, 249, 509, 264]",MISC
1313,delivery,"[511, 249, 573, 264]",MISC
1314,of,"[575, 249, 590, 264]",MISC
1315,content,"[591, 249, 646, 264]",MISC
1316,from,"[647, 249, 678, 264]",MISC
1317,Di,"[679, 249, 774, 264]",MISC
1318,##st,"[679, 249, 774, 264]",MISC
1319,##ri,"[679, 249, 774, 264]",MISC
1320,##but,"[679, 249, 774, 264]",MISC
1321,##ors,"[679, 249, 774, 264]",MISC
1322,in,"[775, 249, 791, 264]",MISC
1323,an,"[791, 249, 807, 264]",MISC
1324,automated,"[807, 249, 878, 264]",MISC
1325,way,"[879, 249, 910, 264]",MISC
1326,.,"[879, 249, 910, 264]",MISC
1327,-,"[911, 249, 913, 264]",MISC
1328,NL,"[911, 249, 913, 264]",MISC
1329,-,"[911, 249, 913, 264]",MISC
1330,Inter,"[383, 264, 466, 277]",MISC
1331,##face,"[383, 264, 466, 277]",MISC
1332,##s,"[383, 264, 466, 277]",MISC
1333,between,"[467, 264, 526, 277]",MISC
1334,What,"[527, 264, 594, 277]",MISC
1335,##s,"[527, 264, 594, 277]",MISC
1336,’,"[527, 264, 594, 277]",MISC
1337,On,"[527, 264, 594, 277]",MISC
1338,(,"[595, 264, 628, 277]",MISC
1339,W,"[595, 264, 628, 277]",MISC
1340,##O,"[595, 264, 628, 277]",MISC
1341,),"[595, 264, 628, 277]",MISC
1342,and,"[629, 264, 653, 277]",MISC
1343,SE,"[654, 264, 678, 277]",MISC
1344,##S,"[654, 264, 678, 277]",MISC
1345,shall,"[680, 264, 721, 277]",MISC
1346,enable,"[722, 264, 772, 277]",MISC
1347,the,"[773, 264, 797, 277]",MISC
1348,stream,"[798, 264, 899, 277]",MISC
1349,##lining,"[798, 264, 899, 277]",MISC
1350,of,"[900, 264, 916, 277]",MISC
1351,all,"[917, 264, 941, 277]",MISC
1352,of,"[943, 264, 958, 277]",MISC
1353,-,"[960, 264, 961, 277]",MISC
1354,NL,"[960, 264, 961, 277]",MISC
1355,-,"[960, 264, 961, 277]",MISC
1356,T,"[383, 279, 431, 292]",B-project_company_name
1357,##ER,"[383, 279, 431, 292]",I-project_company_name
1358,##N,"[383, 279, 431, 292]",I-project_company_name
1359,’,"[383, 279, 431, 292]",MISC
1360,s,"[383, 279, 431, 292]",MISC
1361,content,"[431, 279, 487, 292]",MISC
1362,operations,"[488, 279, 576, 292]",MISC
1363,.,"[488, 279, 576, 292]",MISC
1364,-,"[577, 279, 578, 292]",MISC
1365,NL,"[577, 279, 578, 292]",MISC
1366,-,"[577, 279, 578, 292]",MISC
1367,Role,"[383, 310, 422, 324]",MISC
1368,##s,"[383, 310, 422, 324]",MISC
1369,and,"[422, 310, 445, 324]",MISC
1370,Re,"[446, 310, 581, 324]",MISC
1371,##sp,"[446, 310, 581, 324]",MISC
1372,##ons,"[446, 310, 581, 324]",MISC
1373,##ibi,"[446, 310, 581, 324]",MISC
1374,##lities,"[446, 310, 581, 324]",MISC
1375,:,"[446, 310, 581, 324]",MISC
1376,-,"[582, 310, 584, 324]",MISC
1377,NL,"[582, 310, 584, 324]",MISC
1378,-,"[582, 310, 584, 324]",MISC
1379,Ana,"[424, 324, 512, 337]",MISC
1380,##ly,"[424, 324, 512, 337]",MISC
1381,##zing,"[424, 324, 512, 337]",MISC
1382,the,"[512, 324, 542, 337]",MISC
1383,Re,"[542, 324, 650, 337]",MISC
1384,##quire,"[542, 324, 650, 337]",MISC
1385,##ment,"[542, 324, 650, 337]",MISC
1386,document,"[651, 324, 739, 337]",MISC
1387,.,"[651, 324, 739, 337]",MISC
1388,-,"[740, 324, 741, 337]",MISC
1389,NL,"[740, 324, 741, 337]",MISC
1390,-,"[740, 324, 741, 337]",MISC
1391,Writing,"[424, 336, 497, 352]",MISC
1392,and,"[497, 336, 528, 352]",MISC
1393,reviewing,"[528, 336, 622, 352]",MISC
1394,the,"[622, 336, 653, 352]",MISC
1395,Test,"[653, 336, 694, 352]",MISC
1396,cases,"[694, 336, 746, 352]",MISC
1397,based,"[746, 336, 798, 352]",MISC
1398,on,"[798, 336, 819, 352]",MISC
1399,the,"[819, 336, 850, 352]",MISC
1400,Re,"[850, 336, 965, 352]",MISC
1401,##quire,"[850, 336, 965, 352]",MISC
1402,##ment,"[850, 336, 965, 352]",MISC
1403,-,"[965, 336, 967, 352]",MISC
1404,NL,"[965, 336, 967, 352]",MISC
1405,-,"[965, 336, 967, 352]",MISC
1406,document,"[445, 352, 526, 366]",MISC
1407,.,"[445, 352, 526, 366]",MISC
1408,-,"[526, 352, 528, 366]",MISC
1409,NL,"[526, 352, 528, 366]",MISC
1410,-,"[526, 352, 528, 366]",MISC
1411,Fun,"[424, 367, 528, 381]",MISC
1412,##ctional,"[424, 367, 528, 381]",MISC
1413,and,"[528, 367, 559, 381]",MISC
1414,Integration,"[559, 367, 684, 381]",MISC
1415,",","[559, 367, 684, 381]",MISC
1416,system,"[684, 367, 746, 381]",MISC
1417,testing,"[746, 367, 819, 381]",MISC
1418,and,"[819, 367, 850, 381]",MISC
1419,S,"[850, 367, 882, 381]",MISC
1420,##QL,"[850, 367, 882, 381]",MISC
1421,data,"[882, 367, 923, 381]",MISC
1422,base,"[923, 367, 965, 381]",MISC
1423,-,"[965, 367, 967, 381]",MISC
1424,NL,"[965, 367, 967, 381]",MISC
1425,-,"[965, 367, 967, 381]",MISC
1426,testing,"[445, 381, 500, 395]",MISC
1427,.,"[445, 381, 500, 395]",MISC
1428,-,"[500, 381, 502, 395]",MISC
1429,NL,"[500, 381, 502, 395]",MISC
1430,-,"[500, 381, 502, 395]",MISC
1431,Testing,"[423, 396, 491, 410]",MISC
1432,the,"[491, 396, 519, 410]",MISC
1433,Feature,"[520, 396, 588, 410]",MISC
1434,in,"[588, 396, 607, 410]",MISC
1435,Web,"[607, 396, 635, 410]",MISC
1436,Application,"[636, 396, 742, 410]",MISC
1437,and,"[742, 396, 770, 410]",MISC
1438,iOS,"[771, 396, 799, 410]",MISC
1439,Applications,"[800, 396, 915, 410]",MISC
1440,[,"[916, 396, 963, 410]",MISC
1441,i,"[916, 396, 963, 410]",MISC
1442,##Pad,"[916, 396, 963, 410]",MISC
1443,-,"[965, 396, 967, 410]",MISC
1444,NL,"[965, 396, 967, 410]",MISC
1445,-,"[965, 396, 967, 410]",MISC
1446,and,"[445, 410, 473, 424]",MISC
1447,iPhone,"[473, 410, 537, 424]",MISC
1448,],"[473, 410, 537, 424]",MISC
1449,-,"[538, 410, 540, 424]",MISC
1450,NL,"[538, 410, 540, 424]",MISC
1451,-,"[538, 410, 540, 424]",MISC
1452,Report,"[423, 425, 506, 439]",MISC
1453,##ing,"[423, 425, 506, 439]",MISC
1454,and,"[507, 425, 535, 439]",MISC
1455,tracking,"[535, 425, 610, 439]",MISC
1456,of,"[610, 425, 627, 439]",MISC
1457,defects,"[628, 425, 703, 439]",MISC
1458,.,"[628, 425, 703, 439]",MISC
1459,-,"[703, 425, 705, 439]",MISC
1460,NL,"[703, 425, 705, 439]",MISC
1461,-,"[703, 425, 705, 439]",MISC
1462,Re,"[423, 439, 506, 454]",MISC
1463,##test,"[423, 439, 506, 454]",MISC
1464,##ing,"[423, 439, 506, 454]",MISC
1465,the,"[506, 439, 534, 454]",MISC
1466,fixed,"[534, 439, 579, 454]",MISC
1467,defects,"[580, 439, 653, 454]",MISC
1468,.,"[580, 439, 653, 454]",MISC
1469,-,"[655, 439, 656, 454]",MISC
1470,NL,"[655, 439, 656, 454]",MISC
1471,-,"[655, 439, 656, 454]",MISC
1472,Ex,"[423, 454, 510, 468]",MISC
1473,##ec,"[423, 454, 510, 468]",MISC
1474,##ution,"[423, 454, 510, 468]",MISC
1475,of,"[510, 454, 529, 468]",MISC
1476,Test,"[529, 454, 568, 468]",MISC
1477,cases,"[568, 454, 615, 468]",MISC
1478,on,"[616, 454, 635, 468]",MISC
1479,Test,"[635, 454, 722, 468]",MISC
1480,##link,"[635, 454, 722, 468]",MISC
1481,.,"[635, 454, 722, 468]",MISC
1482,-,"[722, 454, 724, 468]",MISC
1483,NL,"[722, 454, 724, 468]",MISC
1484,-,"[722, 454, 724, 468]",MISC
1485,Pre,"[423, 469, 508, 483]",MISC
1486,##par,"[423, 469, 508, 483]",MISC
1487,##ing,"[423, 469, 508, 483]",MISC
1488,Daily,"[508, 469, 555, 483]",MISC
1489,Status,"[556, 469, 611, 483]",MISC
1490,Report,"[613, 469, 668, 483]",MISC
1491,and,"[669, 469, 697, 483]",MISC
1492,sharing,"[698, 469, 764, 483]",MISC
1493,among,"[764, 469, 811, 483]",MISC
1494,the,"[812, 469, 839, 483]",MISC
1495,stakeholders,"[840, 469, 963, 483]",MISC
1496,.,"[840, 469, 963, 483]",MISC
1497,-,"[963, 469, 965, 483]",MISC
1498,NL,"[963, 469, 965, 483]",MISC
1499,-,"[963, 469, 965, 483]",MISC
1500,Project,"[383, 498, 447, 513]",MISC
1501,#,"[447, 498, 455, 513]",MISC
1502,2,"[456, 498, 473, 513]",MISC
1503,:,"[456, 498, 473, 513]",MISC
1504,-,"[474, 498, 476, 513]",MISC
1505,NL,"[474, 498, 476, 513]",MISC
1506,-,"[474, 498, 476, 513]",MISC
1507,Title,"[383, 529, 455, 543]",MISC
1508,:,"[456, 529, 470, 543]",MISC
1509,CC,"[471, 529, 544, 543]",MISC
1510,##AR,"[471, 529, 544, 543]",MISC
1511,",","[471, 529, 544, 543]",MISC
1512,Anti,"[545, 529, 604, 543]",MISC
1513,Money,"[604, 529, 677, 543]",MISC
1514,Lau,"[678, 529, 913, 543]",MISC
1515,##nder,"[678, 529, 913, 543]",MISC
1516,##ing,"[678, 529, 913, 543]",MISC
1517,(,"[678, 529, 913, 543]",MISC
1518,AM,"[678, 529, 913, 543]",MISC
1519,##L,"[678, 529, 913, 543]",MISC
1520,),"[678, 529, 913, 543]",MISC
1521,",","[678, 529, 913, 543]",MISC
1522,L,"[914, 529, 957, 543]",MISC
1523,##CR,"[914, 529, 957, 543]",MISC
1524,-,"[958, 529, 960, 543]",MISC
1525,NL,"[958, 529, 960, 543]",MISC
1526,-,"[958, 529, 960, 543]",MISC
1527,and,"[383, 544, 421, 558]",MISC
1528,MD,"[422, 544, 460, 558]",MISC
1529,##M,"[422, 544, 460, 558]",MISC
1530,-,"[461, 544, 462, 558]",MISC
1531,NL,"[461, 544, 462, 558]",MISC
1532,-,"[461, 544, 462, 558]",MISC
1533,C,"[383, 558, 519, 571]",MISC
1534,##lient,"[383, 558, 519, 571]",MISC
1535,:,"[520, 558, 542, 571]",MISC
1536,M,"[543, 558, 610, 571]",B-project_company_name
1537,&,"[543, 558, 610, 571]",I-project_company_name
1538,T,"[543, 558, 610, 571]",I-project_company_name
1539,Bank,"[611, 558, 701, 571]",I-project_company_name
1540,US,"[702, 558, 748, 571]",I-project_company_name
1541,-,"[748, 558, 750, 571]",MISC
1542,NL,"[748, 558, 750, 571]",MISC
1543,-,"[748, 558, 750, 571]",MISC
1544,Too,"[383, 573, 448, 586]",MISC
1545,##ls,"[383, 573, 448, 586]",MISC
1546,Used,"[449, 573, 501, 586]",MISC
1547,:,"[502, 573, 514, 586]",MISC
1548,AL,"[515, 573, 567, 586]",MISC
1549,##M,"[515, 573, 567, 586]",MISC
1550,",","[515, 573, 567, 586]",MISC
1551,Te,"[569, 573, 674, 586]",MISC
1552,##rada,"[569, 573, 674, 586]",MISC
1553,##ta,"[569, 573, 674, 586]",MISC
1554,Assistant,"[675, 573, 794, 586]",MISC
1555,14,"[794, 573, 860, 586]",MISC
1556,.,"[794, 573, 860, 586]",MISC
1557,10,"[794, 573, 860, 586]",MISC
1558,-,"[861, 573, 863, 586]",MISC
1559,NL,"[861, 573, 863, 586]",MISC
1560,-,"[861, 573, 863, 586]",MISC
1561,Database,"[383, 586, 533, 600]",MISC
1562,:,"[533, 586, 551, 600]",MISC
1563,Te,"[552, 586, 703, 600]",MISC
1564,##rada,"[552, 586, 703, 600]",MISC
1565,##ta,"[552, 586, 703, 600]",MISC
1566,-,"[703, 586, 705, 600]",MISC
1567,NL,"[703, 586, 705, 600]",MISC
1568,-,"[703, 586, 705, 600]",MISC
1569,Du,"[383, 599, 521, 615]",MISC
1570,##ration,"[383, 599, 521, 615]",MISC
1571,:,"[522, 599, 539, 615]",MISC
1572,SE,"[539, 599, 608, 615]",MISC
1573,##P,"[539, 599, 608, 615]",MISC
1574,##T,"[539, 599, 608, 615]",MISC
1575,2014,"[609, 599, 678, 615]",MISC
1576,–,"[678, 599, 696, 615]",MISC
1577,MA,"[696, 599, 748, 615]",MISC
1578,##R,"[696, 599, 748, 615]",MISC
1579,2016,"[748, 599, 817, 615]",MISC
1580,-,"[818, 599, 819, 615]",MISC
1581,NL,"[818, 599, 819, 615]",MISC
1582,-,"[818, 599, 819, 615]",MISC
1583,Des,"[383, 644, 474, 658]",MISC
1584,##cription,"[383, 644, 474, 658]",MISC
1585,:,"[383, 644, 474, 658]",MISC
1586,-,"[474, 644, 476, 658]",MISC
1587,NL,"[474, 644, 476, 658]",MISC
1588,-,"[474, 644, 476, 658]",MISC
1589,CC,"[383, 662, 428, 675]",MISC
1590,##AR,"[383, 662, 428, 675]",MISC
1591,",","[383, 662, 428, 675]",MISC
1592,AM,"[428, 662, 454, 675]",MISC
1593,##L,"[428, 662, 454, 675]",MISC
1594,and,"[455, 662, 481, 675]",MISC
1595,L,"[482, 662, 508, 675]",MISC
1596,##CR,"[482, 662, 508, 675]",MISC
1597,are,"[509, 662, 535, 675]",MISC
1598,the,"[536, 662, 562, 675]",MISC
1599,projects,"[563, 662, 635, 675]",MISC
1600,where,"[636, 662, 681, 675]",MISC
1601,the,"[681, 662, 707, 675]",MISC
1602,data,"[708, 662, 743, 675]",MISC
1603,are,"[744, 662, 770, 675]",MISC
1604,extracted,"[772, 662, 851, 675]",MISC
1605,from,"[853, 662, 888, 675]",MISC
1606,the,"[889, 662, 915, 675]",MISC
1607,-,"[916, 662, 918, 675]",MISC
1608,NL,"[916, 662, 918, 675]",MISC
1609,-,"[916, 662, 918, 675]",MISC
1610,different,"[383, 675, 454, 690]",MISC
1611,sources,"[454, 675, 509, 690]",MISC
1612,and,"[509, 675, 532, 690]",MISC
1613,Trans,"[533, 675, 620, 690]",MISC
1614,##formed,"[533, 675, 620, 690]",MISC
1615,according,"[620, 675, 691, 690]",MISC
1616,to,"[692, 675, 707, 690]",MISC
1617,the,"[707, 675, 730, 690]",MISC
1618,Business,"[731, 675, 794, 690]",MISC
1619,logic,"[794, 675, 937, 690]",MISC
1620,/,"[794, 675, 937, 690]",MISC
1621,requirements,"[794, 675, 937, 690]",MISC
1622,-,"[937, 675, 939, 690]",MISC
1623,NL,"[937, 675, 939, 690]",MISC
1624,-,"[937, 675, 939, 690]",MISC
1625,and,"[383, 690, 407, 704]",MISC
1626,then,"[408, 690, 441, 704]",MISC
1627,loaded,"[441, 690, 491, 704]",MISC
1628,in,"[492, 690, 507, 704]",MISC
1629,to,"[508, 690, 524, 704]",MISC
1630,the,"[525, 690, 549, 704]",MISC
1631,Data,"[550, 690, 583, 704]",MISC
1632,Ware,"[584, 690, 658, 704]",MISC
1633,##house,"[584, 690, 658, 704]",MISC
1634,for,"[659, 690, 683, 704]",MISC
1635,the,"[684, 690, 709, 704]",MISC
1636,purpose,"[710, 690, 767, 704]",MISC
1637,of,"[768, 690, 784, 704]",MISC
1638,Business,"[785, 690, 851, 704]",MISC
1639,Intelligence,"[852, 690, 953, 704]",MISC
1640,-,"[953, 690, 954, 704]",MISC
1641,NL,"[953, 690, 954, 704]",MISC
1642,-,"[953, 690, 954, 704]",MISC
1643,and,"[383, 705, 407, 719]",MISC
1644,Report,"[407, 705, 480, 719]",MISC
1645,##ing,"[407, 705, 480, 719]",MISC
1646,and,"[480, 705, 504, 719]",MISC
1647,also,"[504, 705, 536, 719]",MISC
1648,Ana,"[537, 705, 617, 719]",MISC
1649,##ly,"[537, 705, 617, 719]",MISC
1650,##tics,"[537, 705, 617, 719]",MISC
1651,.,"[537, 705, 617, 719]",MISC
1652,-,"[618, 705, 620, 719]",MISC
1653,NL,"[618, 705, 620, 719]",MISC
1654,-,"[618, 705, 620, 719]",MISC
1655,Role,"[383, 734, 422, 748]",MISC
1656,##s,"[383, 734, 422, 748]",MISC
1657,and,"[422, 734, 445, 748]",MISC
1658,Re,"[446, 734, 581, 748]",MISC
1659,##sp,"[446, 734, 581, 748]",MISC
1660,##ons,"[446, 734, 581, 748]",MISC
1661,##ibi,"[446, 734, 581, 748]",MISC
1662,##lities,"[446, 734, 581, 748]",MISC
1663,:,"[446, 734, 581, 748]",MISC
1664,-,"[582, 734, 584, 748]",MISC
1665,NL,"[582, 734, 584, 748]",MISC
1666,-,"[582, 734, 584, 748]",MISC
1667,Creation,"[423, 750, 496, 762]",MISC
1668,and,"[496, 750, 522, 762]",MISC
1669,Understanding,"[523, 750, 641, 762]",MISC
1670,of,"[641, 750, 659, 762]",MISC
1671,Map,"[659, 750, 722, 762]",MISC
1672,##ping,"[659, 750, 722, 762]",MISC
1673,Doc,"[723, 750, 813, 762]",MISC
1674,##ume,"[723, 750, 813, 762]",MISC
1675,##nts,"[723, 750, 813, 762]",MISC
1676,.,"[723, 750, 813, 762]",MISC
1677,-,"[814, 750, 816, 762]",MISC
1678,NL,"[814, 750, 816, 762]",MISC
1679,-,"[814, 750, 816, 762]",MISC
1680,In,"[422, 773, 488, 784]",MISC
1681,##volved,"[422, 773, 488, 784]",MISC
1682,in,"[488, 773, 504, 784]",MISC
1683,functional,"[505, 773, 586, 784]",MISC
1684,study,"[588, 773, 628, 784]",MISC
1685,of,"[630, 773, 645, 784]",MISC
1686,the,"[646, 773, 670, 784]",MISC
1687,application,"[671, 773, 770, 784]",MISC
1688,.,"[671, 773, 770, 784]",MISC
1689,-,"[771, 773, 772, 784]",MISC
1690,NL,"[771, 773, 772, 784]",MISC
1691,-,"[771, 773, 772, 784]",MISC
1692,Creation,"[423, 793, 494, 806]",MISC
1693,of,"[494, 793, 511, 806]",MISC
1694,Test,"[512, 793, 547, 806]",MISC
1695,Sc,"[548, 793, 627, 806]",MISC
1696,##ena,"[548, 793, 627, 806]",MISC
1697,##rio,"[548, 793, 627, 806]",MISC
1698,##s,"[548, 793, 627, 806]",MISC
1699,and,"[628, 793, 654, 806]",MISC
1700,Case,"[655, 793, 707, 806]",MISC
1701,##s,"[655, 793, 707, 806]",MISC
1702,.,"[655, 793, 707, 806]",MISC
1703,-,"[708, 793, 710, 806]",MISC
1704,NL,"[708, 793, 710, 806]",MISC
1705,-,"[708, 793, 710, 806]",MISC
1706,Work,"[423, 809, 500, 821]",MISC
1707,##flow,"[423, 809, 500, 821]",MISC
1708,for,"[501, 809, 529, 821]",MISC
1709,ET,"[530, 809, 558, 821]",MISC
1710,##L,"[530, 809, 558, 821]",MISC
1711,process,"[560, 809, 636, 821]",MISC
1712,.,"[560, 809, 636, 821]",MISC
1713,-,"[637, 809, 639, 821]",MISC
1714,NL,"[637, 809, 639, 821]",MISC
1715,-,"[637, 809, 639, 821]",MISC
1716,V,"[422, 831, 498, 843]",MISC
1717,##eri,"[422, 831, 498, 843]",MISC
1718,##fying,"[422, 831, 498, 843]",MISC
1719,the,"[499, 831, 523, 843]",MISC
1720,data,"[524, 831, 557, 843]",MISC
1721,in,"[558, 831, 574, 843]",MISC
1722,target,"[575, 831, 625, 843]",MISC
1723,database,"[626, 831, 694, 843]",MISC
1724,after,"[694, 831, 735, 843]",MISC
1725,ET,"[736, 831, 761, 843]",MISC
1726,##L,"[736, 831, 761, 843]",MISC
1727,process,"[762, 831, 829, 843]",MISC
1728,.,"[762, 831, 829, 843]",MISC
1729,-,"[830, 831, 831, 843]",MISC
1730,NL,"[830, 831, 831, 843]",MISC
1731,-,"[830, 831, 831, 843]",MISC
1732,Per,"[423, 853, 502, 864]",MISC
1733,##formed,"[423, 853, 502, 864]",MISC
1734,column,"[503, 853, 555, 864]",MISC
1735,data,"[557, 853, 591, 864]",MISC
1736,mapping,"[593, 853, 655, 864]",MISC
1737,between,"[655, 853, 718, 864]",MISC
1738,source,"[718, 853, 770, 864]",MISC
1739,&,"[771, 853, 780, 864]",MISC
1740,target,"[780, 853, 832, 864]",MISC
1741,database,"[834, 853, 914, 864]",MISC
1742,.,"[834, 853, 914, 864]",MISC
1743,-,"[915, 853, 916, 864]",MISC
1744,NL,"[915, 853, 916, 864]",MISC
1745,-,"[915, 853, 916, 864]",MISC
1746,Pre,"[422, 876, 488, 887]",MISC
1747,##par,"[422, 876, 488, 887]",MISC
1748,##ed,"[422, 876, 488, 887]",MISC
1749,test,"[488, 876, 521, 887]",MISC
1750,scripts,"[521, 876, 578, 887]",MISC
1751,for,"[578, 876, 603, 887]",MISC
1752,testing,"[603, 876, 660, 887]",MISC
1753,and,"[661, 876, 685, 887]",MISC
1754,reviewed,"[685, 876, 751, 887]",MISC
1755,it,"[751, 876, 775, 887]",MISC
1756,.,"[751, 876, 775, 887]",MISC
1757,-,"[776, 876, 778, 887]",MISC
1758,NL,"[776, 876, 778, 887]",MISC
1759,-,"[776, 876, 778, 887]",MISC
1760,Ex,"[422, 897, 495, 908]",MISC
1761,##ec,"[422, 897, 495, 908]",MISC
1762,##ution,"[422, 897, 495, 908]",MISC
1763,of,"[496, 897, 512, 908]",MISC
1764,Test,"[513, 897, 546, 908]",MISC
1765,scripts,"[546, 897, 603, 908]",MISC
1766,and,"[603, 897, 628, 908]",MISC
1767,logging,"[628, 897, 685, 908]",MISC
1768,of,"[686, 897, 701, 908]",MISC
1769,quality,"[702, 897, 760, 908]",MISC
1770,defects,"[760, 897, 826, 908]",MISC
1771,.,"[760, 897, 826, 908]",MISC
1772,Inter,"[826, 897, 892, 908]",MISC
1773,##act,"[826, 897, 892, 908]",MISC
1774,with,"[892, 897, 925, 908]",MISC
1775,-,"[925, 897, 927, 908]",MISC
1776,NL,"[925, 897, 927, 908]",MISC
1777,-,"[925, 897, 927, 908]",MISC
1778,developers,"[445, 909, 525, 923]",MISC
1779,to,"[525, 909, 541, 923]",MISC
1780,class,"[541, 909, 606, 923]",MISC
1781,##ify,"[541, 909, 606, 923]",MISC
1782,bugs,"[606, 909, 637, 923]",MISC
1783,and,"[638, 909, 660, 923]",MISC
1784,resolve,"[662, 909, 718, 923]",MISC
1785,them,"[718, 909, 758, 923]",MISC
1786,.,"[718, 909, 758, 923]",MISC
1787,-,"[759, 909, 760, 923]",MISC
1788,NL,"[759, 909, 760, 923]",MISC
1789,-,"[759, 909, 760, 923]",MISC
1790,Project,"[86, 60, 150, 75]",MISC
1791,#,"[150, 60, 159, 75]",MISC
1792,3,"[160, 60, 177, 75]",MISC
1793,:,"[160, 60, 177, 75]",MISC
1794,-,"[178, 60, 180, 75]",MISC
1795,NL,"[178, 60, 180, 75]",MISC
1796,-,"[178, 60, 180, 75]",MISC
1797,Title,"[86, 91, 157, 105]",MISC
1798,:,"[157, 91, 171, 105]",MISC
1799,Voyager,"[171, 91, 270, 105]",MISC
1800,Up,"[271, 91, 370, 105]",MISC
1801,##grade,"[271, 91, 370, 105]",MISC
1802,and,"[370, 91, 412, 105]",MISC
1803,Voyager,"[413, 91, 512, 105]",MISC
1804,U,"[512, 91, 554, 105]",MISC
1805,##I,"[512, 91, 554, 105]",MISC
1806,-,"[512, 91, 554, 105]",MISC
1807,Re,"[555, 91, 654, 105]",MISC
1808,##w,"[555, 91, 654, 105]",MISC
1809,##rite,"[555, 91, 654, 105]",MISC
1810,-,"[655, 91, 656, 105]",MISC
1811,NL,"[655, 91, 656, 105]",MISC
1812,-,"[655, 91, 656, 105]",MISC
1813,C,"[86, 105, 223, 120]",MISC
1814,##lient,"[86, 105, 223, 120]",MISC
1815,:,"[223, 105, 246, 120]",MISC
1816,M,"[246, 105, 314, 120]",B-project_company_name
1817,&,"[246, 105, 314, 120]",I-project_company_name
1818,T,"[246, 105, 314, 120]",I-project_company_name
1819,Bank,"[315, 105, 405, 120]",I-project_company_name
1820,US,"[406, 105, 451, 120]",I-project_company_name
1821,-,"[452, 105, 454, 120]",MISC
1822,NL,"[452, 105, 454, 120]",MISC
1823,-,"[452, 105, 454, 120]",MISC
1824,Too,"[86, 120, 159, 133]",MISC
1825,##ls,"[86, 120, 159, 133]",MISC
1826,Used,"[160, 120, 219, 133]",MISC
1827,:,"[219, 120, 233, 133]",MISC
1828,Q,"[234, 120, 263, 133]",MISC
1829,##C,"[234, 120, 263, 133]",MISC
1830,AL,"[263, 120, 307, 133]",MISC
1831,##M,"[263, 120, 307, 133]",MISC
1832,11,"[308, 120, 380, 133]",MISC
1833,.,"[308, 120, 380, 133]",MISC
1834,0,"[308, 120, 380, 133]",MISC
1835,",","[308, 120, 380, 133]",MISC
1836,Main,"[381, 120, 543, 133]",MISC
1837,##frame,"[381, 120, 543, 133]",MISC
1838,##s,"[381, 120, 543, 133]",MISC
1839,.,"[381, 120, 543, 133]",MISC
1840,-,"[544, 120, 545, 133]",MISC
1841,NL,"[544, 120, 545, 133]",MISC
1842,-,"[544, 120, 545, 133]",MISC
1843,Database,"[86, 135, 251, 148]",MISC
1844,:,"[252, 135, 271, 148]",MISC
1845,S,"[272, 135, 333, 148]",MISC
1846,##QL,"[272, 135, 333, 148]",MISC
1847,2008,"[334, 135, 416, 148]",MISC
1848,-,"[417, 135, 419, 148]",MISC
1849,NL,"[417, 135, 419, 148]",MISC
1850,-,"[417, 135, 419, 148]",MISC
1851,Du,"[86, 148, 216, 162]",MISC
1852,##ration,"[86, 148, 216, 162]",MISC
1853,:,"[216, 148, 232, 162]",MISC
1854,SE,"[233, 148, 297, 162]",MISC
1855,##P,"[233, 148, 297, 162]",MISC
1856,##T,"[233, 148, 297, 162]",MISC
1857,2013,"[298, 148, 443, 162]",MISC
1858,-,"[298, 148, 443, 162]",MISC
1859,SE,"[298, 148, 443, 162]",MISC
1860,##P,"[298, 148, 443, 162]",MISC
1861,##T,"[298, 148, 443, 162]",MISC
1862,2014,"[444, 148, 508, 162]",MISC
1863,-,"[509, 148, 511, 162]",MISC
1864,NL,"[509, 148, 511, 162]",MISC
1865,-,"[509, 148, 511, 162]",MISC
1866,Des,"[86, 177, 178, 191]",MISC
1867,##cription,"[86, 177, 178, 191]",MISC
1868,:,"[86, 177, 178, 191]",MISC
1869,-,"[178, 177, 180, 191]",MISC
1870,NL,"[178, 177, 180, 191]",MISC
1871,-,"[178, 177, 180, 191]",MISC
1872,Voyager,"[86, 192, 147, 206]",MISC
1873,Up,"[148, 192, 208, 206]",MISC
1874,##grade,"[148, 192, 208, 206]",MISC
1875,is,"[209, 192, 226, 206]",MISC
1876,conversion,"[227, 192, 313, 206]",MISC
1877,project,"[314, 192, 375, 206]",MISC
1878,where,"[376, 192, 419, 206]",MISC
1879,DB,"[420, 192, 437, 206]",MISC
1880,S,"[437, 192, 463, 206]",MISC
1881,##QL,"[437, 192, 463, 206]",MISC
1882,2000,"[463, 192, 498, 206]",MISC
1883,is,"[499, 192, 516, 206]",MISC
1884,migrated,"[516, 192, 585, 206]",MISC
1885,to,"[586, 192, 604, 206]",MISC
1886,S,"[604, 192, 630, 206]",MISC
1887,##QL,"[604, 192, 630, 206]",MISC
1888,2008,"[630, 192, 734, 206]",MISC
1889,.,"[630, 192, 734, 206]",MISC
1890,Voyager,"[630, 192, 734, 206]",MISC
1891,U,"[735, 192, 761, 206]",MISC
1892,##I,"[735, 192, 761, 206]",MISC
1893,-,"[735, 192, 761, 206]",MISC
1894,Re,"[762, 192, 822, 206]",MISC
1895,##w,"[762, 192, 822, 206]",MISC
1896,##rite,"[762, 192, 822, 206]",MISC
1897,is,"[823, 192, 840, 206]",MISC
1898,re,"[841, 192, 927, 206]",MISC
1899,##gression,"[841, 192, 927, 206]",MISC
1900,-,"[928, 192, 930, 206]",MISC
1901,NL,"[928, 192, 930, 206]",MISC
1902,-,"[928, 192, 930, 206]",MISC
1903,project,"[86, 206, 145, 220]",MISC
1904,where,"[145, 206, 187, 220]",MISC
1905,G,"[188, 206, 212, 220]",MISC
1906,##UI,"[188, 206, 212, 220]",MISC
1907,of,"[213, 206, 229, 220]",MISC
1908,online,"[230, 206, 280, 220]",MISC
1909,Banking,"[281, 206, 340, 220]",MISC
1910,is,"[340, 206, 356, 220]",MISC
1911,re,"[357, 206, 440, 220]",MISC
1912,##written,"[357, 206, 440, 220]",MISC
1913,.,"[357, 206, 440, 220]",MISC
1914,As,"[442, 206, 457, 220]",MISC
1915,part,"[459, 206, 492, 220]",MISC
1916,of,"[492, 206, 508, 220]",MISC
1917,both,"[509, 206, 542, 220]",MISC
1918,projects,"[543, 206, 618, 220]",MISC
1919,",","[543, 206, 618, 220]",MISC
1920,all,"[619, 206, 644, 220]",MISC
1921,the,"[645, 206, 669, 220]",MISC
1922,core,"[670, 206, 712, 220]",MISC
1923,##s,"[670, 206, 712, 220]",MISC
1924,modules,"[713, 206, 771, 220]",MISC
1925,of,"[772, 206, 787, 220]",MISC
1926,web,"[789, 206, 813, 220]",MISC
1927,and,"[814, 206, 838, 220]",MISC
1928,mobile,"[840, 206, 890, 220]",MISC
1929,-,"[890, 206, 892, 220]",MISC
1930,NL,"[890, 206, 892, 220]",MISC
1931,-,"[890, 206, 892, 220]",MISC
1932,banking,"[86, 221, 140, 235]",MISC
1933,are,"[141, 221, 164, 235]",MISC
1934,being,"[165, 221, 203, 235]",MISC
1935,tested,"[204, 221, 258, 235]",MISC
1936,.,"[204, 221, 258, 235]",MISC
1937,-,"[259, 221, 261, 235]",MISC
1938,NL,"[259, 221, 261, 235]",MISC
1939,-,"[259, 221, 261, 235]",MISC
1940,Role,"[86, 264, 124, 279]",MISC
1941,##s,"[86, 264, 124, 279]",MISC
1942,and,"[126, 264, 148, 279]",MISC
1943,Re,"[149, 264, 283, 279]",MISC
1944,##sp,"[149, 264, 283, 279]",MISC
1945,##ons,"[149, 264, 283, 279]",MISC
1946,##ibi,"[149, 264, 283, 279]",MISC
1947,##lities,"[149, 264, 283, 279]",MISC
1948,:,"[149, 264, 283, 279]",MISC
1949,-,"[284, 264, 285, 279]",MISC
1950,NL,"[284, 264, 285, 279]",MISC
1951,-,"[284, 264, 285, 279]",MISC
1952,Understanding,"[126, 289, 233, 300]",MISC
1953,the,"[233, 289, 257, 300]",MISC
1954,C,"[258, 289, 307, 300]",MISC
1955,##lient,"[258, 289, 307, 300]",MISC
1956,Re,"[308, 289, 406, 300]",MISC
1957,##quire,"[308, 289, 406, 300]",MISC
1958,##ments,"[308, 289, 406, 300]",MISC
1959,and,"[407, 289, 431, 300]",MISC
1960,Business,"[432, 289, 498, 300]",MISC
1961,Fun,"[498, 289, 630, 300]",MISC
1962,##ctional,"[498, 289, 630, 300]",MISC
1963,##ities,"[498, 289, 630, 300]",MISC
1964,.,"[498, 289, 630, 300]",MISC
1965,-,"[630, 289, 632, 300]",MISC
1966,NL,"[630, 289, 632, 300]",MISC
1967,-,"[630, 289, 632, 300]",MISC
1968,Creation,"[126, 311, 193, 322]",MISC
1969,of,"[193, 311, 209, 322]",MISC
1970,Trace,"[210, 311, 320, 322]",MISC
1971,##ability,"[210, 311, 320, 322]",MISC
1972,",","[210, 311, 320, 322]",MISC
1973,Test,"[320, 311, 353, 322]",MISC
1974,Sc,"[354, 311, 429, 322]",MISC
1975,##ena,"[354, 311, 429, 322]",MISC
1976,##rio,"[354, 311, 429, 322]",MISC
1977,##s,"[354, 311, 429, 322]",MISC
1978,and,"[430, 311, 455, 322]",MISC
1979,cases,"[456, 311, 497, 322]",MISC
1980,for,"[498, 311, 522, 322]",MISC
1981,both,"[523, 311, 556, 322]",MISC
1982,the,"[557, 311, 582, 322]",MISC
1983,new,"[583, 311, 607, 322]",MISC
1984,and,"[608, 311, 632, 322]",MISC
1985,converted,"[633, 311, 708, 322]",MISC
1986,users,"[710, 311, 760, 322]",MISC
1987,.,"[710, 311, 760, 322]",MISC
1988,-,"[760, 311, 762, 322]",MISC
1989,NL,"[760, 311, 762, 322]",MISC
1990,-,"[760, 311, 762, 322]",MISC
1991,Data,"[126, 332, 163, 344]",MISC
1992,conditioning,"[163, 332, 270, 344]",MISC
1993,using,"[272, 332, 317, 344]",MISC
1994,Hogan,"[318, 332, 371, 344]",MISC
1995,",","[318, 332, 371, 344]",MISC
1996,DB,"[372, 332, 389, 344]",MISC
1997,and,"[390, 332, 416, 344]",MISC
1998,G,"[418, 332, 444, 344]",MISC
1999,##UI,"[418, 332, 444, 344]",MISC
2000,testing,"[445, 332, 518, 344]",MISC
2001,.,"[445, 332, 518, 344]",MISC
2002,-,"[518, 332, 519, 344]",MISC
2003,NL,"[518, 332, 519, 344]",MISC
2004,-,"[518, 332, 519, 344]",MISC
2005,Creation,"[126, 355, 195, 366]",MISC
2006,of,"[196, 355, 214, 366]",MISC
2007,Test,"[214, 355, 249, 366]",MISC
2008,execution,"[249, 355, 327, 366]",MISC
2009,plan,"[328, 355, 372, 366]",MISC
2010,.,"[328, 355, 372, 366]",MISC
2011,-,"[372, 355, 374, 366]",MISC
2012,NL,"[372, 355, 374, 366]",MISC
2013,-,"[372, 355, 374, 366]",MISC
2014,Ex,"[126, 371, 200, 382]",MISC
2015,##ec,"[126, 371, 200, 382]",MISC
2016,##ution,"[126, 371, 200, 382]",MISC
2017,of,"[200, 371, 216, 382]",MISC
2018,Test,"[217, 371, 250, 382]",MISC
2019,cases,"[250, 371, 290, 382]",MISC
2020,and,"[292, 371, 316, 382]",MISC
2021,logging,"[317, 371, 374, 382]",MISC
2022,of,"[375, 371, 390, 382]",MISC
2023,quality,"[391, 371, 448, 382]",MISC
2024,defects,"[449, 371, 515, 382]",MISC
2025,.,"[449, 371, 515, 382]",MISC
2026,Inter,"[516, 371, 582, 382]",MISC
2027,##act,"[516, 371, 582, 382]",MISC
2028,with,"[582, 371, 615, 382]",MISC
2029,developers,"[615, 371, 697, 382]",MISC
2030,to,"[698, 371, 714, 382]",MISC
2031,class,"[715, 371, 781, 382]",MISC
2032,##ify,"[715, 371, 781, 382]",MISC
2033,bugs,"[781, 371, 814, 382]",MISC
2034,and,"[814, 371, 839, 382]",MISC
2035,resolve,"[839, 371, 896, 382]",MISC
2036,them,"[897, 371, 937, 382]",MISC
2037,.,"[897, 371, 937, 382]",MISC
2038,-,"[939, 371, 941, 382]",MISC
2039,NL,"[939, 371, 941, 382]",MISC
2040,-,"[939, 371, 941, 382]",MISC
2041,Certified,"[237, 415, 311, 429]",MISC
2042,in,"[313, 415, 329, 429]",MISC
2043,Se,"[330, 415, 396, 429]",MISC
2044,##len,"[330, 415, 396, 429]",MISC
2045,##ium,"[330, 415, 396, 429]",MISC
2046,Web,"[397, 415, 472, 429]",MISC
2047,##D,"[397, 415, 472, 429]",MISC
2048,##river,"[397, 415, 472, 429]",MISC
2049,Auto,"[473, 415, 556, 429]",MISC
2050,##mation,"[473, 415, 556, 429]",MISC
2051,Testing,"[558, 415, 617, 429]",MISC
2052,Too,"[617, 415, 650, 429]",MISC
2053,##l,"[617, 415, 650, 429]",MISC
2054,From,"[651, 415, 684, 429]",MISC
2055,Q,"[684, 415, 759, 429]",MISC
2056,##sp,"[684, 415, 759, 429]",MISC
2057,##ider,"[684, 415, 759, 429]",MISC
2058,##s,"[684, 415, 759, 429]",MISC
2059,.,"[684, 415, 759, 429]",MISC
2060,-,"[760, 415, 762, 429]",MISC
2061,NL,"[760, 415, 762, 429]",MISC
2062,-,"[760, 415, 762, 429]",MISC
2063,DD,"[86, 446, 221, 464]",MISC
2064,##EC,"[86, 446, 221, 464]",MISC
2065,##LA,"[86, 446, 221, 464]",MISC
2066,##RA,"[86, 446, 221, 464]",MISC
2067,##TI,"[86, 446, 221, 464]",MISC
2068,##ON,"[86, 446, 221, 464]",MISC
2069,##EC,"[86, 446, 221, 464]",MISC
2070,##LA,"[86, 446, 221, 464]",MISC
2071,##RA,"[86, 446, 221, 464]",MISC
2072,##TI,"[86, 446, 221, 464]",MISC
2073,##ON,"[86, 446, 221, 464]",MISC
2074,:,"[86, 446, 221, 464]",MISC
2075,:,"[86, 446, 221, 464]",MISC
2076,-,"[221, 446, 223, 464]",MISC
2077,NL,"[221, 446, 223, 464]",MISC
2078,-,"[221, 446, 223, 464]",MISC
2079,I,"[86, 471, 97, 488]",MISC
2080,here,"[97, 471, 161, 488]",MISC
2081,##by,"[97, 471, 161, 488]",MISC
2082,declare,"[161, 471, 236, 488]",MISC
2083,that,"[236, 471, 277, 488]",MISC
2084,the,"[279, 471, 310, 488]",MISC
2085,above,"[311, 471, 363, 488]",MISC
2086,information,"[364, 471, 480, 488]",MISC
2087,is,"[482, 471, 503, 488]",MISC
2088,true,"[503, 471, 545, 488]",MISC
2089,and,"[546, 471, 577, 488]",MISC
2090,correct,"[578, 471, 653, 488]",MISC
2091,to,"[653, 471, 674, 488]",MISC
2092,the,"[674, 471, 706, 488]",MISC
2093,best,"[706, 471, 748, 488]",MISC
2094,of,"[749, 471, 770, 488]",MISC
2095,my,"[771, 471, 791, 488]",MISC
2096,knowledge,"[792, 471, 898, 488]",MISC
2097,.,"[792, 471, 898, 488]",MISC
2098,-,"[899, 471, 901, 488]",MISC
2099,NL,"[899, 471, 901, 488]",MISC
2100,-,"[899, 471, 901, 488]",MISC
2101,AM,"[618, 495, 755, 510]",B-name
2102,##R,"[618, 495, 755, 510]",I-name
2103,##UT,"[618, 495, 755, 510]",I-name
2104,##H,"[618, 495, 755, 510]",I-name
2105,##ES,"[618, 495, 755, 510]",I-name
2106,##H,"[618, 495, 755, 510]",I-name
2107,.,"[618, 495, 755, 510]",I-name
2108,G,"[618, 495, 755, 510]",I-name
2109,-,"[755, 495, 757, 510]",MISC
2110,NL,"[755, 495, 757, 510]",MISC
2111,-,"[755, 495, 757, 510]",MISC
