,token,box,label
0,Santos,"[414, 98, 500, 121]",B-name
1,##h,"[414, 98, 500, 121]",I-name
2,An,"[500, 98, 610, 121]",I-name
3,##kus,"[500, 98, 610, 121]",I-name
4,##hra,"[500, 98, 610, 121]",I-name
5,##o,"[500, 98, 610, 121]",I-name
6,G,"[610, 98, 695, 121]",I-name
7,##hun,"[610, 98, 695, 121]",I-name
8,##dre,"[610, 98, 695, 121]",I-name
9,-,"[695, 98, 697, 121]",MISC
10,NL,"[695, 98, 697, 121]",MISC
11,-,"[695, 98, 697, 121]",MISC
12,Mobile,"[162, 139, 222, 156]",MISC
13,No,"[222, 139, 251, 156]",MISC
14,:,"[222, 139, 251, 156]",MISC
15,74,"[252, 139, 349, 156]",B-phones_phone
16,##16,"[252, 139, 349, 156]",I-phones_phone
17,##42,"[252, 139, 349, 156]",I-phones_phone
18,##86,"[252, 139, 349, 156]",I-phones_phone
19,##6,"[252, 139, 349, 156]",I-phones_phone
20,##2,"[252, 139, 349, 156]",I-phones_phone
21,-,"[351, 139, 353, 156]",MISC
22,NL,"[351, 139, 353, 156]",MISC
23,-,"[351, 139, 353, 156]",MISC
24,Em,"[660, 139, 900, 156]",MISC
25,##ail,"[660, 139, 900, 156]",MISC
26,:,"[660, 139, 900, 156]",MISC
27,s,"[660, 139, 900, 156]",B-emails_email
28,##gh,"[660, 139, 900, 156]",I-emails_email
29,##und,"[660, 139, 900, 156]",I-emails_email
30,##re,"[660, 139, 900, 156]",I-emails_email
31,##7,"[660, 139, 900, 156]",I-emails_email
32,##7,"[660, 139, 900, 156]",I-emails_email
33,@,"[660, 139, 900, 156]",I-emails_email
34,g,"[660, 139, 900, 156]",I-emails_email
35,##mail,"[660, 139, 900, 156]",I-emails_email
36,.,"[660, 139, 900, 156]",I-emails_email
37,com,"[660, 139, 900, 156]",I-emails_email
38,-,"[900, 139, 902, 156]",MISC
39,NL,"[900, 139, 902, 156]",MISC
40,-,"[900, 139, 902, 156]",MISC
41,CA,"[166, 208, 251, 227]",B-summary_heading
42,##RE,"[166, 208, 251, 227]",I-summary_heading
43,##ER,"[166, 208, 251, 227]",I-summary_heading
44,O,"[252, 208, 379, 227]",I-summary_heading
45,##B,"[252, 208, 379, 227]",I-summary_heading
46,##J,"[252, 208, 379, 227]",I-summary_heading
47,##EC,"[252, 208, 379, 227]",I-summary_heading
48,##TI,"[252, 208, 379, 227]",I-summary_heading
49,##VE,"[252, 208, 379, 227]",I-summary_heading
50,-,"[381, 208, 382, 227]",MISC
51,NL,"[381, 208, 382, 227]",MISC
52,-,"[381, 208, 382, 227]",MISC
53,A,"[220, 236, 229, 253]",MISC
54,position,"[229, 236, 299, 253]",MISC
55,to,"[299, 236, 317, 253]",MISC
56,constantly,"[317, 236, 404, 253]",MISC
57,learn,"[405, 236, 458, 253]",MISC
58,",","[405, 236, 458, 253]",MISC
59,contribute,"[459, 236, 546, 253]",MISC
60,and,"[547, 236, 573, 253]",MISC
61,grow,"[573, 236, 608, 253]",MISC
62,along,"[609, 236, 653, 253]",MISC
63,with,"[653, 236, 688, 253]",MISC
64,the,"[688, 236, 715, 253]",MISC
65,organization,"[715, 236, 829, 253]",MISC
66,.,"[715, 236, 829, 253]",MISC
67,-,"[830, 236, 832, 253]",MISC
68,NL,"[830, 236, 832, 253]",MISC
69,-,"[830, 236, 832, 253]",MISC
70,E,"[166, 299, 290, 318]",B-education_heading
71,##D,"[166, 299, 290, 318]",I-education_heading
72,##UC,"[166, 299, 290, 318]",I-education_heading
73,##AT,"[166, 299, 290, 318]",I-education_heading
74,##ION,"[166, 299, 290, 318]",I-education_heading
75,Q,"[290, 299, 468, 318]",I-education_heading
76,##U,"[290, 299, 468, 318]",I-education_heading
77,##AL,"[290, 299, 468, 318]",I-education_heading
78,##IF,"[290, 299, 468, 318]",I-education_heading
79,##IC,"[290, 299, 468, 318]",I-education_heading
80,##AT,"[290, 299, 468, 318]",I-education_heading
81,##ION,"[290, 299, 468, 318]",I-education_heading
82,-,"[470, 299, 472, 318]",MISC
83,NL,"[470, 299, 472, 318]",MISC
84,-,"[470, 299, 472, 318]",MISC
85,Q,"[187, 341, 346, 358]",MISC
86,##U,"[187, 341, 346, 358]",MISC
87,##AL,"[187, 341, 346, 358]",MISC
88,##IF,"[187, 341, 346, 358]",MISC
89,##IC,"[187, 341, 346, 358]",MISC
90,##AT,"[187, 341, 346, 358]",MISC
91,##ION,"[187, 341, 346, 358]",MISC
92,-,"[347, 341, 359, 358]",MISC
93,IN,"[359, 341, 494, 358]",MISC
94,##ST,"[359, 341, 494, 358]",MISC
95,##IT,"[359, 341, 494, 358]",MISC
96,##UT,"[359, 341, 494, 358]",MISC
97,##ION,"[359, 341, 494, 358]",MISC
98,-,"[494, 341, 507, 358]",MISC
99,B,"[507, 341, 568, 358]",MISC
100,##OA,"[507, 341, 568, 358]",MISC
101,##RD,"[507, 341, 568, 358]",MISC
102,/,"[568, 341, 703, 358]",MISC
103,UN,"[568, 341, 703, 358]",MISC
104,##IVE,"[568, 341, 703, 358]",MISC
105,##RS,"[568, 341, 703, 358]",MISC
106,##IT,"[568, 341, 703, 358]",MISC
107,##Y,"[568, 341, 703, 358]",MISC
108,-,"[704, 341, 716, 358]",MISC
109,Y,"[716, 341, 765, 358]",MISC
110,##EA,"[716, 341, 765, 358]",MISC
111,##R,"[716, 341, 765, 358]",MISC
112,OF,"[765, 341, 790, 358]",MISC
113,PA,"[790, 341, 876, 358]",MISC
114,##SS,"[790, 341, 876, 358]",MISC
115,##ING,"[790, 341, 876, 358]",MISC
116,-,"[876, 341, 889, 358]",MISC
117,AG,"[889, 341, 999, 358]",MISC
118,##GR,"[889, 341, 999, 358]",MISC
119,##EG,"[889, 341, 999, 358]",MISC
120,##AT,"[889, 341, 999, 358]",MISC
121,##E,"[889, 341, 999, 358]",MISC
122,-,"[1000, 341, 1001, 358]",MISC
123,NL,"[1000, 341, 1001, 358]",MISC
124,-,"[1000, 341, 1001, 358]",MISC
125,B,"[195, 399, 213, 424]",B-education_degree
126,##E,"[195, 399, 213, 424]",I-education_degree
127,(,"[213, 399, 330, 424]",MISC
128,Electronics,"[213, 399, 330, 424]",B-education_course
129,),"[213, 399, 330, 424]",MISC
130,-,"[331, 399, 339, 424]",MISC
131,Ma,"[340, 399, 446, 424]",B-education_institute
132,##hara,"[340, 399, 446, 424]",I-education_institute
133,##sha,"[340, 399, 446, 424]",I-education_institute
134,##tra,"[340, 399, 446, 424]",I-education_institute
135,College,"[448, 399, 511, 424]",I-education_institute
136,of,"[511, 399, 529, 424]",I-education_institute
137,En,"[529, 399, 636, 424]",I-education_institute
138,##gin,"[529, 399, 636, 424]",I-education_institute
139,##ner,"[529, 399, 636, 424]",I-education_institute
140,##ing,"[529, 399, 636, 424]",I-education_institute
141,",","[529, 399, 636, 424]",I-education_institute
142,La,"[638, 399, 681, 424]",I-education_institute
143,##tur,"[638, 399, 681, 424]",I-education_institute
144,-,"[683, 399, 691, 424]",MISC
145,S,"[692, 399, 835, 424]",MISC
146,.,"[692, 399, 835, 424]",MISC
147,R,"[692, 399, 835, 424]",MISC
148,.,"[692, 399, 835, 424]",MISC
149,T,"[692, 399, 835, 424]",MISC
150,.,"[692, 399, 835, 424]",MISC
151,M,"[692, 399, 835, 424]",MISC
152,.,"[692, 399, 835, 424]",MISC
153,U,"[692, 399, 835, 424]",MISC
154,.,"[692, 399, 835, 424]",MISC
155,Nan,"[692, 399, 835, 424]",MISC
156,##ded,"[692, 399, 835, 424]",MISC
157,-,"[836, 399, 845, 424]",MISC
158,Aug,"[845, 399, 871, 424]",MISC
159,2013,"[872, 399, 907, 424]",MISC
160,-,"[908, 399, 917, 424]",MISC
161,67,"[917, 399, 970, 424]",MISC
162,.,"[917, 399, 970, 424]",MISC
163,06,"[917, 399, 970, 424]",MISC
164,%,"[917, 399, 970, 424]",MISC
165,-,"[972, 399, 973, 424]",MISC
166,NL,"[972, 399, 973, 424]",MISC
167,-,"[972, 399, 973, 424]",MISC
168,H,"[237, 455, 295, 473]",B-education_degree
169,.,"[237, 455, 295, 473]",I-education_degree
170,S,"[237, 455, 295, 473]",I-education_degree
171,.,"[237, 455, 295, 473]",I-education_degree
172,C,"[237, 455, 295, 473]",I-education_degree
173,-,"[296, 455, 307, 473]",MISC
174,Yo,"[308, 455, 425, 473]",B-education_institute
175,##ges,"[308, 455, 425, 473]",I-education_institute
176,##hwa,"[308, 455, 425, 473]",I-education_institute
177,##ri,"[308, 455, 425, 473]",I-education_institute
178,Jr,"[427, 455, 556, 473]",I-education_institute
179,.,"[427, 455, 556, 473]",I-education_institute
180,College,"[427, 455, 556, 473]",I-education_institute
181,",","[427, 455, 556, 473]",I-education_institute
182,Am,"[557, 455, 662, 473]",I-education_institute
183,##ba,"[557, 455, 662, 473]",I-education_institute
184,##jo,"[557, 455, 662, 473]",I-education_institute
185,##gai,"[557, 455, 662, 473]",I-education_institute
186,-,"[664, 455, 674, 473]",MISC
187,Au,"[675, 455, 793, 473]",MISC
188,##rang,"[675, 455, 793, 473]",MISC
189,##abad,"[675, 455, 793, 473]",MISC
190,-,"[794, 455, 804, 473]",MISC
191,Feb,"[806, 455, 841, 473]",MISC
192,2009,"[841, 455, 888, 473]",MISC
193,-,"[889, 455, 899, 473]",MISC
194,63,"[900, 455, 970, 473]",MISC
195,.,"[900, 455, 970, 473]",MISC
196,00,"[900, 455, 970, 473]",MISC
197,%,"[900, 455, 970, 473]",MISC
198,-,"[972, 455, 973, 473]",MISC
199,NL,"[972, 455, 973, 473]",MISC
200,-,"[972, 455, 973, 473]",MISC
201,SS,"[243, 524, 272, 541]",B-education_degree
202,##C,"[243, 524, 272, 541]",I-education_degree
203,-,"[274, 524, 282, 541]",MISC
204,Dr,"[284, 524, 314, 541]",B-education_institute
205,.,"[284, 524, 314, 541]",I-education_institute
206,V,"[315, 524, 408, 541]",I-education_institute
207,##en,"[315, 524, 408, 541]",I-education_institute
208,##kat,"[315, 524, 408, 541]",I-education_institute
209,##ra,"[315, 524, 408, 541]",I-education_institute
210,##o,"[315, 524, 408, 541]",I-education_institute
211,Da,"[409, 524, 470, 541]",I-education_institute
212,##wal,"[409, 524, 470, 541]",I-education_institute
213,##e,"[409, 524, 470, 541]",I-education_institute
214,High,"[472, 524, 512, 541]",I-education_institute
215,School,"[513, 524, 585, 541]",I-education_institute
216,",","[513, 524, 585, 541]",I-education_institute
217,Am,"[586, 524, 679, 541]",I-education_institute
218,##ba,"[586, 524, 679, 541]",I-education_institute
219,##jo,"[586, 524, 679, 541]",I-education_institute
220,##gai,"[586, 524, 679, 541]",I-education_institute
221,-,"[680, 524, 689, 541]",MISC
222,Au,"[690, 524, 793, 541]",MISC
223,##rang,"[690, 524, 793, 541]",MISC
224,##abad,"[690, 524, 793, 541]",MISC
225,-,"[794, 524, 803, 541]",MISC
226,March,"[805, 524, 856, 541]",MISC
227,2007,"[857, 524, 897, 541]",MISC
228,-,"[899, 524, 907, 541]",MISC
229,78,"[909, 524, 970, 541]",MISC
230,.,"[909, 524, 970, 541]",MISC
231,92,"[909, 524, 970, 541]",MISC
232,%,"[909, 524, 970, 541]",MISC
233,-,"[972, 524, 973, 541]",MISC
234,NL,"[972, 524, 973, 541]",MISC
235,-,"[972, 524, 973, 541]",MISC
236,C,"[166, 576, 272, 595]",B-work_experience_heading
237,##UR,"[166, 576, 272, 595]",I-work_experience_heading
238,##RE,"[166, 576, 272, 595]",I-work_experience_heading
239,##NT,"[166, 576, 272, 595]",I-work_experience_heading
240,W,"[273, 576, 334, 595]",I-work_experience_heading
241,##OR,"[273, 576, 334, 595]",I-work_experience_heading
242,##K,"[273, 576, 334, 595]",I-work_experience_heading
243,ST,"[334, 576, 425, 595]",I-work_experience_heading
244,##AT,"[334, 576, 425, 595]",I-work_experience_heading
245,##US,"[334, 576, 425, 595]",I-work_experience_heading
246,-,"[426, 576, 428, 595]",MISC
247,NL,"[426, 576, 428, 595]",MISC
248,-,"[426, 576, 428, 595]",MISC
249,Working,"[220, 613, 286, 630]",MISC
250,as,"[287, 613, 306, 630]",MISC
251,MS,"[306, 613, 364, 630]",B-employer_role
252,.,"[306, 613, 364, 630]",I-employer_role
253,Net,"[306, 613, 364, 630]",I-employer_role
254,train,"[364, 613, 431, 630]",I-employer_role
255,##ee,"[364, 613, 431, 630]",I-employer_role
256,in,"[432, 613, 451, 630]",MISC
257,Na,"[451, 613, 498, 630]",B-employer_company_name
258,##cre,"[451, 613, 498, 630]",I-employer_company_name
259,Software,"[499, 613, 576, 630]",I-employer_company_name
260,Services,"[576, 613, 653, 630]",I-employer_company_name
261,P,"[653, 613, 681, 630]",I-employer_company_name
262,##v,"[653, 613, 681, 630]",I-employer_company_name
263,##t,"[653, 613, 681, 630]",I-employer_company_name
264,Ltd,"[682, 613, 710, 630]",I-employer_company_name
265,since,"[711, 613, 758, 630]",MISC
266,Feb,"[759, 613, 787, 630]",MISC
267,2015,"[788, 613, 826, 630]",MISC
268,-,"[826, 613, 828, 630]",MISC
269,NL,"[826, 613, 828, 630]",MISC
270,-,"[826, 613, 828, 630]",MISC
271,T,"[166, 662, 291, 682]",B-skills_heading
272,##EC,"[166, 662, 291, 682]",I-skills_heading
273,##H,"[166, 662, 291, 682]",I-skills_heading
274,##NI,"[166, 662, 291, 682]",I-skills_heading
275,##CA,"[166, 662, 291, 682]",I-skills_heading
276,##L,"[166, 662, 291, 682]",I-skills_heading
277,SK,"[293, 662, 376, 682]",I-skills_heading
278,##IL,"[293, 662, 376, 682]",I-skills_heading
279,##LS,"[293, 662, 376, 682]",I-skills_heading
280,-,"[377, 662, 379, 682]",MISC
281,NL,"[377, 662, 379, 682]",MISC
282,-,"[377, 662, 379, 682]",MISC
283,•,"[220, 716, 232, 733]",MISC
284,Programming,"[233, 716, 374, 733]",MISC
285,Language,"[375, 716, 478, 733]",MISC
286,:,"[479, 716, 491, 733]",MISC
287,C,"[492, 716, 595, 733]",MISC
288,",","[492, 716, 595, 733]",MISC
289,C,"[492, 716, 595, 733]",MISC
290,#,"[492, 716, 595, 733]",MISC
291,.,"[492, 716, 595, 733]",MISC
292,Net,"[492, 716, 595, 733]",MISC
293,-,"[596, 716, 597, 733]",MISC
294,NL,"[596, 716, 597, 733]",MISC
295,-,"[596, 716, 597, 733]",MISC
296,•,"[220, 741, 234, 758]",MISC
297,Technology,"[235, 741, 383, 758]",MISC
298,:,"[385, 741, 399, 758]",MISC
299,AS,"[400, 741, 505, 758]",MISC
300,##P,"[400, 741, 505, 758]",MISC
301,.,"[400, 741, 505, 758]",MISC
302,Net,"[400, 741, 505, 758]",MISC
303,MV,"[505, 741, 564, 758]",MISC
304,##C,"[505, 741, 564, 758]",MISC
305,",","[505, 741, 564, 758]",MISC
306,AS,"[565, 741, 684, 758]",MISC
307,##P,"[565, 741, 684, 758]",MISC
308,.,"[565, 741, 684, 758]",MISC
309,Net,"[565, 741, 684, 758]",MISC
310,",","[565, 741, 684, 758]",MISC
311,AD,"[685, 741, 790, 758]",MISC
312,##O,"[685, 741, 790, 758]",MISC
313,.,"[685, 741, 790, 758]",MISC
314,Net,"[685, 741, 790, 758]",MISC
315,-,"[790, 741, 791, 758]",MISC
316,NL,"[790, 741, 791, 758]",MISC
317,-,"[790, 741, 791, 758]",MISC
318,•,"[220, 767, 237, 784]",MISC
319,Database,"[239, 767, 410, 784]",MISC
320,##s,"[239, 767, 410, 784]",MISC
321,:,"[411, 767, 429, 784]",MISC
322,S,"[430, 767, 486, 784]",MISC
323,##QL,"[430, 767, 486, 784]",MISC
324,Server,"[488, 767, 601, 784]",MISC
325,-,"[603, 767, 604, 784]",MISC
326,NL,"[603, 767, 604, 784]",MISC
327,-,"[603, 767, 604, 784]",MISC
328,•,"[220, 792, 239, 809]",MISC
329,Framework,"[240, 792, 418, 809]",MISC
330,:,"[418, 792, 437, 809]",MISC
331,.,"[438, 792, 516, 809]",MISC
332,Net,"[438, 792, 516, 809]",MISC
333,4,"[517, 792, 576, 809]",MISC
334,.,"[517, 792, 576, 809]",MISC
335,5,"[517, 792, 576, 809]",MISC
336,-,"[576, 792, 578, 809]",MISC
337,NL,"[576, 792, 578, 809]",MISC
338,-,"[576, 792, 578, 809]",MISC
339,•,"[220, 818, 234, 834]",MISC
340,Operating,"[234, 818, 362, 834]",MISC
341,System,"[362, 818, 446, 834]",MISC
342,:,"[447, 818, 461, 834]",MISC
343,Windows,"[461, 818, 559, 834]",MISC
344,7,"[560, 818, 588, 834]",MISC
345,",","[560, 818, 588, 834]",MISC
346,Windows,"[589, 818, 687, 834]",MISC
347,8,"[688, 818, 702, 834]",MISC
348,-,"[702, 818, 704, 834]",MISC
349,NL,"[702, 818, 704, 834]",MISC
350,-,"[702, 818, 704, 834]",MISC
351,•,"[220, 843, 230, 861]",MISC
352,Sc,"[231, 843, 334, 861]",MISC
353,##rip,"[231, 843, 334, 861]",MISC
354,##ting,"[231, 843, 334, 861]",MISC
355,Language,"[335, 843, 426, 861]",MISC
356,:,"[427, 843, 438, 861]",MISC
357,Basic,"[439, 843, 495, 861]",MISC
358,Java,"[496, 843, 610, 861]",MISC
359,##Script,"[496, 843, 610, 861]",MISC
360,",","[612, 843, 622, 861]",MISC
361,Basic,"[623, 843, 679, 861]",MISC
362,J,"[681, 843, 761, 861]",MISC
363,##Q,"[681, 843, 761, 861]",MISC
364,##uer,"[681, 843, 761, 861]",MISC
365,##y,"[681, 843, 761, 861]",MISC
366,",","[681, 843, 761, 861]",MISC
367,Basic,"[762, 843, 817, 861]",MISC
368,Ang,"[819, 843, 900, 861]",MISC
369,##ular,"[819, 843, 900, 861]",MISC
370,-,"[900, 843, 902, 861]",MISC
371,NL,"[900, 843, 902, 861]",MISC
372,-,"[900, 843, 902, 861]",MISC
373,J,"[251, 860, 265, 877]",MISC
374,##s,"[251, 860, 265, 877]",MISC
375,-,"[265, 860, 267, 877]",MISC
376,NL,"[265, 860, 267, 877]",MISC
377,-,"[265, 860, 267, 877]",MISC
378,P,"[166, 911, 277, 929]",B-personal_details_heading
379,##ER,"[166, 911, 277, 929]",I-personal_details_heading
380,##SO,"[166, 911, 277, 929]",I-personal_details_heading
381,##NA,"[166, 911, 277, 929]",I-personal_details_heading
382,##L,"[166, 911, 277, 929]",I-personal_details_heading
383,T,"[277, 911, 361, 929]",I-personal_details_heading
384,##RA,"[277, 911, 361, 929]",I-personal_details_heading
385,##IT,"[277, 911, 361, 929]",I-personal_details_heading
386,##S,"[277, 911, 361, 929]",I-personal_details_heading
387,-,"[361, 911, 363, 929]",MISC
388,NL,"[361, 911, 363, 929]",MISC
389,-,"[361, 911, 363, 929]",MISC
390,•,"[220, 930, 230, 947]",MISC
391,Co,"[231, 930, 318, 947]",MISC
392,##mm,"[231, 930, 318, 947]",MISC
393,##ited,"[231, 930, 318, 947]",MISC
394,and,"[319, 930, 353, 947]",MISC
395,Smart,"[353, 930, 407, 947]",MISC
396,Working,"[408, 930, 485, 947]",MISC
397,-,"[486, 930, 487, 947]",MISC
398,NL,"[486, 930, 487, 947]",MISC
399,-,"[486, 930, 487, 947]",MISC
400,•,"[220, 956, 229, 973]",MISC
401,Op,"[230, 956, 331, 973]",MISC
402,##ti,"[230, 956, 331, 973]",MISC
403,##mist,"[230, 956, 331, 973]",MISC
404,##ic,"[230, 956, 331, 973]",MISC
405,and,"[333, 956, 362, 973]",MISC
406,Good,"[363, 956, 404, 973]",MISC
407,Time,"[404, 956, 445, 973]",MISC
408,Management,"[445, 956, 547, 973]",MISC
409,Skills,"[548, 956, 609, 973]",MISC
410,-,"[610, 956, 611, 973]",MISC
411,NL,"[610, 956, 611, 973]",MISC
412,-,"[610, 956, 611, 973]",MISC
413,PR,"[166, 981, 262, 1000]",MISC
414,##O,"[166, 981, 262, 1000]",MISC
415,##J,"[166, 981, 262, 1000]",MISC
416,##EC,"[166, 981, 262, 1000]",MISC
417,##T,"[166, 981, 262, 1000]",MISC
418,DE,"[263, 981, 359, 1000]",MISC
419,##TA,"[263, 981, 359, 1000]",MISC
420,##IL,"[263, 981, 359, 1000]",MISC
421,##S,"[263, 981, 359, 1000]",MISC
422,-,"[360, 981, 361, 1000]",MISC
423,NL,"[360, 981, 361, 1000]",MISC
424,-,"[360, 981, 361, 1000]",MISC
425,•,"[157, 133, 166, 152]",MISC
426,Title,"[167, 133, 291, 152]",MISC
427,:,"[167, 133, 291, 152]",MISC
428,On,"[167, 133, 291, 152]",B-project_title
429,##L,"[167, 133, 291, 152]",I-project_title
430,##ine,"[167, 133, 291, 152]",I-project_title
431,PC,"[292, 133, 311, 152]",I-project_title
432,B,"[313, 133, 385, 152]",I-project_title
433,##uild,"[313, 133, 385, 152]",I-project_title
434,##er,"[313, 133, 385, 152]",I-project_title
435,-,"[386, 133, 388, 152]",MISC
436,NL,"[386, 133, 388, 152]",MISC
437,-,"[386, 133, 388, 152]",MISC
438,Technology,"[204, 153, 307, 170]",MISC
439,:,"[204, 153, 307, 170]",MISC
440,AS,"[308, 153, 544, 170]",MISC
441,##P,"[308, 153, 544, 170]",MISC
442,.,"[308, 153, 544, 170]",MISC
443,Net,"[308, 153, 544, 170]",MISC
444,",","[308, 153, 544, 170]",MISC
445,C,"[308, 153, 544, 170]",MISC
446,#,"[308, 153, 544, 170]",MISC
447,.,"[308, 153, 544, 170]",MISC
448,Net,"[308, 153, 544, 170]",MISC
449,",","[308, 153, 544, 170]",MISC
450,AD,"[308, 153, 544, 170]",MISC
451,##O,"[308, 153, 544, 170]",MISC
452,.,"[308, 153, 544, 170]",MISC
453,Net,"[308, 153, 544, 170]",MISC
454,",","[308, 153, 544, 170]",MISC
455,My,"[308, 153, 544, 170]",MISC
456,S,"[546, 153, 573, 170]",MISC
457,##q,"[546, 153, 573, 170]",MISC
458,##l,"[546, 153, 573, 170]",MISC
459,",","[574, 153, 649, 170]",MISC
460,J,"[574, 153, 649, 170]",MISC
461,##Q,"[574, 153, 649, 170]",MISC
462,##uer,"[574, 153, 649, 170]",MISC
463,##y,"[574, 153, 649, 170]",MISC
464,.,"[574, 153, 649, 170]",MISC
465,-,"[650, 153, 652, 170]",MISC
466,NL,"[650, 153, 652, 170]",MISC
467,-,"[650, 153, 652, 170]",MISC
468,O,"[188, 186, 297, 204]",MISC
469,##bject,"[188, 186, 297, 204]",MISC
470,##ive,"[188, 186, 297, 204]",MISC
471,:,"[188, 186, 297, 204]",MISC
472,It,"[188, 186, 297, 204]",MISC
473,is,"[298, 186, 315, 204]",MISC
474,a,"[316, 186, 325, 204]",MISC
475,web,"[325, 186, 351, 204]",MISC
476,application,"[352, 186, 452, 204]",MISC
477,allow,"[453, 186, 498, 204]",MISC
478,users,"[498, 186, 544, 204]",MISC
479,to,"[544, 186, 561, 204]",MISC
480,assemble,"[562, 186, 634, 204]",MISC
481,their,"[635, 186, 680, 204]",MISC
482,PC,"[680, 186, 698, 204]",MISC
483,via,"[699, 186, 725, 204]",MISC
484,online,"[726, 186, 789, 204]",MISC
485,.,"[726, 186, 789, 204]",MISC
486,-,"[790, 186, 791, 204]",MISC
487,NL,"[790, 186, 791, 204]",MISC
488,-,"[790, 186, 791, 204]",MISC
489,My,"[185, 220, 204, 238]",MISC
490,Role,"[205, 220, 254, 238]",MISC
491,:,"[205, 220, 254, 238]",MISC
492,I,"[254, 220, 263, 238]",MISC
493,have,"[264, 220, 303, 238]",MISC
494,designed,"[304, 220, 383, 238]",MISC
495,and,"[384, 220, 414, 238]",MISC
496,developed,"[414, 220, 503, 238]",MISC
497,the,"[503, 220, 533, 238]",MISC
498,business,"[533, 220, 612, 238]",MISC
499,logic,"[613, 220, 662, 238]",MISC
500,and,"[662, 220, 692, 238]",MISC
501,U,"[692, 220, 711, 238]",MISC
502,##I,"[692, 220, 711, 238]",MISC
503,for,"[712, 220, 742, 238]",MISC
504,Ad,"[742, 220, 791, 238]",MISC
505,##min,"[742, 220, 791, 238]",MISC
506,Mo,"[792, 220, 860, 238]",MISC
507,##du,"[792, 220, 860, 238]",MISC
508,##le,"[792, 220, 860, 238]",MISC
509,.,"[792, 220, 860, 238]",MISC
510,-,"[861, 220, 863, 238]",MISC
511,NL,"[861, 220, 863, 238]",MISC
512,-,"[861, 220, 863, 238]",MISC
513,P,"[215, 251, 332, 270]",B-personal_details_heading
514,##ER,"[215, 251, 332, 270]",I-personal_details_heading
515,##SO,"[215, 251, 332, 270]",I-personal_details_heading
516,##NA,"[215, 251, 332, 270]",I-personal_details_heading
517,##L,"[215, 251, 332, 270]",I-personal_details_heading
518,ST,"[332, 251, 449, 270]",I-personal_details_heading
519,##RE,"[332, 251, 449, 270]",I-personal_details_heading
520,##NG,"[332, 251, 449, 270]",I-personal_details_heading
521,##TH,"[332, 251, 449, 270]",I-personal_details_heading
522,-,"[449, 251, 451, 270]",MISC
523,NL,"[449, 251, 451, 270]",MISC
524,-,"[449, 251, 451, 270]",MISC
525,•,"[157, 273, 166, 290]",MISC
526,I,"[167, 273, 176, 290]",MISC
527,am,"[177, 273, 196, 290]",MISC
528,self,"[198, 273, 238, 290]",MISC
529,motivated,"[238, 273, 340, 290]",MISC
530,.,"[238, 273, 340, 290]",MISC
531,-,"[340, 273, 342, 290]",MISC
532,NL,"[340, 273, 342, 290]",MISC
533,-,"[340, 273, 342, 290]",MISC
534,•,"[157, 307, 167, 324]",MISC
535,I,"[167, 307, 178, 324]",MISC
536,am,"[178, 307, 199, 324]",MISC
537,hard,"[199, 307, 241, 324]",MISC
538,worker,"[241, 307, 304, 324]",MISC
539,and,"[305, 307, 336, 324]",MISC
540,smart,"[336, 307, 389, 324]",MISC
541,worker,"[389, 307, 462, 324]",MISC
542,.,"[389, 307, 462, 324]",MISC
543,-,"[463, 307, 465, 324]",MISC
544,NL,"[463, 307, 465, 324]",MISC
545,-,"[463, 307, 465, 324]",MISC
546,AC,"[166, 338, 339, 356]",MISC
547,##H,"[166, 338, 339, 356]",MISC
548,##IE,"[166, 338, 339, 356]",MISC
549,##VE,"[166, 338, 339, 356]",MISC
550,##ME,"[166, 338, 339, 356]",MISC
551,##NT,"[166, 338, 339, 356]",MISC
552,##S,"[166, 338, 339, 356]",MISC
553,-,"[339, 338, 340, 356]",MISC
554,NL,"[339, 338, 340, 356]",MISC
555,-,"[339, 338, 340, 356]",MISC
556,•,"[220, 358, 229, 375]",MISC
557,Complete,"[230, 358, 323, 375]",MISC
558,##d,"[230, 358, 323, 375]",MISC
559,.,"[323, 358, 364, 375]",MISC
560,NE,"[323, 358, 364, 375]",MISC
561,##T,"[323, 358, 364, 375]",MISC
562,course,"[365, 358, 426, 375]",MISC
563,from,"[427, 358, 467, 375]",MISC
564,Na,"[468, 358, 530, 375]",MISC
565,##resh,"[468, 358, 530, 375]",MISC
566,I,"[531, 358, 539, 375]",MISC
567,Technology,"[541, 358, 644, 375]",MISC
568,-,"[645, 358, 646, 375]",MISC
569,NL,"[645, 358, 646, 375]",MISC
570,-,"[645, 358, 646, 375]",MISC
571,•,"[220, 380, 229, 397]",MISC
572,Complete,"[230, 380, 317, 397]",MISC
573,##d,"[230, 380, 317, 397]",MISC
574,four,"[317, 380, 356, 397]",MISC
575,months,"[356, 380, 414, 397]",MISC
576,.,"[415, 380, 453, 397]",MISC
577,Net,"[415, 380, 453, 397]",MISC
578,training,"[454, 380, 530, 397]",MISC
579,from,"[531, 380, 570, 397]",MISC
580,Na,"[570, 380, 618, 397]",B-employer_company_name
581,##cre,"[570, 380, 618, 397]",I-employer_company_name
582,Software,"[619, 380, 696, 397]",I-employer_company_name
583,Services,"[697, 380, 774, 397]",I-employer_company_name
584,P,"[775, 380, 803, 397]",I-employer_company_name
585,##v,"[775, 380, 803, 397]",I-employer_company_name
586,##t,"[775, 380, 803, 397]",I-employer_company_name
587,Ltd,"[804, 380, 832, 397]",I-employer_company_name
588,-,"[833, 380, 835, 397]",MISC
589,NL,"[833, 380, 835, 397]",MISC
590,-,"[833, 380, 835, 397]",MISC
591,P,"[167, 420, 279, 438]",B-personal_details_heading
592,##ER,"[167, 420, 279, 438]",I-personal_details_heading
593,##SO,"[167, 420, 279, 438]",I-personal_details_heading
594,##NA,"[167, 420, 279, 438]",I-personal_details_heading
595,##L,"[167, 420, 279, 438]",I-personal_details_heading
596,PR,"[280, 420, 378, 438]",I-personal_details_heading
597,##O,"[280, 420, 378, 438]",I-personal_details_heading
598,##FI,"[280, 420, 378, 438]",I-personal_details_heading
599,##LE,"[280, 420, 378, 438]",I-personal_details_heading
600,-,"[379, 420, 381, 438]",MISC
601,NL,"[379, 420, 381, 438]",MISC
602,-,"[379, 420, 381, 438]",MISC
603,•,"[220, 461, 236, 478]",MISC
604,Name,"[236, 461, 303, 478]",MISC
605,:,"[303, 461, 319, 478]",MISC
606,G,"[320, 461, 435, 478]",MISC
607,##hun,"[320, 461, 435, 478]",MISC
608,##dre,"[320, 461, 435, 478]",MISC
609,Santos,"[436, 461, 551, 478]",MISC
610,##h,"[436, 461, 551, 478]",MISC
611,An,"[553, 461, 701, 478]",MISC
612,##kus,"[553, 461, 701, 478]",MISC
613,##hra,"[553, 461, 701, 478]",MISC
614,##o,"[553, 461, 701, 478]",MISC
615,-,"[702, 461, 704, 478]",MISC
616,NL,"[702, 461, 704, 478]",MISC
617,-,"[702, 461, 704, 478]",MISC
618,•,"[220, 486, 234, 503]",MISC
619,Date,"[235, 486, 294, 503]",MISC
620,of,"[296, 486, 326, 503]",MISC
621,Birth,"[326, 486, 402, 503]",MISC
622,:,"[402, 486, 416, 503]",MISC
623,10th,"[418, 486, 477, 503]",MISC
624,Feb,"[479, 486, 524, 503]",MISC
625,1991,"[524, 486, 584, 503]",MISC
626,-,"[585, 486, 587, 503]",MISC
627,NL,"[585, 486, 587, 503]",MISC
628,-,"[585, 486, 587, 503]",MISC
629,•,"[220, 511, 232, 528]",MISC
630,Father,"[234, 511, 316, 528]",MISC
631,Name,"[316, 511, 371, 528]",MISC
632,:,"[372, 511, 384, 528]",MISC
633,G,"[385, 511, 481, 528]",MISC
634,##hun,"[385, 511, 481, 528]",MISC
635,##dre,"[385, 511, 481, 528]",MISC
636,An,"[482, 511, 606, 528]",MISC
637,##kus,"[482, 511, 606, 528]",MISC
638,##hra,"[482, 511, 606, 528]",MISC
639,##o,"[482, 511, 606, 528]",MISC
640,Mu,"[606, 511, 730, 528]",MISC
641,##ku,"[606, 511, 730, 528]",MISC
642,##ndra,"[606, 511, 730, 528]",MISC
643,##o,"[606, 511, 730, 528]",MISC
644,-,"[730, 511, 732, 528]",MISC
645,NL,"[730, 511, 732, 528]",MISC
646,-,"[730, 511, 732, 528]",MISC
647,•,"[220, 537, 230, 554]",MISC
648,Languages,"[231, 537, 336, 554]",MISC
649,Known,"[337, 537, 395, 554]",MISC
650,:,"[396, 537, 406, 554]",MISC
651,English,"[407, 537, 652, 554]",MISC
652,",","[407, 537, 652, 554]",MISC
653,Hindi,"[407, 537, 652, 554]",MISC
654,",","[407, 537, 652, 554]",MISC
655,Marathi,"[407, 537, 652, 554]",MISC
656,-,"[653, 537, 655, 554]",MISC
657,NL,"[653, 537, 655, 554]",MISC
658,-,"[653, 537, 655, 554]",MISC
659,•,"[220, 562, 229, 579]",MISC
660,Ho,"[230, 562, 302, 579]",MISC
661,##bb,"[230, 562, 302, 579]",MISC
662,##ies,"[230, 562, 302, 579]",MISC
663,and,"[303, 562, 333, 579]",MISC
664,Interest,"[335, 562, 427, 579]",MISC
665,##s,"[335, 562, 427, 579]",MISC
666,:,"[429, 562, 438, 579]",MISC
667,Swimming,"[439, 562, 564, 579]",MISC
668,",","[439, 562, 564, 579]",MISC
669,Web,"[439, 562, 564, 579]",MISC
670,B,"[565, 562, 752, 579]",MISC
671,##rows,"[565, 562, 752, 579]",MISC
672,##ing,"[565, 562, 752, 579]",MISC
673,",","[565, 562, 752, 579]",MISC
674,Listen,"[565, 562, 752, 579]",MISC
675,##ing,"[565, 562, 752, 579]",MISC
676,to,"[753, 562, 772, 579]",MISC
677,music,"[774, 562, 825, 579]",MISC
678,-,"[826, 562, 828, 579]",MISC
679,NL,"[826, 562, 828, 579]",MISC
680,-,"[826, 562, 828, 579]",MISC
681,DE,"[166, 588, 321, 606]",B-others_heading
682,##CL,"[166, 588, 321, 606]",I-others_heading
683,##AR,"[166, 588, 321, 606]",I-others_heading
684,##AT,"[166, 588, 321, 606]",I-others_heading
685,##ION,"[166, 588, 321, 606]",I-others_heading
686,-,"[321, 588, 323, 606]",MISC
687,NL,"[321, 588, 323, 606]",MISC
688,-,"[321, 588, 323, 606]",MISC
689,I,"[157, 643, 166, 660]",MISC
690,here,"[166, 643, 220, 660]",MISC
691,##by,"[166, 643, 220, 660]",MISC
692,declare,"[222, 643, 286, 660]",MISC
693,that,"[286, 643, 323, 660]",MISC
694,the,"[324, 643, 350, 660]",MISC
695,above,"[351, 643, 397, 660]",MISC
696,information,"[398, 643, 499, 660]",MISC
697,is,"[499, 643, 517, 660]",MISC
698,true,"[518, 643, 555, 660]",MISC
699,and,"[555, 643, 581, 660]",MISC
700,correct,"[583, 643, 647, 660]",MISC
701,to,"[648, 643, 665, 660]",MISC
702,the,"[666, 643, 692, 660]",MISC
703,best,"[694, 643, 731, 660]",MISC
704,of,"[731, 643, 748, 660]",MISC
705,my,"[749, 643, 767, 660]",MISC
706,knowledge,"[768, 643, 859, 660]",MISC
707,.,"[768, 643, 859, 660]",MISC
708,I,"[861, 643, 869, 660]",MISC
709,bear,"[870, 643, 907, 660]",MISC
710,-,"[907, 643, 909, 660]",MISC
711,NL,"[907, 643, 909, 660]",MISC
712,-,"[907, 643, 909, 660]",MISC
713,the,"[157, 662, 181, 679]",MISC
714,responsibility,"[182, 662, 299, 679]",MISC
715,for,"[300, 662, 324, 679]",MISC
716,the,"[325, 662, 350, 679]",MISC
717,correct,"[351, 662, 441, 679]",MISC
718,##ness,"[351, 662, 441, 679]",MISC
719,of,"[443, 662, 459, 679]",MISC
720,the,"[460, 662, 484, 679]",MISC
721,mentioned,"[485, 662, 560, 679]",MISC
722,particular,"[561, 662, 661, 679]",MISC
723,##s,"[561, 662, 661, 679]",MISC
724,.,"[561, 662, 661, 679]",MISC
725,-,"[662, 662, 664, 679]",MISC
726,NL,"[662, 662, 664, 679]",MISC
727,-,"[662, 662, 664, 679]",MISC
728,Place,"[157, 695, 202, 713]",MISC
729,:,"[157, 695, 202, 713]",MISC
730,-,"[202, 695, 204, 713]",MISC
731,NL,"[202, 695, 204, 713]",MISC
732,-,"[202, 695, 204, 713]",MISC
733,Name,"[715, 695, 763, 713]",MISC
734,:,"[715, 695, 763, 713]",MISC
735,S,"[765, 695, 805, 713]",MISC
736,.,"[765, 695, 805, 713]",MISC
737,A,"[765, 695, 805, 713]",MISC
738,.,"[765, 695, 805, 713]",MISC
739,G,"[805, 695, 875, 713]",MISC
740,##hun,"[805, 695, 875, 713]",MISC
741,##dre,"[805, 695, 875, 713]",MISC
742,-,"[875, 695, 877, 713]",MISC
743,NL,"[875, 695, 877, 713]",MISC
744,-,"[875, 695, 877, 713]",MISC
745,Date,"[157, 729, 197, 746]",MISC
746,:,"[157, 729, 197, 746]",MISC
747,-,"[197, 729, 199, 746]",MISC
748,NL,"[197, 729, 199, 746]",MISC
749,-,"[197, 729, 199, 746]",MISC
