,token,box,label
0,Ari,"[62, 52, 142, 81]",B-name
1,##f,"[62, 52, 142, 81]",I-name
2,Me,"[142, 52, 241, 81]",I-name
3,##mon,"[142, 52, 241, 81]",I-name
4,-,"[243, 52, 244, 81]",MISC
5,NL,"[243, 52, 244, 81]",MISC
6,-,"[243, 52, 244, 81]",MISC
7,Ra,"[713, 115, 812, 133]",MISC
8,##dha,"[713, 115, 812, 133]",MISC
9,##n,"[713, 115, 812, 133]",MISC
10,##pur,"[713, 115, 812, 133]",MISC
11,-,"[812, 115, 814, 133]",MISC
12,NL,"[812, 115, 814, 133]",MISC
13,-,"[812, 115, 814, 133]",MISC
14,Pi,"[713, 133, 746, 151]",MISC
15,##n,"[713, 133, 746, 151]",MISC
16,code,"[746, 133, 866, 151]",MISC
17,-,"[746, 133, 866, 151]",MISC
18,385,"[746, 133, 866, 151]",MISC
19,##34,"[746, 133, 866, 151]",MISC
20,##0,"[746, 133, 866, 151]",MISC
21,-,"[868, 133, 869, 151]",MISC
22,NL,"[868, 133, 869, 151]",MISC
23,-,"[868, 133, 869, 151]",MISC
24,E,"[567, 169, 869, 187]",MISC
25,-,"[567, 169, 869, 187]",MISC
26,mail,"[567, 169, 869, 187]",MISC
27,:,"[567, 169, 869, 187]",MISC
28,a,"[567, 169, 869, 187]",B-emails_email
29,##ri,"[567, 169, 869, 187]",I-emails_email
30,##f,"[567, 169, 869, 187]",I-emails_email
31,##me,"[567, 169, 869, 187]",I-emails_email
32,##mon,"[567, 169, 869, 187]",I-emails_email
33,##7,"[567, 169, 869, 187]",I-emails_email
34,##1,"[567, 169, 869, 187]",I-emails_email
35,@,"[567, 169, 869, 187]",I-emails_email
36,g,"[567, 169, 869, 187]",I-emails_email
37,##mail,"[567, 169, 869, 187]",I-emails_email
38,.,"[567, 169, 869, 187]",I-emails_email
39,com,"[567, 169, 869, 187]",I-emails_email
40,-,"[869, 169, 871, 187]",MISC
41,NL,"[869, 169, 871, 187]",MISC
42,-,"[869, 169, 871, 187]",MISC
43,Mobile,"[62, 185, 131, 203]",MISC
44,No,"[132, 185, 166, 203]",MISC
45,:,"[132, 185, 166, 203]",MISC
46,+,"[166, 185, 316, 203]",MISC
47,91,"[166, 185, 316, 203]",MISC
48,##9,"[166, 185, 316, 203]",MISC
49,##8,"[166, 185, 316, 203]",MISC
50,##9,"[166, 185, 316, 203]",MISC
51,##8,"[166, 185, 316, 203]",MISC
52,##7,"[166, 185, 316, 203]",MISC
53,##32,"[166, 185, 316, 203]",MISC
54,##19,"[166, 185, 316, 203]",MISC
55,##4,"[166, 185, 316, 203]",MISC
56,-,"[317, 185, 319, 203]",MISC
57,NL,"[317, 185, 319, 203]",MISC
58,-,"[317, 185, 319, 203]",MISC
59,_,"[62, 203, 892, 225]",MISC
60,_,"[62, 203, 892, 225]",MISC
61,_,"[62, 203, 892, 225]",MISC
62,_,"[62, 203, 892, 225]",MISC
63,_,"[62, 203, 892, 225]",MISC
64,_,"[62, 203, 892, 225]",MISC
65,_,"[62, 203, 892, 225]",MISC
66,_,"[62, 203, 892, 225]",MISC
67,_,"[62, 203, 892, 225]",MISC
68,_,"[62, 203, 892, 225]",MISC
69,_,"[62, 203, 892, 225]",MISC
70,_,"[62, 203, 892, 225]",MISC
71,_,"[62, 203, 892, 225]",MISC
72,_,"[62, 203, 892, 225]",MISC
73,_,"[62, 203, 892, 225]",MISC
74,_,"[62, 203, 892, 225]",MISC
75,_,"[62, 203, 892, 225]",MISC
76,_,"[62, 203, 892, 225]",MISC
77,_,"[62, 203, 892, 225]",MISC
78,_,"[62, 203, 892, 225]",MISC
79,_,"[62, 203, 892, 225]",MISC
80,_,"[62, 203, 892, 225]",MISC
81,_,"[62, 203, 892, 225]",MISC
82,_,"[62, 203, 892, 225]",MISC
83,_,"[62, 203, 892, 225]",MISC
84,_,"[62, 203, 892, 225]",MISC
85,_,"[62, 203, 892, 225]",MISC
86,_,"[62, 203, 892, 225]",MISC
87,_,"[62, 203, 892, 225]",MISC
88,_,"[62, 203, 892, 225]",MISC
89,_,"[62, 203, 892, 225]",MISC
90,_,"[62, 203, 892, 225]",MISC
91,_,"[62, 203, 892, 225]",MISC
92,_,"[62, 203, 892, 225]",MISC
93,_,"[62, 203, 892, 225]",MISC
94,_,"[62, 203, 892, 225]",MISC
95,_,"[62, 203, 892, 225]",MISC
96,_,"[62, 203, 892, 225]",MISC
97,_,"[62, 203, 892, 225]",MISC
98,_,"[62, 203, 892, 225]",MISC
99,_,"[62, 203, 892, 225]",MISC
100,_,"[62, 203, 892, 225]",MISC
101,_,"[62, 203, 892, 225]",MISC
102,_,"[62, 203, 892, 225]",MISC
103,_,"[62, 203, 892, 225]",MISC
104,_,"[62, 203, 892, 225]",MISC
105,_,"[62, 203, 892, 225]",MISC
106,_,"[62, 203, 892, 225]",MISC
107,_,"[62, 203, 892, 225]",MISC
108,_,"[62, 203, 892, 225]",MISC
109,_,"[62, 203, 892, 225]",MISC
110,_,"[62, 203, 892, 225]",MISC
111,_,"[62, 203, 892, 225]",MISC
112,_,"[62, 203, 892, 225]",MISC
113,_,"[62, 203, 892, 225]",MISC
114,_,"[62, 203, 892, 225]",MISC
115,_,"[62, 203, 892, 225]",MISC
116,_,"[62, 203, 892, 225]",MISC
117,_,"[62, 203, 892, 225]",MISC
118,_,"[62, 203, 892, 225]",MISC
119,_,"[62, 203, 892, 225]",MISC
120,_,"[62, 203, 892, 225]",MISC
121,_,"[62, 203, 892, 225]",MISC
122,_,"[62, 203, 892, 225]",MISC
123,_,"[62, 203, 892, 225]",MISC
124,_,"[62, 203, 892, 225]",MISC
125,_,"[62, 203, 892, 225]",MISC
126,_,"[62, 203, 892, 225]",MISC
127,_,"[62, 203, 892, 225]",MISC
128,_,"[62, 203, 892, 225]",MISC
129,_,"[62, 203, 892, 225]",MISC
130,_,"[62, 203, 892, 225]",MISC
131,_,"[62, 203, 892, 225]",MISC
132,_,"[62, 203, 892, 225]",MISC
133,_,"[62, 203, 892, 225]",MISC
134,_,"[62, 203, 892, 225]",MISC
135,-,"[892, 203, 894, 225]",MISC
136,NL,"[892, 203, 894, 225]",MISC
137,-,"[892, 203, 894, 225]",MISC
138,CA,"[62, 259, 137, 277]",B-summary_heading
139,##RE,"[62, 259, 137, 277]",I-summary_heading
140,##ER,"[62, 259, 137, 277]",I-summary_heading
141,O,"[138, 259, 251, 277]",I-summary_heading
142,##B,"[138, 259, 251, 277]",I-summary_heading
143,##J,"[138, 259, 251, 277]",I-summary_heading
144,##EC,"[138, 259, 251, 277]",I-summary_heading
145,##TI,"[138, 259, 251, 277]",I-summary_heading
146,##VE,"[138, 259, 251, 277]",I-summary_heading
147,-,"[251, 259, 253, 277]",MISC
148,NL,"[251, 259, 253, 277]",MISC
149,-,"[251, 259, 253, 277]",MISC
150,To,"[62, 293, 85, 312]",MISC
151,become,"[86, 293, 157, 312]",MISC
152,a,"[157, 293, 167, 312]",MISC
153,good,"[169, 293, 216, 312]",MISC
154,manager,"[216, 293, 298, 312]",MISC
155,and,"[299, 293, 334, 312]",MISC
156,become,"[335, 293, 406, 312]",MISC
157,a,"[406, 293, 417, 312]",MISC
158,part,"[418, 293, 465, 312]",MISC
159,of,"[465, 293, 488, 312]",MISC
160,a,"[489, 293, 500, 312]",MISC
161,dynamic,"[501, 293, 583, 312]",MISC
162,and,"[584, 293, 619, 312]",MISC
163,competitive,"[620, 293, 750, 312]",MISC
164,organization,"[750, 293, 903, 312]",MISC
165,",","[750, 293, 903, 312]",MISC
166,wherein,"[905, 293, 986, 312]",MISC
167,I,"[988, 293, 998, 312]",MISC
168,-,"[1000, 293, 1001, 312]",MISC
169,NL,"[1000, 293, 1001, 312]",MISC
170,-,"[1000, 293, 1001, 312]",MISC
171,can,"[62, 311, 95, 329]",MISC
172,fully,"[95, 311, 149, 329]",MISC
173,utilize,"[150, 311, 226, 329]",MISC
174,my,"[227, 311, 248, 329]",MISC
175,skills,"[249, 311, 315, 329]",MISC
176,and,"[315, 311, 348, 329]",MISC
177,contribute,"[348, 311, 457, 329]",MISC
178,to,"[458, 311, 479, 329]",MISC
179,the,"[480, 311, 513, 329]",MISC
180,success,"[513, 311, 589, 329]",MISC
181,of,"[590, 311, 611, 329]",MISC
182,my,"[612, 311, 633, 329]",MISC
183,organization,"[634, 311, 766, 329]",MISC
184,as,"[766, 311, 787, 329]",MISC
185,well,"[788, 311, 831, 329]",MISC
186,as,"[832, 311, 853, 329]",MISC
187,my,"[854, 311, 875, 329]",MISC
188,own,"[876, 311, 909, 329]",MISC
189,career,"[909, 311, 985, 329]",MISC
190,.,"[909, 311, 985, 329]",MISC
191,-,"[986, 311, 987, 329]",MISC
192,NL,"[986, 311, 987, 329]",MISC
193,-,"[986, 311, 987, 329]",MISC
194,PR,"[62, 365, 206, 382]",B-education_heading
195,##O,"[62, 365, 206, 382]",I-education_heading
196,##F,"[62, 365, 206, 382]",I-education_heading
197,##ES,"[62, 365, 206, 382]",I-education_heading
198,##SI,"[62, 365, 206, 382]",I-education_heading
199,##ON,"[62, 365, 206, 382]",I-education_heading
200,##AL,"[62, 365, 206, 382]",I-education_heading
201,Q,"[207, 365, 363, 382]",I-education_heading
202,##U,"[207, 365, 363, 382]",I-education_heading
203,##AL,"[207, 365, 363, 382]",I-education_heading
204,##IF,"[207, 365, 363, 382]",I-education_heading
205,##IC,"[207, 365, 363, 382]",I-education_heading
206,##AT,"[207, 365, 363, 382]",I-education_heading
207,##ION,"[207, 365, 363, 382]",I-education_heading
208,-,"[364, 365, 366, 382]",MISC
209,NL,"[364, 365, 366, 382]",MISC
210,-,"[364, 365, 366, 382]",MISC
211,MBA,"[62, 399, 95, 417]",B-education_degree
212,(,"[96, 399, 106, 417]",MISC
213,Special,"[107, 399, 263, 417]",MISC
214,##ization,"[107, 399, 263, 417]",MISC
215,in,"[265, 399, 286, 417]",MISC
216,Marketing,"[287, 399, 388, 417]",B-education_course
217,Management,"[389, 399, 512, 417]",I-education_course
218,),"[389, 399, 512, 417]",MISC
219,from,"[513, 399, 556, 417]",MISC
220,IN,"[558, 399, 614, 417]",B-education_institute
221,##D,"[558, 399, 614, 417]",I-education_institute
222,##US,"[558, 399, 614, 417]",I-education_institute
223,University,"[614, 399, 738, 417]",I-education_institute
224,",","[614, 399, 738, 417]",MISC
225,Ahmed,"[738, 399, 839, 417]",MISC
226,##abad,"[738, 399, 839, 417]",MISC
227,-,"[840, 399, 842, 417]",MISC
228,NL,"[840, 399, 842, 417]",MISC
229,-,"[840, 399, 842, 417]",MISC
230,E,"[62, 452, 196, 470]",B-education_heading
231,##D,"[62, 452, 196, 470]",I-education_heading
232,##UC,"[62, 452, 196, 470]",I-education_heading
233,##AT,"[62, 452, 196, 470]",I-education_heading
234,##ION,"[62, 452, 196, 470]",I-education_heading
235,##AL,"[62, 452, 196, 470]",I-education_heading
236,Q,"[196, 452, 367, 470]",I-education_heading
237,##U,"[196, 452, 367, 470]",I-education_heading
238,##AL,"[196, 452, 367, 470]",I-education_heading
239,##IF,"[196, 452, 367, 470]",I-education_heading
240,##IC,"[196, 452, 367, 470]",I-education_heading
241,##AT,"[196, 452, 367, 470]",I-education_heading
242,##ION,"[196, 452, 367, 470]",I-education_heading
243,##S,"[196, 452, 367, 470]",I-education_heading
244,-,"[368, 452, 369, 470]",MISC
245,NL,"[368, 452, 369, 470]",MISC
246,-,"[368, 452, 369, 470]",MISC
247,DE,"[168, 507, 260, 543]",MISC
248,##GR,"[168, 507, 260, 543]",MISC
249,##EE,"[168, 507, 260, 543]",MISC
250,-,"[260, 507, 274, 543]",MISC
251,IN,"[276, 507, 413, 543]",MISC
252,##ST,"[276, 507, 413, 543]",MISC
253,##IT,"[276, 507, 413, 543]",MISC
254,##UT,"[276, 507, 413, 543]",MISC
255,##E,"[276, 507, 413, 543]",MISC
256,/,"[415, 507, 429, 543]",MISC
257,UN,"[430, 507, 583, 543]",MISC
258,##IVE,"[430, 507, 583, 543]",MISC
259,##RS,"[430, 507, 583, 543]",MISC
260,##IT,"[430, 507, 583, 543]",MISC
261,##Y,"[430, 507, 583, 543]",MISC
262,-,"[584, 507, 598, 543]",MISC
263,Y,"[600, 507, 660, 543]",MISC
264,##EA,"[600, 507, 660, 543]",MISC
265,##R,"[600, 507, 660, 543]",MISC
266,-,"[661, 507, 675, 543]",MISC
267,P,"[677, 507, 830, 543]",MISC
268,##ER,"[677, 507, 830, 543]",MISC
269,##CE,"[677, 507, 830, 543]",MISC
270,##NT,"[677, 507, 830, 543]",MISC
271,##AG,"[677, 507, 830, 543]",MISC
272,##E,"[677, 507, 830, 543]",MISC
273,&,"[831, 507, 845, 543]",MISC
274,C,"[846, 507, 907, 543]",MISC
275,##GP,"[846, 507, 907, 543]",MISC
276,##A,"[846, 507, 907, 543]",MISC
277,(,"[908, 507, 953, 543]",MISC
278,%,"[908, 507, 953, 543]",MISC
279,),"[908, 507, 953, 543]",MISC
280,-,"[954, 507, 956, 543]",MISC
281,NL,"[954, 507, 956, 543]",MISC
282,-,"[954, 507, 956, 543]",MISC
283,MBA,"[184, 553, 234, 571]",B-education_degree
284,-,"[235, 553, 251, 571]",MISC
285,IN,"[253, 553, 338, 571]",B-education_institute
286,##D,"[253, 553, 338, 571]",I-education_institute
287,##US,"[253, 553, 338, 571]",I-education_institute
288,University,"[339, 553, 529, 571]",I-education_institute
289,",","[339, 553, 529, 571]",MISC
290,A,"[530, 553, 684, 571]",MISC
291,##H,"[530, 553, 684, 571]",MISC
292,##ME,"[530, 553, 684, 571]",MISC
293,##DA,"[530, 553, 684, 571]",MISC
294,##BA,"[530, 553, 684, 571]",MISC
295,##D,"[530, 553, 684, 571]",MISC
296,-,"[686, 553, 701, 571]",MISC
297,2013,"[703, 553, 823, 571]",MISC
298,-,"[703, 553, 823, 571]",MISC
299,14,"[703, 553, 823, 571]",MISC
300,-,"[824, 553, 840, 571]",MISC
301,6,"[842, 553, 892, 571]",MISC
302,.,"[842, 553, 892, 571]",MISC
303,7,"[842, 553, 892, 571]",MISC
304,-,"[894, 553, 895, 571]",MISC
305,NL,"[894, 553, 895, 571]",MISC
306,-,"[894, 553, 895, 571]",MISC
307,B,"[185, 581, 281, 600]",B-education_degree
308,##BA,"[185, 581, 281, 600]",I-education_degree
309,-,"[282, 581, 313, 600]",MISC
310,H,"[314, 581, 635, 600]",B-education_institute
311,##NG,"[314, 581, 635, 600]",I-education_institute
312,##U,"[314, 581, 635, 600]",I-education_institute
313,-,"[314, 581, 635, 600]",I-education_institute
314,PA,"[314, 581, 635, 600]",I-education_institute
315,##TA,"[314, 581, 635, 600]",I-education_institute
316,##N,"[314, 581, 635, 600]",I-education_institute
317,-,"[635, 581, 666, 600]",MISC
318,2012,"[667, 581, 796, 600]",MISC
319,-,"[796, 581, 827, 600]",MISC
320,59,"[828, 581, 892, 600]",MISC
321,-,"[892, 581, 894, 600]",MISC
322,NL,"[892, 581, 894, 600]",MISC
323,-,"[892, 581, 894, 600]",MISC
324,H,"[185, 601, 284, 623]",B-education_degree
325,##SC,"[185, 601, 284, 623]",I-education_degree
326,-,"[284, 601, 317, 623]",MISC
327,G,"[317, 601, 482, 623]",B-education_institute
328,##S,"[317, 601, 482, 623]",I-education_institute
329,##H,"[317, 601, 482, 623]",I-education_institute
330,##E,"[317, 601, 482, 623]",I-education_institute
331,##B,"[317, 601, 482, 623]",I-education_institute
332,-,"[482, 601, 515, 623]",MISC
333,2009,"[515, 601, 647, 623]",MISC
334,-,"[647, 601, 680, 623]",MISC
335,54,"[680, 601, 746, 623]",MISC
336,(,"[746, 601, 944, 623]",MISC
337,Sc,"[746, 601, 944, 623]",MISC
338,##i,"[746, 601, 944, 623]",MISC
339,.,"[746, 601, 944, 623]",MISC
340,),"[746, 601, 944, 623]",MISC
341,-,"[944, 601, 946, 623]",MISC
342,NL,"[944, 601, 946, 623]",MISC
343,-,"[944, 601, 946, 623]",MISC
344,SS,"[187, 628, 300, 651]",B-education_degree
345,##C,"[187, 628, 300, 651]",I-education_degree
346,-,"[301, 628, 337, 651]",MISC
347,G,"[339, 628, 490, 651]",B-education_institute
348,##SE,"[339, 628, 490, 651]",I-education_institute
349,##B,"[339, 628, 490, 651]",I-education_institute
350,-,"[490, 628, 527, 651]",MISC
351,2007,"[528, 628, 679, 651]",MISC
352,-,"[680, 628, 716, 651]",MISC
353,72,"[718, 628, 907, 651]",MISC
354,.,"[718, 628, 907, 651]",MISC
355,62,"[718, 628, 907, 651]",MISC
356,-,"[907, 628, 909, 651]",MISC
357,NL,"[907, 628, 909, 651]",MISC
358,-,"[907, 628, 909, 651]",MISC
359,PR,"[62, 673, 168, 690]",B-others_heading
360,##O,"[62, 673, 168, 690]",I-others_heading
361,##J,"[62, 673, 168, 690]",I-others_heading
362,##EC,"[62, 673, 168, 690]",I-others_heading
363,##TS,"[62, 673, 168, 690]",I-others_heading
364,UN,"[168, 673, 300, 690]",I-others_heading
365,##DE,"[168, 673, 300, 690]",I-others_heading
366,##RT,"[168, 673, 300, 690]",I-others_heading
367,##A,"[168, 673, 300, 690]",I-others_heading
368,##KE,"[168, 673, 300, 690]",I-others_heading
369,##N,"[168, 673, 300, 690]",I-others_heading
370,-,"[302, 673, 303, 690]",MISC
371,NL,"[302, 673, 303, 690]",MISC
372,-,"[302, 673, 303, 690]",MISC
373,Industrial,"[62, 708, 168, 726]",MISC
374,V,"[168, 708, 220, 726]",MISC
375,##isi,"[168, 708, 220, 726]",MISC
376,##t,"[168, 708, 220, 726]",MISC
377,at,"[221, 708, 242, 726]",MISC
378,Hindus,"[243, 708, 338, 726]",MISC
379,##tan,"[243, 708, 338, 726]",MISC
380,Be,"[338, 708, 434, 726]",MISC
381,##ver,"[338, 708, 434, 726]",MISC
382,##ages,"[338, 708, 434, 726]",MISC
383,P,"[434, 708, 475, 726]",MISC
384,##v,"[434, 708, 475, 726]",MISC
385,##t,"[434, 708, 475, 726]",MISC
386,.,"[434, 708, 475, 726]",MISC
387,Ltd,"[476, 708, 518, 726]",MISC
388,.,"[476, 708, 518, 726]",MISC
389,Go,"[519, 708, 581, 726]",MISC
390,##ble,"[519, 708, 581, 726]",MISC
391,##j,"[519, 708, 581, 726]",MISC
392,and,"[582, 708, 614, 726]",MISC
393,Am,"[614, 708, 656, 726]",MISC
394,##ul,"[614, 708, 656, 726]",MISC
395,Dai,"[657, 708, 719, 726]",MISC
396,##ry,"[657, 708, 719, 726]",MISC
397,",","[657, 708, 719, 726]",MISC
398,Anand,"[720, 708, 783, 726]",MISC
399,.,"[720, 708, 783, 726]",MISC
400,-,"[784, 708, 786, 726]",MISC
401,NL,"[784, 708, 786, 726]",MISC
402,-,"[784, 708, 786, 726]",MISC
403,Industrial,"[62, 743, 168, 760]",MISC
404,V,"[169, 743, 221, 760]",MISC
405,##isi,"[169, 743, 221, 760]",MISC
406,##t,"[169, 743, 221, 760]",MISC
407,to,"[222, 743, 243, 760]",MISC
408,Shake,"[244, 743, 318, 760]",MISC
409,##en,"[244, 743, 318, 760]",MISC
410,All,"[318, 743, 381, 760]",MISC
411,##oy,"[318, 743, 381, 760]",MISC
412,##s,"[318, 743, 381, 760]",MISC
413,p,"[382, 743, 424, 760]",MISC
414,##v,"[382, 743, 424, 760]",MISC
415,##t,"[382, 743, 424, 760]",MISC
416,.,"[382, 743, 424, 760]",MISC
417,Ltd,"[425, 743, 467, 760]",MISC
418,.,"[425, 743, 467, 760]",MISC
419,to,"[468, 743, 489, 760]",MISC
420,learn,"[489, 743, 541, 760]",MISC
421,practical,"[543, 743, 638, 760]",MISC
422,aspects,"[639, 743, 713, 760]",MISC
423,of,"[713, 743, 734, 760]",MISC
424,Operations,"[735, 743, 841, 760]",MISC
425,Management,"[842, 743, 947, 760]",MISC
426,and,"[948, 743, 980, 760]",MISC
427,-,"[980, 743, 982, 760]",MISC
428,NL,"[980, 743, 982, 760]",MISC
429,-,"[980, 743, 982, 760]",MISC
430,Pre,"[62, 760, 145, 778]",MISC
431,##par,"[62, 760, 145, 778]",MISC
432,##ed,"[62, 760, 145, 778]",MISC
433,the,"[147, 760, 178, 778]",MISC
434,project,"[179, 760, 252, 778]",MISC
435,report,"[253, 760, 315, 778]",MISC
436,on,"[316, 760, 337, 778]",MISC
437,customer,"[338, 760, 421, 778]",MISC
438,satisfaction,"[422, 760, 549, 778]",MISC
439,in,"[550, 760, 570, 778]",MISC
440,marketing,"[571, 760, 665, 778]",MISC
441,-,"[666, 760, 668, 778]",MISC
442,NL,"[666, 760, 668, 778]",MISC
443,-,"[666, 760, 668, 778]",MISC
444,Summer,"[62, 796, 126, 814]",MISC
445,Inter,"[128, 796, 237, 814]",B-employer_role
446,##ns,"[128, 796, 237, 814]",I-employer_role
447,##hip,"[128, 796, 237, 814]",I-employer_role
448,at,"[237, 796, 258, 814]",MISC
449,Ed,"[259, 796, 356, 814]",B-employer_company_name
450,##el,"[259, 796, 356, 814]",I-employer_company_name
451,##wei,"[259, 796, 356, 814]",I-employer_company_name
452,##ss,"[259, 796, 356, 814]",I-employer_company_name
453,Financial,"[358, 796, 455, 814]",I-employer_company_name
454,Advisory,"[456, 796, 543, 814]",I-employer_company_name
455,L,"[544, 796, 597, 814]",I-employer_company_name
456,##T,"[544, 796, 597, 814]",I-employer_company_name
457,##D,"[544, 796, 597, 814]",I-employer_company_name
458,.,"[544, 796, 597, 814]",MISC
459,",","[544, 796, 597, 814]",MISC
460,Ahmed,"[598, 796, 696, 814]",MISC
461,##abad,"[598, 796, 696, 814]",MISC
462,and,"[697, 796, 728, 814]",MISC
463,prepared,"[730, 796, 817, 814]",MISC
464,project,"[817, 796, 894, 814]",MISC
465,report,"[894, 796, 958, 814]",MISC
466,-,"[960, 796, 961, 814]",MISC
467,NL,"[960, 796, 961, 814]",MISC
468,-,"[960, 796, 961, 814]",MISC
469,CO,"[62, 848, 213, 866]",MISC
470,##NT,"[62, 848, 213, 866]",MISC
471,##RI,"[62, 848, 213, 866]",MISC
472,##B,"[62, 848, 213, 866]",MISC
473,##UT,"[62, 848, 213, 866]",MISC
474,##ION,"[62, 848, 213, 866]",MISC
475,:,"[62, 848, 213, 866]",MISC
476,-,"[213, 848, 215, 866]",MISC
477,NL,"[213, 848, 215, 866]",MISC
478,-,"[213, 848, 215, 866]",MISC
479,Survey,"[105, 884, 172, 903]",MISC
480,of,"[174, 884, 196, 903]",MISC
481,the,"[197, 884, 230, 903]",MISC
482,market,"[231, 884, 299, 903]",MISC
483,-,"[300, 884, 302, 903]",MISC
484,NL,"[300, 884, 302, 903]",MISC
485,-,"[300, 884, 302, 903]",MISC
486,Fi,"[104, 902, 143, 921]",MISC
487,##ll,"[104, 902, 143, 921]",MISC
488,up,"[145, 902, 164, 921]",MISC
489,the,"[165, 902, 195, 921]",MISC
490,question,"[196, 902, 328, 921]",MISC
491,##naire,"[196, 902, 328, 921]",MISC
492,-,"[329, 902, 331, 921]",MISC
493,NL,"[329, 902, 331, 921]",MISC
494,-,"[329, 902, 331, 921]",MISC
495,W,"[62, 39, 114, 57]",B-work_experience_heading
496,##OR,"[62, 39, 114, 57]",I-work_experience_heading
497,##K,"[62, 39, 114, 57]",I-work_experience_heading
498,E,"[115, 39, 245, 57]",I-work_experience_heading
499,##X,"[115, 39, 245, 57]",I-work_experience_heading
500,##P,"[115, 39, 245, 57]",I-work_experience_heading
501,##ER,"[115, 39, 245, 57]",I-work_experience_heading
502,##IE,"[115, 39, 245, 57]",I-work_experience_heading
503,##NC,"[115, 39, 245, 57]",I-work_experience_heading
504,##E,"[115, 39, 245, 57]",I-work_experience_heading
505,-,"[246, 39, 248, 57]",MISC
506,NL,"[246, 39, 248, 57]",MISC
507,-,"[246, 39, 248, 57]",MISC
508,I,"[62, 75, 74, 92]",MISC
509,have,"[75, 75, 125, 92]",MISC
510,1,"[125, 75, 137, 92]",MISC
511,year,"[138, 75, 188, 92]",MISC
512,experience,"[188, 75, 313, 92]",MISC
513,as,"[315, 75, 339, 92]",MISC
514,a,"[340, 75, 352, 92]",MISC
515,Market,"[353, 75, 427, 92]",B-employer_role
516,Research,"[429, 75, 529, 92]",I-employer_role
517,Associate,"[530, 75, 643, 92]",I-employer_role
518,in,"[644, 75, 668, 92]",MISC
519,A,"[669, 75, 731, 92]",B-employer_company_name
520,##zure,"[669, 75, 731, 92]",I-employer_company_name
521,knowledge,"[732, 75, 845, 92]",I-employer_company_name
522,Corporation,"[846, 75, 985, 92]",I-employer_company_name
523,",","[985, 75, 997, 92]",MISC
524,-,"[998, 75, 1000, 92]",MISC
525,NL,"[998, 75, 1000, 92]",MISC
526,-,"[998, 75, 1000, 92]",MISC
527,Ahmed,"[62, 92, 173, 110]",MISC
528,##abad,"[62, 92, 173, 110]",MISC
529,-,"[173, 92, 175, 110]",MISC
530,NL,"[173, 92, 175, 110]",MISC
531,-,"[173, 92, 175, 110]",MISC
532,I,"[62, 127, 72, 145]",MISC
533,have,"[74, 127, 121, 145]",MISC
534,1,"[121, 127, 131, 145]",MISC
535,year,"[132, 127, 179, 145]",MISC
536,work,"[179, 127, 226, 145]",MISC
537,experience,"[226, 127, 342, 145]",MISC
538,as,"[343, 127, 366, 145]",MISC
539,a,"[367, 127, 377, 145]",MISC
540,Field,"[378, 127, 436, 145]",B-employer_role
541,sales,"[437, 127, 494, 145]",I-employer_role
542,executive,"[496, 127, 600, 145]",I-employer_role
543,in,"[601, 127, 624, 145]",MISC
544,channel,"[625, 127, 706, 145]",B-employer_company_name
545,play,"[707, 127, 753, 145]",I-employer_company_name
546,P,"[753, 127, 788, 145]",I-employer_company_name
547,##v,"[753, 127, 788, 145]",I-employer_company_name
548,##t,"[753, 127, 788, 145]",I-employer_company_name
549,Ltd,"[789, 127, 823, 145]",I-employer_company_name
550,Ahmed,"[824, 127, 928, 145]",MISC
551,##abad,"[824, 127, 928, 145]",MISC
552,for,"[929, 127, 964, 145]",MISC
553,Lee,"[964, 127, 999, 145]",MISC
554,-,"[1000, 127, 1001, 145]",MISC
555,NL,"[1000, 127, 1001, 145]",MISC
556,-,"[1000, 127, 1001, 145]",MISC
557,Cooper,"[62, 145, 126, 162]",MISC
558,brand,"[127, 145, 191, 162]",MISC
559,.,"[127, 145, 191, 162]",MISC
560,-,"[192, 145, 194, 162]",MISC
561,NL,"[192, 145, 194, 162]",MISC
562,-,"[192, 145, 194, 162]",MISC
563,Currently,"[62, 180, 164, 198]",MISC
564,I,"[166, 180, 176, 198]",MISC
565,am,"[178, 180, 200, 198]",MISC
566,working,"[201, 180, 280, 198]",MISC
567,as,"[282, 180, 304, 198]",MISC
568,a,"[305, 180, 315, 198]",MISC
569,Ji,"[316, 180, 349, 198]",B-employer_role
570,##o,"[316, 180, 349, 198]",I-employer_role
571,Point,"[351, 180, 408, 198]",I-employer_role
572,Manager,"[409, 180, 488, 198]",I-employer_role
573,in,"[489, 180, 512, 198]",MISC
574,Re,"[513, 180, 605, 198]",MISC
575,##liance,"[513, 180, 605, 198]",MISC
576,In,"[605, 180, 697, 198]",MISC
577,##fo,"[605, 180, 697, 198]",MISC
578,##come,"[605, 180, 697, 198]",MISC
579,India,"[697, 180, 755, 198]",MISC
580,P,"[755, 180, 800, 198]",MISC
581,##v,"[755, 180, 800, 198]",MISC
582,##t,"[755, 180, 800, 198]",MISC
583,.,"[755, 180, 800, 198]",MISC
584,Ltd,"[801, 180, 847, 198]",MISC
585,.,"[801, 180, 847, 198]",MISC
586,at,"[848, 180, 870, 198]",MISC
587,B,"[871, 180, 951, 198]",MISC
588,##hab,"[871, 180, 951, 198]",MISC
589,##har,"[871, 180, 951, 198]",MISC
590,from,"[952, 180, 997, 198]",MISC
591,-,"[998, 180, 1000, 198]",MISC
592,NL,"[998, 180, 1000, 198]",MISC
593,-,"[998, 180, 1000, 198]",MISC
594,October,"[62, 198, 140, 216]",MISC
595,2018,"[142, 198, 187, 216]",MISC
596,-,"[187, 198, 189, 216]",MISC
597,NL,"[187, 198, 189, 216]",MISC
598,-,"[187, 198, 189, 216]",MISC
599,Job,"[62, 248, 90, 264]",MISC
600,Role,"[91, 248, 129, 264]",MISC
601,for,"[130, 248, 157, 264]",MISC
602,Re,"[159, 248, 235, 264]",MISC
603,##liance,"[159, 248, 235, 264]",MISC
604,In,"[236, 248, 312, 264]",MISC
605,##fo,"[236, 248, 312, 264]",MISC
606,##come,"[236, 248, 312, 264]",MISC
607,India,"[313, 248, 360, 264]",MISC
608,P,"[362, 248, 389, 264]",MISC
609,##v,"[362, 248, 389, 264]",MISC
610,##t,"[362, 248, 389, 264]",MISC
611,Ltd,"[391, 248, 418, 264]",MISC
612,-,"[420, 248, 421, 264]",MISC
613,NL,"[420, 248, 421, 264]",MISC
614,-,"[420, 248, 421, 264]",MISC
615,Organ,"[103, 263, 202, 279]",MISC
616,##ising,"[103, 263, 202, 279]",MISC
617,sales,"[203, 263, 252, 279]",MISC
618,visits,"[254, 263, 313, 279]",MISC
619,-,"[314, 263, 315, 279]",MISC
620,NL,"[314, 263, 315, 279]",MISC
621,-,"[314, 263, 315, 279]",MISC
622,Relations,"[103, 287, 221, 304]",MISC
623,##hip,"[103, 287, 221, 304]",MISC
624,building,"[221, 287, 299, 304]",MISC
625,-,"[300, 287, 302, 304]",MISC
626,NL,"[300, 287, 302, 304]",MISC
627,-,"[300, 287, 302, 304]",MISC
628,Demons,"[104, 319, 239, 335]",MISC
629,##tra,"[104, 319, 239, 335]",MISC
630,##ting,"[104, 319, 239, 335]",MISC
631,and,"[240, 319, 272, 335]",MISC
632,presenting,"[272, 319, 376, 335]",MISC
633,products,"[377, 319, 461, 335]",MISC
634,-,"[461, 319, 463, 335]",MISC
635,NL,"[461, 319, 463, 335]",MISC
636,-,"[461, 319, 463, 335]",MISC
637,Ai,"[104, 343, 166, 360]",MISC
638,##ming,"[104, 343, 166, 360]",MISC
639,to,"[168, 343, 189, 360]",MISC
640,achieve,"[189, 343, 262, 360]",MISC
641,monthly,"[264, 343, 336, 360]",MISC
642,targets,"[338, 343, 423, 360]",MISC
643,.,"[338, 343, 423, 360]",MISC
644,-,"[423, 343, 425, 360]",MISC
645,NL,"[423, 343, 425, 360]",MISC
646,-,"[423, 343, 425, 360]",MISC
647,ST,"[62, 385, 180, 403]",B-skills_heading
648,##RE,"[62, 385, 180, 403]",I-skills_heading
649,##NG,"[62, 385, 180, 403]",I-skills_heading
650,##TH,"[62, 385, 180, 403]",I-skills_heading
651,##S,"[62, 385, 180, 403]",I-skills_heading
652,-,"[180, 385, 182, 403]",MISC
653,NL,"[180, 385, 182, 403]",MISC
654,-,"[180, 385, 182, 403]",MISC
655,Self,"[104, 419, 257, 438]",MISC
656,-,"[104, 419, 257, 438]",MISC
657,Mo,"[104, 419, 257, 438]",MISC
658,##ti,"[104, 419, 257, 438]",MISC
659,##vated,"[104, 419, 257, 438]",MISC
660,-,"[258, 419, 260, 438]",MISC
661,NL,"[258, 419, 260, 438]",MISC
662,-,"[258, 419, 260, 438]",MISC
663,Communication,"[105, 460, 254, 479]",B-skills_heading
664,Skills,"[255, 460, 323, 479]",I-skills_heading
665,-,"[324, 460, 326, 479]",MISC
666,NL,"[324, 460, 326, 479]",MISC
667,-,"[324, 460, 326, 479]",MISC
668,F,"[103, 500, 213, 519]",MISC
669,##lex,"[103, 500, 213, 519]",MISC
670,##ibility,"[103, 500, 213, 519]",MISC
671,and,"[214, 500, 243, 519]",MISC
672,Ada,"[244, 500, 364, 519]",MISC
673,##pta,"[244, 500, 364, 519]",MISC
674,##bility,"[244, 500, 364, 519]",MISC
675,-,"[364, 500, 366, 519]",MISC
676,NL,"[364, 500, 366, 519]",MISC
677,-,"[364, 500, 366, 519]",MISC
678,Learning,"[104, 539, 187, 558]",MISC
679,a,"[187, 539, 270, 558]",MISC
680,##gi,"[187, 539, 270, 558]",MISC
681,##lity,"[187, 539, 270, 558]",MISC
682,:,"[187, 539, 270, 558]",MISC
683,Quick,"[270, 539, 322, 558]",MISC
684,learn,"[322, 539, 395, 558]",MISC
685,##er,"[322, 539, 395, 558]",MISC
686,-,"[395, 539, 397, 558]",MISC
687,NL,"[395, 539, 397, 558]",MISC
688,-,"[395, 539, 397, 558]",MISC
689,SK,"[62, 581, 126, 599]",B-skills_heading
690,##IL,"[62, 581, 126, 599]",I-skills_heading
691,##LS,"[62, 581, 126, 599]",I-skills_heading
692,-,"[126, 581, 128, 599]",MISC
693,NL,"[126, 581, 128, 599]",MISC
694,-,"[126, 581, 128, 599]",MISC
695,Leadership,"[104, 615, 208, 634]",MISC
696,skills,"[209, 615, 282, 634]",MISC
697,",","[209, 615, 282, 634]",MISC
698,-,"[282, 615, 284, 634]",MISC
699,NL,"[282, 615, 284, 634]",MISC
700,-,"[282, 615, 284, 634]",MISC
701,A,"[105, 634, 187, 653]",MISC
702,##bility,"[105, 634, 187, 653]",MISC
703,to,"[187, 634, 209, 653]",MISC
704,work,"[210, 634, 255, 653]",MISC
705,in,"[257, 634, 279, 653]",MISC
706,a,"[280, 634, 291, 653]",MISC
707,team,"[292, 634, 349, 653]",MISC
708,",","[292, 634, 349, 653]",MISC
709,-,"[350, 634, 352, 653]",MISC
710,NL,"[350, 634, 352, 653]",MISC
711,-,"[350, 634, 352, 653]",MISC
712,Basic,"[105, 655, 160, 671]",MISC
713,computer,"[162, 655, 252, 671]",MISC
714,skill,"[253, 655, 309, 671]",MISC
715,-,"[310, 655, 312, 671]",MISC
716,NL,"[310, 655, 312, 671]",MISC
717,-,"[310, 655, 312, 671]",MISC
718,Social,"[105, 671, 174, 688]",MISC
719,Media,"[175, 671, 233, 688]",MISC
720,Marketing,"[234, 671, 338, 688]",MISC
721,-,"[340, 671, 342, 688]",MISC
722,NL,"[340, 671, 342, 688]",MISC
723,-,"[340, 671, 342, 688]",MISC
724,P,"[62, 736, 163, 754]",B-personal_details_heading
725,##ER,"[62, 736, 163, 754]",I-personal_details_heading
726,##SO,"[62, 736, 163, 754]",I-personal_details_heading
727,##NA,"[62, 736, 163, 754]",I-personal_details_heading
728,##L,"[62, 736, 163, 754]",I-personal_details_heading
729,DE,"[163, 736, 238, 754]",I-personal_details_heading
730,##TA,"[163, 736, 238, 754]",I-personal_details_heading
731,##IL,"[163, 736, 238, 754]",I-personal_details_heading
732,-,"[239, 736, 241, 754]",MISC
733,NL,"[239, 736, 241, 754]",MISC
734,-,"[239, 736, 241, 754]",MISC
735,Gender,"[62, 772, 168, 790]",MISC
736,:,"[168, 772, 185, 790]",MISC
737,Male,"[186, 772, 255, 790]",MISC
738,-,"[256, 772, 258, 790]",MISC
739,NL,"[256, 772, 258, 790]",MISC
740,-,"[256, 772, 258, 790]",MISC
741,Date,"[62, 788, 109, 807]",MISC
742,of,"[110, 788, 132, 807]",MISC
743,Birth,"[133, 788, 193, 807]",MISC
744,:,"[193, 788, 203, 807]",MISC
745,28,"[205, 788, 323, 807]",MISC
746,/,"[205, 788, 323, 807]",MISC
747,05,"[205, 788, 323, 807]",MISC
748,/,"[205, 788, 323, 807]",MISC
749,1992,"[205, 788, 323, 807]",MISC
750,-,"[324, 788, 326, 807]",MISC
751,NL,"[324, 788, 326, 807]",MISC
752,-,"[324, 788, 326, 807]",MISC
753,Mari,"[62, 806, 135, 824]",MISC
754,##tal,"[62, 806, 135, 824]",MISC
755,Status,"[136, 806, 198, 824]",MISC
756,:,"[199, 806, 209, 824]",MISC
757,Single,"[209, 806, 272, 824]",MISC
758,-,"[272, 806, 274, 824]",MISC
759,NL,"[272, 806, 274, 824]",MISC
760,-,"[272, 806, 274, 824]",MISC
761,National,"[62, 824, 187, 842]",MISC
762,##ity,"[62, 824, 187, 842]",MISC
763,:,"[188, 824, 199, 842]",MISC
764,Indian,"[200, 824, 267, 842]",MISC
765,-,"[269, 824, 270, 842]",MISC
766,NL,"[269, 824, 270, 842]",MISC
767,-,"[269, 824, 270, 842]",MISC
768,Languages,"[62, 842, 163, 860]",MISC
769,:,"[163, 842, 173, 860]",MISC
770,English,"[174, 842, 263, 860]",MISC
771,",","[174, 842, 263, 860]",MISC
772,Hindi,"[264, 842, 330, 860]",MISC
773,",","[264, 842, 330, 860]",MISC
774,Gujarat,"[332, 842, 420, 860]",MISC
775,##i,"[332, 842, 420, 860]",MISC
776,-,"[421, 842, 423, 860]",MISC
777,NL,"[421, 842, 423, 860]",MISC
778,-,"[421, 842, 423, 860]",MISC
779,Ho,"[62, 860, 152, 877]",MISC
780,##bb,"[62, 860, 152, 877]",MISC
781,##ies,"[62, 860, 152, 877]",MISC
782,:,"[153, 860, 165, 877]",MISC
783,Reading,"[166, 860, 268, 877]",MISC
784,",","[166, 860, 268, 877]",MISC
785,Cricket,"[270, 860, 360, 877]",MISC
786,-,"[361, 860, 362, 877]",MISC
787,NL,"[361, 860, 362, 877]",MISC
788,-,"[361, 860, 362, 877]",MISC
789,DE,"[62, 912, 199, 930]",B-others_heading
790,##CL,"[62, 912, 199, 930]",I-others_heading
791,##AR,"[62, 912, 199, 930]",I-others_heading
792,##AT,"[62, 912, 199, 930]",I-others_heading
793,##ION,"[62, 912, 199, 930]",I-others_heading
794,-,"[199, 912, 201, 930]",MISC
795,NL,"[199, 912, 201, 930]",MISC
796,-,"[199, 912, 201, 930]",MISC
797,I,"[62, 947, 72, 965]",MISC
798,here,"[73, 947, 139, 965]",MISC
799,##by,"[73, 947, 139, 965]",MISC
800,declare,"[139, 947, 215, 965]",MISC
801,that,"[216, 947, 259, 965]",MISC
802,the,"[260, 947, 293, 965]",MISC
803,information,"[293, 947, 413, 965]",MISC
804,furnished,"[414, 947, 513, 965]",MISC
805,above,"[513, 947, 567, 965]",MISC
806,is,"[568, 947, 589, 965]",MISC
807,true,"[590, 947, 633, 965]",MISC
808,to,"[634, 947, 655, 965]",MISC
809,the,"[656, 947, 689, 965]",MISC
810,best,"[689, 947, 732, 965]",MISC
811,of,"[733, 947, 754, 965]",MISC
812,my,"[755, 947, 776, 965]",MISC
813,Knowledge,"[777, 947, 886, 965]",MISC
814,.,"[777, 947, 886, 965]",MISC
815,-,"[887, 947, 888, 965]",MISC
816,NL,"[887, 947, 888, 965]",MISC
817,-,"[887, 947, 888, 965]",MISC
818,AR,"[854, 982, 909, 1000]",MISC
819,##IF,"[854, 982, 909, 1000]",MISC
820,ME,"[909, 982, 979, 1000]",MISC
821,##MO,"[909, 982, 979, 1000]",MISC
822,##N,"[909, 982, 979, 1000]",MISC
823,-,"[979, 982, 980, 1000]",MISC
824,NL,"[979, 982, 980, 1000]",MISC
825,-,"[979, 982, 980, 1000]",MISC
