,token,box,label
0,t,"[65, 19, 97, 34]",MISC
1,##te,"[65, 19, 97, 34]",MISC
2,-,"[97, 19, 98, 34]",MISC
3,NL,"[97, 19, 98, 34]",MISC
4,-,"[97, 19, 98, 34]",MISC
5,E,"[441, 23, 525, 41]",B-name
6,##shi,"[441, 23, 525, 41]",I-name
7,##ta,"[441, 23, 525, 41]",I-name
8,math,"[525, 23, 608, 41]",I-name
9,##ur,"[525, 23, 608, 41]",I-name
10,-,"[608, 23, 610, 41]",MISC
11,NL,"[608, 23, 610, 41]",MISC
12,-,"[608, 23, 610, 41]",MISC
13,Cell,"[86, 44, 123, 59]",MISC
14,#,"[124, 44, 132, 59]",MISC
15,91,"[133, 44, 254, 59]",B-phones_phone
16,-,"[133, 44, 254, 59]",I-phones_phone
17,89,"[133, 44, 254, 59]",I-phones_phone
18,##51,"[133, 44, 254, 59]",I-phones_phone
19,##6,"[133, 44, 254, 59]",I-phones_phone
20,##29,"[133, 44, 254, 59]",I-phones_phone
21,##8,"[133, 44, 254, 59]",I-phones_phone
22,##7,"[133, 44, 254, 59]",I-phones_phone
23,##8,"[133, 44, 254, 59]",I-phones_phone
24,/,"[255, 44, 264, 59]",MISC
25,Em,"[264, 44, 320, 59]",MISC
26,##ail,"[264, 44, 320, 59]",MISC
27,:,"[264, 44, 320, 59]",MISC
28,es,"[321, 44, 555, 59]",B-emails_email
29,##hita,"[321, 44, 555, 59]",I-emails_email
30,.,"[321, 44, 555, 59]",I-emails_email
31,math,"[321, 44, 555, 59]",I-emails_email
32,##ur,"[321, 44, 555, 59]",I-emails_email
33,##19,"[321, 44, 555, 59]",I-emails_email
34,@,"[321, 44, 555, 59]",I-emails_email
35,g,"[321, 44, 555, 59]",I-emails_email
36,##mail,"[321, 44, 555, 59]",I-emails_email
37,.,"[321, 44, 555, 59]",I-emails_email
38,com,"[321, 44, 555, 59]",I-emails_email
39,/,"[555, 44, 564, 59]",MISC
40,G,"[564, 44, 592, 59]",MISC
41,##it,"[564, 44, 592, 59]",MISC
42,Hu,"[593, 44, 629, 59]",MISC
43,##b,"[593, 44, 629, 59]",MISC
44,:,"[593, 44, 629, 59]",MISC
45,https,"[630, 44, 883, 59]",MISC
46,:,"[630, 44, 883, 59]",MISC
47,/,"[630, 44, 883, 59]",MISC
48,/,"[630, 44, 883, 59]",MISC
49,g,"[630, 44, 883, 59]",MISC
50,##ith,"[630, 44, 883, 59]",MISC
51,##ub,"[630, 44, 883, 59]",MISC
52,.,"[630, 44, 883, 59]",MISC
53,com,"[630, 44, 883, 59]",MISC
54,/,"[630, 44, 883, 59]",MISC
55,es,"[630, 44, 883, 59]",MISC
56,##hita,"[630, 44, 883, 59]",MISC
57,##19,"[630, 44, 883, 59]",MISC
58,-,"[883, 44, 885, 59]",MISC
59,NL,"[883, 44, 885, 59]",MISC
60,-,"[883, 44, 885, 59]",MISC
61,AB,"[93, 107, 161, 119]",MISC
62,##O,"[93, 107, 161, 119]",MISC
63,##UT,"[93, 107, 161, 119]",MISC
64,ME,"[161, 107, 187, 119]",MISC
65,-,"[188, 107, 190, 119]",MISC
66,NL,"[188, 107, 190, 119]",MISC
67,-,"[188, 107, 190, 119]",MISC
68,Excellent,"[114, 131, 190, 146]",MISC
69,communication,"[191, 131, 310, 146]",MISC
70,",","[191, 131, 310, 146]",MISC
71,analytical,"[310, 131, 404, 146]",MISC
72,",","[310, 131, 404, 146]",MISC
73,inter,"[404, 131, 524, 146]",MISC
74,##person,"[404, 131, 524, 146]",MISC
75,##al,"[404, 131, 524, 146]",MISC
76,",","[404, 131, 524, 146]",MISC
77,and,"[524, 131, 548, 146]",MISC
78,presentation,"[549, 131, 652, 146]",MISC
79,skills,"[652, 131, 711, 146]",MISC
80,.,"[652, 131, 711, 146]",MISC
81,-,"[712, 131, 714, 146]",MISC
82,NL,"[712, 131, 714, 146]",MISC
83,-,"[712, 131, 714, 146]",MISC
84,8,"[115, 146, 142, 162]",MISC
85,.,"[115, 146, 142, 162]",MISC
86,5,"[115, 146, 142, 162]",MISC
87,Years,"[143, 146, 188, 162]",MISC
88,of,"[189, 146, 207, 162]",MISC
89,Experience,"[208, 146, 300, 162]",MISC
90,in,"[301, 146, 318, 162]",MISC
91,IT,"[320, 146, 337, 162]",MISC
92,Service,"[338, 146, 403, 162]",MISC
93,as,"[404, 146, 421, 162]",MISC
94,a,"[422, 146, 431, 162]",MISC
95,Full,"[432, 146, 468, 162]",MISC
96,stack,"[469, 146, 514, 162]",MISC
97,software,"[516, 146, 590, 162]",MISC
98,developer,"[590, 146, 674, 162]",MISC
99,and,"[674, 146, 702, 162]",MISC
100,designer,"[702, 146, 786, 162]",MISC
101,.,"[702, 146, 786, 162]",MISC
102,-,"[786, 146, 788, 162]",MISC
103,NL,"[786, 146, 788, 162]",MISC
104,-,"[786, 146, 788, 162]",MISC
105,Strong,"[115, 162, 170, 179]",MISC
106,knowledge,"[171, 162, 254, 179]",MISC
107,in,"[255, 162, 272, 179]",MISC
108,J,"[273, 162, 318, 179]",MISC
109,##AV,"[273, 162, 318, 179]",MISC
110,##A,"[273, 162, 318, 179]",MISC
111,",","[273, 162, 318, 179]",MISC
112,J,"[320, 162, 365, 179]",MISC
113,##2,"[320, 162, 365, 179]",MISC
114,##EE,"[320, 162, 365, 179]",MISC
115,",","[320, 162, 365, 179]",MISC
116,J,"[367, 162, 431, 179]",MISC
117,##A,"[367, 162, 431, 179]",MISC
118,##X,"[367, 162, 431, 179]",MISC
119,-,"[367, 162, 431, 179]",MISC
120,RS,"[367, 162, 431, 179]",MISC
121,",","[367, 162, 431, 179]",MISC
122,Java,"[432, 162, 534, 179]",MISC
123,##s,"[432, 162, 534, 179]",MISC
124,##cript,"[432, 162, 534, 179]",MISC
125,",","[432, 162, 534, 179]",MISC
126,Ang,"[534, 162, 599, 179]",MISC
127,##ular,"[534, 162, 599, 179]",MISC
128,J,"[600, 162, 617, 179]",MISC
129,##S,"[600, 162, 617, 179]",MISC
130,and,"[618, 162, 646, 179]",MISC
131,Python,"[646, 162, 711, 179]",MISC
132,.,"[646, 162, 711, 179]",MISC
133,-,"[712, 162, 714, 179]",MISC
134,NL,"[712, 162, 714, 179]",MISC
135,-,"[712, 162, 714, 179]",MISC
136,Clear,"[115, 179, 160, 197]",MISC
137,understanding,"[161, 179, 281, 197]",MISC
138,of,"[282, 179, 300, 197]",MISC
139,Software,"[301, 179, 375, 197]",MISC
140,Development,"[375, 179, 478, 197]",MISC
141,Life,"[478, 179, 514, 197]",MISC
142,Cycle,"[515, 179, 626, 197]",MISC
143,(,"[515, 179, 626, 197]",MISC
144,SD,"[515, 179, 626, 197]",MISC
145,##LC,"[515, 179, 626, 197]",MISC
146,),"[515, 179, 626, 197]",MISC
147,.,"[515, 179, 626, 197]",MISC
148,-,"[627, 179, 629, 197]",MISC
149,NL,"[627, 179, 629, 197]",MISC
150,-,"[627, 179, 629, 197]",MISC
151,Hard,"[116, 198, 155, 211]",MISC
152,working,"[157, 198, 228, 211]",MISC
153,&,"[229, 198, 238, 211]",MISC
154,Well,"[240, 198, 279, 211]",MISC
155,motivated,"[281, 198, 383, 211]",MISC
156,.,"[281, 198, 383, 211]",MISC
157,-,"[384, 198, 386, 211]",MISC
158,NL,"[384, 198, 386, 211]",MISC
159,-,"[384, 198, 386, 211]",MISC
160,Good,"[115, 213, 153, 226]",MISC
161,team,"[153, 213, 191, 226]",MISC
162,player,"[192, 213, 306, 226]",MISC
163,",","[192, 213, 306, 226]",MISC
164,Quick,"[192, 213, 306, 226]",MISC
165,learn,"[307, 213, 384, 226]",MISC
166,##er,"[307, 213, 384, 226]",MISC
167,.,"[307, 213, 384, 226]",MISC
168,-,"[384, 213, 386, 226]",MISC
169,NL,"[384, 213, 386, 226]",MISC
170,-,"[384, 213, 386, 226]",MISC
171,Will,"[114, 227, 213, 242]",MISC
172,##ing,"[114, 227, 213, 242]",MISC
173,##ness,"[114, 227, 213, 242]",MISC
174,to,"[213, 227, 231, 242]",MISC
175,learn,"[231, 227, 285, 242]",MISC
176,",","[231, 227, 285, 242]",MISC
177,to,"[285, 227, 303, 242]",MISC
178,perform,"[303, 227, 366, 242]",MISC
179,&,"[366, 227, 375, 242]",MISC
180,take,"[375, 227, 410, 242]",MISC
181,on,"[411, 227, 429, 242]",MISC
182,responsibilities,"[429, 227, 573, 242]",MISC
183,and,"[574, 227, 600, 242]",MISC
184,challenges,"[601, 227, 699, 242]",MISC
185,.,"[601, 227, 699, 242]",MISC
186,-,"[700, 227, 701, 242]",MISC
187,NL,"[700, 227, 701, 242]",MISC
188,-,"[700, 227, 701, 242]",MISC
189,PR,"[93, 256, 230, 268]",B-work_experience_heading
190,##O,"[93, 256, 230, 268]",I-work_experience_heading
191,##F,"[93, 256, 230, 268]",I-work_experience_heading
192,##ES,"[93, 256, 230, 268]",I-work_experience_heading
193,##SI,"[93, 256, 230, 268]",I-work_experience_heading
194,##ON,"[93, 256, 230, 268]",I-work_experience_heading
195,##AL,"[93, 256, 230, 268]",I-work_experience_heading
196,E,"[230, 256, 343, 268]",I-work_experience_heading
197,##X,"[230, 256, 343, 268]",I-work_experience_heading
198,##P,"[230, 256, 343, 268]",I-work_experience_heading
199,##ER,"[230, 256, 343, 268]",I-work_experience_heading
200,##IE,"[230, 256, 343, 268]",I-work_experience_heading
201,##NC,"[230, 256, 343, 268]",I-work_experience_heading
202,##E,"[230, 256, 343, 268]",I-work_experience_heading
203,-,"[344, 256, 346, 268]",MISC
204,NL,"[344, 256, 346, 268]",MISC
205,-,"[344, 256, 346, 268]",MISC
206,Senior,"[93, 304, 149, 316]",B-employer_role
207,Software,"[150, 304, 224, 316]",I-employer_role
208,Engineer,"[225, 304, 299, 316]",I-employer_role
209,–,"[300, 304, 309, 316]",MISC
210,C,"[309, 304, 356, 316]",B-employer_company_name
211,##isco,"[309, 304, 356, 316]",I-employer_company_name
212,-,"[357, 304, 358, 316]",MISC
213,NL,"[357, 304, 358, 316]",MISC
214,-,"[357, 304, 358, 316]",MISC
215,April,"[811, 304, 856, 316]",MISC
216,2016,"[856, 304, 890, 316]",MISC
217,–,"[892, 304, 901, 316]",MISC
218,Till,"[901, 304, 936, 316]",MISC
219,-,"[937, 304, 939, 316]",MISC
220,NL,"[937, 304, 939, 316]",MISC
221,-,"[937, 304, 939, 316]",MISC
222,Date,"[811, 321, 847, 333]",MISC
223,-,"[847, 321, 849, 333]",MISC
224,NL,"[847, 321, 849, 333]",MISC
225,-,"[847, 321, 849, 333]",MISC
226,Project,"[74, 349, 129, 363]",MISC
227,Det,"[130, 349, 192, 363]",MISC
228,##ails,"[130, 349, 192, 363]",MISC
229,:,"[130, 349, 192, 363]",MISC
230,-,"[194, 349, 195, 363]",MISC
231,NL,"[194, 349, 195, 363]",MISC
232,-,"[194, 349, 195, 363]",MISC
233,Period,"[202, 366, 266, 380]",MISC
234,:,"[202, 366, 266, 380]",MISC
235,April,"[267, 366, 312, 380]",MISC
236,2016,"[313, 366, 349, 380]",MISC
237,–,"[350, 366, 358, 380]",MISC
238,Till,"[359, 366, 395, 380]",MISC
239,Date,"[396, 366, 432, 380]",MISC
240,-,"[433, 366, 435, 380]",MISC
241,NL,"[433, 366, 435, 380]",MISC
242,-,"[433, 366, 435, 380]",MISC
243,Project,"[202, 384, 263, 397]",MISC
244,Name,"[263, 384, 306, 397]",MISC
245,:,"[263, 384, 306, 397]",MISC
246,C,"[306, 384, 350, 397]",B-employer_company_name
247,##isco,"[306, 384, 350, 397]",I-employer_company_name
248,Unified,"[350, 384, 410, 397]",MISC
249,Intelligence,"[410, 384, 514, 397]",MISC
250,center,"[514, 384, 566, 397]",MISC
251,-,"[566, 384, 568, 397]",MISC
252,NL,"[566, 384, 568, 397]",MISC
253,-,"[566, 384, 568, 397]",MISC
254,Team,"[202, 400, 240, 413]",MISC
255,size,"[240, 400, 287, 413]",MISC
256,:,"[240, 400, 287, 413]",MISC
257,4,"[288, 400, 297, 413]",MISC
258,-,"[298, 400, 299, 413]",MISC
259,NL,"[298, 400, 299, 413]",MISC
260,-,"[298, 400, 299, 413]",MISC
261,Role,"[202, 417, 244, 431]",MISC
262,:,"[202, 417, 244, 431]",MISC
263,Full,"[245, 417, 278, 431]",MISC
264,stack,"[280, 417, 321, 431]",MISC
265,developer,"[323, 417, 399, 431]",MISC
266,-,"[400, 417, 402, 431]",MISC
267,NL,"[400, 417, 402, 431]",MISC
268,-,"[400, 417, 402, 431]",MISC
269,Des,"[74, 433, 169, 447]",MISC
270,##cription,"[74, 433, 169, 447]",MISC
271,:,"[74, 433, 169, 447]",MISC
272,-,"[169, 433, 171, 447]",MISC
273,NL,"[169, 433, 171, 447]",MISC
274,-,"[169, 433, 171, 447]",MISC
275,A,"[140, 450, 149, 464]",MISC
276,reporting,"[149, 450, 227, 464]",MISC
277,application,"[228, 450, 325, 464]",MISC
278,for,"[325, 450, 351, 464]",MISC
279,Super,"[352, 450, 438, 464]",MISC
280,##visor,"[352, 450, 438, 464]",MISC
281,and,"[440, 450, 466, 464]",MISC
282,agents,"[467, 450, 519, 464]",MISC
283,in,"[520, 450, 537, 464]",MISC
284,Call,"[537, 450, 572, 464]",MISC
285,center,"[573, 450, 625, 464]",MISC
286,product,"[626, 450, 695, 464]",MISC
287,.,"[626, 450, 695, 464]",MISC
288,-,"[696, 450, 698, 464]",MISC
289,NL,"[696, 450, 698, 464]",MISC
290,-,"[696, 450, 698, 464]",MISC
291,Role,"[74, 474, 116, 487]",MISC
292,##s,"[74, 474, 116, 487]",MISC
293,and,"[116, 474, 140, 487]",MISC
294,Re,"[141, 474, 283, 487]",MISC
295,##sp,"[141, 474, 283, 487]",MISC
296,##ons,"[141, 474, 283, 487]",MISC
297,##ibi,"[141, 474, 283, 487]",MISC
298,##lities,"[141, 474, 283, 487]",MISC
299,:,"[141, 474, 283, 487]",MISC
300,-,"[284, 474, 285, 487]",MISC
301,NL,"[284, 474, 285, 487]",MISC
302,-,"[284, 474, 285, 487]",MISC
303,Work,"[116, 487, 180, 504]",MISC
304,##ed,"[116, 487, 180, 504]",MISC
305,on,"[181, 487, 201, 504]",MISC
306,stories,"[202, 487, 277, 504]",MISC
307,as,"[278, 487, 298, 504]",MISC
308,a,"[299, 487, 310, 504]",MISC
309,member,"[310, 487, 374, 504]",MISC
310,of,"[375, 487, 395, 504]",MISC
311,s,"[396, 487, 450, 504]",MISC
312,##c,"[396, 487, 450, 504]",MISC
313,##rum,"[396, 487, 450, 504]",MISC
314,team,"[450, 487, 504, 504]",MISC
315,.,"[450, 487, 504, 504]",MISC
316,-,"[504, 487, 506, 504]",MISC
317,NL,"[504, 487, 506, 504]",MISC
318,-,"[504, 487, 506, 504]",MISC
319,Independent,"[115, 504, 240, 522]",MISC
320,##ly,"[115, 504, 240, 522]",MISC
321,worked,"[240, 504, 297, 522]",MISC
322,on,"[298, 504, 317, 522]",MISC
323,Design,"[317, 504, 383, 522]",MISC
324,",","[317, 504, 383, 522]",MISC
325,development,"[385, 504, 490, 522]",MISC
326,and,"[490, 504, 518, 522]",MISC
327,executing,"[519, 504, 606, 522]",MISC
328,test,"[606, 504, 644, 522]",MISC
329,plan,"[645, 504, 691, 522]",MISC
330,.,"[645, 504, 691, 522]",MISC
331,-,"[693, 504, 694, 522]",MISC
332,NL,"[693, 504, 694, 522]",MISC
333,-,"[693, 504, 694, 522]",MISC
334,I,"[115, 522, 217, 538]",MISC
335,##mple,"[115, 522, 217, 538]",MISC
336,##mented,"[115, 522, 217, 538]",MISC
337,R,"[218, 522, 255, 538]",MISC
338,##ES,"[218, 522, 255, 538]",MISC
339,##T,"[218, 522, 255, 538]",MISC
340,API,"[256, 522, 292, 538]",MISC
341,##s,"[256, 522, 292, 538]",MISC
342,for,"[293, 522, 321, 538]",MISC
343,various,"[322, 522, 388, 538]",MISC
344,features,"[388, 522, 462, 538]",MISC
345,using,"[463, 522, 510, 538]",MISC
346,jersey,"[510, 522, 576, 538]",MISC
347,.,"[510, 522, 576, 538]",MISC
348,Used,"[576, 522, 612, 538]",MISC
349,Post,"[613, 522, 679, 538]",MISC
350,##man,"[613, 522, 679, 538]",MISC
351,to,"[679, 522, 697, 538]",MISC
352,test,"[698, 522, 735, 538]",MISC
353,R,"[736, 522, 772, 538]",MISC
354,##ES,"[736, 522, 772, 538]",MISC
355,##T,"[736, 522, 772, 538]",MISC
356,API,"[773, 522, 801, 538]",MISC
357,extensively,"[802, 522, 914, 538]",MISC
358,.,"[802, 522, 914, 538]",MISC
359,-,"[915, 522, 916, 538]",MISC
360,NL,"[915, 522, 916, 538]",MISC
361,-,"[915, 522, 916, 538]",MISC
362,Created,"[115, 538, 183, 555]",MISC
363,U,"[184, 538, 203, 555]",MISC
364,##I,"[184, 538, 203, 555]",MISC
365,using,"[204, 538, 252, 555]",MISC
366,Ang,"[253, 538, 320, 555]",MISC
367,##ular,"[253, 538, 320, 555]",MISC
368,J,"[322, 538, 341, 555]",MISC
369,##S,"[322, 538, 341, 555]",MISC
370,1,"[341, 538, 380, 555]",MISC
371,.,"[341, 538, 380, 555]",MISC
372,4,"[341, 538, 380, 555]",MISC
373,.,"[341, 538, 380, 555]",MISC
374,-,"[381, 538, 383, 555]",MISC
375,NL,"[381, 538, 383, 555]",MISC
376,-,"[381, 538, 383, 555]",MISC
377,Work,"[115, 555, 170, 572]",MISC
378,##ed,"[115, 555, 170, 572]",MISC
379,on,"[171, 555, 188, 572]",MISC
380,upgrade,"[189, 555, 253, 572]",MISC
381,scripts,"[255, 555, 319, 572]",MISC
382,which,"[320, 555, 365, 572]",MISC
383,involved,"[367, 555, 441, 572]",MISC
384,p,"[442, 555, 506, 572]",MISC
385,##yt,"[442, 555, 506, 572]",MISC
386,##hon,"[442, 555, 506, 572]",MISC
387,",","[442, 555, 506, 572]",MISC
388,sq,"[507, 555, 535, 572]",MISC
389,##l,"[507, 555, 535, 572]",MISC
390,and,"[535, 555, 563, 572]",MISC
391,shell,"[563, 555, 608, 572]",MISC
392,script,"[610, 555, 702, 572]",MISC
393,##ing,"[610, 555, 702, 572]",MISC
394,.,"[610, 555, 702, 572]",MISC
395,-,"[703, 555, 705, 572]",MISC
396,NL,"[703, 555, 705, 572]",MISC
397,-,"[703, 555, 705, 572]",MISC
398,Skills,"[74, 592, 126, 605]",MISC
399,Used,"[126, 592, 161, 605]",MISC
400,:,"[161, 592, 170, 605]",MISC
401,Core,"[170, 592, 205, 605]",MISC
402,Java,"[205, 592, 248, 605]",MISC
403,",","[205, 592, 248, 605]",MISC
404,J,"[249, 592, 309, 605]",MISC
405,##A,"[249, 592, 309, 605]",MISC
406,##X,"[249, 592, 309, 605]",MISC
407,-,"[249, 592, 309, 605]",MISC
408,RS,"[249, 592, 309, 605]",MISC
409,",","[249, 592, 309, 605]",MISC
410,J,"[310, 592, 353, 605]",MISC
411,##2,"[310, 592, 353, 605]",MISC
412,##EE,"[310, 592, 353, 605]",MISC
413,",","[310, 592, 353, 605]",MISC
414,Java,"[353, 592, 440, 605]",MISC
415,##s,"[353, 592, 440, 605]",MISC
416,##cript,"[353, 592, 440, 605]",MISC
417,E,"[441, 592, 475, 605]",MISC
418,##S,"[441, 592, 475, 605]",MISC
419,##6,"[441, 592, 475, 605]",MISC
420,",","[441, 592, 475, 605]",MISC
421,Ang,"[475, 592, 536, 605]",MISC
422,##ular,"[475, 592, 536, 605]",MISC
423,J,"[537, 592, 563, 605]",MISC
424,##S,"[537, 592, 563, 605]",MISC
425,",","[537, 592, 563, 605]",MISC
426,Python,"[563, 592, 623, 605]",MISC
427,",","[563, 592, 623, 605]",MISC
428,S,"[624, 592, 650, 605]",MISC
429,##QL,"[624, 592, 650, 605]",MISC
430,and,"[650, 592, 676, 605]",MISC
431,Shell,"[676, 592, 720, 605]",MISC
432,script,"[720, 592, 807, 605]",MISC
433,##ing,"[720, 592, 807, 605]",MISC
434,.,"[720, 592, 807, 605]",MISC
435,-,"[807, 592, 809, 605]",MISC
436,NL,"[807, 592, 809, 605]",MISC
437,-,"[807, 592, 809, 605]",MISC
438,Too,"[74, 608, 117, 621]",MISC
439,##ls,"[74, 608, 117, 621]",MISC
440,Used,"[118, 608, 162, 621]",MISC
441,:,"[118, 608, 162, 621]",MISC
442,Eclipse,"[163, 608, 232, 621]",MISC
443,",","[163, 608, 232, 621]",MISC
444,Sub,"[234, 608, 303, 621]",MISC
445,##lim,"[234, 608, 303, 621]",MISC
446,##e,"[234, 608, 303, 621]",MISC
447,",","[234, 608, 303, 621]",MISC
448,Post,"[305, 608, 374, 621]",MISC
449,##man,"[305, 608, 374, 621]",MISC
450,.,"[305, 608, 374, 621]",MISC
451,-,"[376, 608, 377, 621]",MISC
452,NL,"[376, 608, 377, 621]",MISC
453,-,"[376, 608, 377, 621]",MISC
454,Senior,"[93, 651, 124, 681]",B-employer_role
455,Software,"[124, 651, 166, 681]",I-employer_role
456,Engineer,"[166, 651, 207, 681]",I-employer_role
457,–,"[207, 651, 213, 681]",MISC
458,Co,"[213, 651, 259, 681]",B-employer_company_name
459,##gni,"[213, 651, 259, 681]",I-employer_company_name
460,##zan,"[213, 651, 259, 681]",I-employer_company_name
461,##t,"[213, 651, 259, 681]",I-employer_company_name
462,Technology,"[259, 651, 311, 681]",MISC
463,Solutions,"[311, 651, 358, 681]",MISC
464,P,"[358, 651, 374, 681]",MISC
465,##v,"[358, 651, 374, 681]",MISC
466,##t,"[358, 651, 374, 681]",MISC
467,Ltd,"[374, 651, 395, 681]",MISC
468,.,"[374, 651, 395, 681]",MISC
469,-,"[395, 651, 396, 681]",MISC
470,NL,"[395, 651, 396, 681]",MISC
471,-,"[395, 651, 396, 681]",MISC
472,C,"[443, 651, 504, 663]",MISC
473,##lient,"[443, 651, 504, 663]",MISC
474,:,"[505, 651, 513, 663]",MISC
475,AN,"[515, 651, 544, 663]",MISC
476,##Z,"[515, 651, 544, 663]",MISC
477,-,"[545, 651, 547, 663]",MISC
478,NL,"[545, 651, 547, 663]",MISC
479,-,"[545, 651, 547, 663]",MISC
480,Sept,"[811, 651, 850, 663]",MISC
481,2014,"[851, 651, 891, 663]",MISC
482,–,"[892, 651, 900, 663]",MISC
483,March,"[902, 651, 952, 663]",MISC
484,-,"[953, 651, 954, 663]",MISC
485,NL,"[953, 651, 954, 663]",MISC
486,-,"[953, 651, 954, 663]",MISC
487,Financial,"[443, 667, 521, 681]",MISC
488,Services,"[521, 667, 590, 681]",MISC
489,(,"[590, 667, 668, 681]",MISC
490,Banking,"[590, 667, 668, 681]",MISC
491,),"[590, 667, 668, 681]",MISC
492,-,"[668, 667, 670, 681]",MISC
493,NL,"[668, 667, 670, 681]",MISC
494,-,"[668, 667, 670, 681]",MISC
495,2016,"[811, 667, 845, 681]",MISC
496,-,"[845, 667, 847, 681]",MISC
497,NL,"[845, 667, 847, 681]",MISC
498,-,"[845, 667, 847, 681]",MISC
499,Project,"[74, 708, 129, 721]",MISC
500,Det,"[130, 708, 192, 721]",MISC
501,##ails,"[130, 708, 192, 721]",MISC
502,:,"[130, 708, 192, 721]",MISC
503,-,"[194, 708, 195, 721]",MISC
504,NL,"[194, 708, 195, 721]",MISC
505,-,"[194, 708, 195, 721]",MISC
506,Period,"[202, 725, 272, 738]",MISC
507,:,"[202, 725, 272, 738]",MISC
508,Sept,"[273, 725, 312, 738]",MISC
509,2014,"[313, 725, 353, 738]",MISC
510,–,"[353, 725, 362, 738]",MISC
511,July,"[363, 725, 403, 738]",MISC
512,2015,"[403, 725, 443, 738]",MISC
513,-,"[443, 725, 445, 738]",MISC
514,NL,"[443, 725, 445, 738]",MISC
515,-,"[443, 725, 445, 738]",MISC
516,Project,"[202, 742, 265, 756]",MISC
517,Name,"[266, 742, 311, 756]",MISC
518,:,"[266, 742, 311, 756]",MISC
519,Digital,"[312, 742, 374, 756]",MISC
520,Channel,"[376, 742, 438, 756]",MISC
521,En,"[440, 742, 530, 756]",MISC
522,##able,"[440, 742, 530, 756]",MISC
523,##ment,"[440, 742, 530, 756]",MISC
524,-,"[532, 742, 533, 756]",MISC
525,NL,"[532, 742, 533, 756]",MISC
526,-,"[532, 742, 533, 756]",MISC
527,Team,"[199, 758, 237, 772]",MISC
528,size,"[237, 758, 284, 772]",MISC
529,:,"[237, 758, 284, 772]",MISC
530,2,"[285, 758, 293, 772]",MISC
531,-,"[294, 758, 296, 772]",MISC
532,NL,"[294, 758, 296, 772]",MISC
533,-,"[294, 758, 296, 772]",MISC
534,Role,"[202, 775, 249, 789]",MISC
535,:,"[202, 775, 249, 789]",MISC
536,Java,"[249, 775, 286, 789]",MISC
537,Designer,"[287, 775, 362, 789]",MISC
538,&,"[363, 775, 371, 789]",MISC
539,Dev,"[372, 775, 457, 789]",MISC
540,##elo,"[372, 775, 457, 789]",MISC
541,##per,"[372, 775, 457, 789]",MISC
542,-,"[457, 775, 459, 789]",MISC
543,NL,"[457, 775, 459, 789]",MISC
544,-,"[457, 775, 459, 789]",MISC
545,Des,"[74, 791, 169, 805]",MISC
546,##cription,"[74, 791, 169, 805]",MISC
547,:,"[74, 791, 169, 805]",MISC
548,-,"[169, 791, 171, 805]",MISC
549,NL,"[169, 791, 171, 805]",MISC
550,-,"[169, 791, 171, 805]",MISC
551,A,"[140, 809, 149, 822]",MISC
552,site,"[149, 809, 185, 822]",MISC
553,which,"[185, 809, 230, 822]",MISC
554,provides,"[231, 809, 304, 822]",MISC
555,platform,"[304, 809, 377, 822]",MISC
556,for,"[377, 809, 403, 822]",MISC
557,Bank,"[404, 809, 440, 822]",MISC
558,employees,"[441, 809, 522, 822]",MISC
559,to,"[522, 809, 540, 822]",MISC
560,support,"[541, 809, 603, 822]",MISC
561,internet,"[604, 809, 677, 822]",MISC
562,banking,"[677, 809, 740, 822]",MISC
563,application,"[741, 809, 850, 822]",MISC
564,.,"[741, 809, 850, 822]",MISC
565,-,"[850, 809, 852, 822]",MISC
566,NL,"[850, 809, 852, 822]",MISC
567,-,"[850, 809, 852, 822]",MISC
568,Role,"[74, 832, 116, 846]",MISC
569,##s,"[74, 832, 116, 846]",MISC
570,and,"[116, 832, 140, 846]",MISC
571,Re,"[141, 832, 283, 846]",MISC
572,##sp,"[141, 832, 283, 846]",MISC
573,##ons,"[141, 832, 283, 846]",MISC
574,##ibi,"[141, 832, 283, 846]",MISC
575,##lities,"[141, 832, 283, 846]",MISC
576,:,"[141, 832, 283, 846]",MISC
577,-,"[284, 832, 285, 846]",MISC
578,NL,"[284, 832, 285, 846]",MISC
579,-,"[284, 832, 285, 846]",MISC
580,Ana,"[114, 846, 196, 863]",MISC
581,##ly,"[114, 846, 196, 863]",MISC
582,##zing,"[114, 846, 196, 863]",MISC
583,use,"[196, 846, 222, 863]",MISC
584,cases,"[224, 846, 269, 863]",MISC
585,in,"[269, 846, 287, 863]",MISC
586,functional,"[287, 846, 378, 863]",MISC
587,specification,"[378, 846, 496, 863]",MISC
588,document,"[497, 846, 570, 863]",MISC
589,and,"[570, 846, 596, 863]",MISC
590,interacting,"[597, 846, 696, 863]",MISC
591,with,"[697, 846, 734, 863]",MISC
592,the,"[734, 846, 760, 863]",MISC
593,Business,"[761, 846, 834, 863]",MISC
594,analysts,"[834, 846, 907, 863]",MISC
595,to,"[907, 846, 924, 863]",MISC
596,-,"[925, 846, 927, 863]",MISC
597,NL,"[925, 846, 927, 863]",MISC
598,-,"[925, 846, 927, 863]",MISC
599,resolve,"[136, 865, 192, 879]",MISC
600,que,"[193, 865, 257, 879]",MISC
601,##ries,"[193, 865, 257, 879]",MISC
602,.,"[193, 865, 257, 879]",MISC
603,-,"[258, 865, 259, 879]",MISC
604,NL,"[258, 865, 259, 879]",MISC
605,-,"[258, 865, 259, 879]",MISC
606,Dev,"[115, 879, 202, 896]",MISC
607,##el,"[115, 879, 202, 896]",MISC
608,##ping,"[115, 879, 202, 896]",MISC
609,application,"[203, 879, 311, 896]",MISC
610,modules,"[311, 879, 378, 896]",MISC
611,end,"[379, 879, 407, 896]",MISC
612,to,"[409, 879, 428, 896]",MISC
613,end,"[428, 879, 466, 896]",MISC
614,.,"[428, 879, 466, 896]",MISC
615,-,"[467, 879, 469, 896]",MISC
616,NL,"[467, 879, 469, 896]",MISC
617,-,"[467, 879, 469, 896]",MISC
618,Fi,"[116, 896, 176, 913]",MISC
619,##xing,"[116, 896, 176, 913]",MISC
620,bugs,"[178, 896, 217, 913]",MISC
621,raised,"[219, 896, 280, 913]",MISC
622,by,"[281, 896, 300, 913]",MISC
623,Q,"[302, 896, 321, 913]",MISC
624,##A,"[302, 896, 321, 913]",MISC
625,team,"[322, 896, 372, 913]",MISC
626,.,"[322, 896, 372, 913]",MISC
627,-,"[374, 896, 376, 913]",MISC
628,NL,"[374, 896, 376, 913]",MISC
629,-,"[374, 896, 376, 913]",MISC
630,Skills,"[74, 933, 131, 947]",MISC
631,Used,"[131, 933, 169, 947]",MISC
632,:,"[169, 933, 178, 947]",MISC
633,Core,"[179, 933, 217, 947]",MISC
634,Java,"[217, 933, 264, 947]",MISC
635,",","[217, 933, 264, 947]",MISC
636,Spring,"[265, 933, 322, 947]",MISC
637,Core,"[322, 933, 369, 947]",MISC
638,",","[322, 933, 369, 947]",MISC
639,MV,"[370, 933, 397, 947]",MISC
640,##C,"[370, 933, 397, 947]",MISC
641,&,"[398, 933, 407, 947]",MISC
642,A,"[408, 933, 446, 947]",MISC
643,##OP,"[408, 933, 446, 947]",MISC
644,",","[408, 933, 446, 947]",MISC
645,Oracle,"[446, 933, 503, 947]",MISC
646,11,"[503, 933, 522, 947]",MISC
647,G,"[522, 933, 541, 947]",MISC
648,",","[522, 933, 541, 947]",MISC
649,J,"[541, 933, 598, 947]",MISC
650,##quer,"[541, 933, 598, 947]",MISC
651,##y,"[541, 933, 598, 947]",MISC
652,Core,"[598, 933, 636, 947]",MISC
653,&,"[636, 933, 645, 947]",MISC
654,Jasper,"[646, 933, 703, 947]",MISC
655,reports,"[703, 933, 779, 947]",MISC
656,.,"[703, 933, 779, 947]",MISC
657,-,"[779, 933, 781, 947]",MISC
658,NL,"[779, 933, 781, 947]",MISC
659,-,"[779, 933, 781, 947]",MISC
660,Too,"[74, 949, 121, 963]",MISC
661,##ls,"[74, 949, 121, 963]",MISC
662,Used,"[121, 949, 168, 963]",MISC
663,:,"[121, 949, 168, 963]",MISC
664,Eclipse,"[169, 949, 243, 963]",MISC
665,",","[169, 949, 243, 963]",MISC
666,WA,"[244, 949, 272, 963]",MISC
667,##S,"[244, 949, 272, 963]",MISC
668,7,"[272, 949, 328, 963]",MISC
669,",","[272, 949, 328, 963]",MISC
670,S,"[272, 949, 328, 963]",MISC
671,##OA,"[272, 949, 328, 963]",MISC
672,##P,"[272, 949, 328, 963]",MISC
673,U,"[329, 949, 357, 963]",MISC
674,##I,"[329, 949, 357, 963]",MISC
675,",","[329, 949, 357, 963]",MISC
676,Oracle,"[357, 949, 413, 963]",MISC
677,S,"[414, 949, 442, 963]",MISC
678,##QL,"[414, 949, 442, 963]",MISC
679,developer,"[443, 949, 527, 963]",MISC
680,&,"[528, 949, 536, 963]",MISC
681,Jasper,"[537, 949, 592, 963]",MISC
682,Studio,"[594, 949, 649, 963]",MISC
683,.,"[650, 949, 659, 963]",MISC
684,-,"[660, 949, 662, 963]",MISC
685,NL,"[660, 949, 662, 963]",MISC
686,-,"[660, 949, 662, 963]",MISC
687,Software,"[93, 19, 166, 33]",B-employer_role
688,Engineer,"[166, 19, 239, 33]",I-employer_role
689,–,"[239, 19, 248, 33]",MISC
690,A,"[248, 19, 330, 33]",MISC
691,##cc,"[248, 19, 330, 33]",MISC
692,##ent,"[248, 19, 330, 33]",MISC
693,##ure,"[248, 19, 330, 33]",MISC
694,services,"[330, 19, 403, 33]",MISC
695,-,"[403, 19, 405, 33]",MISC
696,NL,"[403, 19, 405, 33]",MISC
697,-,"[403, 19, 405, 33]",MISC
698,Financial,"[443, 19, 519, 33]",MISC
699,Services,"[519, 19, 587, 33]",MISC
700,(,"[587, 19, 679, 33]",MISC
701,Insurance,"[587, 19, 679, 33]",MISC
702,),"[587, 19, 679, 33]",MISC
703,-,"[681, 19, 682, 33]",MISC
704,NL,"[681, 19, 682, 33]",MISC
705,-,"[681, 19, 682, 33]",MISC
706,July,"[814, 19, 892, 33]",MISC
707,##20,"[814, 19, 892, 33]",MISC
708,##11,"[814, 19, 892, 33]",MISC
709,–,"[893, 19, 902, 33]",MISC
710,Aug,"[903, 19, 932, 33]",MISC
711,2014,"[932, 19, 970, 33]",MISC
712,-,"[972, 19, 974, 33]",MISC
713,NL,"[972, 19, 974, 33]",MISC
714,-,"[972, 19, 974, 33]",MISC
715,P,"[93, 36, 119, 49]",MISC
716,##v,"[93, 36, 119, 49]",MISC
717,##t,"[93, 36, 119, 49]",MISC
718,Ltd,"[119, 36, 154, 49]",MISC
719,.,"[119, 36, 154, 49]",MISC
720,-,"[154, 36, 155, 49]",MISC
721,NL,"[154, 36, 155, 49]",MISC
722,-,"[154, 36, 155, 49]",MISC
723,(,"[811, 36, 838, 49]",MISC
724,34,"[811, 36, 838, 49]",MISC
725,Month,"[839, 36, 903, 49]",MISC
726,##s,"[839, 36, 903, 49]",MISC
727,),"[839, 36, 903, 49]",MISC
728,-,"[904, 36, 906, 49]",MISC
729,NL,"[904, 36, 906, 49]",MISC
730,-,"[904, 36, 906, 49]",MISC
731,Project,"[74, 71, 129, 84]",MISC
732,Det,"[130, 71, 192, 84]",MISC
733,##ails,"[130, 71, 192, 84]",MISC
734,:,"[130, 71, 192, 84]",MISC
735,-,"[194, 71, 195, 84]",MISC
736,NL,"[194, 71, 195, 84]",MISC
737,-,"[194, 71, 195, 84]",MISC
738,Period,"[202, 89, 273, 103]",MISC
739,:,"[202, 89, 273, 103]",MISC
740,Jan,"[274, 89, 303, 103]",MISC
741,2014,"[304, 89, 344, 103]",MISC
742,–,"[345, 89, 353, 103]",MISC
743,July,"[355, 89, 395, 103]",MISC
744,a,"[396, 89, 404, 103]",MISC
745,2014,"[406, 89, 446, 103]",MISC
746,-,"[447, 89, 448, 103]",MISC
747,NL,"[447, 89, 448, 103]",MISC
748,-,"[447, 89, 448, 103]",MISC
749,Project,"[202, 105, 266, 119]",MISC
750,Name,"[267, 105, 312, 119]",MISC
751,:,"[267, 105, 312, 119]",MISC
752,Integrated,"[312, 105, 403, 119]",MISC
753,Cut,"[404, 105, 468, 119]",MISC
754,##omer,"[404, 105, 468, 119]",MISC
755,Platform,"[469, 105, 541, 119]",MISC
756,-,"[542, 105, 544, 119]",MISC
757,NL,"[542, 105, 544, 119]",MISC
758,-,"[542, 105, 544, 119]",MISC
759,Team,"[199, 123, 237, 136]",MISC
760,size,"[237, 123, 284, 136]",MISC
761,:,"[237, 123, 284, 136]",MISC
762,6,"[285, 123, 293, 136]",MISC
763,-,"[294, 123, 296, 136]",MISC
764,NL,"[294, 123, 296, 136]",MISC
765,-,"[294, 123, 296, 136]",MISC
766,Role,"[202, 139, 249, 152]",MISC
767,:,"[202, 139, 249, 152]",MISC
768,Java,"[249, 139, 286, 152]",MISC
769,Designer,"[287, 139, 362, 152]",MISC
770,&,"[363, 139, 371, 152]",MISC
771,Dev,"[372, 139, 457, 152]",MISC
772,##elo,"[372, 139, 457, 152]",MISC
773,##per,"[372, 139, 457, 152]",MISC
774,-,"[457, 139, 459, 152]",MISC
775,NL,"[457, 139, 459, 152]",MISC
776,-,"[457, 139, 459, 152]",MISC
777,Des,"[74, 156, 169, 169]",MISC
778,##cription,"[74, 156, 169, 169]",MISC
779,:,"[74, 156, 169, 169]",MISC
780,-,"[169, 156, 171, 169]",MISC
781,NL,"[169, 156, 171, 169]",MISC
782,-,"[169, 156, 171, 169]",MISC
783,A,"[140, 172, 149, 185]",MISC
784,site,"[149, 172, 186, 185]",MISC
785,which,"[187, 172, 232, 185]",MISC
786,provides,"[233, 172, 308, 185]",MISC
787,an,"[308, 172, 326, 185]",MISC
788,integrated,"[327, 172, 419, 185]",MISC
789,platform,"[421, 172, 495, 185]",MISC
790,for,"[495, 172, 523, 185]",MISC
791,customers,"[523, 172, 607, 185]",MISC
792,for,"[608, 172, 635, 185]",MISC
793,purchasing,"[636, 172, 728, 185]",MISC
794,Fire,"[729, 172, 774, 185]",MISC
795,",","[729, 172, 774, 185]",MISC
796,Auto,"[776, 172, 812, 185]",MISC
797,and,"[813, 172, 841, 185]",MISC
798,Life,"[841, 172, 878, 185]",MISC
799,policy,"[879, 172, 962, 185]",MISC
800,##and,"[879, 172, 962, 185]",MISC
801,-,"[963, 172, 965, 185]",MISC
802,NL,"[963, 172, 965, 185]",MISC
803,-,"[963, 172, 965, 185]",MISC
804,Banking,"[74, 189, 140, 203]",MISC
805,.,"[74, 189, 140, 203]",MISC
806,-,"[140, 189, 142, 203]",MISC
807,NL,"[140, 189, 142, 203]",MISC
808,-,"[140, 189, 142, 203]",MISC
809,Role,"[74, 213, 116, 226]",MISC
810,##s,"[74, 213, 116, 226]",MISC
811,and,"[116, 213, 140, 226]",MISC
812,Re,"[141, 213, 283, 226]",MISC
813,##sp,"[141, 213, 283, 226]",MISC
814,##ons,"[141, 213, 283, 226]",MISC
815,##ibi,"[141, 213, 283, 226]",MISC
816,##lities,"[141, 213, 283, 226]",MISC
817,:,"[141, 213, 283, 226]",MISC
818,-,"[284, 213, 285, 226]",MISC
819,NL,"[284, 213, 285, 226]",MISC
820,-,"[284, 213, 285, 226]",MISC
821,Inter,"[115, 226, 215, 243]",MISC
822,##act,"[115, 226, 215, 243]",MISC
823,##ing,"[115, 226, 215, 243]",MISC
824,with,"[217, 226, 253, 243]",MISC
825,Business,"[254, 226, 327, 243]",MISC
826,Ana,"[328, 226, 392, 243]",MISC
827,##ly,"[328, 226, 392, 243]",MISC
828,##st,"[328, 226, 392, 243]",MISC
829,on,"[393, 226, 410, 243]",MISC
830,a,"[412, 226, 420, 243]",MISC
831,day,"[421, 226, 513, 243]",MISC
832,-,"[421, 226, 513, 243]",MISC
833,to,"[421, 226, 513, 243]",MISC
834,-,"[421, 226, 513, 243]",MISC
835,day,"[421, 226, 513, 243]",MISC
836,basis,"[514, 226, 559, 243]",MISC
837,to,"[560, 226, 577, 243]",MISC
838,gather,"[579, 226, 634, 243]",MISC
839,the,"[634, 226, 662, 243]",MISC
840,requirements,"[662, 226, 782, 243]",MISC
841,.,"[662, 226, 782, 243]",MISC
842,-,"[783, 226, 785, 243]",MISC
843,NL,"[783, 226, 785, 243]",MISC
844,-,"[783, 226, 785, 243]",MISC
845,Ana,"[114, 243, 198, 261]",MISC
846,##ly,"[114, 243, 198, 261]",MISC
847,##zing,"[114, 243, 198, 261]",MISC
848,requirement,"[198, 243, 298, 261]",MISC
849,and,"[300, 243, 328, 261]",MISC
850,RC,"[328, 243, 428, 261]",MISC
851,##N,"[328, 243, 428, 261]",MISC
852,(,"[328, 243, 428, 261]",MISC
853,Re,"[328, 243, 428, 261]",MISC
854,##quest,"[328, 243, 428, 261]",MISC
855,change,"[430, 243, 485, 261]",MISC
856,not,"[485, 243, 605, 261]",MISC
857,##ification,"[485, 243, 605, 261]",MISC
858,),"[485, 243, 605, 261]",MISC
859,and,"[606, 243, 634, 261]",MISC
860,proposing,"[634, 243, 717, 261]",MISC
861,design,"[717, 243, 773, 261]",MISC
862,so,"[773, 243, 846, 261]",MISC
863,##ution,"[773, 243, 846, 261]",MISC
864,.,"[773, 243, 846, 261]",MISC
865,-,"[847, 243, 849, 261]",MISC
866,NL,"[847, 243, 849, 261]",MISC
867,-,"[847, 243, 849, 261]",MISC
868,Dev,"[115, 261, 214, 277]",MISC
869,##elo,"[115, 261, 214, 277]",MISC
870,##ping,"[115, 261, 214, 277]",MISC
871,P,"[215, 261, 245, 277]",MISC
872,##OC,"[215, 261, 245, 277]",MISC
873,to,"[245, 261, 265, 277]",MISC
874,come,"[266, 261, 305, 277]",MISC
875,up,"[306, 261, 325, 277]",MISC
876,with,"[326, 261, 365, 277]",MISC
877,design,"[366, 261, 425, 277]",MISC
878,solution,"[426, 261, 516, 277]",MISC
879,.,"[426, 261, 516, 277]",MISC
880,-,"[516, 261, 518, 277]",MISC
881,NL,"[516, 261, 518, 277]",MISC
882,-,"[516, 261, 518, 277]",MISC
883,Pre,"[115, 277, 200, 294]",MISC
884,##par,"[115, 277, 200, 294]",MISC
885,##ing,"[115, 277, 200, 294]",MISC
886,detailed,"[200, 277, 274, 294]",MISC
887,design,"[275, 277, 331, 294]",MISC
888,document,"[332, 277, 406, 294]",MISC
889,for,"[407, 277, 435, 294]",MISC
890,the,"[435, 277, 463, 294]",MISC
891,module,"[464, 277, 519, 294]",MISC
892,with,"[520, 277, 557, 294]",MISC
893,the,"[558, 277, 624, 294]",MISC
894,##flow,"[558, 277, 624, 294]",MISC
895,diagram,"[624, 277, 765, 294]",MISC
896,(,"[624, 277, 765, 294]",MISC
897,created,"[624, 277, 765, 294]",MISC
898,using,"[766, 277, 813, 294]",MISC
899,VI,"[813, 277, 879, 294]",MISC
900,##SI,"[813, 277, 879, 294]",MISC
901,##O,"[813, 277, 879, 294]",MISC
902,),"[813, 277, 879, 294]",MISC
903,",","[813, 277, 879, 294]",MISC
904,Class,"[879, 277, 926, 294]",MISC
905,and,"[926, 277, 954, 294]",MISC
906,-,"[954, 277, 956, 294]",MISC
907,NL,"[954, 277, 956, 294]",MISC
908,-,"[954, 277, 956, 294]",MISC
909,Se,"[136, 298, 211, 311]",MISC
910,##quence,"[136, 298, 211, 311]",MISC
911,diagram,"[212, 298, 353, 311]",MISC
912,(,"[212, 298, 353, 311]",MISC
913,created,"[212, 298, 353, 311]",MISC
914,using,"[354, 298, 401, 311]",MISC
915,RS,"[402, 298, 429, 311]",MISC
916,##A,"[402, 298, 429, 311]",MISC
917,modeling,"[430, 298, 515, 311]",MISC
918,),"[430, 298, 515, 311]",MISC
919,and,"[515, 298, 543, 311]",MISC
920,pseudo,"[544, 298, 599, 311]",MISC
921,code,"[600, 298, 647, 311]",MISC
922,.,"[600, 298, 647, 311]",MISC
923,-,"[648, 298, 649, 311]",MISC
924,NL,"[648, 298, 649, 311]",MISC
925,-,"[648, 298, 649, 311]",MISC
926,Dev,"[115, 311, 202, 327]",MISC
927,##el,"[115, 311, 202, 327]",MISC
928,##ping,"[115, 311, 202, 327]",MISC
929,application,"[202, 311, 308, 327]",MISC
930,modules,"[309, 311, 377, 327]",MISC
931,based,"[377, 311, 426, 327]",MISC
932,on,"[426, 311, 445, 327]",MISC
933,Spring,"[445, 311, 503, 327]",MISC
934,MV,"[504, 311, 531, 327]",MISC
935,##C,"[504, 311, 531, 327]",MISC
936,and,"[533, 311, 561, 327]",MISC
937,web,"[562, 311, 638, 327]",MISC
938,##flow,"[562, 311, 638, 327]",MISC
939,",","[562, 311, 638, 327]",MISC
940,hi,"[640, 311, 659, 327]",MISC
941,be,"[659, 311, 727, 327]",MISC
942,##rna,"[659, 311, 727, 327]",MISC
943,##te,"[659, 311, 727, 327]",MISC
944,and,"[727, 311, 755, 327]",MISC
945,web,"[756, 311, 872, 327]",MISC
946,##ser,"[756, 311, 872, 327]",MISC
947,##vice,"[756, 311, 872, 327]",MISC
948,##s,"[756, 311, 872, 327]",MISC
949,.,"[756, 311, 872, 327]",MISC
950,-,"[873, 311, 875, 327]",MISC
951,NL,"[873, 311, 875, 327]",MISC
952,-,"[873, 311, 875, 327]",MISC
953,Skills,"[74, 347, 129, 360]",MISC
954,Used,"[130, 347, 167, 360]",MISC
955,:,"[168, 347, 176, 360]",MISC
956,Spring,"[177, 347, 233, 360]",MISC
957,MV,"[233, 347, 261, 360]",MISC
958,##C,"[233, 347, 261, 360]",MISC
959,&,"[262, 347, 270, 360]",MISC
960,Web,"[271, 347, 335, 360]",MISC
961,##fo,"[271, 347, 335, 360]",MISC
962,##w,"[271, 347, 335, 360]",MISC
963,",","[271, 347, 335, 360]",MISC
964,Java,"[337, 347, 439, 360]",MISC
965,##Script,"[337, 347, 439, 360]",MISC
966,",","[337, 347, 439, 360]",MISC
967,CS,"[440, 347, 476, 360]",MISC
968,##S,"[440, 347, 476, 360]",MISC
969,",","[440, 347, 476, 360]",MISC
970,j,"[477, 347, 541, 360]",MISC
971,##quer,"[477, 347, 541, 360]",MISC
972,##y,"[477, 347, 541, 360]",MISC
973,",","[477, 347, 541, 360]",MISC
974,Web,"[543, 347, 673, 360]",MISC
975,##S,"[543, 347, 673, 360]",MISC
976,##er,"[543, 347, 673, 360]",MISC
977,##vice,"[543, 347, 673, 360]",MISC
978,##san,"[543, 347, 673, 360]",MISC
979,##d,"[543, 347, 673, 360]",MISC
980,j,"[674, 347, 730, 360]",MISC
981,##uni,"[674, 347, 730, 360]",MISC
982,##ts,"[674, 347, 730, 360]",MISC
983,based,"[731, 347, 777, 360]",MISC
984,on,"[777, 347, 795, 360]",MISC
985,Easy,"[796, 347, 871, 360]",MISC
986,##M,"[796, 347, 871, 360]",MISC
987,##ock,"[796, 347, 871, 360]",MISC
988,-,"[871, 347, 873, 360]",MISC
989,NL,"[871, 347, 873, 360]",MISC
990,-,"[871, 347, 873, 360]",MISC
991,framework,"[74, 364, 164, 378]",MISC
992,.,"[74, 364, 164, 378]",MISC
993,-,"[164, 364, 166, 378]",MISC
994,NL,"[164, 364, 166, 378]",MISC
995,-,"[164, 364, 166, 378]",MISC
996,Too,"[74, 380, 119, 394]",MISC
997,##ls,"[74, 380, 119, 394]",MISC
998,Used,"[120, 380, 165, 394]",MISC
999,:,"[120, 380, 165, 394]",MISC
1000,Spring,"[165, 380, 219, 394]",MISC
1001,Too,"[220, 380, 257, 394]",MISC
1002,##l,"[220, 380, 257, 394]",MISC
1003,suite,"[257, 380, 347, 394]",MISC
1004,",","[257, 380, 347, 394]",MISC
1005,Soap,"[257, 380, 347, 394]",MISC
1006,U,"[348, 380, 365, 394]",MISC
1007,##I,"[348, 380, 365, 394]",MISC
1008,&,"[366, 380, 375, 394]",MISC
1009,Post,"[376, 380, 476, 394]",MISC
1010,##g,"[376, 380, 476, 394]",MISC
1011,##re,"[376, 380, 476, 394]",MISC
1012,##S,"[376, 380, 476, 394]",MISC
1013,##QL,"[376, 380, 476, 394]",MISC
1014,.,"[376, 380, 476, 394]",MISC
1015,-,"[476, 380, 478, 394]",MISC
1016,NL,"[476, 380, 478, 394]",MISC
1017,-,"[476, 380, 478, 394]",MISC
1018,Project,"[74, 416, 129, 429]",MISC
1019,Det,"[130, 416, 192, 429]",MISC
1020,##ails,"[130, 416, 192, 429]",MISC
1021,:,"[130, 416, 192, 429]",MISC
1022,-,"[194, 416, 195, 429]",MISC
1023,NL,"[194, 416, 195, 429]",MISC
1024,-,"[194, 416, 195, 429]",MISC
1025,Period,"[202, 434, 277, 448]",MISC
1026,:,"[202, 434, 277, 448]",MISC
1027,Nov,"[278, 434, 309, 448]",MISC
1028,2012,"[310, 434, 352, 448]",MISC
1029,–,"[353, 434, 364, 448]",MISC
1030,Dec,"[364, 434, 395, 448]",MISC
1031,2013,"[397, 434, 438, 448]",MISC
1032,-,"[440, 434, 441, 448]",MISC
1033,NL,"[440, 434, 441, 448]",MISC
1034,-,"[440, 434, 441, 448]",MISC
1035,Project,"[202, 450, 266, 464]",MISC
1036,Name,"[267, 450, 312, 464]",MISC
1037,:,"[267, 450, 312, 464]",MISC
1038,Business,"[313, 450, 386, 464]",MISC
1039,Rule,"[387, 450, 423, 464]",MISC
1040,Con,"[423, 450, 515, 464]",MISC
1041,##version,"[423, 450, 515, 464]",MISC
1042,Too,"[516, 450, 552, 464]",MISC
1043,##l,"[516, 450, 552, 464]",MISC
1044,-,"[552, 450, 554, 464]",MISC
1045,NL,"[552, 450, 554, 464]",MISC
1046,-,"[552, 450, 554, 464]",MISC
1047,Team,"[199, 466, 237, 480]",MISC
1048,size,"[237, 466, 284, 480]",MISC
1049,:,"[237, 466, 284, 480]",MISC
1050,3,"[285, 466, 293, 480]",MISC
1051,-,"[294, 466, 296, 480]",MISC
1052,NL,"[294, 466, 296, 480]",MISC
1053,-,"[294, 466, 296, 480]",MISC
1054,Role,"[202, 483, 246, 497]",MISC
1055,:,"[202, 483, 246, 497]",MISC
1056,Java,"[247, 483, 282, 497]",MISC
1057,Dev,"[283, 483, 363, 497]",MISC
1058,##elo,"[283, 483, 363, 497]",MISC
1059,##per,"[283, 483, 363, 497]",MISC
1060,-,"[363, 483, 365, 497]",MISC
1061,NL,"[363, 483, 365, 497]",MISC
1062,-,"[363, 483, 365, 497]",MISC
1063,Des,"[74, 500, 169, 513]",MISC
1064,##cription,"[74, 500, 169, 513]",MISC
1065,:,"[74, 500, 169, 513]",MISC
1066,-,"[169, 500, 171, 513]",MISC
1067,NL,"[169, 500, 171, 513]",MISC
1068,-,"[169, 500, 171, 513]",MISC
1069,Business,"[136, 517, 211, 530]",MISC
1070,rule,"[212, 517, 248, 530]",MISC
1071,conversion,"[249, 517, 343, 530]",MISC
1072,tool,"[343, 517, 379, 530]",MISC
1073,provides,"[381, 517, 455, 530]",MISC
1074,a,"[456, 517, 464, 530]",MISC
1075,means,"[465, 517, 512, 530]",MISC
1076,for,"[512, 517, 540, 530]",MISC
1077,conversion,"[540, 517, 634, 530]",MISC
1078,of,"[634, 517, 652, 530]",MISC
1079,business,"[653, 517, 728, 530]",MISC
1080,rules,"[728, 517, 775, 530]",MISC
1081,into,"[775, 517, 812, 530]",MISC
1082,format,"[813, 517, 868, 530]",MISC
1083,which,"[869, 517, 916, 530]",MISC
1084,can,"[916, 517, 944, 530]",MISC
1085,be,"[944, 517, 962, 530]",MISC
1086,-,"[963, 517, 965, 530]",MISC
1087,NL,"[963, 517, 965, 530]",MISC
1088,-,"[963, 517, 965, 530]",MISC
1089,directly,"[74, 533, 150, 546]",MISC
1090,fed,"[150, 533, 178, 546]",MISC
1091,to,"[179, 533, 198, 546]",MISC
1092,BR,"[198, 533, 236, 546]",MISC
1093,##MS,"[198, 533, 236, 546]",MISC
1094,like,"[236, 533, 275, 546]",MISC
1095,d,"[275, 533, 340, 546]",MISC
1096,##roo,"[275, 533, 340, 546]",MISC
1097,##ls,"[275, 533, 340, 546]",MISC
1098,",","[275, 533, 340, 546]",MISC
1099,blaze,"[342, 533, 388, 546]",MISC
1100,and,"[389, 533, 417, 546]",MISC
1101,W,"[418, 533, 465, 546]",MISC
1102,##OD,"[418, 533, 465, 546]",MISC
1103,##M,"[418, 533, 465, 546]",MISC
1104,.,"[418, 533, 465, 546]",MISC
1105,-,"[466, 533, 467, 546]",MISC
1106,NL,"[466, 533, 467, 546]",MISC
1107,-,"[466, 533, 467, 546]",MISC
1108,Role,"[74, 573, 116, 587]",MISC
1109,##s,"[74, 573, 116, 587]",MISC
1110,and,"[116, 573, 140, 587]",MISC
1111,Re,"[141, 573, 283, 587]",MISC
1112,##sp,"[141, 573, 283, 587]",MISC
1113,##ons,"[141, 573, 283, 587]",MISC
1114,##ibi,"[141, 573, 283, 587]",MISC
1115,##lities,"[141, 573, 283, 587]",MISC
1116,:,"[141, 573, 283, 587]",MISC
1117,-,"[284, 573, 285, 587]",MISC
1118,NL,"[284, 573, 285, 587]",MISC
1119,-,"[284, 573, 285, 587]",MISC
1120,Ana,"[115, 587, 200, 604]",MISC
1121,##ly,"[115, 587, 200, 604]",MISC
1122,##zing,"[115, 587, 200, 604]",MISC
1123,more,"[201, 587, 239, 604]",MISC
1124,than,"[239, 587, 277, 604]",MISC
1125,1000,"[277, 587, 315, 604]",MISC
1126,rules,"[316, 587, 362, 604]",MISC
1127,and,"[363, 587, 391, 604]",MISC
1128,converting,"[392, 587, 487, 604]",MISC
1129,them,"[488, 587, 526, 604]",MISC
1130,into,"[526, 587, 564, 604]",MISC
1131,S,"[564, 587, 602, 604]",MISC
1132,##B,"[564, 587, 602, 604]",MISC
1133,##VR,"[564, 587, 602, 604]",MISC
1134,(,"[603, 587, 698, 604]",MISC
1135,Se,"[603, 587, 698, 604]",MISC
1136,##man,"[603, 587, 698, 604]",MISC
1137,##tics,"[603, 587, 698, 604]",MISC
1138,of,"[698, 587, 717, 604]",MISC
1139,business,"[717, 587, 794, 604]",MISC
1140,vocabulary,"[794, 587, 898, 604]",MISC
1141,),"[794, 587, 898, 604]",MISC
1142,-,"[899, 587, 901, 604]",MISC
1143,NL,"[899, 587, 901, 604]",MISC
1144,-,"[899, 587, 901, 604]",MISC
1145,com,"[136, 607, 214, 620]",MISC
1146,##pliant,"[136, 607, 214, 620]",MISC
1147,format,"[214, 607, 275, 620]",MISC
1148,.,"[214, 607, 275, 620]",MISC
1149,-,"[275, 607, 277, 620]",MISC
1150,NL,"[275, 607, 277, 620]",MISC
1151,-,"[275, 607, 277, 620]",MISC
1152,Dev,"[115, 620, 210, 637]",MISC
1153,##elo,"[115, 620, 210, 637]",MISC
1154,##ping,"[115, 620, 210, 637]",MISC
1155,grammar,"[211, 620, 277, 637]",MISC
1156,for,"[279, 620, 306, 637]",MISC
1157,par,"[308, 620, 374, 637]",MISC
1158,##sing,"[308, 620, 374, 637]",MISC
1159,rules,"[375, 620, 422, 637]",MISC
1160,using,"[423, 620, 470, 637]",MISC
1161,AN,"[472, 620, 518, 637]",MISC
1162,##TL,"[472, 620, 518, 637]",MISC
1163,##R,"[472, 620, 518, 637]",MISC
1164,tool,"[520, 620, 567, 637]",MISC
1165,.,"[520, 620, 567, 637]",MISC
1166,-,"[568, 620, 570, 637]",MISC
1167,NL,"[568, 620, 570, 637]",MISC
1168,-,"[568, 620, 570, 637]",MISC
1169,Dev,"[115, 637, 214, 655]",MISC
1170,##elo,"[115, 637, 214, 655]",MISC
1171,##ping,"[115, 637, 214, 655]",MISC
1172,custom,"[215, 637, 274, 655]",MISC
1173,x,"[274, 637, 304, 655]",MISC
1174,##s,"[274, 637, 304, 655]",MISC
1175,##d,"[274, 637, 304, 655]",MISC
1176,which,"[304, 637, 353, 655]",MISC
1177,can,"[354, 637, 383, 655]",MISC
1178,be,"[384, 637, 403, 655]",MISC
1179,used,"[403, 637, 442, 655]",MISC
1180,as,"[443, 637, 462, 655]",MISC
1181,an,"[463, 637, 482, 655]",MISC
1182,intermediate,"[483, 637, 601, 655]",MISC
1183,format,"[602, 637, 672, 655]",MISC
1184,.,"[602, 637, 672, 655]",MISC
1185,-,"[672, 637, 674, 655]",MISC
1186,NL,"[672, 637, 674, 655]",MISC
1187,-,"[672, 637, 674, 655]",MISC
1188,Dev,"[114, 655, 206, 672]",MISC
1189,##elo,"[114, 655, 206, 672]",MISC
1190,##ping,"[114, 655, 206, 672]",MISC
1191,d,"[207, 655, 261, 672]",MISC
1192,##roo,"[207, 655, 261, 672]",MISC
1193,##ls,"[207, 655, 261, 672]",MISC
1194,engine,"[262, 655, 316, 672]",MISC
1195,to,"[318, 655, 335, 672]",MISC
1196,convert,"[336, 655, 400, 672]",MISC
1197,the,"[401, 655, 427, 672]",MISC
1198,intermediate,"[428, 655, 538, 672]",MISC
1199,x,"[539, 655, 565, 672]",MISC
1200,##m,"[539, 655, 565, 672]",MISC
1201,##l,"[539, 655, 565, 672]",MISC
1202,format,"[567, 655, 621, 672]",MISC
1203,to,"[622, 655, 640, 672]",MISC
1204,d,"[641, 655, 695, 672]",MISC
1205,##roo,"[641, 655, 695, 672]",MISC
1206,##ls,"[641, 655, 695, 672]",MISC
1207,specific,"[696, 655, 769, 672]",MISC
1208,d,"[770, 655, 807, 672]",MISC
1209,##rl,"[770, 655, 807, 672]",MISC
1210,.,"[770, 655, 807, 672]",MISC
1211,-,"[807, 655, 809, 672]",MISC
1212,NL,"[807, 655, 809, 672]",MISC
1213,-,"[807, 655, 809, 672]",MISC
1214,Skills,"[74, 692, 129, 705]",MISC
1215,Used,"[129, 692, 166, 705]",MISC
1216,:,"[166, 692, 175, 705]",MISC
1217,Core,"[176, 692, 212, 705]",MISC
1218,Java,"[213, 692, 285, 705]",MISC
1219,",","[213, 692, 285, 705]",MISC
1220,x,"[213, 692, 285, 705]",MISC
1221,##m,"[213, 692, 285, 705]",MISC
1222,##l,"[213, 692, 285, 705]",MISC
1223,and,"[287, 692, 314, 705]",MISC
1224,X,"[314, 692, 351, 705]",MISC
1225,##SD,"[314, 692, 351, 705]",MISC
1226,.,"[314, 692, 351, 705]",MISC
1227,-,"[351, 692, 353, 705]",MISC
1228,NL,"[351, 692, 353, 705]",MISC
1229,-,"[351, 692, 353, 705]",MISC
1230,Too,"[74, 708, 123, 721]",MISC
1231,##ls,"[74, 708, 123, 721]",MISC
1232,Used,"[124, 708, 172, 721]",MISC
1233,:,"[124, 708, 172, 721]",MISC
1234,AN,"[173, 708, 222, 721]",MISC
1235,##TL,"[173, 708, 222, 721]",MISC
1236,##R,"[173, 708, 222, 721]",MISC
1237,and,"[223, 708, 252, 721]",MISC
1238,RS,"[253, 708, 291, 721]",MISC
1239,##A,"[253, 708, 291, 721]",MISC
1240,.,"[253, 708, 291, 721]",MISC
1241,-,"[292, 708, 294, 721]",MISC
1242,NL,"[292, 708, 294, 721]",MISC
1243,-,"[292, 708, 294, 721]",MISC
1244,Project,"[74, 743, 129, 757]",MISC
1245,Det,"[130, 743, 192, 757]",MISC
1246,##ails,"[130, 743, 192, 757]",MISC
1247,:,"[130, 743, 192, 757]",MISC
1248,-,"[194, 743, 195, 757]",MISC
1249,NL,"[194, 743, 195, 757]",MISC
1250,-,"[194, 743, 195, 757]",MISC
1251,Custom,"[202, 762, 287, 775]",MISC
1252,##er,"[202, 762, 287, 775]",MISC
1253,:,"[202, 762, 287, 775]",MISC
1254,State,"[287, 762, 334, 775]",MISC
1255,Farm,"[334, 762, 371, 775]",MISC
1256,-,"[372, 762, 374, 775]",MISC
1257,NL,"[372, 762, 374, 775]",MISC
1258,-,"[372, 762, 374, 775]",MISC
1259,Period,"[202, 778, 270, 791]",MISC
1260,:,"[202, 778, 270, 791]",MISC
1261,Jul,"[271, 778, 298, 791]",MISC
1262,2011,"[300, 778, 338, 791]",MISC
1263,–,"[339, 778, 348, 791]",MISC
1264,Nov,"[349, 778, 377, 791]",MISC
1265,2012,"[378, 778, 416, 791]",MISC
1266,-,"[417, 778, 419, 791]",MISC
1267,NL,"[417, 778, 419, 791]",MISC
1268,-,"[417, 778, 419, 791]",MISC
1269,Project,"[202, 794, 265, 807]",MISC
1270,Name,"[266, 794, 311, 807]",MISC
1271,:,"[266, 794, 311, 807]",MISC
1272,Unified,"[312, 794, 374, 807]",MISC
1273,Auto,"[376, 794, 412, 807]",MISC
1274,Experience,"[412, 794, 503, 807]",MISC
1275,-,"[504, 794, 506, 807]",MISC
1276,NL,"[504, 794, 506, 807]",MISC
1277,-,"[504, 794, 506, 807]",MISC
1278,Team,"[199, 811, 237, 825]",MISC
1279,size,"[237, 811, 284, 825]",MISC
1280,:,"[237, 811, 284, 825]",MISC
1281,6,"[285, 811, 293, 825]",MISC
1282,-,"[294, 811, 296, 825]",MISC
1283,NL,"[294, 811, 296, 825]",MISC
1284,-,"[294, 811, 296, 825]",MISC
1285,Role,"[202, 827, 246, 841]",MISC
1286,:,"[202, 827, 246, 841]",MISC
1287,Java,"[247, 827, 282, 841]",MISC
1288,Dev,"[283, 827, 363, 841]",MISC
1289,##elo,"[283, 827, 363, 841]",MISC
1290,##per,"[283, 827, 363, 841]",MISC
1291,-,"[363, 827, 365, 841]",MISC
1292,NL,"[363, 827, 365, 841]",MISC
1293,-,"[363, 827, 365, 841]",MISC
1294,Des,"[74, 860, 169, 874]",MISC
1295,##cription,"[74, 860, 169, 874]",MISC
1296,:,"[74, 860, 169, 874]",MISC
1297,-,"[169, 860, 171, 874]",MISC
1298,NL,"[169, 860, 171, 874]",MISC
1299,-,"[169, 860, 171, 874]",MISC
1300,Web,"[136, 878, 164, 891]",MISC
1301,based,"[164, 878, 209, 891]",MISC
1302,application,"[211, 878, 311, 891]",MISC
1303,which,"[313, 878, 358, 891]",MISC
1304,deals,"[359, 878, 404, 891]",MISC
1305,with,"[406, 878, 442, 891]",MISC
1306,insurance,"[443, 878, 526, 891]",MISC
1307,for,"[527, 878, 554, 891]",MISC
1308,private,"[554, 878, 619, 891]",MISC
1309,owned,"[619, 878, 664, 891]",MISC
1310,vehicles,"[666, 878, 749, 891]",MISC
1311,.,"[666, 878, 749, 891]",MISC
1312,The,"[749, 878, 777, 891]",MISC
1313,customer,"[777, 878, 850, 891]",MISC
1314,enters,"[852, 878, 907, 891]",MISC
1315,all,"[907, 878, 935, 891]",MISC
1316,the,"[935, 878, 963, 891]",MISC
1317,-,"[963, 878, 965, 891]",MISC
1318,NL,"[963, 878, 965, 891]",MISC
1319,-,"[963, 878, 965, 891]",MISC
1320,details,"[74, 894, 138, 907]",MISC
1321,in,"[140, 894, 157, 907]",MISC
1322,the,"[158, 894, 186, 907]",MISC
1323,application,"[186, 894, 297, 907]",MISC
1324,",","[186, 894, 297, 907]",MISC
1325,based,"[299, 894, 345, 907]",MISC
1326,on,"[345, 894, 363, 907]",MISC
1327,these,"[364, 894, 411, 907]",MISC
1328,details,"[411, 894, 475, 907]",MISC
1329,a,"[476, 894, 485, 907]",MISC
1330,quote,"[486, 894, 533, 907]",MISC
1331,is,"[533, 894, 550, 907]",MISC
1332,generated,"[551, 894, 635, 907]",MISC
1333,which,"[636, 894, 682, 907]",MISC
1334,can,"[682, 894, 710, 907]",MISC
1335,be,"[710, 894, 728, 907]",MISC
1336,purchased,"[729, 894, 812, 907]",MISC
1337,online,"[813, 894, 877, 907]",MISC
1338,.,"[813, 894, 877, 907]",MISC
1339,The,"[879, 894, 907, 907]",MISC
1340,option,"[907, 894, 962, 907]",MISC
1341,-,"[963, 894, 965, 907]",MISC
1342,NL,"[963, 894, 965, 907]",MISC
1343,-,"[963, 894, 965, 907]",MISC
1344,to,"[74, 911, 93, 924]",MISC
1345,purchase,"[94, 911, 172, 924]",MISC
1346,the,"[173, 911, 202, 924]",MISC
1347,policy,"[202, 911, 261, 924]",MISC
1348,depends,"[262, 911, 329, 924]",MISC
1349,on,"[331, 911, 350, 924]",MISC
1350,the,"[351, 911, 380, 924]",MISC
1351,answers,"[380, 911, 448, 924]",MISC
1352,provided,"[449, 911, 527, 924]",MISC
1353,by,"[528, 911, 548, 924]",MISC
1354,the,"[548, 911, 578, 924]",MISC
1355,customer,"[578, 911, 666, 924]",MISC
1356,.,"[578, 911, 666, 924]",MISC
1357,At,"[667, 911, 686, 924]",MISC
1358,any,"[687, 911, 716, 924]",MISC
1359,point,"[716, 911, 765, 924]",MISC
1360,in,"[766, 911, 785, 924]",MISC
1361,the,"[785, 911, 815, 924]",MISC
1362,application,"[815, 911, 933, 924]",MISC
1363,",","[815, 911, 933, 924]",MISC
1364,the,"[933, 911, 963, 924]",MISC
1365,-,"[963, 911, 965, 924]",MISC
1366,NL,"[963, 911, 965, 924]",MISC
1367,-,"[963, 911, 965, 924]",MISC
1368,customer,"[74, 927, 149, 940]",MISC
1369,has,"[149, 927, 177, 940]",MISC
1370,provision,"[177, 927, 260, 940]",MISC
1371,to,"[262, 927, 279, 940]",MISC
1372,send,"[280, 927, 317, 940]",MISC
1373,quote,"[318, 927, 365, 940]",MISC
1374,to,"[365, 927, 382, 940]",MISC
1375,agent,"[383, 927, 439, 940]",MISC
1376,.,"[383, 927, 439, 940]",MISC
1377,-,"[440, 927, 441, 940]",MISC
1378,NL,"[440, 927, 441, 940]",MISC
1379,-,"[440, 927, 441, 940]",MISC
1380,Role,"[74, 960, 116, 974]",MISC
1381,##s,"[74, 960, 116, 974]",MISC
1382,and,"[116, 960, 140, 974]",MISC
1383,Re,"[141, 960, 283, 974]",MISC
1384,##sp,"[141, 960, 283, 974]",MISC
1385,##ons,"[141, 960, 283, 974]",MISC
1386,##ibi,"[141, 960, 283, 974]",MISC
1387,##lities,"[141, 960, 283, 974]",MISC
1388,:,"[141, 960, 283, 974]",MISC
1389,-,"[284, 960, 285, 974]",MISC
1390,NL,"[284, 960, 285, 974]",MISC
1391,-,"[284, 960, 285, 974]",MISC
1392,En,"[115, 974, 229, 991]",MISC
1393,##han,"[115, 974, 229, 991]",MISC
1394,##ce,"[115, 974, 229, 991]",MISC
1395,##ments,"[115, 974, 229, 991]",MISC
1396,(,"[231, 974, 317, 991]",MISC
1397,Stories,"[231, 974, 317, 991]",MISC
1398,),"[231, 974, 317, 991]",MISC
1399,based,"[317, 974, 364, 991]",MISC
1400,on,"[366, 974, 385, 991]",MISC
1401,Spring,"[385, 974, 442, 991]",MISC
1402,MV,"[443, 974, 470, 991]",MISC
1403,##C,"[443, 974, 470, 991]",MISC
1404,&,"[472, 974, 480, 991]",MISC
1405,Web,"[481, 974, 663, 991]",MISC
1406,##flow,"[481, 974, 663, 991]",MISC
1407,",","[481, 974, 663, 991]",MISC
1408,Java,"[481, 974, 663, 991]",MISC
1409,##s,"[481, 974, 663, 991]",MISC
1410,##cript,"[481, 974, 663, 991]",MISC
1411,",","[481, 974, 663, 991]",MISC
1412,CS,"[664, 974, 692, 991]",MISC
1413,##S,"[664, 974, 692, 991]",MISC
1414,and,"[693, 974, 721, 991]",MISC
1415,j,"[722, 974, 788, 991]",MISC
1416,##quer,"[722, 974, 788, 991]",MISC
1417,##y,"[722, 974, 788, 991]",MISC
1418,.,"[722, 974, 788, 991]",MISC
1419,-,"[790, 974, 792, 991]",MISC
1420,NL,"[790, 974, 792, 991]",MISC
1421,-,"[790, 974, 792, 991]",MISC
1422,De,"[114, 14, 225, 32]",MISC
1423,##fect,"[114, 14, 225, 32]",MISC
1424,##fi,"[114, 14, 225, 32]",MISC
1425,##xing,"[114, 14, 225, 32]",MISC
1426,which,"[226, 14, 271, 32]",MISC
1427,involved,"[272, 14, 345, 32]",MISC
1428,thorough,"[346, 14, 419, 32]",MISC
1429,de,"[421, 14, 504, 32]",MISC
1430,##bu,"[421, 14, 504, 32]",MISC
1431,##gging,"[421, 14, 504, 32]",MISC
1432,of,"[504, 14, 521, 32]",MISC
1433,application,"[523, 14, 633, 32]",MISC
1434,.,"[523, 14, 633, 32]",MISC
1435,-,"[634, 14, 636, 32]",MISC
1436,NL,"[634, 14, 636, 32]",MISC
1437,-,"[634, 14, 636, 32]",MISC
1438,Work,"[115, 32, 170, 48]",MISC
1439,##ed,"[115, 32, 170, 48]",MISC
1440,on,"[172, 32, 189, 48]",MISC
1441,production,"[191, 32, 284, 48]",MISC
1442,incidents,"[286, 32, 379, 48]",MISC
1443,.,"[286, 32, 379, 48]",MISC
1444,Ana,"[381, 32, 455, 48]",MISC
1445,##ly,"[381, 32, 455, 48]",MISC
1446,##zed,"[381, 32, 455, 48]",MISC
1447,error,"[457, 32, 504, 48]",MISC
1448,logs,"[504, 32, 541, 48]",MISC
1449,using,"[542, 32, 589, 48]",MISC
1450,S,"[590, 32, 645, 48]",MISC
1451,##p,"[590, 32, 645, 48]",MISC
1452,##lu,"[590, 32, 645, 48]",MISC
1453,##nk,"[590, 32, 645, 48]",MISC
1454,&,"[647, 32, 656, 48]",MISC
1455,Tea,"[657, 32, 684, 48]",MISC
1456,leaf,"[685, 32, 732, 48]",MISC
1457,.,"[685, 32, 732, 48]",MISC
1458,-,"[733, 32, 734, 48]",MISC
1459,NL,"[733, 32, 734, 48]",MISC
1460,-,"[733, 32, 734, 48]",MISC
1461,Code,"[115, 48, 153, 65]",MISC
1462,reviews,"[153, 48, 230, 65]",MISC
1463,.,"[153, 48, 230, 65]",MISC
1464,Hand,"[230, 48, 307, 65]",MISC
1465,##ling,"[230, 48, 307, 65]",MISC
1466,day,"[307, 48, 335, 65]",MISC
1467,to,"[336, 48, 355, 65]",MISC
1468,day,"[355, 48, 383, 65]",MISC
1469,activities,"[384, 48, 480, 65]",MISC
1470,of,"[481, 48, 500, 65]",MISC
1471,the,"[500, 48, 528, 65]",MISC
1472,team,"[529, 48, 575, 65]",MISC
1473,.,"[529, 48, 575, 65]",MISC
1474,(,"[577, 48, 653, 65]",MISC
1475,Working,"[577, 48, 653, 65]",MISC
1476,on,"[654, 48, 673, 65]",MISC
1477,a,"[673, 48, 720, 65]",MISC
1478,##gi,"[673, 48, 720, 65]",MISC
1479,##le,"[673, 48, 720, 65]",MISC
1480,methodology,"[721, 48, 835, 65]",MISC
1481,),"[721, 48, 835, 65]",MISC
1482,-,"[837, 48, 838, 65]",MISC
1483,NL,"[837, 48, 838, 65]",MISC
1484,-,"[837, 48, 838, 65]",MISC
1485,Per,"[115, 65, 200, 82]",MISC
1486,##formed,"[115, 65, 200, 82]",MISC
1487,unit,"[201, 65, 239, 82]",MISC
1488,testing,"[240, 65, 306, 82]",MISC
1489,based,"[307, 65, 354, 82]",MISC
1490,on,"[355, 65, 374, 82]",MISC
1491,Easy,"[374, 65, 451, 82]",MISC
1492,##M,"[374, 65, 451, 82]",MISC
1493,##ock,"[374, 65, 451, 82]",MISC
1494,framework,"[451, 65, 536, 82]",MISC
1495,and,"[538, 65, 565, 82]",MISC
1496,functional,"[567, 65, 662, 82]",MISC
1497,testing,"[663, 65, 739, 82]",MISC
1498,.,"[663, 65, 739, 82]",MISC
1499,-,"[740, 65, 741, 82]",MISC
1500,NL,"[740, 65, 741, 82]",MISC
1501,-,"[740, 65, 741, 82]",MISC
1502,Daily,"[114, 82, 157, 99]",MISC
1503,status,"[157, 82, 209, 99]",MISC
1504,reporting,"[210, 82, 288, 99]",MISC
1505,to,"[288, 82, 305, 99]",MISC
1506,client,"[306, 82, 358, 99]",MISC
1507,directly,"[358, 82, 436, 99]",MISC
1508,.,"[358, 82, 436, 99]",MISC
1509,-,"[436, 82, 438, 99]",MISC
1510,NL,"[436, 82, 438, 99]",MISC
1511,-,"[436, 82, 438, 99]",MISC
1512,Skills,"[74, 119, 129, 133]",MISC
1513,Used,"[130, 119, 166, 133]",MISC
1514,:,"[167, 119, 176, 133]",MISC
1515,Spring,"[176, 119, 232, 133]",MISC
1516,MV,"[232, 119, 260, 133]",MISC
1517,##C,"[232, 119, 260, 133]",MISC
1518,&,"[260, 119, 269, 133]",MISC
1519,Web,"[270, 119, 342, 133]",MISC
1520,##flow,"[270, 119, 342, 133]",MISC
1521,",","[270, 119, 342, 133]",MISC
1522,Java,"[344, 119, 446, 133]",MISC
1523,##Script,"[344, 119, 446, 133]",MISC
1524,",","[344, 119, 446, 133]",MISC
1525,CS,"[446, 119, 483, 133]",MISC
1526,##S,"[446, 119, 483, 133]",MISC
1527,",","[446, 119, 483, 133]",MISC
1528,j,"[484, 119, 548, 133]",MISC
1529,##quer,"[484, 119, 548, 133]",MISC
1530,##y,"[484, 119, 548, 133]",MISC
1531,",","[484, 119, 548, 133]",MISC
1532,Web,"[549, 119, 679, 133]",MISC
1533,##S,"[549, 119, 679, 133]",MISC
1534,##er,"[549, 119, 679, 133]",MISC
1535,##vice,"[549, 119, 679, 133]",MISC
1536,##san,"[549, 119, 679, 133]",MISC
1537,##d,"[549, 119, 679, 133]",MISC
1538,j,"[679, 119, 735, 133]",MISC
1539,##uni,"[679, 119, 735, 133]",MISC
1540,##ts,"[679, 119, 735, 133]",MISC
1541,based,"[735, 119, 780, 133]",MISC
1542,on,"[782, 119, 799, 133]",MISC
1543,Easy,"[800, 119, 873, 133]",MISC
1544,##M,"[800, 119, 873, 133]",MISC
1545,##ock,"[800, 119, 873, 133]",MISC
1546,-,"[875, 119, 876, 133]",MISC
1547,NL,"[875, 119, 876, 133]",MISC
1548,-,"[875, 119, 876, 133]",MISC
1549,framework,"[74, 135, 164, 149]",MISC
1550,.,"[74, 135, 164, 149]",MISC
1551,-,"[164, 135, 166, 149]",MISC
1552,NL,"[164, 135, 166, 149]",MISC
1553,-,"[164, 135, 166, 149]",MISC
1554,Too,"[74, 152, 119, 166]",MISC
1555,##ls,"[74, 152, 119, 166]",MISC
1556,Used,"[120, 152, 157, 166]",MISC
1557,:,"[157, 152, 166, 166]",MISC
1558,RS,"[166, 152, 203, 166]",MISC
1559,##A,"[166, 152, 203, 166]",MISC
1560,",","[166, 152, 203, 166]",MISC
1561,Post,"[203, 152, 304, 166]",MISC
1562,##g,"[203, 152, 304, 166]",MISC
1563,##re,"[203, 152, 304, 166]",MISC
1564,##S,"[203, 152, 304, 166]",MISC
1565,##QL,"[203, 152, 304, 166]",MISC
1566,",","[203, 152, 304, 166]",MISC
1567,Tea,"[305, 152, 369, 166]",MISC
1568,##leaf,"[305, 152, 369, 166]",MISC
1569,and,"[370, 152, 398, 166]",MISC
1570,S,"[398, 152, 462, 166]",MISC
1571,##p,"[398, 152, 462, 166]",MISC
1572,##lu,"[398, 152, 462, 166]",MISC
1573,##nk,"[398, 152, 462, 166]",MISC
1574,.,"[398, 152, 462, 166]",MISC
1575,-,"[462, 152, 464, 166]",MISC
1576,NL,"[462, 152, 464, 166]",MISC
1577,-,"[462, 152, 464, 166]",MISC
1578,S,"[93, 204, 161, 216]",MISC
1579,##UM,"[93, 204, 161, 216]",MISC
1580,##ME,"[93, 204, 161, 216]",MISC
1581,##R,"[93, 204, 161, 216]",MISC
1582,IN,"[162, 204, 276, 216]",MISC
1583,##TE,"[162, 204, 276, 216]",MISC
1584,##R,"[162, 204, 276, 216]",MISC
1585,##NS,"[162, 204, 276, 216]",MISC
1586,##H,"[162, 204, 276, 216]",MISC
1587,##IP,"[162, 204, 276, 216]",MISC
1588,D,"[277, 204, 345, 216]",MISC
1589,##UR,"[277, 204, 345, 216]",MISC
1590,##ING,"[277, 204, 345, 216]",MISC
1591,Engineering,"[346, 204, 473, 216]",MISC
1592,-,"[473, 204, 474, 216]",MISC
1593,NL,"[473, 204, 474, 216]",MISC
1594,-,"[473, 204, 474, 216]",MISC
1595,National,"[93, 229, 169, 241]",MISC
1596,Mine,"[169, 229, 235, 241]",MISC
1597,##ral,"[169, 229, 235, 241]",MISC
1598,Development,"[236, 229, 340, 241]",MISC
1599,-,"[341, 229, 343, 241]",MISC
1600,NL,"[341, 229, 343, 241]",MISC
1601,-,"[341, 229, 343, 241]",MISC
1602,Ty,"[436, 229, 476, 241]",B-employer_company_name
1603,##re,"[436, 229, 476, 241]",I-employer_company_name
1604,Life,"[477, 229, 517, 241]",I-employer_company_name
1605,Management,"[517, 229, 618, 241]",I-employer_company_name
1606,System,"[618, 229, 679, 241]",I-employer_company_name
1607,-,"[679, 229, 681, 241]",MISC
1608,NL,"[679, 229, 681, 241]",MISC
1609,-,"[679, 229, 681, 241]",MISC
1610,June,"[826, 229, 871, 241]",MISC
1611,",","[826, 229, 871, 241]",MISC
1612,2010,"[871, 229, 906, 241]",MISC
1613,–,"[907, 229, 916, 241]",MISC
1614,July,"[916, 229, 961, 241]",MISC
1615,",","[916, 229, 961, 241]",MISC
1616,-,"[961, 229, 963, 241]",MISC
1617,NL,"[961, 229, 963, 241]",MISC
1618,-,"[961, 229, 963, 241]",MISC
1619,Corporation,"[93, 246, 192, 258]",MISC
1620,Ltd,"[192, 246, 218, 258]",MISC
1621,-,"[220, 246, 221, 258]",MISC
1622,NL,"[220, 246, 221, 258]",MISC
1623,-,"[220, 246, 221, 258]",MISC
1624,2010,"[831, 246, 868, 258]",MISC
1625,(,"[869, 246, 887, 258]",MISC
1626,2,"[869, 246, 887, 258]",MISC
1627,months,"[888, 246, 954, 258]",MISC
1628,),"[888, 246, 954, 258]",MISC
1629,-,"[954, 246, 956, 258]",MISC
1630,NL,"[954, 246, 956, 258]",MISC
1631,-,"[954, 246, 956, 258]",MISC
1632,Dev,"[83, 266, 171, 278]",MISC
1633,##elo,"[83, 266, 171, 278]",MISC
1634,##ped,"[83, 266, 171, 278]",MISC
1635,Ty,"[171, 266, 210, 278]",MISC
1636,##re,"[171, 266, 210, 278]",MISC
1637,life,"[211, 266, 249, 278]",MISC
1638,management,"[250, 266, 347, 278]",MISC
1639,application,"[349, 266, 456, 278]",MISC
1640,based,"[457, 266, 506, 278]",MISC
1641,on,"[507, 266, 526, 278]",MISC
1642,P,"[526, 266, 556, 278]",MISC
1643,##HP,"[526, 266, 556, 278]",MISC
1644,and,"[556, 266, 585, 278]",MISC
1645,my,"[585, 266, 644, 278]",MISC
1646,##s,"[585, 266, 644, 278]",MISC
1647,##q,"[585, 266, 644, 278]",MISC
1648,##l,"[585, 266, 644, 278]",MISC
1649,.,"[585, 266, 644, 278]",MISC
1650,It,"[645, 266, 664, 278]",MISC
1651,provides,"[664, 266, 742, 278]",MISC
1652,end,"[743, 266, 773, 278]",MISC
1653,to,"[773, 266, 792, 278]",MISC
1654,end,"[792, 266, 822, 278]",MISC
1655,solution,"[822, 266, 900, 278]",MISC
1656,for,"[901, 266, 930, 278]",MISC
1657,the,"[930, 266, 960, 278]",MISC
1658,t,"[960, 266, 998, 278]",MISC
1659,##yre,"[960, 266, 998, 278]",MISC
1660,-,"[999, 266, 1001, 278]",MISC
1661,NL,"[999, 266, 1001, 278]",MISC
1662,-,"[999, 266, 1001, 278]",MISC
1663,record,"[83, 282, 136, 295]",MISC
1664,maintenance,"[138, 282, 238, 295]",MISC
1665,and,"[239, 282, 265, 295]",MISC
1666,the,"[266, 282, 292, 295]",MISC
1667,t,"[294, 282, 330, 295]",MISC
1668,##yre,"[294, 282, 330, 295]",MISC
1669,life,"[330, 282, 367, 295]",MISC
1670,calculation,"[367, 282, 467, 295]",MISC
1671,in,"[468, 282, 485, 295]",MISC
1672,the,"[486, 282, 512, 295]",MISC
1673,mines,"[514, 282, 567, 295]",MISC
1674,",","[514, 282, 567, 295]",MISC
1675,which,"[569, 282, 614, 295]",MISC
1676,minimize,"[614, 282, 696, 295]",MISC
1677,##d,"[614, 282, 696, 295]",MISC
1678,paper,"[697, 282, 742, 295]",MISC
1679,work,"[743, 282, 788, 295]",MISC
1680,.,"[743, 282, 788, 295]",MISC
1681,The,"[789, 282, 815, 295]",MISC
1682,various,"[816, 282, 880, 295]",MISC
1683,features,"[880, 282, 953, 295]",MISC
1684,of,"[954, 282, 971, 295]",MISC
1685,the,"[972, 282, 998, 295]",MISC
1686,-,"[1000, 282, 1001, 295]",MISC
1687,NL,"[1000, 282, 1001, 295]",MISC
1688,-,"[1000, 282, 1001, 295]",MISC
1689,system,"[83, 299, 136, 311]",MISC
1690,are,"[137, 299, 163, 311]",MISC
1691,-,"[164, 299, 173, 311]",MISC
1692,t,"[173, 299, 208, 311]",MISC
1693,##yre,"[173, 299, 208, 311]",MISC
1694,removal,"[210, 299, 353, 311]",MISC
1695,",","[210, 299, 353, 311]",MISC
1696,fit,"[210, 299, 353, 311]",MISC
1697,##ment,"[210, 299, 353, 311]",MISC
1698,",","[210, 299, 353, 311]",MISC
1699,h,"[354, 299, 380, 311]",MISC
1700,##m,"[354, 299, 380, 311]",MISC
1701,##r,"[354, 299, 380, 311]",MISC
1702,up,"[382, 299, 453, 311]",MISC
1703,##dation,"[382, 299, 453, 311]",MISC
1704,and,"[454, 299, 480, 311]",MISC
1705,generation,"[481, 299, 571, 311]",MISC
1706,of,"[572, 299, 589, 311]",MISC
1707,performance,"[590, 299, 689, 311]",MISC
1708,reports,"[690, 299, 761, 311]",MISC
1709,.,"[690, 299, 761, 311]",MISC
1710,-,"[762, 299, 764, 311]",MISC
1711,NL,"[762, 299, 764, 311]",MISC
1712,-,"[762, 299, 764, 311]",MISC
1713,Major,"[102, 332, 145, 344]",B-employer_role
1714,project,"[147, 332, 209, 344]",I-employer_role
1715,in,"[210, 332, 227, 344]",I-employer_role
1716,college,"[228, 332, 290, 344]",I-employer_role
1717,-,"[291, 332, 292, 344]",MISC
1718,NL,"[291, 332, 292, 344]",MISC
1719,-,"[291, 332, 292, 344]",MISC
1720,Vision,"[447, 332, 500, 344]",B-employer_company_name
1721,for,"[502, 332, 528, 344]",I-employer_company_name
1722,blind,"[529, 332, 574, 344]",I-employer_company_name
1723,-,"[575, 332, 577, 344]",MISC
1724,NL,"[575, 332, 577, 344]",MISC
1725,-,"[575, 332, 577, 344]",MISC
1726,Nov,"[840, 332, 882, 344]",MISC
1727,",","[840, 332, 882, 344]",MISC
1728,2010,"[882, 332, 923, 344]",MISC
1729,–,"[923, 332, 934, 344]",MISC
1730,May,"[934, 332, 975, 344]",MISC
1731,",","[934, 332, 975, 344]",MISC
1732,-,"[975, 332, 977, 344]",MISC
1733,NL,"[975, 332, 977, 344]",MISC
1734,-,"[975, 332, 977, 344]",MISC
1735,2011,"[845, 349, 882, 362]",MISC
1736,(,"[883, 349, 900, 362]",MISC
1737,7,"[883, 349, 900, 362]",MISC
1738,months,"[902, 349, 968, 362]",MISC
1739,),"[902, 349, 968, 362]",MISC
1740,-,"[968, 349, 970, 362]",MISC
1741,NL,"[968, 349, 970, 362]",MISC
1742,-,"[968, 349, 970, 362]",MISC
1743,Led,"[83, 365, 110, 378]",MISC
1744,a,"[112, 365, 120, 378]",MISC
1745,team,"[121, 365, 160, 378]",MISC
1746,of,"[160, 365, 179, 378]",MISC
1747,3,"[179, 365, 188, 378]",MISC
1748,members,"[189, 365, 257, 378]",MISC
1749,to,"[257, 365, 276, 378]",MISC
1750,develop,"[276, 365, 344, 378]",MISC
1751,the,"[344, 365, 372, 378]",MISC
1752,major,"[373, 365, 420, 378]",MISC
1753,project,"[421, 365, 489, 378]",MISC
1754,under,"[489, 365, 536, 378]",MISC
1755,the,"[537, 365, 565, 378]",MISC
1756,domain,"[566, 365, 624, 378]",MISC
1757,of,"[624, 365, 643, 378]",MISC
1758,image,"[644, 365, 690, 378]",MISC
1759,processing,"[692, 365, 798, 378]",MISC
1760,.,"[692, 365, 798, 378]",MISC
1761,-,"[798, 365, 800, 378]",MISC
1762,NL,"[798, 365, 800, 378]",MISC
1763,-,"[798, 365, 800, 378]",MISC
1764,The,"[83, 383, 109, 395]",MISC
1765,system,"[110, 383, 163, 395]",MISC
1766,analyses,"[164, 383, 235, 395]",MISC
1767,the,"[236, 383, 262, 395]",MISC
1768,images,"[263, 383, 317, 395]",MISC
1769,and,"[317, 383, 343, 395]",MISC
1770,identifies,"[344, 383, 434, 395]",MISC
1771,text,"[434, 383, 469, 395]",MISC
1772,contents,"[470, 383, 541, 395]",MISC
1773,in,"[542, 383, 560, 395]",MISC
1774,them,"[560, 383, 605, 395]",MISC
1775,.,"[560, 383, 605, 395]",MISC
1776,The,"[605, 383, 631, 395]",MISC
1777,detection,"[632, 383, 712, 395]",MISC
1778,and,"[714, 383, 740, 395]",MISC
1779,recognition,"[741, 383, 839, 395]",MISC
1780,of,"[840, 383, 857, 395]",MISC
1781,text,"[858, 383, 892, 395]",MISC
1782,in,"[894, 383, 911, 395]",MISC
1783,images,"[912, 383, 966, 395]",MISC
1784,is,"[966, 383, 983, 395]",MISC
1785,-,"[984, 383, 986, 395]",MISC
1786,NL,"[984, 383, 986, 395]",MISC
1787,-,"[984, 383, 986, 395]",MISC
1788,implemented,"[83, 403, 180, 416]",MISC
1789,using,"[181, 403, 224, 416]",MISC
1790,the,"[225, 403, 251, 416]",MISC
1791,principles,"[252, 403, 341, 416]",MISC
1792,of,"[341, 403, 359, 416]",MISC
1793,image,"[359, 403, 403, 416]",MISC
1794,processing,"[404, 403, 501, 416]",MISC
1795,.,"[404, 403, 501, 416]",MISC
1796,-,"[502, 403, 504, 416]",MISC
1797,NL,"[502, 403, 504, 416]",MISC
1798,-,"[502, 403, 504, 416]",MISC
1799,E,"[91, 458, 202, 470]",B-education_heading
1800,##D,"[91, 458, 202, 470]",I-education_heading
1801,##UC,"[91, 458, 202, 470]",I-education_heading
1802,##AT,"[91, 458, 202, 470]",I-education_heading
1803,##ION,"[91, 458, 202, 470]",I-education_heading
1804,-,"[202, 458, 204, 470]",MISC
1805,NL,"[202, 458, 204, 470]",MISC
1806,-,"[202, 458, 204, 470]",MISC
1807,Examination,"[138, 503, 253, 517]",MISC
1808,-,"[254, 503, 264, 517]",MISC
1809,School,"[264, 503, 410, 517]",MISC
1810,/,"[264, 503, 410, 517]",MISC
1811,College,"[264, 503, 410, 517]",MISC
1812,-,"[412, 503, 422, 517]",MISC
1813,Board,"[422, 503, 485, 517]",MISC
1814,/,"[422, 503, 485, 517]",MISC
1815,University,"[485, 503, 589, 517]",MISC
1816,-,"[590, 503, 601, 517]",MISC
1817,Year,"[601, 503, 643, 517]",MISC
1818,of,"[643, 503, 664, 517]",MISC
1819,Pass,"[664, 503, 737, 517]",MISC
1820,##ing,"[664, 503, 737, 517]",MISC
1821,-,"[738, 503, 748, 517]",MISC
1822,Per,"[748, 503, 852, 517]",MISC
1823,##cent,"[748, 503, 852, 517]",MISC
1824,##age,"[748, 503, 852, 517]",MISC
1825,/,"[853, 503, 864, 517]",MISC
1826,C,"[864, 503, 905, 517]",MISC
1827,##GP,"[864, 503, 905, 517]",MISC
1828,##A,"[864, 503, 905, 517]",MISC
1829,-,"[906, 503, 908, 517]",MISC
1830,NL,"[906, 503, 908, 517]",MISC
1831,-,"[906, 503, 908, 517]",MISC
1832,B,"[152, 554, 207, 559]",B-education_degree
1833,.,"[152, 554, 207, 559]",I-education_degree
1834,E,"[152, 554, 207, 559]",I-education_degree
1835,(,"[208, 554, 300, 559]",MISC
1836,CS,"[208, 554, 300, 559]",B-education_course
1837,##E,"[208, 554, 300, 559]",I-education_course
1838,),"[208, 554, 300, 559]",MISC
1839,-,"[301, 554, 318, 559]",MISC
1840,SD,"[319, 554, 449, 559]",B-education_institute
1841,##MC,"[319, 554, 449, 559]",I-education_institute
1842,##ET,"[319, 554, 449, 559]",I-education_institute
1843,",","[319, 554, 449, 559]",I-education_institute
1844,D,"[449, 554, 579, 559]",I-education_institute
1845,##har,"[449, 554, 579, 559]",I-education_institute
1846,##wa,"[449, 554, 579, 559]",I-education_institute
1847,##d,"[449, 554, 579, 559]",I-education_institute
1848,-,"[579, 554, 597, 559]",MISC
1849,V,"[598, 554, 653, 559]",MISC
1850,##TU,"[598, 554, 653, 559]",MISC
1851,-,"[654, 554, 671, 559]",MISC
1852,2011,"[672, 554, 745, 559]",MISC
1853,-,"[746, 554, 764, 559]",MISC
1854,9,"[765, 554, 838, 559]",MISC
1855,.,"[765, 554, 838, 559]",MISC
1856,3,"[765, 554, 838, 559]",MISC
1857,/,"[765, 554, 838, 559]",MISC
1858,10,"[839, 554, 876, 559]",MISC
1859,-,"[876, 554, 878, 559]",MISC
1860,NL,"[876, 554, 878, 559]",MISC
1861,-,"[876, 554, 878, 559]",MISC
1862,XII,"[176, 589, 218, 597]",B-education_degree
1863,-,"[219, 589, 233, 597]",MISC
1864,Ken,"[234, 589, 348, 597]",B-education_institute
1865,##dr,"[234, 589, 348, 597]",I-education_institute
1866,##iya,"[234, 589, 348, 597]",I-education_institute
1867,V,"[349, 589, 477, 597]",I-education_institute
1868,##idy,"[349, 589, 477, 597]",I-education_institute
1869,##alaya,"[349, 589, 477, 597]",I-education_institute
1870,Don,"[479, 589, 607, 597]",I-education_institute
1871,##ima,"[479, 589, 607, 597]",I-education_institute
1872,##lai,"[479, 589, 607, 597]",I-education_institute
1873,-,"[608, 589, 622, 597]",MISC
1874,C,"[623, 589, 737, 597]",MISC
1875,.,"[623, 589, 737, 597]",MISC
1876,B,"[623, 589, 737, 597]",MISC
1877,.,"[623, 589, 737, 597]",MISC
1878,S,"[623, 589, 737, 597]",MISC
1879,.,"[623, 589, 737, 597]",MISC
1880,E,"[623, 589, 737, 597]",MISC
1881,.,"[623, 589, 737, 597]",MISC
1882,-,"[738, 589, 752, 597]",MISC
1883,2007,"[753, 589, 810, 597]",MISC
1884,-,"[810, 589, 824, 597]",MISC
1885,89,"[825, 589, 866, 597]",MISC
1886,%,"[825, 589, 866, 597]",MISC
1887,-,"[868, 589, 870, 597]",MISC
1888,NL,"[868, 589, 870, 597]",MISC
1889,-,"[868, 589, 870, 597]",MISC
1890,X,"[183, 621, 197, 635]",B-education_degree
1891,-,"[198, 621, 212, 635]",MISC
1892,Ken,"[213, 621, 331, 635]",B-education_institute
1893,##dr,"[213, 621, 331, 635]",I-education_institute
1894,##iya,"[213, 621, 331, 635]",I-education_institute
1895,V,"[332, 621, 465, 635]",I-education_institute
1896,##idy,"[332, 621, 465, 635]",I-education_institute
1897,##alaya,"[332, 621, 465, 635]",I-education_institute
1898,Don,"[466, 621, 599, 635]",I-education_institute
1899,##ima,"[466, 621, 599, 635]",I-education_institute
1900,##lai,"[466, 621, 599, 635]",I-education_institute
1901,-,"[600, 621, 614, 635]",MISC
1902,C,"[615, 621, 733, 635]",MISC
1903,.,"[615, 621, 733, 635]",MISC
1904,B,"[615, 621, 733, 635]",MISC
1905,.,"[615, 621, 733, 635]",MISC
1906,S,"[615, 621, 733, 635]",MISC
1907,.,"[615, 621, 733, 635]",MISC
1908,E,"[615, 621, 733, 635]",MISC
1909,.,"[615, 621, 733, 635]",MISC
1910,-,"[734, 621, 748, 635]",MISC
1911,2005,"[749, 621, 808, 635]",MISC
1912,-,"[808, 621, 822, 635]",MISC
1913,94,"[823, 621, 866, 635]",MISC
1914,%,"[823, 621, 866, 635]",MISC
1915,-,"[868, 621, 870, 635]",MISC
1916,NL,"[868, 621, 870, 635]",MISC
1917,-,"[868, 621, 870, 635]",MISC
1918,CE,"[93, 721, 246, 733]",B-others_heading
1919,##RT,"[93, 721, 246, 733]",I-others_heading
1920,##IF,"[93, 721, 246, 733]",I-others_heading
1921,##IC,"[93, 721, 246, 733]",I-others_heading
1922,##AT,"[93, 721, 246, 733]",I-others_heading
1923,##ION,"[93, 721, 246, 733]",I-others_heading
1924,##S,"[93, 721, 246, 733]",I-others_heading
1925,-,"[246, 721, 247, 733]",MISC
1926,NL,"[246, 721, 247, 733]",MISC
1927,-,"[246, 721, 247, 733]",MISC
1928,Oracle,"[83, 741, 135, 757]",MISC
1929,Certified,"[136, 741, 216, 757]",MISC
1930,Java,"[216, 741, 251, 757]",MISC
1931,Professional,"[252, 741, 366, 757]",MISC
1932,.,"[252, 741, 366, 757]",MISC
1933,-,"[367, 741, 369, 757]",MISC
1934,NL,"[367, 741, 369, 757]",MISC
1935,-,"[367, 741, 369, 757]",MISC
1936,Oracle,"[83, 758, 139, 774]",MISC
1937,Certified,"[139, 758, 223, 774]",MISC
1938,Web,"[223, 758, 315, 774]",MISC
1939,##S,"[223, 758, 315, 774]",MISC
1940,##er,"[223, 758, 315, 774]",MISC
1941,##vice,"[223, 758, 315, 774]",MISC
1942,Dev,"[317, 758, 409, 774]",MISC
1943,##elo,"[317, 758, 409, 774]",MISC
1944,##per,"[317, 758, 409, 774]",MISC
1945,.,"[317, 758, 409, 774]",MISC
1946,-,"[410, 758, 412, 774]",MISC
1947,NL,"[410, 758, 412, 774]",MISC
1948,-,"[410, 758, 412, 774]",MISC
1949,A,"[83, 777, 163, 793]",MISC
1950,##cc,"[83, 777, 163, 793]",MISC
1951,##ent,"[83, 777, 163, 793]",MISC
1952,##ure,"[83, 777, 163, 793]",MISC
1953,certified,"[163, 777, 243, 793]",MISC
1954,developer,"[243, 777, 322, 793]",MISC
1955,(,"[323, 777, 428, 793]",MISC
1956,Certificate,"[323, 777, 428, 793]",MISC
1957,from,"[429, 777, 464, 793]",MISC
1958,MIT,"[465, 777, 508, 793]",MISC
1959,),"[465, 777, 508, 793]",MISC
1960,.,"[465, 777, 508, 793]",MISC
1961,-,"[509, 777, 511, 793]",MISC
1962,NL,"[509, 777, 511, 793]",MISC
1963,-,"[509, 777, 511, 793]",MISC
1964,E,"[83, 816, 140, 828]",B-others_heading
1965,##XT,"[83, 816, 140, 828]",I-others_heading
1966,##RA,"[83, 816, 140, 828]",I-others_heading
1967,C,"[141, 816, 257, 828]",I-others_heading
1968,##UR,"[141, 816, 257, 828]",I-others_heading
1969,##RI,"[141, 816, 257, 828]",I-others_heading
1970,##CU,"[141, 816, 257, 828]",I-others_heading
1971,##LA,"[141, 816, 257, 828]",I-others_heading
1972,##R,"[141, 816, 257, 828]",I-others_heading
1973,ACT,"[257, 816, 374, 828]",I-others_heading
1974,##I,"[257, 816, 374, 828]",I-others_heading
1975,##VI,"[257, 816, 374, 828]",I-others_heading
1976,##TI,"[257, 816, 374, 828]",I-others_heading
1977,##ES,"[257, 816, 374, 828]",I-others_heading
1978,-,"[374, 816, 376, 828]",MISC
1979,NL,"[374, 816, 376, 828]",MISC
1980,-,"[374, 816, 376, 828]",MISC
1981,Active,"[84, 843, 141, 859]",MISC
1982,member,"[142, 843, 199, 859]",MISC
1983,of,"[200, 843, 219, 859]",MISC
1984,the,"[219, 843, 247, 859]",MISC
1985,VA,"[248, 843, 295, 859]",MISC
1986,##J,"[248, 843, 295, 859]",MISC
1987,##RA,"[248, 843, 295, 859]",MISC
1988,initiative,"[296, 843, 392, 859]",MISC
1989,at,"[393, 843, 412, 859]",MISC
1990,A,"[412, 843, 508, 859]",MISC
1991,##cc,"[412, 843, 508, 859]",MISC
1992,##ent,"[412, 843, 508, 859]",MISC
1993,##ure,"[412, 843, 508, 859]",MISC
1994,.,"[412, 843, 508, 859]",MISC
1995,-,"[509, 843, 511, 859]",MISC
1996,NL,"[509, 843, 511, 859]",MISC
1997,-,"[509, 843, 511, 859]",MISC
1998,Volunteer,"[84, 862, 189, 878]",MISC
1999,##ed,"[84, 862, 189, 878]",MISC
2000,at,"[190, 862, 209, 878]",MISC
2001,multiple,"[210, 862, 296, 878]",MISC
2002,##s,"[210, 862, 296, 878]",MISC
2003,events,"[297, 862, 354, 878]",MISC
2004,under,"[355, 862, 402, 878]",MISC
2005,CS,"[403, 862, 431, 878]",MISC
2006,##R,"[403, 862, 431, 878]",MISC
2007,wing,"[432, 862, 470, 878]",MISC
2008,of,"[471, 862, 490, 878]",MISC
2009,A,"[490, 862, 586, 878]",MISC
2010,##cc,"[490, 862, 586, 878]",MISC
2011,##ent,"[490, 862, 586, 878]",MISC
2012,##ure,"[490, 862, 586, 878]",MISC
2013,.,"[490, 862, 586, 878]",MISC
2014,-,"[587, 862, 589, 878]",MISC
2015,NL,"[587, 862, 589, 878]",MISC
2016,-,"[587, 862, 589, 878]",MISC
2017,Per,"[84, 881, 170, 897]",MISC
2018,##formed,"[84, 881, 170, 897]",MISC
2019,dance,"[172, 881, 220, 897]",MISC
2020,during,"[221, 881, 278, 897]",MISC
2021,F,"[280, 881, 299, 897]",MISC
2022,##S,"[280, 881, 299, 897]",MISC
2023,f,"[299, 881, 337, 897]",MISC
2024,##ete,"[299, 881, 337, 897]",MISC
2025,A,"[338, 881, 435, 897]",MISC
2026,##cc,"[338, 881, 435, 897]",MISC
2027,##ent,"[338, 881, 435, 897]",MISC
2028,##ure,"[338, 881, 435, 897]",MISC
2029,.,"[338, 881, 435, 897]",MISC
2030,-,"[436, 881, 438, 897]",MISC
2031,NL,"[436, 881, 438, 897]",MISC
2032,-,"[436, 881, 438, 897]",MISC
2033,Played,"[84, 900, 139, 916]",MISC
2034,Key,"[140, 900, 215, 916]",MISC
2035,##board,"[140, 900, 215, 916]",MISC
2036,during,"[216, 900, 272, 916]",MISC
2037,various,"[273, 900, 339, 916]",MISC
2038,events,"[340, 900, 395, 916]",MISC
2039,in,"[397, 900, 414, 916]",MISC
2040,college,"[416, 900, 490, 916]",MISC
2041,.,"[416, 900, 490, 916]",MISC
2042,-,"[492, 900, 493, 916]",MISC
2043,NL,"[492, 900, 493, 916]",MISC
2044,-,"[492, 900, 493, 916]",MISC
2045,P,"[93, 949, 185, 961]",B-personal_details_heading
2046,##ER,"[93, 949, 185, 961]",I-personal_details_heading
2047,##SO,"[93, 949, 185, 961]",I-personal_details_heading
2048,##NA,"[93, 949, 185, 961]",I-personal_details_heading
2049,##L,"[93, 949, 185, 961]",I-personal_details_heading
2050,PR,"[186, 949, 268, 961]",I-personal_details_heading
2051,##O,"[186, 949, 268, 961]",I-personal_details_heading
2052,##FI,"[186, 949, 268, 961]",I-personal_details_heading
2053,##LE,"[186, 949, 268, 961]",I-personal_details_heading
2054,-,"[268, 949, 270, 961]",MISC
2055,NL,"[268, 949, 270, 961]",MISC
2056,-,"[268, 949, 270, 961]",MISC
2057,Date,"[74, 987, 109, 1000]",MISC
2058,of,"[110, 987, 128, 1000]",MISC
2059,Birth,"[128, 987, 182, 1000]",MISC
2060,:,"[128, 987, 182, 1000]",MISC
2061,July,"[183, 987, 217, 1000]",MISC
2062,19,"[219, 987, 245, 1000]",MISC
2063,",","[219, 987, 245, 1000]",MISC
2064,1990,"[246, 987, 280, 1000]",MISC
2065,-,"[282, 987, 284, 1000]",MISC
2066,NL,"[282, 987, 284, 1000]",MISC
2067,-,"[282, 987, 284, 1000]",MISC
2068,Gender,"[74, 18, 142, 30]",MISC
2069,:,"[74, 18, 142, 30]",MISC
2070,Female,"[143, 18, 202, 30]",MISC
2071,-,"[202, 18, 204, 30]",MISC
2072,NL,"[202, 18, 204, 30]",MISC
2073,-,"[202, 18, 204, 30]",MISC
2074,Mari,"[74, 35, 131, 48]",MISC
2075,##tal,"[74, 35, 131, 48]",MISC
2076,Status,"[133, 35, 190, 48]",MISC
2077,:,"[133, 35, 190, 48]",MISC
2078,Single,"[192, 35, 242, 48]",MISC
2079,-,"[242, 35, 244, 48]",MISC
2080,NL,"[242, 35, 244, 48]",MISC
2081,-,"[242, 35, 244, 48]",MISC
2082,Languages,"[74, 51, 162, 64]",MISC
2083,Known,"[163, 51, 222, 64]",MISC
2084,:,"[163, 51, 222, 64]",MISC
2085,English,"[222, 51, 300, 64]",MISC
2086,",","[222, 51, 300, 64]",MISC
2087,Hindi,"[301, 51, 349, 64]",MISC
2088,and,"[350, 51, 379, 64]",MISC
2089,Kannada,"[379, 51, 447, 64]",MISC
2090,-,"[448, 51, 450, 64]",MISC
2091,NL,"[448, 51, 450, 64]",MISC
2092,-,"[448, 51, 450, 64]",MISC
