,token,box,label
0,Deep,"[62, 67, 126, 85]",B-name
1,##ak,"[62, 67, 126, 85]",I-name
2,T,"[126, 67, 191, 85]",I-name
3,##i,"[126, 67, 191, 85]",I-name
4,##wari,"[126, 67, 191, 85]",I-name
5,-,"[191, 67, 193, 85]",MISC
6,NL,"[191, 67, 193, 85]",MISC
7,-,"[191, 67, 193, 85]",MISC
8,E,"[62, 105, 133, 123]",MISC
9,-,"[62, 105, 133, 123]",MISC
10,mail,"[62, 105, 133, 123]",MISC
11,:,"[62, 105, 133, 123]",MISC
12,dip,"[134, 105, 371, 123]",B-emails_email
13,##ak,"[134, 105, 371, 123]",I-emails_email
14,##te,"[134, 105, 371, 123]",I-emails_email
15,##wari,"[134, 105, 371, 123]",I-emails_email
16,##6,"[134, 105, 371, 123]",I-emails_email
17,##7,"[134, 105, 371, 123]",I-emails_email
18,@,"[134, 105, 371, 123]",I-emails_email
19,g,"[134, 105, 371, 123]",I-emails_email
20,##mail,"[134, 105, 371, 123]",I-emails_email
21,.,"[134, 105, 371, 123]",I-emails_email
22,com,"[134, 105, 371, 123]",I-emails_email
23,-,"[372, 105, 373, 123]",MISC
24,NL,"[372, 105, 373, 123]",MISC
25,-,"[372, 105, 373, 123]",MISC
26,Mobile,"[751, 105, 826, 123]",MISC
27,:,"[751, 105, 826, 123]",MISC
28,+,"[826, 105, 976, 123]",B-phones_phone
29,91,"[826, 105, 976, 123]",I-phones_phone
30,-,"[826, 105, 976, 123]",I-phones_phone
31,95,"[826, 105, 976, 123]",I-phones_phone
32,##38,"[826, 105, 976, 123]",I-phones_phone
33,##9,"[826, 105, 976, 123]",I-phones_phone
34,##7,"[826, 105, 976, 123]",I-phones_phone
35,##9,"[826, 105, 976, 123]",I-phones_phone
36,##70,"[826, 105, 976, 123]",I-phones_phone
37,##4,"[826, 105, 976, 123]",I-phones_phone
38,-,"[977, 105, 979, 123]",MISC
39,NL,"[977, 105, 979, 123]",MISC
40,-,"[977, 105, 979, 123]",MISC
41,Experience,"[62, 143, 191, 164]",B-summary_heading
42,Su,"[192, 143, 294, 164]",I-summary_heading
43,##mma,"[192, 143, 294, 164]",I-summary_heading
44,##ry,"[192, 143, 294, 164]",I-summary_heading
45,:,"[192, 143, 294, 164]",I-summary_heading
46,-,"[295, 143, 297, 164]",MISC
47,NL,"[295, 143, 297, 164]",MISC
48,-,"[295, 143, 297, 164]",MISC
49,Senior,"[62, 183, 123, 201]",B-employer_role
50,Associate,"[125, 183, 217, 201]",I-employer_role
51,with,"[218, 183, 258, 201]",MISC
52,6,"[260, 183, 279, 201]",MISC
53,+,"[260, 183, 279, 201]",MISC
54,years,"[281, 183, 331, 201]",MISC
55,of,"[333, 183, 352, 201]",MISC
56,experience,"[354, 183, 456, 201]",MISC
57,in,"[458, 183, 477, 201]",MISC
58,IT,"[479, 183, 498, 201]",MISC
59,industry,"[500, 183, 592, 201]",MISC
60,.,"[500, 183, 592, 201]",MISC
61,Experience,"[593, 183, 696, 201]",MISC
62,in,"[697, 183, 717, 201]",MISC
63,Sales,"[718, 183, 831, 201]",MISC
64,##force,"[718, 183, 831, 201]",MISC
65,",","[718, 183, 831, 201]",MISC
66,Software,"[833, 183, 915, 201]",MISC
67,Testing,"[916, 183, 998, 201]",MISC
68,",","[916, 183, 998, 201]",MISC
69,-,"[1000, 183, 1001, 201]",MISC
70,NL,"[1000, 183, 1001, 201]",MISC
71,-,"[1000, 183, 1001, 201]",MISC
72,Se,"[62, 202, 140, 219]",MISC
73,##len,"[62, 202, 140, 219]",MISC
74,##ium,"[62, 202, 140, 219]",MISC
75,Web,"[141, 202, 171, 219]",MISC
76,Auto,"[171, 202, 278, 219]",MISC
77,##mation,"[171, 202, 278, 219]",MISC
78,",","[171, 202, 278, 219]",MISC
79,team,"[279, 202, 317, 219]",MISC
80,leading,"[319, 202, 386, 219]",MISC
81,&,"[388, 202, 396, 219]",MISC
82,training,"[398, 202, 486, 219]",MISC
83,",","[398, 202, 486, 219]",MISC
84,client,"[486, 202, 546, 219]",MISC
85,interactions,"[546, 202, 664, 219]",MISC
86,and,"[664, 202, 694, 219]",MISC
87,technical,"[694, 202, 782, 219]",MISC
88,guidance,"[782, 202, 871, 219]",MISC
89,.,"[782, 202, 871, 219]",MISC
90,Pro,"[871, 202, 930, 219]",MISC
91,##ven,"[871, 202, 930, 219]",MISC
92,ability,"[930, 202, 998, 219]",MISC
93,-,"[999, 202, 1001, 219]",MISC
94,NL,"[999, 202, 1001, 219]",MISC
95,-,"[999, 202, 1001, 219]",MISC
96,in,"[62, 221, 83, 238]",MISC
97,Se,"[83, 221, 167, 238]",MISC
98,##len,"[83, 221, 167, 238]",MISC
99,##ium,"[83, 221, 167, 238]",MISC
100,automation,"[168, 221, 274, 238]",MISC
101,with,"[274, 221, 316, 238]",MISC
102,Java,"[317, 221, 369, 238]",MISC
103,.,"[317, 221, 369, 238]",MISC
104,-,"[370, 221, 372, 238]",MISC
105,NL,"[370, 221, 372, 238]",MISC
106,-,"[370, 221, 372, 238]",MISC
107,Ski,"[62, 257, 120, 278]",MISC
108,##ll,"[62, 257, 120, 278]",MISC
109,Su,"[121, 257, 213, 278]",MISC
110,##mma,"[121, 257, 213, 278]",MISC
111,##ry,"[121, 257, 213, 278]",MISC
112,:,"[121, 257, 213, 278]",MISC
113,Sales,"[215, 257, 331, 278]",MISC
114,##force,"[215, 257, 331, 278]",MISC
115,Testing,"[332, 257, 424, 278]",MISC
116,.,"[332, 257, 424, 278]",MISC
117,-,"[426, 257, 427, 278]",MISC
118,NL,"[426, 257, 427, 278]",MISC
119,-,"[426, 257, 427, 278]",MISC
120,Re,"[73, 296, 179, 310]",MISC
121,##mark,"[73, 296, 179, 310]",MISC
122,##able,"[73, 296, 179, 310]",MISC
123,experience,"[180, 296, 286, 310]",MISC
124,with,"[287, 296, 329, 310]",MISC
125,Sales,"[330, 296, 436, 310]",MISC
126,##force,"[330, 296, 436, 310]",MISC
127,CR,"[437, 296, 478, 310]",MISC
128,##M,"[437, 296, 478, 310]",MISC
129,.,"[437, 296, 478, 310]",MISC
130,-,"[480, 296, 481, 310]",MISC
131,NL,"[480, 296, 481, 310]",MISC
132,-,"[480, 296, 481, 310]",MISC
133,Understanding,"[72, 315, 205, 329]",MISC
134,of,"[206, 315, 225, 329]",MISC
135,A,"[226, 315, 277, 329]",MISC
136,##pe,"[226, 315, 277, 329]",MISC
137,##x,"[226, 315, 277, 329]",MISC
138,",","[226, 315, 277, 329]",MISC
139,Visual,"[277, 315, 338, 329]",MISC
140,force,"[339, 315, 400, 329]",MISC
141,.,"[339, 315, 400, 329]",MISC
142,Good,"[401, 315, 441, 329]",MISC
143,knowledge,"[442, 315, 534, 329]",MISC
144,of,"[534, 315, 553, 329]",MISC
145,database,"[554, 315, 636, 329]",MISC
146,administration,"[636, 315, 779, 329]",MISC
147,and,"[780, 315, 810, 329]",MISC
148,que,"[811, 315, 861, 329]",MISC
149,##ry,"[811, 315, 861, 329]",MISC
150,language,"[862, 315, 954, 329]",MISC
151,.,"[862, 315, 954, 329]",MISC
152,-,"[954, 315, 956, 329]",MISC
153,NL,"[954, 315, 956, 329]",MISC
154,-,"[954, 315, 956, 329]",MISC
155,Ex,"[72, 332, 161, 347]",MISC
156,##pert,"[72, 332, 161, 347]",MISC
157,##ise,"[72, 332, 161, 347]",MISC
158,in,"[161, 332, 180, 347]",MISC
159,Organization,"[181, 332, 299, 347]",MISC
160,setup,"[300, 332, 359, 347]",MISC
161,",","[300, 332, 359, 347]",MISC
162,Use,"[360, 332, 398, 347]",MISC
163,##r,"[360, 332, 398, 347]",MISC
164,setup,"[399, 332, 448, 347]",MISC
165,and,"[449, 332, 478, 347]",MISC
166,other,"[479, 332, 527, 347]",MISC
167,ad,"[528, 332, 577, 347]",MISC
168,##min,"[528, 332, 577, 347]",MISC
169,configurations,"[578, 332, 726, 347]",MISC
170,.,"[578, 332, 726, 347]",MISC
171,-,"[726, 332, 728, 347]",MISC
172,NL,"[726, 332, 728, 347]",MISC
173,-,"[726, 332, 728, 347]",MISC
174,Experience,"[72, 351, 167, 365]",MISC
175,in,"[169, 351, 188, 365]",MISC
176,creating,"[188, 351, 264, 365]",MISC
177,work,"[265, 351, 352, 365]",MISC
178,##flow,"[265, 351, 352, 365]",MISC
179,##s,"[265, 351, 352, 365]",MISC
180,rules,"[353, 351, 410, 365]",MISC
181,",","[353, 351, 410, 365]",MISC
182,approval,"[411, 351, 487, 365]",MISC
183,processes,"[488, 351, 584, 365]",MISC
184,",","[488, 351, 584, 365]",MISC
185,valid,"[585, 351, 681, 365]",MISC
186,##ation,"[585, 351, 681, 365]",MISC
187,rules,"[682, 351, 729, 365]",MISC
188,and,"[730, 351, 758, 365]",MISC
189,process,"[759, 351, 825, 365]",MISC
190,builders,"[827, 351, 903, 365]",MISC
191,for,"[904, 351, 932, 365]",MISC
192,-,"[933, 351, 935, 365]",MISC
193,NL,"[933, 351, 935, 365]",MISC
194,-,"[933, 351, 935, 365]",MISC
195,sales,"[93, 367, 177, 384]",MISC
196,##force,"[93, 367, 177, 384]",MISC
197,applications,"[177, 367, 285, 384]",MISC
198,.,"[177, 367, 285, 384]",MISC
199,-,"[286, 367, 288, 384]",MISC
200,NL,"[286, 367, 288, 384]",MISC
201,-,"[286, 367, 288, 384]",MISC
202,A,"[71, 388, 136, 403]",MISC
203,##bility,"[71, 388, 136, 403]",MISC
204,to,"[136, 388, 154, 403]",MISC
205,translate,"[155, 388, 236, 403]",MISC
206,business,"[238, 388, 311, 403]",MISC
207,requirements,"[312, 388, 422, 403]",MISC
208,into,"[423, 388, 460, 403]",MISC
209,application,"[460, 388, 561, 403]",MISC
210,functionality,"[562, 388, 691, 403]",MISC
211,.,"[562, 388, 691, 403]",MISC
212,-,"[692, 388, 693, 403]",MISC
213,NL,"[692, 388, 693, 403]",MISC
214,-,"[692, 388, 693, 403]",MISC
215,Hands,"[72, 407, 123, 422]",MISC
216,on,"[124, 407, 143, 422]",MISC
217,experience,"[145, 407, 247, 422]",MISC
218,in,"[248, 407, 267, 422]",MISC
219,Service,"[269, 407, 340, 422]",MISC
220,and,"[341, 407, 370, 422]",MISC
221,Sales,"[372, 407, 422, 422]",MISC
222,Applications,"[424, 407, 557, 422]",MISC
223,.,"[424, 407, 557, 422]",MISC
224,-,"[558, 407, 560, 422]",MISC
225,NL,"[558, 407, 560, 422]",MISC
226,-,"[558, 407, 560, 422]",MISC
227,Auto,"[62, 441, 180, 462]",MISC
228,##mation,"[62, 441, 180, 462]",MISC
229,Testing,"[182, 441, 278, 462]",MISC
230,:,"[182, 441, 278, 462]",MISC
231,-,"[278, 441, 280, 462]",MISC
232,NL,"[278, 441, 280, 462]",MISC
233,-,"[278, 441, 280, 462]",MISC
234,Ex,"[73, 479, 168, 493]",MISC
235,##pert,"[73, 479, 168, 493]",MISC
236,##ise,"[73, 479, 168, 493]",MISC
237,in,"[169, 479, 189, 493]",MISC
238,Se,"[190, 479, 273, 493]",MISC
239,##len,"[190, 479, 273, 493]",MISC
240,##ium,"[190, 479, 273, 493]",MISC
241,automation,"[275, 479, 381, 493]",MISC
242,using,"[382, 479, 434, 493]",MISC
243,Se,"[435, 479, 518, 493]",MISC
244,##len,"[435, 479, 518, 493]",MISC
245,##ium,"[435, 479, 518, 493]",MISC
246,Web,"[520, 479, 626, 493]",MISC
247,##D,"[520, 479, 626, 493]",MISC
248,##river,"[520, 479, 626, 493]",MISC
249,",","[520, 479, 626, 493]",MISC
250,J,"[626, 479, 679, 493]",MISC
251,##AV,"[626, 479, 679, 493]",MISC
252,##A,"[626, 479, 679, 493]",MISC
253,",","[626, 479, 679, 493]",MISC
254,Test,"[680, 479, 753, 493]",MISC
255,##NG,"[680, 479, 753, 493]",MISC
256,.,"[680, 479, 753, 493]",MISC
257,-,"[754, 479, 756, 493]",MISC
258,NL,"[754, 479, 756, 493]",MISC
259,-,"[754, 479, 756, 493]",MISC
260,Designed,"[72, 497, 154, 512]",MISC
261,and,"[155, 497, 184, 512]",MISC
262,implemented,"[185, 497, 297, 512]",MISC
263,different,"[298, 497, 391, 512]",MISC
264,automation,"[391, 497, 494, 512]",MISC
265,framework,"[494, 497, 596, 512]",MISC
266,##s,"[494, 497, 596, 512]",MISC
267,from,"[596, 497, 636, 512]",MISC
268,star,"[638, 497, 698, 512]",MISC
269,##ch,"[638, 497, 698, 512]",MISC
270,like,"[699, 497, 739, 512]",MISC
271,Page,"[740, 497, 780, 512]",MISC
272,O,"[781, 497, 853, 512]",MISC
273,##bject,"[781, 497, 853, 512]",MISC
274,##s,"[781, 497, 853, 512]",MISC
275,framework,"[853, 497, 956, 512]",MISC
276,",","[853, 497, 956, 512]",MISC
277,-,"[956, 497, 958, 512]",MISC
278,NL,"[956, 497, 958, 512]",MISC
279,-,"[956, 497, 958, 512]",MISC
280,Data,"[93, 513, 133, 530]",MISC
281,Drive,"[134, 513, 195, 530]",MISC
282,##n,"[134, 513, 195, 530]",MISC
283,framework,"[196, 513, 286, 530]",MISC
284,and,"[287, 513, 317, 530]",MISC
285,Hybrid,"[318, 513, 379, 530]",MISC
286,framework,"[379, 513, 470, 530]",MISC
287,for,"[471, 513, 501, 530]",MISC
288,the,"[502, 513, 531, 530]",MISC
289,project,"[533, 513, 613, 530]",MISC
290,.,"[533, 513, 613, 530]",MISC
291,Ex,"[614, 513, 705, 530]",MISC
292,##pert,"[614, 513, 705, 530]",MISC
293,##ise,"[614, 513, 705, 530]",MISC
294,in,"[706, 513, 725, 530]",MISC
295,writing,"[727, 513, 798, 530]",MISC
296,Se,"[798, 513, 878, 530]",MISC
297,##len,"[798, 513, 878, 530]",MISC
298,##ium,"[798, 513, 878, 530]",MISC
299,Web,"[880, 513, 970, 530]",MISC
300,##D,"[880, 513, 970, 530]",MISC
301,##river,"[880, 513, 970, 530]",MISC
302,-,"[972, 513, 973, 530]",MISC
303,NL,"[972, 513, 973, 530]",MISC
304,-,"[972, 513, 973, 530]",MISC
305,automation,"[93, 532, 193, 549]",MISC
306,scripts,"[193, 532, 261, 549]",MISC
307,in,"[262, 532, 281, 549]",MISC
308,J,"[282, 532, 331, 549]",MISC
309,##AV,"[282, 532, 331, 549]",MISC
310,##A,"[282, 532, 331, 549]",MISC
311,.,"[282, 532, 331, 549]",MISC
312,-,"[332, 532, 333, 549]",MISC
313,NL,"[332, 532, 333, 549]",MISC
314,-,"[332, 532, 333, 549]",MISC
315,Ex,"[72, 553, 148, 568]",MISC
316,##ec,"[72, 553, 148, 568]",MISC
317,##uted,"[72, 553, 148, 568]",MISC
318,automation,"[150, 553, 245, 568]",MISC
319,scripts,"[247, 553, 315, 568]",MISC
320,on,"[315, 553, 334, 568]",MISC
321,different,"[334, 553, 421, 568]",MISC
322,browser,"[422, 553, 625, 568]",MISC
323,##s,"[422, 553, 625, 568]",MISC
324,/,"[422, 553, 625, 568]",MISC
325,environments,"[422, 553, 625, 568]",MISC
326,&,"[626, 553, 634, 568]",MISC
327,reported,"[635, 553, 712, 568]",MISC
328,defects,"[713, 553, 857, 568]",MISC
329,/,"[713, 553, 857, 568]",MISC
330,results,"[713, 553, 857, 568]",MISC
331,to,"[859, 553, 878, 568]",MISC
332,the,"[878, 553, 906, 568]",MISC
333,team,"[907, 553, 954, 568]",MISC
334,.,"[907, 553, 954, 568]",MISC
335,-,"[956, 553, 958, 568]",MISC
336,NL,"[956, 553, 958, 568]",MISC
337,-,"[956, 553, 958, 568]",MISC
338,Too,"[73, 572, 114, 585]",MISC
339,##k,"[73, 572, 114, 585]",MISC
340,ownership,"[115, 572, 209, 585]",MISC
341,of,"[210, 572, 231, 585]",MISC
342,automation,"[232, 572, 336, 585]",MISC
343,and,"[337, 572, 369, 585]",MISC
344,led,"[369, 572, 401, 585]",MISC
345,the,"[401, 572, 432, 585]",MISC
346,automation,"[433, 572, 537, 585]",MISC
347,team,"[539, 572, 580, 585]",MISC
348,by,"[581, 572, 602, 585]",MISC
349,mentor,"[602, 572, 696, 585]",MISC
350,##ing,"[602, 572, 696, 585]",MISC
351,the,"[698, 572, 729, 585]",MISC
352,team,"[729, 572, 771, 585]",MISC
353,as,"[772, 572, 793, 585]",MISC
354,required,"[793, 572, 887, 585]",MISC
355,.,"[793, 572, 887, 585]",MISC
356,-,"[888, 572, 890, 585]",MISC
357,NL,"[888, 572, 890, 585]",MISC
358,-,"[888, 572, 890, 585]",MISC
359,Excellent,"[72, 589, 157, 604]",MISC
360,experience,"[158, 589, 252, 604]",MISC
361,in,"[253, 589, 271, 604]",MISC
362,automation,"[272, 589, 366, 604]",MISC
363,of,"[368, 589, 385, 604]",MISC
364,Web,"[387, 589, 481, 604]",MISC
365,-,"[387, 589, 481, 604]",MISC
366,based,"[387, 589, 481, 604]",MISC
367,",","[387, 589, 481, 604]",MISC
368,highly,"[483, 589, 538, 604]",MISC
369,transaction,"[540, 589, 663, 604]",MISC
370,##al,"[540, 589, 663, 604]",MISC
371,and,"[664, 589, 692, 604]",MISC
372,large,"[693, 589, 740, 604]",MISC
373,C,"[741, 589, 968, 604]",MISC
374,##lient,"[741, 589, 968, 604]",MISC
375,/,"[741, 589, 968, 604]",MISC
376,Server,"[741, 589, 968, 604]",MISC
377,/,"[741, 589, 968, 604]",MISC
378,Multi,"[741, 589, 968, 604]",MISC
379,-,"[741, 589, 968, 604]",MISC
380,tier,"[741, 589, 968, 604]",MISC
381,-,"[970, 589, 972, 604]",MISC
382,NL,"[970, 589, 972, 604]",MISC
383,-,"[970, 589, 972, 604]",MISC
384,applications,"[93, 605, 198, 623]",MISC
385,.,"[93, 605, 198, 623]",MISC
386,-,"[198, 605, 200, 623]",MISC
387,NL,"[198, 605, 200, 623]",MISC
388,-,"[198, 605, 200, 623]",MISC
389,Solid,"[72, 627, 123, 642]",MISC
390,experience,"[124, 627, 227, 642]",MISC
391,of,"[227, 627, 246, 642]",MISC
392,De,"[248, 627, 361, 642]",MISC
393,##fect,"[248, 627, 361, 642]",MISC
394,/,"[248, 627, 361, 642]",MISC
395,Test,"[248, 627, 361, 642]",MISC
396,Management,"[362, 627, 464, 642]",MISC
397,tools,"[465, 627, 515, 642]",MISC
398,like,"[517, 627, 557, 642]",MISC
399,Silk,"[558, 627, 598, 642]",MISC
400,Central,"[599, 627, 670, 642]",MISC
401,and,"[671, 627, 701, 642]",MISC
402,Q,"[702, 627, 732, 642]",MISC
403,##C,"[702, 627, 732, 642]",MISC
404,.,"[702, 627, 732, 642]",MISC
405,-,"[733, 627, 735, 642]",MISC
406,NL,"[733, 627, 735, 642]",MISC
407,-,"[733, 627, 735, 642]",MISC
408,Pro,"[72, 646, 133, 660]",MISC
409,##ven,"[72, 646, 133, 660]",MISC
410,skills,"[134, 646, 195, 660]",MISC
411,in,"[196, 646, 215, 660]",MISC
412,Leading,"[217, 646, 288, 660]",MISC
413,and,"[289, 646, 319, 660]",MISC
414,training,"[320, 646, 402, 660]",MISC
415,teams,"[403, 646, 464, 660]",MISC
416,",","[403, 646, 464, 660]",MISC
417,Test,"[465, 646, 505, 660]",MISC
418,Management,"[506, 646, 608, 660]",MISC
419,and,"[609, 646, 639, 660]",MISC
420,Meeting,"[640, 646, 711, 660]",MISC
421,the,"[712, 646, 742, 660]",MISC
422,deadline,"[743, 646, 846, 660]",MISC
423,##s,"[743, 646, 846, 660]",MISC
424,.,"[743, 646, 846, 660]",MISC
425,-,"[846, 646, 848, 660]",MISC
426,NL,"[846, 646, 848, 660]",MISC
427,-,"[846, 646, 848, 660]",MISC
428,Strong,"[72, 664, 131, 678]",MISC
429,communication,"[133, 664, 263, 678]",MISC
430,&,"[264, 664, 272, 678]",MISC
431,interaction,"[274, 664, 383, 678]",MISC
432,with,"[385, 664, 425, 678]",MISC
433,C,"[425, 664, 505, 678]",MISC
434,##lient,"[425, 664, 505, 678]",MISC
435,##s,"[425, 664, 505, 678]",MISC
436,",","[425, 664, 505, 678]",MISC
437,Dev,"[506, 664, 615, 678]",MISC
438,##elo,"[506, 664, 615, 678]",MISC
439,##pers,"[506, 664, 615, 678]",MISC
440,",","[506, 664, 615, 678]",MISC
441,Business,"[616, 664, 696, 678]",MISC
442,Ana,"[697, 664, 787, 678]",MISC
443,##ly,"[697, 664, 787, 678]",MISC
444,##sts,"[697, 664, 787, 678]",MISC
445,",","[697, 664, 787, 678]",MISC
446,Management,"[788, 664, 897, 678]",MISC
447,.,"[788, 664, 897, 678]",MISC
448,-,"[899, 664, 900, 678]",MISC
449,NL,"[899, 664, 900, 678]",MISC
450,-,"[899, 664, 900, 678]",MISC
451,Strong,"[72, 682, 133, 697]",MISC
452,experience,"[134, 682, 237, 697]",MISC
453,of,"[237, 682, 256, 697]",MISC
454,Business,"[258, 682, 340, 697]",MISC
455,Applications,"[340, 682, 464, 697]",MISC
456,and,"[464, 682, 493, 697]",MISC
457,Communications,"[495, 682, 637, 697]",MISC
458,domains,"[639, 682, 721, 697]",MISC
459,.,"[639, 682, 721, 697]",MISC
460,-,"[721, 682, 723, 697]",MISC
461,NL,"[721, 682, 723, 697]",MISC
462,-,"[721, 682, 723, 697]",MISC
463,Pro,"[72, 698, 133, 715]",MISC
464,##ven,"[72, 698, 133, 715]",MISC
465,ability,"[133, 698, 203, 715]",MISC
466,in,"[204, 698, 224, 715]",MISC
467,working,"[225, 698, 294, 715]",MISC
468,individually,"[296, 698, 418, 715]",MISC
469,or,"[418, 698, 437, 715]",MISC
470,as,"[438, 698, 457, 715]",MISC
471,a,"[459, 698, 467, 715]",MISC
472,part,"[469, 698, 509, 715]",MISC
473,of,"[509, 698, 529, 715]",MISC
474,team,"[530, 698, 580, 715]",MISC
475,",","[530, 698, 580, 715]",MISC
476,Problem,"[581, 698, 650, 715]",MISC
477,solving,"[652, 698, 732, 715]",MISC
478,",","[652, 698, 732, 715]",MISC
479,Process,"[733, 698, 803, 715]",MISC
480,improvement,"[804, 698, 916, 715]",MISC
481,-,"[916, 698, 918, 715]",MISC
482,NL,"[916, 698, 918, 715]",MISC
483,-,"[916, 698, 918, 715]",MISC
484,activities,"[93, 717, 193, 734]",MISC
485,",","[93, 717, 193, 734]",MISC
486,Ana,"[193, 717, 281, 734]",MISC
487,##ly,"[193, 717, 281, 734]",MISC
488,##tical,"[193, 717, 281, 734]",MISC
489,skills,"[283, 717, 345, 734]",MISC
490,",","[283, 717, 345, 734]",MISC
491,reporting,"[346, 717, 426, 734]",MISC
492,and,"[427, 717, 453, 734]",MISC
493,As,"[454, 717, 534, 734]",MISC
494,##sist,"[454, 717, 534, 734]",MISC
495,##ing,"[454, 717, 534, 734]",MISC
496,to,"[535, 717, 553, 734]",MISC
497,Manager,"[553, 717, 625, 734]",MISC
498,.,"[553, 717, 625, 734]",MISC
499,-,"[626, 717, 627, 734]",MISC
500,NL,"[626, 717, 627, 734]",MISC
501,-,"[626, 717, 627, 734]",MISC
502,Ce,"[62, 754, 203, 774]",B-others_heading
503,##rt,"[62, 754, 203, 774]",I-others_heading
504,##ifications,"[62, 754, 203, 774]",I-others_heading
505,-,"[203, 754, 205, 774]",MISC
506,NL,"[203, 754, 205, 774]",MISC
507,-,"[203, 754, 205, 774]",MISC
508,Sales,"[62, 796, 173, 815]",MISC
509,##force,"[62, 796, 173, 815]",MISC
510,Certified,"[175, 796, 276, 815]",MISC
511,Administrator,"[276, 796, 422, 815]",MISC
512,(,"[422, 796, 488, 815]",MISC
513,SP,"[422, 796, 488, 815]",MISC
514,##17,"[422, 796, 488, 815]",MISC
515,),"[422, 796, 488, 815]",MISC
516,-,"[490, 796, 492, 815]",MISC
517,NL,"[490, 796, 492, 815]",MISC
518,-,"[490, 796, 492, 815]",MISC
519,Sales,"[62, 815, 175, 833]",MISC
520,##force,"[62, 815, 175, 833]",MISC
521,Certified,"[177, 815, 279, 833]",MISC
522,Platform,"[280, 815, 370, 833]",MISC
523,Dev,"[372, 815, 474, 833]",MISC
524,##elo,"[372, 815, 474, 833]",MISC
525,##per,"[372, 815, 474, 833]",MISC
526,I,"[475, 815, 485, 833]",MISC
527,-,"[486, 815, 488, 833]",MISC
528,NL,"[486, 815, 488, 833]",MISC
529,-,"[486, 815, 488, 833]",MISC
530,Deep,"[62, 67, 126, 85]",B-name
531,##ak,"[62, 67, 126, 85]",I-name
532,T,"[126, 67, 191, 85]",I-name
533,##i,"[126, 67, 191, 85]",I-name
534,##wari,"[126, 67, 191, 85]",I-name
535,-,"[191, 67, 193, 85]",MISC
536,NL,"[191, 67, 193, 85]",MISC
537,-,"[191, 67, 193, 85]",MISC
538,Professional,"[62, 87, 198, 107]",B-work_experience_heading
539,Experience,"[198, 87, 311, 107]",I-work_experience_heading
540,-,"[311, 87, 313, 107]",MISC
541,NL,"[311, 87, 313, 107]",MISC
542,-,"[311, 87, 313, 107]",MISC
543,Working,"[62, 126, 130, 143]",MISC
544,as,"[132, 126, 151, 143]",MISC
545,Senior,"[152, 126, 211, 143]",B-employer_role
546,Associate,"[211, 126, 300, 143]",I-employer_role
547,in,"[301, 126, 320, 143]",MISC
548,Sa,"[320, 126, 399, 143]",B-employer_company_name
549,##pie,"[320, 126, 399, 143]",I-employer_company_name
550,##nt,"[320, 126, 399, 143]",I-employer_company_name
551,",","[320, 126, 399, 143]",MISC
552,Bangalore,"[400, 126, 489, 143]",MISC
553,till,"[489, 126, 527, 143]",MISC
554,date,"[529, 126, 578, 143]",MISC
555,.,"[529, 126, 578, 143]",MISC
556,-,"[579, 126, 580, 143]",MISC
557,NL,"[579, 126, 580, 143]",MISC
558,-,"[579, 126, 580, 143]",MISC
559,Projects,"[62, 159, 135, 178]",MISC
560,Det,"[135, 159, 208, 178]",MISC
561,##ails,"[135, 159, 208, 178]",MISC
562,:,"[135, 159, 208, 178]",MISC
563,-,"[208, 159, 210, 178]",MISC
564,NL,"[208, 159, 210, 178]",MISC
565,-,"[208, 159, 210, 178]",MISC
566,Project,"[62, 195, 126, 213]",MISC
567,1,"[127, 195, 144, 213]",MISC
568,:,"[127, 195, 144, 213]",MISC
569,-,"[146, 195, 147, 213]",MISC
570,NL,"[146, 195, 147, 213]",MISC
571,-,"[146, 195, 147, 213]",MISC
572,Du,"[62, 230, 175, 247]",MISC
573,##ration,"[62, 230, 175, 247]",MISC
574,:,"[176, 230, 190, 247]",MISC
575,December,"[190, 230, 303, 247]",MISC
576,2017,"[304, 230, 359, 247]",MISC
577,–,"[360, 230, 374, 247]",MISC
578,Till,"[375, 230, 430, 247]",MISC
579,Date,"[431, 230, 487, 247]",MISC
580,-,"[488, 230, 490, 247]",MISC
581,NL,"[488, 230, 490, 247]",MISC
582,-,"[488, 230, 490, 247]",MISC
583,Company,"[62, 253, 184, 270]",MISC
584,:,"[184, 253, 201, 270]",MISC
585,Sa,"[201, 253, 323, 270]",B-employer_company_name
586,##pie,"[201, 253, 323, 270]",I-employer_company_name
587,##nt,"[201, 253, 323, 270]",I-employer_company_name
588,-,"[323, 253, 325, 270]",MISC
589,NL,"[323, 253, 325, 270]",MISC
590,-,"[323, 253, 325, 270]",MISC
591,Role,"[62, 274, 130, 292]",MISC
592,:,"[130, 274, 146, 292]",MISC
593,Senior,"[147, 274, 248, 292]",B-employer_role
594,Associate,"[249, 274, 400, 292]",I-employer_role
595,-,"[401, 274, 403, 292]",MISC
596,NL,"[401, 274, 403, 292]",MISC
597,-,"[401, 274, 403, 292]",MISC
598,Work,"[62, 297, 113, 315]",MISC
599,Location,"[114, 297, 216, 315]",MISC
600,:,"[217, 297, 229, 315]",MISC
601,Bangalore,"[230, 297, 344, 315]",MISC
602,-,"[346, 297, 347, 315]",MISC
603,NL,"[346, 297, 347, 315]",MISC
604,-,"[346, 297, 347, 315]",MISC
605,Skills,"[62, 319, 137, 337]",MISC
606,:,"[137, 319, 149, 337]",MISC
607,Sales,"[150, 319, 275, 337]",MISC
608,##force,"[150, 319, 275, 337]",MISC
609,Ad,"[275, 319, 350, 337]",MISC
610,##min,"[275, 319, 350, 337]",MISC
611,",","[275, 319, 350, 337]",MISC
612,Q,"[350, 319, 375, 337]",MISC
613,##A,"[350, 319, 375, 337]",MISC
614,Auto,"[375, 319, 513, 337]",MISC
615,##mation,"[375, 319, 513, 337]",MISC
616,",","[375, 319, 513, 337]",MISC
617,Auto,"[513, 319, 638, 337]",MISC
618,##mation,"[513, 319, 638, 337]",MISC
619,Testing,"[638, 319, 738, 337]",MISC
620,.,"[638, 319, 738, 337]",MISC
621,-,"[739, 319, 740, 337]",MISC
622,NL,"[739, 319, 740, 337]",MISC
623,-,"[739, 319, 740, 337]",MISC
624,The,"[62, 363, 92, 382]",MISC
625,objective,"[92, 363, 181, 382]",MISC
626,of,"[183, 363, 202, 382]",MISC
627,the,"[203, 363, 232, 382]",MISC
628,project,"[233, 363, 302, 382]",MISC
629,was,"[303, 363, 332, 382]",MISC
630,to,"[333, 363, 352, 382]",MISC
631,create,"[353, 363, 412, 382]",MISC
632,a,"[413, 363, 422, 382]",MISC
633,retaliation,"[423, 363, 533, 382]",MISC
634,system,"[534, 363, 593, 382]",MISC
635,which,"[594, 363, 643, 382]",MISC
636,will,"[644, 363, 684, 382]",MISC
637,help,"[684, 363, 724, 382]",MISC
638,the,"[724, 363, 754, 382]",MISC
639,employees,"[754, 363, 843, 382]",MISC
640,to,"[845, 363, 864, 382]",MISC
641,create,"[865, 363, 924, 382]",MISC
642,an,"[925, 363, 944, 382]",MISC
643,RC,"[945, 363, 975, 382]",MISC
644,##I,"[945, 363, 975, 382]",MISC
645,-,"[975, 363, 977, 382]",MISC
646,NL,"[975, 363, 977, 382]",MISC
647,-,"[975, 363, 977, 382]",MISC
648,(,"[62, 382, 179, 399]",MISC
649,Re,"[62, 382, 179, 399]",MISC
650,##tal,"[62, 382, 179, 399]",MISC
651,##iation,"[62, 382, 179, 399]",MISC
652,complaint,"[179, 382, 266, 399]",MISC
653,Investigation,"[267, 382, 402, 399]",MISC
654,),"[267, 382, 402, 399]",MISC
655,case,"[403, 382, 441, 399]",MISC
656,against,"[442, 382, 510, 399]",MISC
657,the,"[510, 382, 538, 399]",MISC
658,employers,"[539, 382, 626, 399]",MISC
659,if,"[627, 382, 646, 399]",MISC
660,needed,"[646, 382, 704, 399]",MISC
661,and,"[705, 382, 732, 399]",MISC
662,allow,"[734, 382, 781, 399]",MISC
663,the,"[783, 382, 810, 399]",MISC
664,RC,"[812, 382, 840, 399]",MISC
665,##I,"[812, 382, 840, 399]",MISC
666,department,"[841, 382, 937, 399]",MISC
667,to,"[938, 382, 957, 399]",MISC
668,-,"[958, 382, 960, 399]",MISC
669,NL,"[958, 382, 960, 399]",MISC
670,-,"[958, 382, 960, 399]",MISC
671,store,"[62, 400, 113, 418]",MISC
672,and,"[114, 400, 144, 418]",MISC
673,manage,"[145, 400, 206, 418]",MISC
674,the,"[207, 400, 237, 418]",MISC
675,RC,"[238, 400, 268, 418]",MISC
676,##I,"[238, 400, 268, 418]",MISC
677,cases,"[269, 400, 330, 418]",MISC
678,.,"[269, 400, 330, 418]",MISC
679,-,"[332, 400, 333, 418]",MISC
680,NL,"[332, 400, 333, 418]",MISC
681,-,"[332, 400, 333, 418]",MISC
682,Role,"[62, 445, 107, 462]",MISC
683,##s,"[62, 445, 107, 462]",MISC
684,and,"[108, 445, 134, 462]",MISC
685,Re,"[136, 445, 282, 462]",MISC
686,##sp,"[136, 445, 282, 462]",MISC
687,##ons,"[136, 445, 282, 462]",MISC
688,##ibi,"[136, 445, 282, 462]",MISC
689,##lities,"[136, 445, 282, 462]",MISC
690,-,"[283, 445, 285, 462]",MISC
691,NL,"[283, 445, 285, 462]",MISC
692,-,"[283, 445, 285, 462]",MISC
693,Understanding,"[72, 491, 199, 506]",MISC
694,the,"[201, 491, 230, 506]",MISC
695,Business,"[230, 491, 309, 506]",MISC
696,requirements,"[309, 491, 428, 506]",MISC
697,and,"[428, 491, 458, 506]",MISC
698,con,"[458, 491, 566, 506]",MISC
699,##fi,"[458, 491, 566, 506]",MISC
700,##gu,"[458, 491, 566, 506]",MISC
701,##ring,"[458, 491, 566, 506]",MISC
702,the,"[567, 491, 596, 506]",MISC
703,application,"[596, 491, 704, 506]",MISC
704,to,"[705, 491, 724, 506]",MISC
705,meet,"[725, 491, 763, 506]",MISC
706,the,"[765, 491, 794, 506]",MISC
707,requirements,"[794, 491, 921, 506]",MISC
708,.,"[794, 491, 921, 506]",MISC
709,-,"[923, 491, 925, 506]",MISC
710,NL,"[923, 491, 925, 506]",MISC
711,-,"[923, 491, 925, 506]",MISC
712,Dev,"[72, 510, 180, 525]",MISC
713,##elo,"[72, 510, 180, 525]",MISC
714,##ping,"[72, 510, 180, 525]",MISC
715,",","[72, 510, 180, 525]",MISC
716,deploy,"[180, 510, 267, 525]",MISC
717,##ing,"[180, 510, 267, 525]",MISC
718,and,"[268, 510, 296, 525]",MISC
719,maintaining,"[298, 510, 405, 525]",MISC
720,the,"[405, 510, 433, 525]",MISC
721,work,"[435, 510, 513, 525]",MISC
722,##flow,"[435, 510, 513, 525]",MISC
723,rules,"[513, 510, 571, 525]",MISC
724,",","[513, 510, 571, 525]",MISC
725,approval,"[572, 510, 650, 525]",MISC
726,processes,"[651, 510, 748, 525]",MISC
727,",","[651, 510, 748, 525]",MISC
728,and,"[749, 510, 777, 525]",MISC
729,valid,"[778, 510, 876, 525]",MISC
730,##ation,"[778, 510, 876, 525]",MISC
731,rules,"[876, 510, 934, 525]",MISC
732,.,"[876, 510, 934, 525]",MISC
733,-,"[935, 510, 937, 525]",MISC
734,NL,"[935, 510, 937, 525]",MISC
735,-,"[935, 510, 937, 525]",MISC
736,C,"[72, 529, 152, 544]",MISC
737,##rea,"[72, 529, 152, 544]",MISC
738,##ting,"[72, 529, 152, 544]",MISC
739,the,"[154, 529, 183, 544]",MISC
740,reports,"[184, 529, 254, 544]",MISC
741,and,"[255, 529, 285, 544]",MISC
742,dash,"[286, 529, 397, 544]",MISC
743,##boards,"[286, 529, 397, 544]",MISC
744,.,"[286, 529, 397, 544]",MISC
745,-,"[398, 529, 400, 544]",MISC
746,NL,"[398, 529, 400, 544]",MISC
747,-,"[398, 529, 400, 544]",MISC
748,In,"[72, 546, 150, 561]",MISC
749,##volved,"[72, 546, 150, 561]",MISC
750,in,"[151, 546, 170, 561]",MISC
751,helping,"[170, 546, 238, 561]",MISC
752,team,"[239, 546, 277, 561]",MISC
753,in,"[278, 546, 297, 561]",MISC
754,performing,"[298, 546, 395, 561]",MISC
755,the,"[396, 546, 424, 561]",MISC
756,functional,"[426, 546, 523, 561]",MISC
757,testing,"[524, 546, 592, 561]",MISC
758,of,"[593, 546, 612, 561]",MISC
759,the,"[612, 546, 640, 561]",MISC
760,application,"[642, 546, 758, 561]",MISC
761,.,"[642, 546, 758, 561]",MISC
762,-,"[760, 546, 761, 561]",MISC
763,NL,"[760, 546, 761, 561]",MISC
764,-,"[760, 546, 761, 561]",MISC
765,In,"[72, 565, 152, 580]",MISC
766,##volved,"[72, 565, 152, 580]",MISC
767,in,"[153, 565, 172, 580]",MISC
768,Re,"[173, 565, 293, 580]",MISC
769,##quire,"[173, 565, 293, 580]",MISC
770,##ments,"[173, 565, 293, 580]",MISC
771,Analysis,"[294, 565, 384, 580]",MISC
772,",","[294, 565, 384, 580]",MISC
773,Impact,"[384, 565, 444, 580]",MISC
774,Analysis,"[445, 565, 535, 580]",MISC
775,",","[445, 565, 535, 580]",MISC
776,Test,"[535, 565, 575, 580]",MISC
777,Planning,"[576, 565, 666, 580]",MISC
778,",","[576, 565, 666, 580]",MISC
779,Test,"[666, 565, 706, 580]",MISC
780,Ex,"[707, 565, 797, 580]",MISC
781,##ec,"[707, 565, 797, 580]",MISC
782,##ution,"[707, 565, 797, 580]",MISC
783,and,"[797, 565, 827, 580]",MISC
784,De,"[828, 565, 887, 580]",MISC
785,##fect,"[828, 565, 887, 580]",MISC
786,Track,"[888, 565, 978, 580]",MISC
787,##ing,"[888, 565, 978, 580]",MISC
788,.,"[888, 565, 978, 580]",MISC
789,-,"[979, 565, 980, 580]",MISC
790,NL,"[979, 565, 980, 580]",MISC
791,-,"[979, 565, 980, 580]",MISC
792,C,"[72, 584, 150, 599]",MISC
793,##rea,"[72, 584, 150, 599]",MISC
794,##ting,"[72, 584, 150, 599]",MISC
795,new,"[151, 584, 181, 599]",MISC
796,scripts,"[181, 584, 249, 599]",MISC
797,using,"[251, 584, 299, 599]",MISC
798,se,"[300, 584, 379, 599]",MISC
799,##len,"[300, 584, 379, 599]",MISC
800,##ium,"[300, 584, 379, 599]",MISC
801,and,"[380, 584, 409, 599]",MISC
802,up,"[409, 584, 488, 599]",MISC
803,##dating,"[409, 584, 488, 599]",MISC
804,and,"[489, 584, 518, 599]",MISC
805,op,"[519, 584, 618, 599]",MISC
806,##ti,"[519, 584, 618, 599]",MISC
807,##mizing,"[519, 584, 618, 599]",MISC
808,the,"[618, 584, 647, 599]",MISC
809,existing,"[648, 584, 726, 599]",MISC
810,scripts,"[727, 584, 805, 599]",MISC
811,.,"[727, 584, 805, 599]",MISC
812,-,"[806, 584, 808, 599]",MISC
813,NL,"[806, 584, 808, 599]",MISC
814,-,"[806, 584, 808, 599]",MISC
815,Project,"[62, 621, 126, 639]",MISC
816,2,"[127, 621, 144, 639]",MISC
817,:,"[127, 621, 144, 639]",MISC
818,-,"[146, 621, 147, 639]",MISC
819,NL,"[146, 621, 147, 639]",MISC
820,-,"[146, 621, 147, 639]",MISC
821,Du,"[62, 656, 173, 675]",MISC
822,##ration,"[62, 656, 173, 675]",MISC
823,:,"[174, 656, 188, 675]",MISC
824,September,"[188, 656, 313, 675]",MISC
825,2016,"[314, 656, 370, 675]",MISC
826,–,"[370, 656, 384, 675]",MISC
827,November,"[384, 656, 496, 675]",MISC
828,2017,"[496, 656, 552, 675]",MISC
829,-,"[553, 656, 554, 675]",MISC
830,NL,"[553, 656, 554, 675]",MISC
831,-,"[553, 656, 554, 675]",MISC
832,Company,"[62, 679, 184, 697]",MISC
833,:,"[184, 679, 201, 697]",MISC
834,Sa,"[201, 679, 323, 697]",B-employer_company_name
835,##pie,"[201, 679, 323, 697]",I-employer_company_name
836,##nt,"[201, 679, 323, 697]",I-employer_company_name
837,-,"[323, 679, 325, 697]",MISC
838,NL,"[323, 679, 325, 697]",MISC
839,-,"[323, 679, 325, 697]",MISC
840,Role,"[62, 702, 130, 719]",MISC
841,:,"[130, 702, 146, 719]",MISC
842,Senior,"[147, 702, 248, 719]",B-employer_role
843,Associate,"[249, 702, 400, 719]",I-employer_role
844,-,"[401, 702, 403, 719]",MISC
845,NL,"[401, 702, 403, 719]",MISC
846,-,"[401, 702, 403, 719]",MISC
847,Work,"[62, 723, 113, 741]",MISC
848,Location,"[114, 723, 216, 741]",MISC
849,:,"[217, 723, 229, 741]",MISC
850,Bangalore,"[230, 723, 344, 741]",MISC
851,-,"[346, 723, 347, 741]",MISC
852,NL,"[346, 723, 347, 741]",MISC
853,-,"[346, 723, 347, 741]",MISC
854,Skills,"[62, 746, 135, 764]",MISC
855,:,"[136, 746, 148, 764]",MISC
856,Sales,"[148, 746, 270, 764]",MISC
857,##force,"[148, 746, 270, 764]",MISC
858,Ad,"[272, 746, 345, 764]",MISC
859,##min,"[272, 746, 345, 764]",MISC
860,",","[272, 746, 345, 764]",MISC
861,Q,"[346, 746, 370, 764]",MISC
862,##A,"[346, 746, 370, 764]",MISC
863,Auto,"[370, 746, 506, 764]",MISC
864,##mation,"[370, 746, 506, 764]",MISC
865,",","[370, 746, 506, 764]",MISC
866,Fun,"[506, 746, 628, 764]",MISC
867,##ctional,"[506, 746, 628, 764]",MISC
868,Testing,"[630, 746, 727, 764]",MISC
869,.,"[630, 746, 727, 764]",MISC
870,-,"[728, 746, 730, 764]",MISC
871,NL,"[728, 746, 730, 764]",MISC
872,-,"[728, 746, 730, 764]",MISC
873,The,"[62, 790, 90, 808]",MISC
874,objective,"[92, 790, 179, 808]",MISC
875,of,"[180, 790, 199, 808]",MISC
876,this,"[200, 790, 238, 808]",MISC
877,project,"[239, 790, 307, 808]",MISC
878,was,"[308, 790, 336, 808]",MISC
879,to,"[337, 790, 356, 808]",MISC
880,provide,"[357, 790, 425, 808]",MISC
881,the,"[426, 790, 453, 808]",MISC
882,ability,"[455, 790, 523, 808]",MISC
883,for,"[524, 790, 552, 808]",MISC
884,Custom,"[553, 790, 632, 808]",MISC
885,##er,"[553, 790, 632, 808]",MISC
886,Service,"[632, 790, 700, 808]",MISC
887,Representatives,"[701, 790, 847, 808]",MISC
888,(,"[848, 790, 905, 808]",MISC
889,CS,"[848, 790, 905, 808]",MISC
890,##R,"[848, 790, 905, 808]",MISC
891,##s,"[848, 790, 905, 808]",MISC
892,),"[848, 790, 905, 808]",MISC
893,and,"[907, 790, 935, 808]",MISC
894,other,"[936, 790, 985, 808]",MISC
895,-,"[986, 790, 987, 808]",MISC
896,NL,"[986, 790, 987, 808]",MISC
897,-,"[986, 790, 987, 808]",MISC
898,business,"[62, 809, 140, 827]",MISC
899,units,"[141, 809, 189, 827]",MISC
900,to,"[190, 809, 209, 827]",MISC
901,sea,"[210, 809, 307, 827]",MISC
902,##m,"[210, 809, 307, 827]",MISC
903,##lessly,"[210, 809, 307, 827]",MISC
904,access,"[308, 809, 365, 827]",MISC
905,data,"[367, 809, 405, 827]",MISC
906,that,"[406, 809, 444, 827]",MISC
907,will,"[445, 809, 484, 827]",MISC
908,provide,"[485, 809, 553, 827]",MISC
909,a,"[554, 809, 562, 827]",MISC
910,360,"[563, 809, 591, 827]",MISC
911,degree,"[593, 809, 650, 827]",MISC
912,view,"[652, 809, 690, 827]",MISC
913,of,"[691, 809, 710, 827]",MISC
914,a,"[711, 809, 720, 827]",MISC
915,customer,"[721, 809, 818, 827]",MISC
916,’,"[721, 809, 818, 827]",MISC
917,s,"[721, 809, 818, 827]",MISC
918,relationship,"[819, 809, 936, 827]",MISC
919,and,"[937, 809, 965, 827]",MISC
920,-,"[966, 809, 968, 827]",MISC
921,NL,"[966, 809, 968, 827]",MISC
922,-,"[966, 809, 968, 827]",MISC
923,enabling,"[62, 827, 140, 845]",MISC
924,them,"[141, 827, 179, 845]",MISC
925,to,"[180, 827, 199, 845]",MISC
926,be,"[200, 827, 219, 845]",MISC
927,more,"[220, 827, 258, 845]",MISC
928,effective,"[259, 827, 346, 845]",MISC
929,in,"[348, 827, 367, 845]",MISC
930,their,"[367, 827, 416, 845]",MISC
931,interactions,"[417, 827, 533, 845]",MISC
932,with,"[535, 827, 573, 845]",MISC
933,customers,"[574, 827, 661, 845]",MISC
934,and,"[663, 827, 691, 845]",MISC
935,to,"[692, 827, 712, 845]",MISC
936,stream,"[712, 827, 809, 845]",MISC
937,##line,"[712, 827, 809, 845]",MISC
938,downstream,"[811, 827, 908, 845]",MISC
939,-,"[909, 827, 911, 845]",MISC
940,NL,"[909, 827, 911, 845]",MISC
941,-,"[909, 827, 911, 845]",MISC
942,transaction,"[62, 845, 158, 863]",MISC
943,processing,"[158, 845, 253, 863]",MISC
944,.,"[158, 845, 253, 863]",MISC
945,-,"[253, 845, 255, 863]",MISC
946,NL,"[253, 845, 255, 863]",MISC
947,-,"[253, 845, 255, 863]",MISC
948,Role,"[62, 887, 107, 903]",MISC
949,##s,"[62, 887, 107, 903]",MISC
950,and,"[108, 887, 134, 903]",MISC
951,Re,"[136, 887, 282, 903]",MISC
952,##sp,"[136, 887, 282, 903]",MISC
953,##ons,"[136, 887, 282, 903]",MISC
954,##ibi,"[136, 887, 282, 903]",MISC
955,##lities,"[136, 887, 282, 903]",MISC
956,-,"[283, 887, 285, 903]",MISC
957,NL,"[283, 887, 285, 903]",MISC
958,-,"[283, 887, 285, 903]",MISC
959,Understanding,"[72, 930, 199, 945]",MISC
960,the,"[201, 930, 230, 945]",MISC
961,Business,"[230, 930, 309, 945]",MISC
962,requirements,"[309, 930, 428, 945]",MISC
963,and,"[428, 930, 458, 945]",MISC
964,con,"[458, 930, 566, 945]",MISC
965,##fi,"[458, 930, 566, 945]",MISC
966,##gu,"[458, 930, 566, 945]",MISC
967,##ring,"[458, 930, 566, 945]",MISC
968,the,"[567, 930, 596, 945]",MISC
969,application,"[596, 930, 704, 945]",MISC
970,to,"[705, 930, 724, 945]",MISC
971,meet,"[725, 930, 763, 945]",MISC
972,the,"[765, 930, 794, 945]",MISC
973,requirements,"[794, 930, 921, 945]",MISC
974,.,"[794, 930, 921, 945]",MISC
975,-,"[923, 930, 925, 945]",MISC
976,NL,"[923, 930, 925, 945]",MISC
977,-,"[923, 930, 925, 945]",MISC
978,Dev,"[72, 949, 180, 962]",MISC
979,##elo,"[72, 949, 180, 962]",MISC
980,##ping,"[72, 949, 180, 962]",MISC
981,",","[72, 949, 180, 962]",MISC
982,deploy,"[180, 949, 267, 962]",MISC
983,##ing,"[180, 949, 267, 962]",MISC
984,and,"[268, 949, 296, 962]",MISC
985,maintaining,"[298, 949, 405, 962]",MISC
986,the,"[405, 949, 433, 962]",MISC
987,work,"[435, 949, 513, 962]",MISC
988,##flow,"[435, 949, 513, 962]",MISC
989,rules,"[513, 949, 571, 962]",MISC
990,",","[513, 949, 571, 962]",MISC
991,approval,"[572, 949, 650, 962]",MISC
992,processes,"[651, 949, 748, 962]",MISC
993,",","[651, 949, 748, 962]",MISC
994,and,"[749, 949, 777, 962]",MISC
995,valid,"[778, 949, 876, 962]",MISC
996,##ation,"[778, 949, 876, 962]",MISC
997,rules,"[876, 949, 934, 962]",MISC
998,.,"[876, 949, 934, 962]",MISC
999,-,"[935, 949, 937, 962]",MISC
1000,NL,"[935, 949, 937, 962]",MISC
1001,-,"[935, 949, 937, 962]",MISC
1002,C,"[72, 966, 152, 981]",MISC
1003,##rea,"[72, 966, 152, 981]",MISC
1004,##ting,"[72, 966, 152, 981]",MISC
1005,the,"[154, 966, 183, 981]",MISC
1006,reports,"[184, 966, 254, 981]",MISC
1007,and,"[255, 966, 285, 981]",MISC
1008,dash,"[286, 966, 397, 981]",MISC
1009,##boards,"[286, 966, 397, 981]",MISC
1010,.,"[286, 966, 397, 981]",MISC
1011,-,"[398, 966, 400, 981]",MISC
1012,NL,"[398, 966, 400, 981]",MISC
1013,-,"[398, 966, 400, 981]",MISC
1014,In,"[72, 985, 150, 1000]",MISC
1015,##volved,"[72, 985, 150, 1000]",MISC
1016,in,"[151, 985, 170, 1000]",MISC
1017,helping,"[170, 985, 238, 1000]",MISC
1018,team,"[239, 985, 277, 1000]",MISC
1019,in,"[278, 985, 297, 1000]",MISC
1020,performing,"[298, 985, 395, 1000]",MISC
1021,the,"[396, 985, 424, 1000]",MISC
1022,functional,"[426, 985, 523, 1000]",MISC
1023,testing,"[524, 985, 592, 1000]",MISC
1024,of,"[593, 985, 612, 1000]",MISC
1025,the,"[612, 985, 640, 1000]",MISC
1026,application,"[642, 985, 758, 1000]",MISC
1027,.,"[642, 985, 758, 1000]",MISC
1028,-,"[760, 985, 761, 1000]",MISC
1029,NL,"[760, 985, 761, 1000]",MISC
1030,-,"[760, 985, 761, 1000]",MISC
1031,Deep,"[62, 67, 126, 85]",B-name
1032,##ak,"[62, 67, 126, 85]",I-name
1033,T,"[126, 67, 191, 85]",I-name
1034,##i,"[126, 67, 191, 85]",I-name
1035,##wari,"[126, 67, 191, 85]",I-name
1036,-,"[191, 67, 193, 85]",MISC
1037,NL,"[191, 67, 193, 85]",MISC
1038,-,"[191, 67, 193, 85]",MISC
1039,In,"[72, 89, 152, 104]",MISC
1040,##volved,"[72, 89, 152, 104]",MISC
1041,in,"[153, 89, 172, 104]",MISC
1042,Re,"[173, 89, 293, 104]",MISC
1043,##quire,"[173, 89, 293, 104]",MISC
1044,##ments,"[173, 89, 293, 104]",MISC
1045,Analysis,"[294, 89, 384, 104]",MISC
1046,",","[294, 89, 384, 104]",MISC
1047,Impact,"[384, 89, 444, 104]",MISC
1048,Analysis,"[445, 89, 535, 104]",MISC
1049,",","[445, 89, 535, 104]",MISC
1050,Test,"[535, 89, 575, 104]",MISC
1051,Planning,"[576, 89, 666, 104]",MISC
1052,",","[576, 89, 666, 104]",MISC
1053,Test,"[666, 89, 706, 104]",MISC
1054,Ex,"[707, 89, 797, 104]",MISC
1055,##ec,"[707, 89, 797, 104]",MISC
1056,##ution,"[707, 89, 797, 104]",MISC
1057,and,"[797, 89, 827, 104]",MISC
1058,De,"[828, 89, 887, 104]",MISC
1059,##fect,"[828, 89, 887, 104]",MISC
1060,Track,"[888, 89, 978, 104]",MISC
1061,##ing,"[888, 89, 978, 104]",MISC
1062,.,"[888, 89, 978, 104]",MISC
1063,-,"[979, 89, 980, 104]",MISC
1064,NL,"[979, 89, 980, 104]",MISC
1065,-,"[979, 89, 980, 104]",MISC
1066,C,"[72, 108, 150, 123]",MISC
1067,##rea,"[72, 108, 150, 123]",MISC
1068,##ting,"[72, 108, 150, 123]",MISC
1069,new,"[151, 108, 181, 123]",MISC
1070,scripts,"[181, 108, 249, 123]",MISC
1071,using,"[251, 108, 299, 123]",MISC
1072,se,"[300, 108, 379, 123]",MISC
1073,##len,"[300, 108, 379, 123]",MISC
1074,##ium,"[300, 108, 379, 123]",MISC
1075,and,"[380, 108, 409, 123]",MISC
1076,up,"[409, 108, 488, 123]",MISC
1077,##dating,"[409, 108, 488, 123]",MISC
1078,and,"[489, 108, 518, 123]",MISC
1079,op,"[519, 108, 618, 123]",MISC
1080,##ti,"[519, 108, 618, 123]",MISC
1081,##mizing,"[519, 108, 618, 123]",MISC
1082,the,"[618, 108, 647, 123]",MISC
1083,existing,"[648, 108, 726, 123]",MISC
1084,scripts,"[727, 108, 805, 123]",MISC
1085,.,"[727, 108, 805, 123]",MISC
1086,-,"[806, 108, 808, 123]",MISC
1087,NL,"[806, 108, 808, 123]",MISC
1088,-,"[806, 108, 808, 123]",MISC
1089,Project,"[62, 146, 126, 162]",MISC
1090,3,"[127, 146, 144, 162]",MISC
1091,:,"[127, 146, 144, 162]",MISC
1092,-,"[146, 146, 147, 162]",MISC
1093,NL,"[146, 146, 147, 162]",MISC
1094,-,"[146, 146, 147, 162]",MISC
1095,Du,"[62, 184, 173, 203]",MISC
1096,##ration,"[62, 184, 173, 203]",MISC
1097,:,"[174, 184, 188, 203]",MISC
1098,December,"[188, 184, 299, 203]",MISC
1099,2015,"[299, 184, 355, 203]",MISC
1100,–,"[355, 184, 369, 203]",MISC
1101,September,"[369, 184, 495, 203]",MISC
1102,2016,"[495, 184, 551, 203]",MISC
1103,-,"[551, 184, 553, 203]",MISC
1104,NL,"[551, 184, 553, 203]",MISC
1105,-,"[551, 184, 553, 203]",MISC
1106,Company,"[62, 207, 156, 225]",MISC
1107,:,"[156, 207, 169, 225]",MISC
1108,A,"[170, 207, 290, 225]",MISC
1109,##cc,"[170, 207, 290, 225]",MISC
1110,##ent,"[170, 207, 290, 225]",MISC
1111,##ure,"[170, 207, 290, 225]",MISC
1112,Services,"[291, 207, 399, 225]",MISC
1113,Limited,"[399, 207, 493, 225]",MISC
1114,-,"[493, 207, 495, 225]",MISC
1115,NL,"[493, 207, 495, 225]",MISC
1116,-,"[493, 207, 495, 225]",MISC
1117,Role,"[62, 230, 123, 247]",MISC
1118,:,"[123, 230, 137, 247]",MISC
1119,Senior,"[139, 230, 229, 247]",MISC
1120,Software,"[231, 230, 352, 247]",MISC
1121,Engineer,"[353, 230, 475, 247]",MISC
1122,-,"[476, 230, 478, 247]",MISC
1123,NL,"[476, 230, 478, 247]",MISC
1124,-,"[476, 230, 478, 247]",MISC
1125,Work,"[62, 252, 113, 269]",MISC
1126,Location,"[114, 252, 216, 269]",MISC
1127,:,"[217, 252, 229, 269]",MISC
1128,Bangalore,"[230, 252, 344, 269]",MISC
1129,-,"[346, 252, 347, 269]",MISC
1130,NL,"[346, 252, 347, 269]",MISC
1131,-,"[346, 252, 347, 269]",MISC
1132,Skills,"[62, 274, 139, 292]",MISC
1133,:,"[139, 274, 151, 292]",MISC
1134,Sales,"[151, 274, 278, 292]",MISC
1135,##force,"[151, 274, 278, 292]",MISC
1136,Ad,"[279, 274, 342, 292]",MISC
1137,##min,"[279, 274, 342, 292]",MISC
1138,and,"[343, 274, 381, 292]",MISC
1139,Sales,"[381, 274, 508, 292]",MISC
1140,##force,"[381, 274, 508, 292]",MISC
1141,testing,"[508, 274, 597, 292]",MISC
1142,-,"[598, 274, 599, 292]",MISC
1143,NL,"[598, 274, 599, 292]",MISC
1144,-,"[598, 274, 599, 292]",MISC
1145,Role,"[62, 319, 107, 335]",MISC
1146,##s,"[62, 319, 107, 335]",MISC
1147,and,"[108, 319, 134, 335]",MISC
1148,Re,"[136, 319, 282, 335]",MISC
1149,##sp,"[136, 319, 282, 335]",MISC
1150,##ons,"[136, 319, 282, 335]",MISC
1151,##ibi,"[136, 319, 282, 335]",MISC
1152,##lities,"[136, 319, 282, 335]",MISC
1153,-,"[283, 319, 285, 335]",MISC
1154,NL,"[283, 319, 285, 335]",MISC
1155,-,"[283, 319, 285, 335]",MISC
1156,Work,"[72, 361, 133, 376]",MISC
1157,##ed,"[72, 361, 133, 376]",MISC
1158,as,"[133, 361, 152, 376]",MISC
1159,a,"[154, 361, 162, 376]",MISC
1160,Sales,"[164, 361, 265, 376]",MISC
1161,##force,"[164, 361, 265, 376]",MISC
1162,Administrator,"[266, 361, 398, 376]",MISC
1163,and,"[398, 361, 427, 376]",MISC
1164,Sales,"[428, 361, 529, 376]",MISC
1165,##force,"[428, 361, 529, 376]",MISC
1166,Test,"[530, 361, 600, 376]",MISC
1167,##er,"[530, 361, 600, 376]",MISC
1168,.,"[530, 361, 600, 376]",MISC
1169,-,"[601, 361, 603, 376]",MISC
1170,NL,"[601, 361, 603, 376]",MISC
1171,-,"[601, 361, 603, 376]",MISC
1172,Work,"[72, 380, 131, 395]",MISC
1173,##ed,"[72, 380, 131, 395]",MISC
1174,on,"[132, 380, 151, 395]",MISC
1175,the,"[152, 380, 182, 395]",MISC
1176,configuration,"[182, 380, 311, 395]",MISC
1177,of,"[313, 380, 332, 395]",MISC
1178,the,"[333, 380, 362, 395]",MISC
1179,custom,"[363, 380, 422, 395]",MISC
1180,application,"[423, 380, 543, 395]",MISC
1181,.,"[423, 380, 543, 395]",MISC
1182,Created,"[543, 380, 613, 395]",MISC
1183,objects,"[613, 380, 693, 395]",MISC
1184,",","[613, 380, 693, 395]",MISC
1185,records,"[694, 380, 763, 395]",MISC
1186,type,"[764, 380, 804, 395]",MISC
1187,and,"[804, 380, 833, 395]",MISC
1188,page,"[834, 380, 874, 395]",MISC
1189,layout,"[874, 380, 954, 395]",MISC
1190,##s,"[874, 380, 954, 395]",MISC
1191,.,"[874, 380, 954, 395]",MISC
1192,-,"[954, 380, 956, 395]",MISC
1193,NL,"[954, 380, 956, 395]",MISC
1194,-,"[954, 380, 956, 395]",MISC
1195,Also,"[72, 399, 110, 412]",MISC
1196,created,"[111, 399, 179, 412]",MISC
1197,the,"[181, 399, 210, 412]",MISC
1198,automation,"[210, 399, 307, 412]",MISC
1199,processes,"[309, 399, 397, 412]",MISC
1200,for,"[398, 399, 427, 412]",MISC
1201,the,"[427, 399, 457, 412]",MISC
1202,application,"[457, 399, 575, 412]",MISC
1203,.,"[457, 399, 575, 412]",MISC
1204,-,"[575, 399, 577, 412]",MISC
1205,NL,"[575, 399, 577, 412]",MISC
1206,-,"[575, 399, 577, 412]",MISC
1207,Understanding,"[72, 416, 201, 431]",MISC
1208,business,"[201, 416, 279, 431]",MISC
1209,requirements,"[281, 416, 399, 431]",MISC
1210,and,"[400, 416, 429, 431]",MISC
1211,author,"[429, 416, 518, 431]",MISC
1212,##ing,"[429, 416, 518, 431]",MISC
1213,scenarios,"[519, 416, 608, 431]",MISC
1214,based,"[608, 416, 657, 431]",MISC
1215,on,"[658, 416, 677, 431]",MISC
1216,the,"[678, 416, 707, 431]",MISC
1217,understanding,"[707, 416, 845, 431]",MISC
1218,.,"[707, 416, 845, 431]",MISC
1219,-,"[846, 416, 848, 431]",MISC
1220,NL,"[846, 416, 848, 431]",MISC
1221,-,"[846, 416, 848, 431]",MISC
1222,C,"[72, 435, 150, 450]",MISC
1223,##rea,"[72, 435, 150, 450]",MISC
1224,##ting,"[72, 435, 150, 450]",MISC
1225,new,"[151, 435, 181, 450]",MISC
1226,scripts,"[181, 435, 249, 450]",MISC
1227,using,"[251, 435, 299, 450]",MISC
1228,se,"[300, 435, 379, 450]",MISC
1229,##len,"[300, 435, 379, 450]",MISC
1230,##ium,"[300, 435, 379, 450]",MISC
1231,and,"[380, 435, 409, 450]",MISC
1232,up,"[409, 435, 488, 450]",MISC
1233,##dating,"[409, 435, 488, 450]",MISC
1234,and,"[489, 435, 518, 450]",MISC
1235,op,"[519, 435, 618, 450]",MISC
1236,##ti,"[519, 435, 618, 450]",MISC
1237,##mizing,"[519, 435, 618, 450]",MISC
1238,the,"[618, 435, 647, 450]",MISC
1239,existing,"[648, 435, 726, 450]",MISC
1240,scripts,"[727, 435, 805, 450]",MISC
1241,.,"[727, 435, 805, 450]",MISC
1242,-,"[806, 435, 808, 450]",MISC
1243,NL,"[806, 435, 808, 450]",MISC
1244,-,"[806, 435, 808, 450]",MISC
1245,Was,"[73, 454, 104, 469]",MISC
1246,involved,"[106, 454, 193, 469]",MISC
1247,in,"[193, 454, 214, 469]",MISC
1248,the,"[214, 454, 246, 469]",MISC
1249,development,"[247, 454, 365, 469]",MISC
1250,of,"[367, 454, 388, 469]",MISC
1251,the,"[389, 454, 420, 469]",MISC
1252,framework,"[421, 454, 519, 469]",MISC
1253,and,"[519, 454, 551, 469]",MISC
1254,migrated,"[552, 454, 639, 469]",MISC
1255,scripts,"[639, 454, 714, 469]",MISC
1256,from,"[715, 454, 759, 469]",MISC
1257,modular,"[759, 454, 834, 469]",MISC
1258,framework,"[835, 454, 932, 469]",MISC
1259,to,"[933, 454, 954, 469]",MISC
1260,P,"[955, 454, 986, 469]",MISC
1261,##OM,"[955, 454, 986, 469]",MISC
1262,-,"[987, 454, 989, 469]",MISC
1263,NL,"[987, 454, 989, 469]",MISC
1264,-,"[987, 454, 989, 469]",MISC
1265,framework,"[93, 469, 189, 487]",MISC
1266,.,"[93, 469, 189, 487]",MISC
1267,-,"[189, 469, 191, 487]",MISC
1268,NL,"[189, 469, 191, 487]",MISC
1269,-,"[189, 469, 191, 487]",MISC
1270,I,"[72, 491, 206, 505]",MISC
1271,##dent,"[72, 491, 206, 505]",MISC
1272,##ification,"[72, 491, 206, 505]",MISC
1273,of,"[207, 491, 226, 505]",MISC
1274,the,"[226, 491, 254, 505]",MISC
1275,re,"[255, 491, 351, 505]",MISC
1276,##gression,"[255, 491, 351, 505]",MISC
1277,test,"[352, 491, 390, 505]",MISC
1278,cases,"[390, 491, 437, 505]",MISC
1279,for,"[439, 491, 467, 505]",MISC
1280,automation,"[468, 491, 563, 505]",MISC
1281,during,"[564, 491, 622, 505]",MISC
1282,build,"[622, 491, 669, 505]",MISC
1283,gap,"[670, 491, 709, 505]",MISC
1284,.,"[670, 491, 709, 505]",MISC
1285,-,"[709, 491, 711, 505]",MISC
1286,NL,"[709, 491, 711, 505]",MISC
1287,-,"[709, 491, 711, 505]",MISC
1288,Effect,"[72, 509, 178, 524]",MISC
1289,##ively,"[72, 509, 178, 524]",MISC
1290,communicating,"[178, 509, 303, 524]",MISC
1291,the,"[304, 509, 332, 524]",MISC
1292,issues,"[333, 509, 390, 524]",MISC
1293,identified,"[391, 509, 487, 524]",MISC
1294,during,"[488, 509, 545, 524]",MISC
1295,different,"[546, 509, 633, 524]",MISC
1296,phases,"[633, 509, 690, 524]",MISC
1297,of,"[691, 509, 710, 524]",MISC
1298,testing,"[710, 509, 776, 524]",MISC
1299,cycle,"[778, 509, 825, 524]",MISC
1300,to,"[826, 509, 845, 524]",MISC
1301,ensure,"[846, 509, 903, 524]",MISC
1302,a,"[904, 509, 912, 524]",MISC
1303,risk,"[913, 509, 952, 524]",MISC
1304,free,"[952, 509, 990, 524]",MISC
1305,-,"[991, 509, 993, 524]",MISC
1306,NL,"[991, 509, 993, 524]",MISC
1307,-,"[991, 509, 993, 524]",MISC
1308,delivery,"[93, 525, 166, 542]",MISC
1309,.,"[93, 525, 166, 542]",MISC
1310,-,"[166, 525, 168, 542]",MISC
1311,NL,"[166, 525, 168, 542]",MISC
1312,-,"[166, 525, 168, 542]",MISC
1313,Pro,"[72, 546, 157, 561]",MISC
1314,##vid,"[72, 546, 157, 561]",MISC
1315,##ing,"[72, 546, 157, 561]",MISC
1316,the,"[158, 546, 185, 561]",MISC
1317,high,"[186, 546, 223, 561]",MISC
1318,quality,"[225, 546, 291, 561]",MISC
1319,deliver,"[291, 546, 404, 561]",MISC
1320,##ables,"[291, 546, 404, 561]",MISC
1321,test,"[406, 546, 443, 561]",MISC
1322,artifacts,"[444, 546, 530, 561]",MISC
1323,and,"[530, 546, 558, 561]",MISC
1324,testing,"[559, 546, 625, 561]",MISC
1325,to,"[626, 546, 643, 561]",MISC
1326,ensure,"[645, 546, 701, 561]",MISC
1327,no,"[702, 546, 720, 561]",MISC
1328,Production,"[721, 546, 815, 561]",MISC
1329,defects,"[817, 546, 892, 561]",MISC
1330,.,"[817, 546, 892, 561]",MISC
1331,-,"[893, 546, 895, 561]",MISC
1332,NL,"[893, 546, 895, 561]",MISC
1333,-,"[893, 546, 895, 561]",MISC
1334,Time,"[72, 565, 129, 580]",MISC
1335,##ly,"[72, 565, 129, 580]",MISC
1336,reporting,"[130, 565, 217, 580]",MISC
1337,/,"[218, 565, 295, 580]",MISC
1338,logging,"[218, 565, 295, 580]",MISC
1339,the,"[296, 565, 324, 580]",MISC
1340,problem,"[326, 565, 394, 580]",MISC
1341,not,"[394, 565, 519, 580]",MISC
1342,##ifications,"[394, 565, 519, 580]",MISC
1343,identified,"[521, 565, 618, 580]",MISC
1344,during,"[619, 565, 676, 580]",MISC
1345,the,"[677, 565, 705, 580]",MISC
1346,time,"[707, 565, 745, 580]",MISC
1347,of,"[746, 565, 765, 580]",MISC
1348,testing,"[765, 565, 833, 580]",MISC
1349,and,"[834, 565, 861, 580]",MISC
1350,working,"[863, 565, 931, 580]",MISC
1351,closely,"[931, 565, 999, 580]",MISC
1352,-,"[999, 565, 1001, 580]",MISC
1353,NL,"[999, 565, 1001, 580]",MISC
1354,-,"[999, 565, 1001, 580]",MISC
1355,with,"[93, 580, 130, 597]",MISC
1356,leads,"[131, 580, 253, 597]",MISC
1357,/,"[131, 580, 253, 597]",MISC
1358,on,"[131, 580, 253, 597]",MISC
1359,##shore,"[131, 580, 253, 597]",MISC
1360,coordinator,"[255, 580, 406, 597]",MISC
1361,##s,"[255, 580, 406, 597]",MISC
1362,/,"[255, 580, 406, 597]",MISC
1363,de,"[255, 580, 406, 597]",MISC
1364,##v,"[255, 580, 406, 597]",MISC
1365,team,"[407, 580, 443, 597]",MISC
1366,on,"[445, 580, 462, 597]",MISC
1367,the,"[464, 580, 492, 597]",MISC
1368,closure,"[492, 580, 567, 597]",MISC
1369,.,"[492, 580, 567, 597]",MISC
1370,-,"[568, 580, 570, 597]",MISC
1371,NL,"[568, 580, 570, 597]",MISC
1372,-,"[568, 580, 570, 597]",MISC
1373,Pre,"[72, 601, 159, 616]",MISC
1374,##par,"[72, 601, 159, 616]",MISC
1375,##ing,"[72, 601, 159, 616]",MISC
1376,and,"[159, 601, 187, 616]",MISC
1377,communicating,"[188, 601, 314, 616]",MISC
1378,the,"[315, 601, 343, 616]",MISC
1379,daily,"[344, 601, 461, 616]",MISC
1380,/,"[344, 601, 461, 616]",MISC
1381,weekly,"[344, 601, 461, 616]",MISC
1382,status,"[461, 601, 518, 616]",MISC
1383,report,"[519, 601, 576, 616]",MISC
1384,to,"[577, 601, 596, 616]",MISC
1385,the,"[597, 601, 625, 616]",MISC
1386,client,"[626, 601, 683, 616]",MISC
1387,capturing,"[684, 601, 771, 616]",MISC
1388,the,"[772, 601, 800, 616]",MISC
1389,details,"[801, 601, 869, 616]",MISC
1390,like,"[869, 601, 907, 616]",MISC
1391,test,"[908, 601, 946, 616]",MISC
1392,plan,"[947, 601, 985, 616]",MISC
1393,-,"[986, 601, 987, 616]",MISC
1394,NL,"[986, 601, 987, 616]",MISC
1395,-,"[986, 601, 987, 616]",MISC
1396,coverage,"[93, 617, 177, 635]",MISC
1397,",","[93, 617, 177, 635]",MISC
1398,test,"[179, 617, 215, 635]",MISC
1399,case,"[216, 617, 253, 635]",MISC
1400,execution,"[254, 617, 338, 635]",MISC
1401,coverage,"[339, 617, 414, 635]",MISC
1402,per,"[415, 617, 443, 635]",MISC
1403,build,"[443, 617, 490, 635]",MISC
1404,wise,"[490, 617, 537, 635]",MISC
1405,",","[490, 617, 537, 635]",MISC
1406,issues,"[538, 617, 593, 635]",MISC
1407,encountered,"[594, 617, 708, 635]",MISC
1408,",","[594, 617, 708, 635]",MISC
1409,problem,"[708, 617, 774, 635]",MISC
1410,not,"[774, 617, 896, 635]",MISC
1411,##ifications,"[774, 617, 896, 635]",MISC
1412,with,"[897, 617, 934, 635]",MISC
1413,their,"[935, 617, 982, 635]",MISC
1414,-,"[982, 617, 984, 635]",MISC
1415,NL,"[982, 617, 984, 635]",MISC
1416,-,"[982, 617, 984, 635]",MISC
1417,classification,"[93, 636, 220, 654]",MISC
1418,and,"[221, 636, 247, 654]",MISC
1419,status,"[248, 636, 302, 654]",MISC
1420,and,"[303, 636, 329, 654]",MISC
1421,effort,"[330, 636, 384, 654]",MISC
1422,u,"[384, 636, 483, 654]",MISC
1423,##til,"[384, 636, 483, 654]",MISC
1424,##ization,"[384, 636, 483, 654]",MISC
1425,on,"[484, 636, 502, 654]",MISC
1426,weekly,"[503, 636, 556, 654]",MISC
1427,basis,"[557, 636, 611, 654]",MISC
1428,.,"[557, 636, 611, 654]",MISC
1429,-,"[612, 636, 613, 654]",MISC
1430,NL,"[612, 636, 613, 654]",MISC
1431,-,"[612, 636, 613, 654]",MISC
1432,Project,"[62, 698, 126, 715]",MISC
1433,4,"[127, 698, 144, 715]",MISC
1434,:,"[127, 698, 144, 715]",MISC
1435,-,"[146, 698, 147, 715]",MISC
1436,NL,"[146, 698, 147, 715]",MISC
1437,-,"[146, 698, 147, 715]",MISC
1438,Du,"[62, 733, 175, 752]",MISC
1439,##ration,"[62, 733, 175, 752]",MISC
1440,:,"[176, 733, 189, 752]",MISC
1441,October,"[190, 733, 289, 752]",MISC
1442,2012,"[289, 733, 345, 752]",MISC
1443,–,"[346, 733, 360, 752]",MISC
1444,November,"[360, 733, 473, 752]",MISC
1445,2015,"[473, 733, 529, 752]",MISC
1446,-,"[530, 733, 532, 752]",MISC
1447,NL,"[530, 733, 532, 752]",MISC
1448,-,"[530, 733, 532, 752]",MISC
1449,Company,"[62, 756, 156, 773]",MISC
1450,:,"[156, 756, 169, 773]",MISC
1451,A,"[170, 756, 290, 773]",MISC
1452,##cc,"[170, 756, 290, 773]",MISC
1453,##ent,"[170, 756, 290, 773]",MISC
1454,##ure,"[170, 756, 290, 773]",MISC
1455,Services,"[291, 756, 399, 773]",MISC
1456,Limited,"[399, 756, 493, 773]",MISC
1457,-,"[493, 756, 495, 773]",MISC
1458,NL,"[493, 756, 495, 773]",MISC
1459,-,"[493, 756, 495, 773]",MISC
1460,Role,"[62, 778, 128, 796]",MISC
1461,:,"[129, 778, 145, 796]",MISC
1462,Software,"[146, 778, 280, 796]",MISC
1463,Engineer,"[281, 778, 415, 796]",MISC
1464,-,"[415, 778, 417, 796]",MISC
1465,NL,"[415, 778, 417, 796]",MISC
1466,-,"[415, 778, 417, 796]",MISC
1467,Work,"[62, 800, 113, 817]",MISC
1468,Location,"[114, 800, 216, 817]",MISC
1469,:,"[217, 800, 229, 817]",MISC
1470,Bangalore,"[230, 800, 344, 817]",MISC
1471,-,"[346, 800, 347, 817]",MISC
1472,NL,"[346, 800, 347, 817]",MISC
1473,-,"[346, 800, 347, 817]",MISC
1474,Skills,"[62, 823, 132, 840]",MISC
1475,:,"[133, 823, 143, 840]",MISC
1476,Fun,"[145, 823, 261, 840]",MISC
1477,##ctional,"[145, 823, 261, 840]",MISC
1478,Testing,"[262, 823, 356, 840]",MISC
1479,",","[262, 823, 356, 840]",MISC
1480,Web,"[357, 823, 391, 840]",MISC
1481,Testing,"[392, 823, 474, 840]",MISC
1482,and,"[474, 823, 509, 840]",MISC
1483,Integration,"[510, 823, 638, 840]",MISC
1484,testing,"[639, 823, 733, 840]",MISC
1485,.,"[639, 823, 733, 840]",MISC
1486,-,"[733, 823, 735, 840]",MISC
1487,NL,"[733, 823, 735, 840]",MISC
1488,-,"[733, 823, 735, 840]",MISC
1489,Role,"[62, 867, 107, 884]",MISC
1490,##s,"[62, 867, 107, 884]",MISC
1491,and,"[108, 867, 134, 884]",MISC
1492,Re,"[136, 867, 282, 884]",MISC
1493,##sp,"[136, 867, 282, 884]",MISC
1494,##ons,"[136, 867, 282, 884]",MISC
1495,##ibi,"[136, 867, 282, 884]",MISC
1496,##lities,"[136, 867, 282, 884]",MISC
1497,-,"[283, 867, 285, 884]",MISC
1498,NL,"[283, 867, 285, 884]",MISC
1499,-,"[283, 867, 285, 884]",MISC
1500,In,"[72, 914, 152, 928]",MISC
1501,##volved,"[72, 914, 152, 928]",MISC
1502,in,"[153, 914, 172, 928]",MISC
1503,Re,"[173, 914, 293, 928]",MISC
1504,##quire,"[173, 914, 293, 928]",MISC
1505,##ments,"[173, 914, 293, 928]",MISC
1506,Analysis,"[294, 914, 384, 928]",MISC
1507,",","[294, 914, 384, 928]",MISC
1508,Impact,"[384, 914, 444, 928]",MISC
1509,Analysis,"[445, 914, 535, 928]",MISC
1510,",","[445, 914, 535, 928]",MISC
1511,Test,"[535, 914, 575, 928]",MISC
1512,Planning,"[576, 914, 666, 928]",MISC
1513,",","[576, 914, 666, 928]",MISC
1514,Test,"[666, 914, 706, 928]",MISC
1515,Ex,"[707, 914, 797, 928]",MISC
1516,##ec,"[707, 914, 797, 928]",MISC
1517,##ution,"[707, 914, 797, 928]",MISC
1518,and,"[797, 914, 827, 928]",MISC
1519,De,"[828, 914, 887, 928]",MISC
1520,##fect,"[828, 914, 887, 928]",MISC
1521,Track,"[888, 914, 978, 928]",MISC
1522,##ing,"[888, 914, 978, 928]",MISC
1523,.,"[888, 914, 978, 928]",MISC
1524,-,"[979, 914, 980, 928]",MISC
1525,NL,"[979, 914, 980, 928]",MISC
1526,-,"[979, 914, 980, 928]",MISC
1527,Work,"[72, 932, 133, 946]",MISC
1528,##ed,"[72, 932, 133, 946]",MISC
1529,as,"[133, 932, 152, 946]",MISC
1530,a,"[154, 932, 162, 946]",MISC
1531,manual,"[164, 932, 225, 946]",MISC
1532,test,"[225, 932, 286, 946]",MISC
1533,##er,"[225, 932, 286, 946]",MISC
1534,and,"[286, 932, 315, 946]",MISC
1535,was,"[316, 932, 346, 946]",MISC
1536,part,"[347, 932, 387, 946]",MISC
1537,of,"[388, 932, 407, 946]",MISC
1538,functional,"[408, 932, 509, 946]",MISC
1539,web,"[510, 932, 539, 946]",MISC
1540,and,"[540, 932, 570, 946]",MISC
1541,Integration,"[571, 932, 682, 946]",MISC
1542,testing,"[682, 932, 752, 946]",MISC
1543,of,"[754, 932, 773, 946]",MISC
1544,the,"[774, 932, 803, 946]",MISC
1545,application,"[804, 932, 926, 946]",MISC
1546,.,"[804, 932, 926, 946]",MISC
1547,-,"[926, 932, 928, 946]",MISC
1548,NL,"[926, 932, 928, 946]",MISC
1549,-,"[926, 932, 928, 946]",MISC
1550,Clearly,"[72, 950, 140, 965]",MISC
1551,understanding,"[140, 950, 265, 965]",MISC
1552,the,"[267, 950, 295, 965]",MISC
1553,application,"[296, 950, 402, 965]",MISC
1554,and,"[404, 950, 432, 965]",MISC
1555,the,"[433, 950, 461, 965]",MISC
1556,business,"[462, 950, 539, 965]",MISC
1557,requirements,"[540, 950, 666, 965]",MISC
1558,.,"[540, 950, 666, 965]",MISC
1559,-,"[667, 950, 669, 965]",MISC
1560,NL,"[667, 950, 669, 965]",MISC
1561,-,"[667, 950, 669, 965]",MISC
1562,Understanding,"[72, 969, 204, 983]",MISC
1563,the,"[205, 969, 234, 983]",MISC
1564,Business,"[235, 969, 315, 983]",MISC
1565,Process,"[317, 969, 388, 983]",MISC
1566,of,"[388, 969, 408, 983]",MISC
1567,C,"[409, 969, 470, 983]",MISC
1568,##lient,"[409, 969, 470, 983]",MISC
1569,application,"[470, 969, 581, 983]",MISC
1570,and,"[582, 969, 612, 983]",MISC
1571,SL,"[613, 969, 663, 983]",MISC
1572,##As,"[613, 969, 663, 983]",MISC
1573,.,"[613, 969, 663, 983]",MISC
1574,-,"[664, 969, 666, 983]",MISC
1575,NL,"[664, 969, 666, 983]",MISC
1576,-,"[664, 969, 666, 983]",MISC
1577,Deep,"[62, 67, 126, 85]",B-name
1578,##ak,"[62, 67, 126, 85]",I-name
1579,T,"[126, 67, 191, 85]",I-name
1580,##i,"[126, 67, 191, 85]",I-name
1581,##wari,"[126, 67, 191, 85]",I-name
1582,-,"[191, 67, 193, 85]",MISC
1583,NL,"[191, 67, 193, 85]",MISC
1584,-,"[191, 67, 193, 85]",MISC
1585,Working,"[72, 89, 144, 104]",MISC
1586,on,"[145, 89, 164, 104]",MISC
1587,creation,"[165, 89, 247, 104]",MISC
1588,of,"[248, 89, 267, 104]",MISC
1589,Re,"[268, 89, 381, 104]",MISC
1590,##quire,"[268, 89, 381, 104]",MISC
1591,##ment,"[268, 89, 381, 104]",MISC
1592,Trace,"[382, 89, 505, 104]",MISC
1593,##ability,"[382, 89, 505, 104]",MISC
1594,Matrix,"[505, 89, 566, 104]",MISC
1595,(,"[567, 89, 628, 104]",MISC
1596,R,"[567, 89, 628, 104]",MISC
1597,##TM,"[567, 89, 628, 104]",MISC
1598,),"[567, 89, 628, 104]",MISC
1599,",","[567, 89, 628, 104]",MISC
1600,Test,"[629, 89, 669, 104]",MISC
1601,Case,"[670, 89, 731, 104]",MISC
1602,##s,"[670, 89, 731, 104]",MISC
1603,",","[670, 89, 731, 104]",MISC
1604,Test,"[732, 89, 772, 104]",MISC
1605,Plan,"[774, 89, 824, 104]",MISC
1606,",","[774, 89, 824, 104]",MISC
1607,Con,"[825, 89, 928, 104]",MISC
1608,##fi,"[825, 89, 928, 104]",MISC
1609,##dence,"[825, 89, 928, 104]",MISC
1610,-,"[928, 89, 930, 104]",MISC
1611,NL,"[928, 89, 930, 104]",MISC
1612,-,"[928, 89, 930, 104]",MISC
1613,works,"[93, 104, 198, 123]",MISC
1614,##hee,"[93, 104, 198, 123]",MISC
1615,##ts,"[93, 104, 198, 123]",MISC
1616,and,"[198, 104, 230, 123]",MISC
1617,End,"[230, 104, 261, 123]",MISC
1618,of,"[261, 104, 282, 123]",MISC
1619,Test,"[282, 104, 324, 123]",MISC
1620,Doc,"[324, 104, 429, 123]",MISC
1621,##ume,"[324, 104, 429, 123]",MISC
1622,##nts,"[324, 104, 429, 123]",MISC
1623,.,"[324, 104, 429, 123]",MISC
1624,-,"[429, 104, 431, 123]",MISC
1625,NL,"[429, 104, 431, 123]",MISC
1626,-,"[429, 104, 431, 123]",MISC
1627,Effect,"[71, 126, 174, 140]",MISC
1628,##ively,"[71, 126, 174, 140]",MISC
1629,interacting,"[175, 126, 277, 140]",MISC
1630,with,"[278, 126, 315, 140]",MISC
1631,leads,"[316, 126, 437, 140]",MISC
1632,/,"[316, 126, 437, 140]",MISC
1633,on,"[316, 126, 437, 140]",MISC
1634,##shore,"[316, 126, 437, 140]",MISC
1635,coordinator,"[438, 126, 540, 140]",MISC
1636,and,"[541, 126, 569, 140]",MISC
1637,application,"[569, 126, 672, 140]",MISC
1638,team,"[672, 126, 709, 140]",MISC
1639,for,"[710, 126, 738, 140]",MISC
1640,all,"[738, 126, 766, 140]",MISC
1641,support,"[766, 126, 888, 140]",MISC
1642,/,"[766, 126, 888, 140]",MISC
1643,issue,"[766, 126, 888, 140]",MISC
1644,resolution,"[888, 126, 980, 140]",MISC
1645,-,"[982, 126, 984, 140]",MISC
1646,NL,"[982, 126, 984, 140]",MISC
1647,-,"[982, 126, 984, 140]",MISC
1648,activities,"[93, 142, 173, 159]",MISC
1649,.,"[93, 142, 173, 159]",MISC
1650,-,"[173, 142, 175, 159]",MISC
1651,NL,"[173, 142, 175, 159]",MISC
1652,-,"[173, 142, 175, 159]",MISC
1653,Effect,"[72, 163, 178, 178]",MISC
1654,##ively,"[72, 163, 178, 178]",MISC
1655,communicating,"[178, 163, 303, 178]",MISC
1656,the,"[304, 163, 332, 178]",MISC
1657,issues,"[333, 163, 390, 178]",MISC
1658,identified,"[391, 163, 487, 178]",MISC
1659,during,"[488, 163, 545, 178]",MISC
1660,different,"[546, 163, 633, 178]",MISC
1661,phases,"[633, 163, 690, 178]",MISC
1662,of,"[691, 163, 710, 178]",MISC
1663,testing,"[710, 163, 776, 178]",MISC
1664,cycle,"[778, 163, 825, 178]",MISC
1665,to,"[826, 163, 845, 178]",MISC
1666,ensure,"[846, 163, 903, 178]",MISC
1667,a,"[904, 163, 912, 178]",MISC
1668,risk,"[913, 163, 952, 178]",MISC
1669,free,"[952, 163, 990, 178]",MISC
1670,-,"[991, 163, 993, 178]",MISC
1671,NL,"[991, 163, 993, 178]",MISC
1672,-,"[991, 163, 993, 178]",MISC
1673,delivery,"[93, 178, 166, 197]",MISC
1674,.,"[93, 178, 166, 197]",MISC
1675,-,"[166, 178, 168, 197]",MISC
1676,NL,"[166, 178, 168, 197]",MISC
1677,-,"[166, 178, 168, 197]",MISC
1678,Pro,"[72, 201, 157, 215]",MISC
1679,##vid,"[72, 201, 157, 215]",MISC
1680,##ing,"[72, 201, 157, 215]",MISC
1681,the,"[158, 201, 185, 215]",MISC
1682,high,"[186, 201, 223, 215]",MISC
1683,quality,"[225, 201, 291, 215]",MISC
1684,deliver,"[291, 201, 404, 215]",MISC
1685,##ables,"[291, 201, 404, 215]",MISC
1686,test,"[406, 201, 443, 215]",MISC
1687,artifacts,"[444, 201, 530, 215]",MISC
1688,and,"[530, 201, 558, 215]",MISC
1689,testing,"[559, 201, 625, 215]",MISC
1690,to,"[626, 201, 643, 215]",MISC
1691,ensure,"[645, 201, 701, 215]",MISC
1692,no,"[702, 201, 720, 215]",MISC
1693,Production,"[721, 201, 815, 215]",MISC
1694,defects,"[817, 201, 892, 215]",MISC
1695,.,"[817, 201, 892, 215]",MISC
1696,-,"[893, 201, 895, 215]",MISC
1697,NL,"[893, 201, 895, 215]",MISC
1698,-,"[893, 201, 895, 215]",MISC
1699,Time,"[72, 218, 131, 233]",MISC
1700,##ly,"[72, 218, 131, 233]",MISC
1701,reporting,"[131, 218, 220, 233]",MISC
1702,/,"[220, 218, 298, 233]",MISC
1703,logging,"[220, 218, 298, 233]",MISC
1704,the,"[299, 218, 329, 233]",MISC
1705,problem,"[329, 218, 396, 233]",MISC
1706,Not,"[398, 218, 525, 233]",MISC
1707,##ifications,"[398, 218, 525, 233]",MISC
1708,identified,"[526, 218, 623, 233]",MISC
1709,during,"[625, 218, 684, 233]",MISC
1710,the,"[684, 218, 713, 233]",MISC
1711,time,"[713, 218, 752, 233]",MISC
1712,of,"[753, 218, 772, 233]",MISC
1713,testing,"[773, 218, 840, 233]",MISC
1714,and,"[842, 218, 871, 233]",MISC
1715,working,"[871, 218, 939, 233]",MISC
1716,-,"[940, 218, 942, 233]",MISC
1717,NL,"[940, 218, 942, 233]",MISC
1718,-,"[940, 218, 942, 233]",MISC
1719,closely,"[93, 234, 160, 252]",MISC
1720,with,"[160, 234, 196, 252]",MISC
1721,leads,"[197, 234, 319, 252]",MISC
1722,/,"[197, 234, 319, 252]",MISC
1723,on,"[197, 234, 319, 252]",MISC
1724,##shore,"[197, 234, 319, 252]",MISC
1725,coordinator,"[320, 234, 472, 252]",MISC
1726,##s,"[320, 234, 472, 252]",MISC
1727,/,"[320, 234, 472, 252]",MISC
1728,de,"[320, 234, 472, 252]",MISC
1729,##v,"[320, 234, 472, 252]",MISC
1730,team,"[472, 234, 508, 252]",MISC
1731,on,"[510, 234, 527, 252]",MISC
1732,the,"[529, 234, 556, 252]",MISC
1733,closure,"[557, 234, 632, 252]",MISC
1734,.,"[557, 234, 632, 252]",MISC
1735,-,"[633, 234, 634, 252]",MISC
1736,NL,"[633, 234, 634, 252]",MISC
1737,-,"[633, 234, 634, 252]",MISC
1738,Pre,"[72, 256, 159, 270]",MISC
1739,##par,"[72, 256, 159, 270]",MISC
1740,##ing,"[72, 256, 159, 270]",MISC
1741,and,"[159, 256, 187, 270]",MISC
1742,communicating,"[188, 256, 314, 270]",MISC
1743,the,"[315, 256, 343, 270]",MISC
1744,daily,"[344, 256, 461, 270]",MISC
1745,/,"[344, 256, 461, 270]",MISC
1746,weekly,"[344, 256, 461, 270]",MISC
1747,status,"[461, 256, 518, 270]",MISC
1748,report,"[519, 256, 576, 270]",MISC
1749,to,"[577, 256, 596, 270]",MISC
1750,the,"[597, 256, 625, 270]",MISC
1751,client,"[626, 256, 683, 270]",MISC
1752,capturing,"[684, 256, 771, 270]",MISC
1753,the,"[772, 256, 800, 270]",MISC
1754,details,"[801, 256, 869, 270]",MISC
1755,like,"[869, 256, 907, 270]",MISC
1756,test,"[908, 256, 946, 270]",MISC
1757,plan,"[947, 256, 985, 270]",MISC
1758,-,"[986, 256, 987, 270]",MISC
1759,NL,"[986, 256, 987, 270]",MISC
1760,-,"[986, 256, 987, 270]",MISC
1761,coverage,"[93, 270, 177, 289]",MISC
1762,",","[93, 270, 177, 289]",MISC
1763,test,"[179, 270, 215, 289]",MISC
1764,case,"[216, 270, 253, 289]",MISC
1765,execution,"[254, 270, 338, 289]",MISC
1766,coverage,"[339, 270, 414, 289]",MISC
1767,per,"[415, 270, 443, 289]",MISC
1768,build,"[443, 270, 490, 289]",MISC
1769,wise,"[490, 270, 537, 289]",MISC
1770,",","[490, 270, 537, 289]",MISC
1771,issues,"[538, 270, 593, 289]",MISC
1772,encountered,"[594, 270, 708, 289]",MISC
1773,",","[594, 270, 708, 289]",MISC
1774,problem,"[708, 270, 774, 289]",MISC
1775,not,"[774, 270, 896, 289]",MISC
1776,##ifications,"[774, 270, 896, 289]",MISC
1777,with,"[897, 270, 934, 289]",MISC
1778,their,"[935, 270, 982, 289]",MISC
1779,-,"[982, 270, 984, 289]",MISC
1780,NL,"[982, 270, 984, 289]",MISC
1781,-,"[982, 270, 984, 289]",MISC
1782,classification,"[93, 289, 220, 308]",MISC
1783,and,"[221, 289, 247, 308]",MISC
1784,status,"[248, 289, 302, 308]",MISC
1785,and,"[303, 289, 329, 308]",MISC
1786,effort,"[330, 289, 384, 308]",MISC
1787,u,"[384, 289, 483, 308]",MISC
1788,##til,"[384, 289, 483, 308]",MISC
1789,##ization,"[384, 289, 483, 308]",MISC
1790,on,"[484, 289, 502, 308]",MISC
1791,weekly,"[503, 289, 556, 308]",MISC
1792,basis,"[557, 289, 611, 308]",MISC
1793,.,"[557, 289, 611, 308]",MISC
1794,-,"[612, 289, 613, 308]",MISC
1795,NL,"[612, 289, 613, 308]",MISC
1796,-,"[612, 289, 613, 308]",MISC
1797,Education,"[62, 331, 163, 351]",B-education_heading
1798,Det,"[163, 331, 252, 351]",I-education_heading
1799,##ails,"[163, 331, 252, 351]",I-education_heading
1800,:,"[163, 331, 252, 351]",I-education_heading
1801,-,"[253, 331, 255, 351]",MISC
1802,NL,"[253, 331, 255, 351]",MISC
1803,-,"[253, 331, 255, 351]",MISC
1804,Bachelor,"[62, 371, 144, 388]",MISC
1805,of,"[145, 371, 164, 388]",MISC
1806,Technology,"[166, 371, 268, 388]",MISC
1807,in,"[269, 371, 289, 388]",MISC
1808,Information,"[290, 371, 403, 388]",MISC
1809,Technology,"[404, 371, 507, 388]",MISC
1810,from,"[508, 371, 548, 388]",MISC
1811,Graphic,"[549, 371, 621, 388]",B-education_institute
1812,Era,"[622, 371, 651, 388]",I-education_institute
1813,University,"[653, 371, 766, 388]",I-education_institute
1814,",","[653, 371, 766, 388]",I-education_institute
1815,De,"[767, 371, 859, 388]",I-education_institute
1816,##hra,"[767, 371, 859, 388]",I-education_institute
1817,##du,"[767, 371, 859, 388]",I-education_institute
1818,##n,"[767, 371, 859, 388]",I-education_institute
1819,.,"[767, 371, 859, 388]",MISC
1820,-,"[860, 371, 862, 388]",MISC
1821,NL,"[860, 371, 862, 388]",MISC
1822,-,"[860, 371, 862, 388]",MISC
1823,Course,"[86, 407, 203, 426]",MISC
1824,-,"[204, 407, 223, 426]",MISC
1825,Institution,"[223, 407, 437, 426]",MISC
1826,-,"[439, 407, 458, 426]",MISC
1827,Per,"[458, 407, 653, 426]",MISC
1828,##cent,"[458, 407, 653, 426]",MISC
1829,##age,"[458, 407, 653, 426]",MISC
1830,-,"[654, 407, 673, 426]",MISC
1831,Year,"[674, 407, 752, 426]",MISC
1832,of,"[752, 407, 790, 426]",MISC
1833,passing,"[791, 407, 927, 426]",MISC
1834,-,"[928, 407, 930, 426]",MISC
1835,NL,"[928, 407, 930, 426]",MISC
1836,-,"[928, 407, 930, 426]",MISC
1837,High,"[86, 431, 146, 449]",B-education_degree
1838,School,"[146, 431, 235, 449]",I-education_degree
1839,-,"[236, 431, 250, 449]",MISC
1840,River,"[251, 431, 385, 449]",B-education_institute
1841,##dale,"[251, 431, 385, 449]",I-education_institute
1842,High,"[385, 431, 444, 449]",I-education_institute
1843,School,"[445, 431, 549, 449]",I-education_institute
1844,",","[445, 431, 549, 449]",I-education_institute
1845,De,"[549, 431, 667, 449]",I-education_institute
1846,##hra,"[549, 431, 667, 449]",I-education_institute
1847,##du,"[549, 431, 667, 449]",I-education_institute
1848,##n,"[549, 431, 667, 449]",I-education_institute
1849,-,"[668, 431, 682, 449]",MISC
1850,89,"[683, 431, 756, 449]",MISC
1851,.,"[683, 431, 756, 449]",MISC
1852,5,"[683, 431, 756, 449]",MISC
1853,%,"[683, 431, 756, 449]",MISC
1854,-,"[758, 431, 772, 449]",MISC
1855,2006,"[773, 431, 832, 449]",MISC
1856,-,"[833, 431, 834, 449]",MISC
1857,NL,"[833, 431, 834, 449]",MISC
1858,-,"[833, 431, 834, 449]",MISC
1859,Intermediate,"[86, 466, 255, 483]",B-education_degree
1860,-,"[255, 466, 269, 483]",MISC
1861,River,"[269, 466, 395, 483]",B-education_institute
1862,##dale,"[269, 466, 395, 483]",I-education_institute
1863,High,"[396, 466, 452, 483]",I-education_institute
1864,School,"[452, 466, 550, 483]",I-education_institute
1865,",","[452, 466, 550, 483]",I-education_institute
1866,De,"[551, 466, 662, 483]",I-education_institute
1867,##hra,"[551, 466, 662, 483]",I-education_institute
1868,##du,"[551, 466, 662, 483]",I-education_institute
1869,##n,"[551, 466, 662, 483]",I-education_institute
1870,-,"[664, 466, 678, 483]",MISC
1871,83,"[678, 466, 761, 483]",MISC
1872,.,"[678, 466, 761, 483]",MISC
1873,67,"[678, 466, 761, 483]",MISC
1874,%,"[678, 466, 761, 483]",MISC
1875,-,"[762, 466, 776, 483]",MISC
1876,2008,"[776, 466, 832, 483]",MISC
1877,-,"[833, 466, 834, 483]",MISC
1878,NL,"[833, 466, 834, 483]",MISC
1879,-,"[833, 466, 834, 483]",MISC
1880,B,"[86, 500, 179, 517]",B-education_degree
1881,.,"[86, 500, 179, 517]",I-education_degree
1882,Tech,"[86, 500, 179, 517]",I-education_degree
1883,-,"[180, 500, 194, 517]",MISC
1884,Graphic,"[195, 500, 303, 517]",B-education_institute
1885,Era,"[304, 500, 349, 517]",I-education_institute
1886,University,"[351, 500, 521, 517]",I-education_institute
1887,",","[351, 500, 521, 517]",I-education_institute
1888,De,"[522, 500, 645, 517]",I-education_institute
1889,##hra,"[522, 500, 645, 517]",I-education_institute
1890,##du,"[522, 500, 645, 517]",I-education_institute
1891,##n,"[522, 500, 645, 517]",I-education_institute
1892,-,"[646, 500, 660, 517]",MISC
1893,80,"[662, 500, 754, 517]",MISC
1894,.,"[662, 500, 754, 517]",MISC
1895,01,"[662, 500, 754, 517]",MISC
1896,%,"[662, 500, 754, 517]",MISC
1897,-,"[755, 500, 769, 517]",MISC
1898,2012,"[770, 500, 831, 517]",MISC
1899,-,"[833, 500, 834, 517]",MISC
1900,NL,"[833, 500, 834, 517]",MISC
1901,-,"[833, 500, 834, 517]",MISC
1902,Personal,"[62, 571, 149, 592]",B-personal_details_heading
1903,Det,"[150, 571, 237, 592]",I-personal_details_heading
1904,##ails,"[150, 571, 237, 592]",I-personal_details_heading
1905,:,"[150, 571, 237, 592]",I-personal_details_heading
1906,-,"[238, 571, 240, 592]",MISC
1907,NL,"[238, 571, 240, 592]",MISC
1908,-,"[238, 571, 240, 592]",MISC
1909,D,"[62, 621, 111, 640]",MISC
1910,##O,"[62, 621, 111, 640]",MISC
1911,##B,"[62, 621, 111, 640]",MISC
1912,:,"[62, 621, 111, 640]",MISC
1913,-,"[111, 621, 113, 640]",MISC
1914,NL,"[111, 621, 113, 640]",MISC
1915,-,"[111, 621, 113, 640]",MISC
1916,6th,"[187, 621, 219, 640]",MISC
1917,September,"[219, 621, 313, 640]",MISC
1918,1990,"[313, 621, 354, 640]",MISC
1919,-,"[354, 621, 356, 640]",MISC
1920,NL,"[354, 621, 356, 640]",MISC
1921,-,"[354, 621, 356, 640]",MISC
1922,Language,"[62, 644, 165, 662]",MISC
1923,:,"[62, 644, 165, 662]",MISC
1924,English,"[166, 644, 246, 662]",MISC
1925,and,"[246, 644, 280, 662]",MISC
1926,Hindi,"[281, 644, 338, 662]",MISC
1927,-,"[339, 644, 340, 662]",MISC
1928,NL,"[339, 644, 340, 662]",MISC
1929,-,"[339, 644, 340, 662]",MISC
1930,Location,"[62, 671, 165, 689]",MISC
1931,:,"[62, 671, 165, 689]",MISC
1932,Bangalore,"[166, 671, 268, 689]",MISC
1933,-,"[269, 671, 271, 689]",MISC
1934,NL,"[269, 671, 271, 689]",MISC
1935,-,"[269, 671, 271, 689]",MISC
