,token,box,label
0,C,"[389, 43, 550, 62]",MISC
1,##UR,"[389, 43, 550, 62]",MISC
2,##RI,"[389, 43, 550, 62]",MISC
3,##CU,"[389, 43, 550, 62]",MISC
4,##L,"[389, 43, 550, 62]",MISC
5,##UM,"[389, 43, 550, 62]",MISC
6,VI,"[552, 43, 632, 62]",MISC
7,##TA,"[552, 43, 632, 62]",MISC
8,##E,"[552, 43, 632, 62]",MISC
9,-,"[633, 43, 635, 62]",MISC
10,NL,"[633, 43, 635, 62]",MISC
11,-,"[633, 43, 635, 62]",MISC
12,P,"[64, 83, 139, 98]",B-name
13,##ram,"[64, 83, 139, 98]",I-name
14,##od,"[64, 83, 139, 98]",I-name
15,Raj,"[141, 83, 178, 98]",I-name
16,Ara,"[179, 83, 229, 98]",I-name
17,##s,"[179, 83, 229, 98]",I-name
18,-,"[230, 83, 232, 98]",MISC
19,NL,"[230, 83, 232, 98]",MISC
20,-,"[230, 83, 232, 98]",MISC
21,E,"[64, 98, 152, 115]",MISC
22,-,"[64, 98, 152, 115]",MISC
23,Mail,"[64, 98, 152, 115]",MISC
24,:,"[64, 98, 152, 115]",MISC
25,P,"[152, 98, 442, 115]",B-emails_email
26,##ram,"[152, 98, 442, 115]",I-emails_email
27,##od,"[152, 98, 442, 115]",I-emails_email
28,##raj,"[152, 98, 442, 115]",I-emails_email
29,##ara,"[152, 98, 442, 115]",I-emails_email
30,##s,"[152, 98, 442, 115]",I-emails_email
31,@,"[152, 98, 442, 115]",I-emails_email
32,g,"[152, 98, 442, 115]",I-emails_email
33,##mail,"[152, 98, 442, 115]",I-emails_email
34,.,"[152, 98, 442, 115]",I-emails_email
35,com,"[152, 98, 442, 115]",I-emails_email
36,-,"[443, 98, 445, 115]",MISC
37,NL,"[443, 98, 445, 115]",MISC
38,-,"[443, 98, 445, 115]",MISC
39,Contact,"[64, 114, 161, 131]",MISC
40,No,"[161, 114, 203, 131]",MISC
41,:,"[161, 114, 203, 131]",MISC
42,+,"[203, 114, 384, 131]",B-phones_phone
43,91,"[203, 114, 384, 131]",I-phones_phone
44,##9,"[203, 114, 384, 131]",I-phones_phone
45,##7,"[203, 114, 384, 131]",I-phones_phone
46,##41,"[203, 114, 384, 131]",I-phones_phone
47,##55,"[203, 114, 384, 131]",I-phones_phone
48,##6,"[203, 114, 384, 131]",I-phones_phone
49,##7,"[203, 114, 384, 131]",I-phones_phone
50,##8,"[203, 114, 384, 131]",I-phones_phone
51,##9,"[203, 114, 384, 131]",I-phones_phone
52,-,"[384, 114, 386, 131]",MISC
53,NL,"[384, 114, 386, 131]",MISC
54,-,"[384, 114, 386, 131]",MISC
55,In,"[71, 152, 91, 166]",MISC
56,quest,"[92, 152, 144, 166]",MISC
57,of,"[144, 152, 164, 166]",MISC
58,challenging,"[165, 152, 280, 166]",MISC
59,opportunities,"[280, 152, 414, 166]",MISC
60,in,"[416, 152, 436, 166]",MISC
61,Sales,"[437, 152, 489, 166]",MISC
62,&,"[489, 152, 498, 166]",MISC
63,Marketing,"[499, 152, 592, 166]",MISC
64,/,"[593, 152, 602, 166]",MISC
65,Business,"[604, 152, 686, 166]",MISC
66,Development,"[688, 152, 802, 166]",MISC
67,/,"[802, 152, 811, 166]",MISC
68,Channel,"[813, 152, 884, 166]",MISC
69,Management,"[886, 152, 990, 166]",MISC
70,-,"[991, 152, 992, 166]",MISC
71,NL,"[991, 152, 992, 166]",MISC
72,-,"[991, 152, 992, 166]",MISC
73,with,"[166, 166, 207, 179]",MISC
74,a,"[207, 166, 216, 179]",MISC
75,leading,"[217, 166, 289, 179]",MISC
76,organization,"[290, 166, 413, 179]",MISC
77,of,"[413, 166, 433, 179]",MISC
78,re,"[434, 166, 495, 179]",MISC
79,##pute,"[434, 166, 495, 179]",MISC
80,prefer,"[496, 166, 598, 179]",MISC
81,##ably,"[496, 166, 598, 179]",MISC
82,in,"[599, 166, 618, 179]",MISC
83,FM,"[619, 166, 784, 179]",MISC
84,##C,"[619, 166, 784, 179]",MISC
85,##G,"[619, 166, 784, 179]",MISC
86,/,"[619, 166, 784, 179]",MISC
87,FM,"[619, 166, 784, 179]",MISC
88,##CD,"[619, 166, 784, 179]",MISC
89,/,"[619, 166, 784, 179]",MISC
90,Modern,"[619, 166, 784, 179]",MISC
91,Trade,"[784, 166, 834, 179]",MISC
92,Sector,"[836, 166, 897, 179]",MISC
93,-,"[898, 166, 899, 179]",MISC
94,NL,"[898, 166, 899, 179]",MISC
95,-,"[898, 166, 899, 179]",MISC
96,AB,"[64, 186, 191, 200]",MISC
97,##RI,"[64, 186, 191, 200]",MISC
98,##D,"[64, 186, 191, 200]",MISC
99,##GE,"[64, 186, 191, 200]",MISC
100,##ME,"[64, 186, 191, 200]",MISC
101,##NT,"[64, 186, 191, 200]",MISC
102,-,"[191, 186, 193, 200]",MISC
103,NL,"[191, 186, 193, 200]",MISC
104,-,"[191, 186, 193, 200]",MISC
105,A,"[75, 226, 86, 240]",MISC
106,dynamic,"[87, 226, 168, 240]",MISC
107,professional,"[168, 226, 306, 240]",MISC
108,with,"[306, 226, 351, 240]",MISC
109,8,"[353, 226, 363, 240]",MISC
110,years,"[364, 226, 421, 240]",MISC
111,of,"[422, 226, 443, 240]",MISC
112,q,"[445, 226, 583, 240]",MISC
113,##uant,"[445, 226, 583, 240]",MISC
114,##ifiable,"[445, 226, 583, 240]",MISC
115,experience,"[584, 226, 698, 240]",MISC
116,in,"[699, 226, 721, 240]",MISC
117,Sales,"[722, 226, 780, 240]",MISC
118,&,"[780, 226, 791, 240]",MISC
119,Marketing,"[792, 226, 906, 240]",MISC
120,",","[792, 226, 906, 240]",MISC
121,Business,"[907, 226, 998, 240]",MISC
122,-,"[1000, 226, 1001, 240]",MISC
123,NL,"[1000, 226, 1001, 240]",MISC
124,-,"[1000, 226, 1001, 240]",MISC
125,Development,"[89, 238, 214, 252]",MISC
126,",","[89, 238, 214, 252]",MISC
127,Channel,"[216, 238, 289, 252]",MISC
128,Management,"[290, 238, 395, 252]",MISC
129,and,"[395, 238, 426, 252]",MISC
130,Health,"[427, 238, 490, 252]",MISC
131,Care,"[490, 238, 542, 252]",MISC
132,.,"[490, 238, 542, 252]",MISC
133,-,"[543, 238, 545, 252]",MISC
134,NL,"[543, 238, 545, 252]",MISC
135,-,"[543, 238, 545, 252]",MISC
136,Currently,"[73, 257, 159, 269]",MISC
137,associated,"[159, 257, 254, 269]",MISC
138,with,"[255, 257, 293, 269]",MISC
139,B,"[293, 257, 351, 269]",B-employer_company_name
140,##hart,"[293, 257, 351, 269]",I-employer_company_name
141,##i,"[293, 257, 351, 269]",I-employer_company_name
142,Air,"[351, 257, 408, 269]",I-employer_company_name
143,##tel,"[351, 257, 408, 269]",I-employer_company_name
144,Ltd,"[408, 257, 446, 269]",I-employer_company_name
145,.,"[408, 257, 446, 269]",MISC
146,Bangalore,"[446, 257, 532, 269]",MISC
147,as,"[532, 257, 550, 269]",MISC
148,Territory,"[551, 257, 637, 269]",B-employer_role
149,Sales,"[637, 257, 684, 269]",I-employer_role
150,Manager,"[685, 257, 760, 269]",I-employer_role
151,.,"[685, 257, 760, 269]",MISC
152,-,"[762, 257, 763, 269]",MISC
153,NL,"[762, 257, 763, 269]",MISC
154,-,"[762, 257, 763, 269]",MISC
155,A,"[73, 274, 82, 288]",MISC
156,pro,"[83, 274, 167, 288]",MISC
157,##active,"[83, 274, 167, 288]",MISC
158,plan,"[168, 274, 232, 288]",MISC
159,##ner,"[168, 274, 232, 288]",MISC
160,with,"[234, 274, 272, 288]",MISC
161,expertise,"[272, 274, 356, 288]",MISC
162,in,"[357, 274, 375, 288]",MISC
163,Market,"[376, 274, 431, 288]",MISC
164,Plan,"[432, 274, 470, 288]",MISC
165,execution,"[470, 274, 563, 288]",MISC
166,",","[470, 274, 563, 288]",MISC
167,Pro,"[565, 274, 649, 288]",MISC
168,##mote,"[565, 274, 649, 288]",MISC
169,##rs,"[565, 274, 649, 288]",MISC
170,Program,"[650, 274, 725, 288]",MISC
171,",","[650, 274, 725, 288]",MISC
172,market,"[725, 274, 781, 288]",MISC
173,competitor,"[782, 274, 875, 288]",MISC
174,and,"[877, 274, 903, 288]",MISC
175,key,"[905, 274, 932, 288]",MISC
176,account,"[933, 274, 998, 288]",MISC
177,-,"[1000, 274, 1001, 288]",MISC
178,NL,"[1000, 274, 1001, 288]",MISC
179,-,"[1000, 274, 1001, 288]",MISC
180,management,"[89, 287, 178, 300]",MISC
181,&,"[179, 287, 188, 300]",MISC
182,financial,"[188, 287, 269, 300]",MISC
183,planning,"[269, 287, 350, 300]",MISC
184,.,"[269, 287, 350, 300]",MISC
185,-,"[350, 287, 352, 300]",MISC
186,NL,"[350, 287, 352, 300]",MISC
187,-,"[350, 287, 352, 300]",MISC
188,Pro,"[72, 305, 123, 318]",MISC
189,##ven,"[72, 305, 123, 318]",MISC
190,ability,"[124, 305, 183, 318]",MISC
191,of,"[184, 305, 200, 318]",MISC
192,identifying,"[201, 305, 294, 318]",MISC
193,and,"[296, 305, 321, 318]",MISC
194,sour,"[322, 305, 389, 318]",MISC
195,##cing,"[322, 305, 389, 318]",MISC
196,major,"[390, 305, 433, 318]",MISC
197,institutional,"[433, 305, 544, 318]",MISC
198,clients,"[545, 305, 604, 318]",MISC
199,and,"[605, 305, 630, 318]",MISC
200,es,"[631, 305, 716, 318]",MISC
201,##cal,"[631, 305, 716, 318]",MISC
202,##ating,"[631, 305, 716, 318]",MISC
203,sales,"[716, 305, 759, 318]",MISC
204,turnover,"[759, 305, 836, 318]",MISC
205,.,"[759, 305, 836, 318]",MISC
206,-,"[837, 305, 838, 318]",MISC
207,NL,"[837, 305, 838, 318]",MISC
208,-,"[837, 305, 838, 318]",MISC
209,A,"[73, 323, 138, 337]",MISC
210,##bility,"[73, 323, 138, 337]",MISC
211,to,"[139, 323, 157, 337]",MISC
212,execute,"[157, 323, 222, 337]",MISC
213,a,"[223, 323, 232, 337]",MISC
214,wide,"[232, 323, 268, 337]",MISC
215,range,"[270, 323, 316, 337]",MISC
216,of,"[317, 323, 334, 337]",MISC
217,sales,"[335, 323, 382, 337]",MISC
218,and,"[382, 323, 409, 337]",MISC
219,marketing,"[410, 323, 494, 337]",MISC
220,strategies,"[494, 323, 587, 337]",MISC
221,to,"[588, 323, 606, 337]",MISC
222,establish,"[607, 323, 691, 337]",MISC
223,market,"[691, 323, 746, 337]",MISC
224,presence,"[747, 323, 820, 337]",MISC
225,and,"[822, 323, 849, 337]",MISC
226,increase,"[850, 323, 923, 337]",MISC
227,revenues,"[925, 323, 998, 337]",MISC
228,-,"[999, 323, 1001, 337]",MISC
229,NL,"[999, 323, 1001, 337]",MISC
230,-,"[999, 323, 1001, 337]",MISC
231,and,"[89, 335, 110, 349]",MISC
232,profit,"[111, 335, 213, 349]",MISC
233,##ability,"[111, 335, 213, 349]",MISC
234,.,"[111, 335, 213, 349]",MISC
235,-,"[214, 335, 216, 349]",MISC
236,NL,"[214, 335, 216, 349]",MISC
237,-,"[214, 335, 216, 349]",MISC
238,Excellent,"[73, 354, 151, 366]",MISC
239,com,"[152, 354, 258, 366]",MISC
240,##mu,"[152, 354, 258, 366]",MISC
241,##nica,"[152, 354, 258, 366]",MISC
242,##tor,"[152, 354, 258, 366]",MISC
243,seeking,"[258, 354, 319, 366]",MISC
244,a,"[320, 354, 327, 366]",MISC
245,challenging,"[329, 354, 425, 366]",MISC
246,position,"[426, 354, 504, 366]",MISC
247,",","[426, 354, 504, 366]",MISC
248,utilizing,"[505, 354, 584, 366]",MISC
249,current,"[585, 354, 645, 366]",MISC
250,skills,"[646, 354, 698, 366]",MISC
251,and,"[699, 354, 724, 366]",MISC
252,abilities,"[726, 354, 814, 366]",MISC
253,",","[726, 354, 814, 366]",MISC
254,with,"[814, 354, 848, 366]",MISC
255,the,"[849, 354, 874, 366]",MISC
256,opportunity,"[876, 354, 973, 366]",MISC
257,for,"[973, 354, 998, 366]",MISC
258,-,"[999, 354, 1001, 366]",MISC
259,NL,"[999, 354, 1001, 366]",MISC
260,-,"[999, 354, 1001, 366]",MISC
261,professional,"[89, 366, 186, 380]",MISC
262,growth,"[187, 366, 244, 380]",MISC
263,.,"[187, 366, 244, 380]",MISC
264,-,"[245, 366, 246, 380]",MISC
265,NL,"[245, 366, 246, 380]",MISC
266,-,"[245, 366, 246, 380]",MISC
267,Areas,"[74, 384, 122, 398]",MISC
268,of,"[122, 384, 140, 398]",MISC
269,expertise,"[142, 384, 229, 398]",MISC
270,:,"[229, 384, 238, 398]",MISC
271,-,"[239, 384, 241, 398]",MISC
272,NL,"[239, 384, 241, 398]",MISC
273,-,"[239, 384, 241, 398]",MISC
274,Channel,"[440, 400, 519, 412]",MISC
275,&,"[519, 400, 530, 412]",MISC
276,Distribution,"[530, 400, 664, 412]",MISC
277,-,"[665, 400, 667, 412]",MISC
278,NL,"[665, 400, 667, 412]",MISC
279,-,"[665, 400, 667, 412]",MISC
280,N,"[773, 400, 881, 412]",MISC
281,##ego,"[773, 400, 881, 412]",MISC
282,##tia,"[773, 400, 881, 412]",MISC
283,##tion,"[773, 400, 881, 412]",MISC
284,-,"[881, 400, 883, 412]",MISC
285,NL,"[881, 400, 883, 412]",MISC
286,-,"[881, 400, 883, 412]",MISC
287,Management,"[291, 412, 355, 430]",MISC
288,Market,"[363, 412, 401, 430]",MISC
289,Analysis,"[402, 412, 459, 430]",MISC
290,.,"[402, 412, 459, 430]",MISC
291,-,"[461, 412, 463, 430]",MISC
292,NL,"[461, 412, 463, 430]",MISC
293,-,"[461, 412, 463, 430]",MISC
294,Team,"[775, 415, 822, 429]",MISC
295,Management,"[822, 415, 940, 429]",MISC
296,-,"[940, 415, 942, 429]",MISC
297,NL,"[940, 415, 942, 429]",MISC
298,-,"[940, 415, 942, 429]",MISC
299,Services,"[439, 429, 517, 441]",MISC
300,Marketing,"[517, 429, 605, 441]",MISC
301,-,"[606, 429, 608, 441]",MISC
302,NL,"[606, 429, 608, 441]",MISC
303,-,"[606, 429, 608, 441]",MISC
304,PR,"[64, 463, 186, 476]",MISC
305,##O,"[64, 463, 186, 476]",MISC
306,##FI,"[64, 463, 186, 476]",MISC
307,##CI,"[64, 463, 186, 476]",MISC
308,##EN,"[64, 463, 186, 476]",MISC
309,##C,"[64, 463, 186, 476]",MISC
310,##Y,"[64, 463, 186, 476]",MISC
311,F,"[187, 463, 242, 476]",MISC
312,##OR,"[187, 463, 242, 476]",MISC
313,##TE,"[187, 463, 242, 476]",MISC
314,-,"[243, 463, 245, 476]",MISC
315,NL,"[243, 463, 245, 476]",MISC
316,-,"[243, 463, 245, 476]",MISC
317,Marketing,"[73, 498, 155, 512]",MISC
318,/,"[157, 498, 165, 512]",MISC
319,Business,"[166, 498, 239, 512]",MISC
320,Development,"[240, 498, 351, 512]",MISC
321,:,"[240, 498, 351, 512]",MISC
322,For,"[351, 498, 451, 512]",MISC
323,##eca,"[351, 498, 451, 512]",MISC
324,##sting,"[351, 498, 451, 512]",MISC
325,monthly,"[453, 498, 582, 512]",MISC
326,/,"[453, 498, 582, 512]",MISC
327,annual,"[453, 498, 582, 512]",MISC
328,sales,"[583, 498, 627, 512]",MISC
329,targets,"[629, 498, 693, 512]",MISC
330,&,"[694, 498, 703, 512]",MISC
331,driving,"[703, 498, 767, 512]",MISC
332,sales,"[768, 498, 813, 512]",MISC
333,initiatives,"[814, 498, 914, 512]",MISC
334,to,"[916, 498, 934, 512]",MISC
335,achieve,"[935, 498, 999, 512]",MISC
336,-,"[1000, 498, 1001, 512]",MISC
337,NL,"[1000, 498, 1001, 512]",MISC
338,-,"[1000, 498, 1001, 512]",MISC
339,business,"[89, 512, 168, 526]",MISC
340,goals,"[168, 512, 216, 526]",MISC
341,&,"[218, 512, 227, 526]",MISC
342,managing,"[228, 512, 306, 526]",MISC
343,the,"[307, 512, 335, 526]",MISC
344,front,"[336, 512, 424, 526]",MISC
345,##line,"[336, 512, 424, 526]",MISC
346,sales,"[425, 512, 474, 526]",MISC
347,team,"[475, 512, 514, 526]",MISC
348,to,"[515, 512, 534, 526]",MISC
349,achieve,"[534, 512, 602, 526]",MISC
350,them,"[604, 512, 652, 526]",MISC
351,.,"[604, 512, 652, 526]",MISC
352,Review,"[653, 512, 741, 526]",MISC
353,##ing,"[653, 512, 741, 526]",MISC
354,and,"[742, 512, 771, 526]",MISC
355,interpret,"[772, 512, 890, 526]",MISC
356,##ing,"[772, 512, 890, 526]",MISC
357,competition,"[891, 512, 998, 526]",MISC
358,-,"[1000, 512, 1001, 526]",MISC
359,NL,"[1000, 512, 1001, 526]",MISC
360,-,"[1000, 512, 1001, 526]",MISC
361,after,"[89, 526, 135, 539]",MISC
362,in,"[136, 526, 209, 539]",MISC
363,-,"[136, 526, 209, 539]",MISC
364,depth,"[136, 526, 209, 539]",MISC
365,analysis,"[211, 526, 284, 539]",MISC
366,of,"[286, 526, 304, 539]",MISC
367,market,"[305, 526, 360, 539]",MISC
368,information,"[361, 526, 463, 539]",MISC
369,as,"[464, 526, 482, 539]",MISC
370,well,"[483, 526, 519, 539]",MISC
371,as,"[521, 526, 539, 539]",MISC
372,scanning,"[540, 526, 613, 539]",MISC
373,the,"[615, 526, 641, 539]",MISC
374,environment,"[643, 526, 745, 539]",MISC
375,for,"[746, 526, 773, 539]",MISC
376,new,"[774, 526, 801, 539]",MISC
377,business,"[802, 526, 876, 539]",MISC
378,opportunities,"[877, 526, 999, 539]",MISC
379,-,"[1000, 526, 1001, 539]",MISC
380,NL,"[1000, 526, 1001, 539]",MISC
381,-,"[1000, 526, 1001, 539]",MISC
382,and,"[89, 539, 114, 553]",MISC
383,competition,"[115, 539, 216, 553]",MISC
384,",","[115, 539, 216, 553]",MISC
385,in,"[217, 539, 301, 553]",MISC
386,##iti,"[217, 539, 301, 553]",MISC
387,##ating,"[217, 539, 301, 553]",MISC
388,sales,"[302, 539, 343, 553]",MISC
389,trigger,"[345, 539, 413, 553]",MISC
390,.,"[345, 539, 413, 553]",MISC
391,-,"[413, 539, 415, 553]",MISC
392,NL,"[413, 539, 415, 553]",MISC
393,-,"[413, 539, 415, 553]",MISC
394,Distribution,"[73, 573, 184, 587]",MISC
395,/,"[186, 573, 259, 587]",MISC
396,Channel,"[186, 573, 259, 587]",MISC
397,Deal,"[260, 573, 334, 587]",MISC
398,##ers,"[260, 573, 334, 587]",MISC
399,:,"[260, 573, 334, 587]",MISC
400,Eva,"[335, 573, 428, 587]",MISC
401,##lu,"[335, 573, 428, 587]",MISC
402,##ating,"[335, 573, 428, 587]",MISC
403,performance,"[429, 573, 531, 587]",MISC
404,&,"[532, 573, 541, 587]",MISC
405,monitoring,"[541, 573, 634, 587]",MISC
406,distributor,"[635, 573, 737, 587]",MISC
407,sales,"[738, 573, 784, 587]",MISC
408,and,"[784, 573, 811, 587]",MISC
409,marketing,"[812, 573, 896, 587]",MISC
410,activities,"[897, 573, 999, 587]",MISC
411,.,"[897, 573, 999, 587]",MISC
412,-,"[1000, 573, 1001, 587]",MISC
413,NL,"[1000, 573, 1001, 587]",MISC
414,-,"[1000, 573, 1001, 587]",MISC
415,Managing,"[89, 587, 169, 600]",MISC
416,network,"[170, 587, 240, 600]",MISC
417,of,"[241, 587, 260, 600]",MISC
418,Channel,"[261, 587, 331, 600]",MISC
419,Partners,"[332, 587, 412, 600]",MISC
420,across,"[413, 587, 472, 600]",MISC
421,assigned,"[473, 587, 554, 600]",MISC
422,territories,"[554, 587, 665, 600]",MISC
423,for,"[666, 587, 694, 600]",MISC
424,deeper,"[696, 587, 755, 600]",MISC
425,market,"[757, 587, 816, 600]",MISC
426,penetration,"[817, 587, 928, 600]",MISC
427,&,"[929, 587, 938, 600]",MISC
428,reach,"[939, 587, 998, 600]",MISC
429,.,"[939, 587, 998, 600]",MISC
430,-,"[1000, 587, 1001, 600]",MISC
431,NL,"[1000, 587, 1001, 600]",MISC
432,-,"[1000, 587, 1001, 600]",MISC
433,Hand,"[89, 600, 164, 614]",MISC
434,##ling,"[89, 600, 164, 614]",MISC
435,secondary,"[165, 600, 249, 614]",MISC
436,dealers,"[250, 600, 325, 614]",MISC
437,’,"[250, 600, 325, 614]",MISC
438,network,"[326, 600, 392, 614]",MISC
439,for,"[392, 600, 419, 614]",MISC
440,the,"[421, 600, 448, 614]",MISC
441,op,"[449, 600, 516, 614]",MISC
442,##ti,"[449, 600, 516, 614]",MISC
443,##mum,"[449, 600, 516, 614]",MISC
444,exploration,"[516, 600, 620, 614]",MISC
445,&,"[620, 600, 629, 614]",MISC
446,en,"[630, 600, 696, 614]",MISC
447,##qui,"[630, 600, 696, 614]",MISC
448,##ry,"[630, 600, 696, 614]",MISC
449,generation,"[696, 600, 800, 614]",MISC
450,",","[696, 600, 800, 614]",MISC
451,follow,"[800, 600, 904, 614]",MISC
452,-,"[800, 600, 904, 614]",MISC
453,ups,"[800, 600, 904, 614]",MISC
454,",","[800, 600, 904, 614]",MISC
455,evaluation,"[905, 600, 999, 614]",MISC
456,-,"[1000, 600, 1001, 614]",MISC
457,NL,"[1000, 600, 1001, 614]",MISC
458,-,"[1000, 600, 1001, 614]",MISC
459,of,"[89, 614, 107, 628]",MISC
460,potential,"[107, 614, 199, 628]",MISC
461,##s,"[107, 614, 199, 628]",MISC
462,and,"[199, 614, 226, 628]",MISC
463,conversion,"[227, 614, 327, 628]",MISC
464,.,"[227, 614, 327, 628]",MISC
465,Monitor,"[328, 614, 419, 628]",MISC
466,##ing,"[328, 614, 419, 628]",MISC
467,Distribution,"[419, 614, 529, 628]",MISC
468,networks,"[530, 614, 603, 628]",MISC
469,to,"[603, 614, 621, 628]",MISC
470,ensure,"[621, 614, 675, 628]",MISC
471,ready,"[676, 614, 721, 628]",MISC
472,availability,"[722, 614, 831, 628]",MISC
473,of,"[832, 614, 850, 628]",MISC
474,the,"[851, 614, 878, 628]",MISC
475,services,"[878, 614, 952, 628]",MISC
476,at,"[952, 614, 970, 628]",MISC
477,all,"[970, 614, 997, 628]",MISC
478,-,"[998, 614, 1000, 628]",MISC
479,NL,"[998, 614, 1000, 628]",MISC
480,-,"[998, 614, 1000, 628]",MISC
481,times,"[89, 628, 144, 641]",MISC
482,.,"[89, 628, 144, 641]",MISC
483,G,"[146, 628, 212, 641]",MISC
484,##uid,"[146, 628, 212, 641]",MISC
485,##ing,"[146, 628, 212, 641]",MISC
486,and,"[212, 628, 239, 641]",MISC
487,training,"[241, 628, 316, 641]",MISC
488,Partners,"[317, 628, 392, 641]",MISC
489,to,"[392, 628, 410, 641]",MISC
490,accomplish,"[411, 628, 506, 641]",MISC
491,set,"[506, 628, 533, 641]",MISC
492,revenue,"[535, 628, 601, 641]",MISC
493,and,"[601, 628, 628, 641]",MISC
494,business,"[630, 628, 705, 641]",MISC
495,targets,"[705, 628, 781, 641]",MISC
496,.,"[705, 628, 781, 641]",MISC
497,-,"[781, 628, 783, 641]",MISC
498,NL,"[781, 628, 783, 641]",MISC
499,-,"[781, 628, 783, 641]",MISC
500,Key,"[73, 659, 100, 672]",MISC
501,A,"[101, 659, 166, 672]",MISC
502,##cco,"[101, 659, 166, 672]",MISC
503,##unt,"[101, 659, 166, 672]",MISC
504,Management,"[167, 659, 269, 672]",MISC
505,:,"[167, 659, 269, 672]",MISC
506,I,"[270, 659, 372, 672]",MISC
507,##dent,"[270, 659, 372, 672]",MISC
508,##ifying,"[270, 659, 372, 672]",MISC
509,key,"[373, 659, 530, 672]",MISC
510,/,"[373, 659, 530, 672]",MISC
511,institutional,"[373, 659, 530, 672]",MISC
512,accounts,"[532, 659, 605, 672]",MISC
513,and,"[607, 659, 633, 672]",MISC
514,strategically,"[635, 659, 754, 672]",MISC
515,secure,"[756, 659, 812, 672]",MISC
516,profitable,"[812, 659, 905, 672]",MISC
517,business,"[906, 659, 979, 672]",MISC
518,as,"[981, 659, 999, 672]",MISC
519,-,"[1000, 659, 1001, 672]",MISC
520,NL,"[1000, 659, 1001, 672]",MISC
521,-,"[1000, 659, 1001, 672]",MISC
522,well,"[89, 672, 127, 686]",MISC
523,as,"[128, 672, 146, 686]",MISC
524,new,"[148, 672, 176, 686]",MISC
525,business,"[177, 672, 254, 686]",MISC
526,tie,"[255, 672, 323, 686]",MISC
527,-,"[255, 672, 323, 686]",MISC
528,ups,"[255, 672, 323, 686]",MISC
529,with,"[324, 672, 361, 686]",MISC
530,the,"[363, 672, 392, 686]",MISC
531,corporate,"[392, 672, 489, 686]",MISC
532,.,"[392, 672, 489, 686]",MISC
533,Relations,"[490, 672, 607, 686]",MISC
534,##hip,"[490, 672, 607, 686]",MISC
535,building,"[608, 672, 685, 686]",MISC
536,with,"[686, 672, 724, 686]",MISC
537,decision,"[725, 672, 802, 686]",MISC
538,makers,"[804, 672, 861, 686]",MISC
539,and,"[862, 672, 891, 686]",MISC
540,key,"[892, 672, 920, 686]",MISC
541,buyers,"[921, 672, 978, 686]",MISC
542,in,"[980, 672, 998, 686]",MISC
543,-,"[1000, 672, 1001, 686]",MISC
544,NL,"[1000, 672, 1001, 686]",MISC
545,-,"[1000, 672, 1001, 686]",MISC
546,pre,"[89, 686, 169, 700]",MISC
547,-,"[89, 686, 169, 700]",MISC
548,sales,"[89, 686, 169, 700]",MISC
549,negotiation,"[170, 686, 268, 700]",MISC
550,stages,"[268, 686, 322, 700]",MISC
551,after,"[322, 686, 367, 700]",MISC
552,giving,"[367, 686, 420, 700]",MISC
553,presentations,"[421, 686, 537, 700]",MISC
554,to,"[537, 686, 555, 700]",MISC
555,prospective,"[555, 686, 653, 700]",MISC
556,clients,"[654, 686, 716, 700]",MISC
557,and,"[716, 686, 743, 700]",MISC
558,generating,"[743, 686, 833, 700]",MISC
559,en,"[833, 686, 922, 700]",MISC
560,##quiries,"[833, 686, 922, 700]",MISC
561,.,"[833, 686, 922, 700]",MISC
562,-,"[923, 686, 924, 700]",MISC
563,NL,"[923, 686, 924, 700]",MISC
564,-,"[923, 686, 924, 700]",MISC
565,Team,"[74, 718, 114, 732]",MISC
566,Management,"[115, 718, 228, 732]",MISC
567,:,"[115, 718, 228, 732]",MISC
568,Leading,"[228, 718, 300, 732]",MISC
569,&,"[300, 718, 309, 732]",MISC
570,monitoring,"[311, 718, 413, 732]",MISC
571,the,"[413, 718, 444, 732]",MISC
572,performance,"[444, 718, 557, 732]",MISC
573,of,"[557, 718, 577, 732]",MISC
574,team,"[578, 718, 617, 732]",MISC
575,members,"[619, 718, 691, 732]",MISC
576,to,"[691, 718, 711, 732]",MISC
577,ensure,"[712, 718, 772, 732]",MISC
578,efficiency,"[773, 718, 875, 732]",MISC
579,in,"[876, 718, 896, 732]",MISC
580,operations,"[897, 718, 999, 732]",MISC
581,-,"[1000, 718, 1001, 732]",MISC
582,NL,"[1000, 718, 1001, 732]",MISC
583,-,"[1000, 718, 1001, 732]",MISC
584,and,"[89, 732, 116, 746]",MISC
585,meeting,"[116, 732, 179, 746]",MISC
586,of,"[180, 732, 198, 746]",MISC
587,individual,"[198, 732, 288, 746]",MISC
588,&,"[289, 732, 298, 746]",MISC
589,group,"[298, 732, 343, 746]",MISC
590,targets,"[344, 732, 415, 746]",MISC
591,.,"[344, 732, 415, 746]",MISC
592,I,"[417, 732, 515, 746]",MISC
593,##dent,"[417, 732, 515, 746]",MISC
594,##ifying,"[417, 732, 515, 746]",MISC
595,and,"[517, 732, 544, 746]",MISC
596,implementing,"[544, 732, 653, 746]",MISC
597,strategies,"[653, 732, 743, 746]",MISC
598,for,"[745, 732, 771, 746]",MISC
599,building,"[772, 732, 843, 746]",MISC
600,team,"[845, 732, 880, 746]",MISC
601,effectiveness,"[881, 732, 999, 746]",MISC
602,-,"[1000, 732, 1001, 746]",MISC
603,NL,"[1000, 732, 1001, 746]",MISC
604,-,"[1000, 732, 1001, 746]",MISC
605,by,"[89, 746, 109, 759]",MISC
606,promoting,"[109, 746, 199, 759]",MISC
607,a,"[200, 746, 209, 759]",MISC
608,spirit,"[210, 746, 269, 759]",MISC
609,of,"[271, 746, 291, 759]",MISC
610,cooperation,"[291, 746, 402, 759]",MISC
611,between,"[403, 746, 472, 759]",MISC
612,team,"[473, 746, 513, 759]",MISC
613,members,"[514, 746, 594, 759]",MISC
614,.,"[514, 746, 594, 759]",MISC
615,Con,"[595, 746, 695, 759]",MISC
616,##duct,"[595, 746, 695, 759]",MISC
617,##ing,"[595, 746, 695, 759]",MISC
618,training,"[696, 746, 776, 759]",MISC
619,programs,"[777, 746, 857, 759]",MISC
620,for,"[858, 746, 886, 759]",MISC
621,team,"[888, 746, 928, 759]",MISC
622,members,"[929, 746, 998, 759]",MISC
623,-,"[1000, 746, 1001, 759]",MISC
624,NL,"[1000, 746, 1001, 759]",MISC
625,-,"[1000, 746, 1001, 759]",MISC
626,for,"[89, 759, 114, 773]",MISC
627,enhancing,"[115, 759, 192, 773]",MISC
628,their,"[192, 759, 233, 773]",MISC
629,skill,"[235, 759, 276, 773]",MISC
630,levels,"[278, 759, 337, 773]",MISC
631,.,"[278, 759, 337, 773]",MISC
632,-,"[338, 759, 339, 773]",MISC
633,NL,"[338, 759, 339, 773]",MISC
634,-,"[338, 759, 339, 773]",MISC
635,E,"[64, 808, 180, 822]",B-work_experience_heading
636,##X,"[64, 808, 180, 822]",I-work_experience_heading
637,##P,"[64, 808, 180, 822]",I-work_experience_heading
638,##ER,"[64, 808, 180, 822]",I-work_experience_heading
639,##IE,"[64, 808, 180, 822]",I-work_experience_heading
640,##NC,"[64, 808, 180, 822]",I-work_experience_heading
641,##E,"[64, 808, 180, 822]",I-work_experience_heading
642,CH,"[180, 808, 296, 822]",I-work_experience_heading
643,##RO,"[180, 808, 296, 822]",I-work_experience_heading
644,##N,"[180, 808, 296, 822]",I-work_experience_heading
645,##OL,"[180, 808, 296, 822]",I-work_experience_heading
646,##O,"[180, 808, 296, 822]",I-work_experience_heading
647,##G,"[180, 808, 296, 822]",I-work_experience_heading
648,##Y,"[180, 808, 296, 822]",I-work_experience_heading
649,-,"[296, 808, 298, 822]",MISC
650,NL,"[296, 808, 298, 822]",MISC
651,-,"[296, 808, 298, 822]",MISC
652,Organization,"[101, 842, 230, 855]",MISC
653,1,"[230, 842, 241, 855]",MISC
654,:,"[241, 842, 252, 855]",MISC
655,P,"[252, 842, 316, 855]",B-employer_company_name
656,##fi,"[252, 842, 316, 855]",I-employer_company_name
657,##zer,"[252, 842, 316, 855]",I-employer_company_name
658,L,"[316, 842, 348, 855]",I-employer_company_name
659,##T,"[316, 842, 348, 855]",I-employer_company_name
660,##D,"[316, 842, 348, 855]",I-employer_company_name
661,-,"[348, 842, 350, 855]",MISC
662,NL,"[348, 842, 350, 855]",MISC
663,-,"[348, 842, 350, 855]",MISC
664,Design,"[75, 858, 193, 871]",MISC
665,##ation,"[75, 858, 193, 871]",MISC
666,:,"[193, 858, 204, 871]",MISC
667,Professional,"[204, 858, 333, 871]",B-employer_role
668,Service,"[333, 858, 409, 871]",I-employer_role
669,officer,"[409, 858, 484, 871]",I-employer_role
670,-,"[484, 858, 486, 871]",MISC
671,NL,"[484, 858, 486, 871]",MISC
672,-,"[484, 858, 486, 871]",MISC
673,Year,"[77, 874, 127, 889]",MISC
674,Of,"[129, 874, 154, 889]",MISC
675,Ex,"[154, 874, 192, 889]",MISC
676,##p,"[154, 874, 192, 889]",MISC
677,:,"[193, 874, 206, 889]",MISC
678,3,"[206, 874, 219, 889]",MISC
679,Years,"[219, 874, 283, 889]",MISC
680,(,"[284, 874, 334, 889]",MISC
681,Sep,"[284, 874, 334, 889]",MISC
682,2011,"[335, 874, 400, 889]",MISC
683,-,"[335, 874, 400, 889]",MISC
684,July,"[400, 874, 450, 889]",MISC
685,2014,"[452, 874, 516, 889]",MISC
686,),"[452, 874, 516, 889]",MISC
687,-,"[516, 874, 518, 889]",MISC
688,NL,"[516, 874, 518, 889]",MISC
689,-,"[516, 874, 518, 889]",MISC
690,Role,"[75, 906, 131, 921]",MISC
691,:,"[75, 906, 131, 921]",MISC
692,Meeting,"[132, 906, 210, 921]",MISC
693,up,"[211, 906, 232, 921]",MISC
694,doctors,"[234, 906, 312, 921]",MISC
695,on,"[313, 906, 334, 921]",MISC
696,a,"[335, 906, 346, 921]",MISC
697,planned,"[347, 906, 425, 921]",MISC
698,basis,"[426, 906, 492, 921]",MISC
699,",","[426, 906, 492, 921]",MISC
700,Meeting,"[494, 906, 572, 921]",MISC
701,up,"[573, 906, 594, 921]",MISC
702,chemist,"[595, 906, 696, 921]",MISC
703,##s,"[595, 906, 696, 921]",MISC
704,",","[595, 906, 696, 921]",MISC
705,booking,"[697, 906, 776, 921]",MISC
706,personal,"[776, 906, 866, 921]",MISC
707,orders,"[867, 906, 945, 921]",MISC
708,",","[867, 906, 945, 921]",MISC
709,new,"[946, 906, 978, 921]",MISC
710,-,"[980, 906, 982, 921]",MISC
711,NL,"[980, 906, 982, 921]",MISC
712,-,"[980, 906, 982, 921]",MISC
713,product,"[64, 921, 135, 936]",MISC
714,launch,"[136, 921, 197, 936]",MISC
715,in,"[199, 921, 218, 936]",MISC
716,the,"[219, 921, 250, 936]",MISC
717,market,"[250, 921, 322, 936]",MISC
718,",","[250, 921, 322, 936]",MISC
719,Hand,"[323, 921, 405, 936]",MISC
720,##ling,"[323, 921, 405, 936]",MISC
721,Stock,"[406, 921, 508, 936]",MISC
722,##ists,"[406, 921, 508, 936]",MISC
723,.,"[406, 921, 508, 936]",MISC
724,-,"[509, 921, 511, 936]",MISC
725,NL,"[509, 921, 511, 936]",MISC
726,-,"[509, 921, 511, 936]",MISC
727,Success,"[186, 953, 293, 968]",MISC
728,##ful,"[186, 953, 293, 968]",MISC
729,in,"[294, 953, 316, 968]",MISC
730,New,"[316, 953, 348, 968]",MISC
731,Product,"[348, 953, 424, 968]",MISC
732,launch,"[424, 953, 489, 968]",MISC
733,in,"[490, 953, 511, 968]",MISC
734,the,"[511, 953, 544, 968]",MISC
735,territory,"[544, 953, 651, 968]",MISC
736,.,"[544, 953, 651, 968]",MISC
737,-,"[652, 953, 654, 968]",MISC
738,NL,"[652, 953, 654, 968]",MISC
739,-,"[652, 953, 654, 968]",MISC
740,Got,"[187, 968, 223, 985]",MISC
741,1st,"[223, 968, 259, 985]",MISC
742,rank,"[259, 968, 306, 985]",MISC
743,on,"[307, 968, 330, 985]",MISC
744,N,"[331, 968, 378, 985]",MISC
745,##P,"[331, 968, 378, 985]",MISC
746,##TP,"[331, 968, 378, 985]",MISC
747,program,"[379, 968, 463, 985]",MISC
748,held,"[463, 968, 510, 985]",MISC
749,at,"[512, 968, 535, 985]",MISC
750,head,"[536, 968, 582, 985]",MISC
751,office,"[584, 968, 655, 985]",MISC
752,Mumbai,"[656, 968, 740, 985]",MISC
753,.,"[656, 968, 740, 985]",MISC
754,-,"[740, 968, 742, 985]",MISC
755,NL,"[740, 968, 742, 985]",MISC
756,-,"[740, 968, 742, 985]",MISC
757,Re,"[187, 983, 286, 999]",MISC
758,##ceived,"[187, 983, 286, 999]",MISC
759,More,"[286, 983, 334, 999]",MISC
760,Number,"[335, 983, 409, 999]",MISC
761,of,"[409, 983, 433, 999]",MISC
762,I,"[434, 983, 495, 999]",MISC
763,##RP,"[434, 983, 495, 999]",MISC
764,’,"[434, 983, 495, 999]",MISC
765,s,"[434, 983, 495, 999]",MISC
766,from,"[496, 983, 544, 999]",MISC
767,D,"[545, 983, 581, 999]",MISC
768,##M,"[545, 983, 581, 999]",MISC
769,",","[545, 983, 581, 999]",MISC
770,F,"[582, 983, 631, 999]",MISC
771,##TM,"[582, 983, 631, 999]",MISC
772,",","[582, 983, 631, 999]",MISC
773,RB,"[632, 983, 680, 999]",MISC
774,##M,"[632, 983, 680, 999]",MISC
775,.,"[632, 983, 680, 999]",MISC
776,-,"[681, 983, 683, 999]",MISC
777,NL,"[681, 983, 683, 999]",MISC
778,-,"[681, 983, 683, 999]",MISC
779,Organization,"[94, 88, 207, 101]",MISC
780,2,"[208, 88, 226, 101]",MISC
781,:,"[208, 88, 226, 101]",MISC
782,B,"[227, 88, 283, 101]",B-employer_company_name
783,##hart,"[227, 88, 283, 101]",I-employer_company_name
784,##i,"[227, 88, 283, 101]",I-employer_company_name
785,Air,"[284, 88, 340, 101]",I-employer_company_name
786,##tel,"[284, 88, 340, 101]",I-employer_company_name
787,Ltd,"[341, 88, 368, 101]",I-employer_company_name
788,-,"[370, 88, 372, 101]",MISC
789,NL,"[370, 88, 372, 101]",MISC
790,-,"[370, 88, 372, 101]",MISC
791,Design,"[75, 104, 195, 118]",MISC
792,##ation,"[75, 104, 195, 118]",MISC
793,:,"[195, 104, 206, 118]",MISC
794,Territory,"[206, 104, 305, 118]",B-employer_role
795,Sales,"[305, 104, 358, 118]",I-employer_role
796,Manager,"[359, 104, 435, 118]",I-employer_role
797,-,"[436, 104, 438, 118]",MISC
798,NL,"[436, 104, 438, 118]",MISC
799,-,"[436, 104, 438, 118]",MISC
800,Year,"[76, 120, 122, 134]",MISC
801,Of,"[123, 120, 146, 134]",MISC
802,Ex,"[146, 120, 180, 134]",MISC
803,##p,"[146, 120, 180, 134]",MISC
804,:,"[181, 120, 192, 134]",MISC
805,5,"[193, 120, 204, 134]",MISC
806,Years,"[205, 120, 262, 134]",MISC
807,(,"[264, 120, 310, 134]",MISC
808,Aug,"[264, 120, 310, 134]",MISC
809,2014,"[311, 120, 416, 134]",MISC
810,-,"[311, 120, 416, 134]",MISC
811,Till,"[311, 120, 416, 134]",MISC
812,Date,"[417, 120, 474, 134]",MISC
813,),"[417, 120, 474, 134]",MISC
814,-,"[475, 120, 477, 134]",MISC
815,NL,"[475, 120, 477, 134]",MISC
816,-,"[475, 120, 477, 134]",MISC
817,High,"[69, 150, 152, 162]",B-skills_heading
818,##lights,"[69, 150, 152, 162]",I-skills_heading
819,:,"[69, 150, 152, 162]",I-skills_heading
820,-,"[152, 150, 153, 162]",MISC
821,NL,"[152, 150, 153, 162]",MISC
822,-,"[152, 150, 153, 162]",MISC
823,A,"[234, 166, 330, 179]",MISC
824,##cco,"[234, 166, 330, 179]",MISC
825,##unta,"[234, 166, 330, 179]",MISC
826,##ble,"[234, 166, 330, 179]",MISC
827,for,"[332, 166, 357, 179]",MISC
828,entire,"[358, 166, 410, 179]",MISC
829,Pre,"[411, 166, 481, 179]",MISC
830,-,"[411, 166, 481, 179]",MISC
831,Pa,"[411, 166, 481, 179]",MISC
832,##id,"[411, 166, 481, 179]",MISC
833,products,"[483, 166, 552, 179]",MISC
834,of,"[554, 166, 570, 179]",MISC
835,B,"[571, 166, 623, 179]",MISC
836,##hart,"[571, 166, 623, 179]",MISC
837,##i,"[571, 166, 623, 179]",MISC
838,Air,"[625, 166, 677, 179]",MISC
839,##tel,"[625, 166, 677, 179]",MISC
840,Limited,"[678, 166, 748, 179]",MISC
841,.,"[678, 166, 748, 179]",MISC
842,-,"[749, 166, 751, 179]",MISC
843,NL,"[749, 166, 751, 179]",MISC
844,-,"[749, 166, 751, 179]",MISC
845,Re,"[234, 179, 332, 192]",MISC
846,##sponsible,"[234, 179, 332, 192]",MISC
847,for,"[334, 179, 361, 192]",MISC
848,6,"[361, 179, 370, 192]",MISC
849,Di,"[370, 179, 469, 192]",MISC
850,##st,"[370, 179, 469, 192]",MISC
851,##ri,"[370, 179, 469, 192]",MISC
852,##but,"[370, 179, 469, 192]",MISC
853,##or,"[370, 179, 469, 192]",MISC
854,A,"[470, 179, 569, 192]",MISC
855,##c,"[470, 179, 569, 192]",MISC
856,##quisition,"[470, 179, 569, 192]",MISC
857,and,"[570, 179, 597, 192]",MISC
858,Pro,"[598, 179, 678, 192]",MISC
859,##mote,"[598, 179, 678, 192]",MISC
860,##rs,"[598, 179, 678, 192]",MISC
861,Place,"[680, 179, 769, 192]",MISC
862,##ment,"[680, 179, 769, 192]",MISC
863,.,"[680, 179, 769, 192]",MISC
864,-,"[771, 179, 772, 192]",MISC
865,NL,"[771, 179, 772, 192]",MISC
866,-,"[771, 179, 772, 192]",MISC
867,Co,"[235, 192, 360, 205]",MISC
868,-,"[235, 192, 360, 205]",MISC
869,Or,"[235, 192, 360, 205]",MISC
870,##dina,"[235, 192, 360, 205]",MISC
871,##ting,"[235, 192, 360, 205]",MISC
872,with,"[361, 192, 399, 205]",MISC
873,Pay,"[400, 192, 477, 205]",MISC
874,##ments,"[400, 192, 477, 205]",MISC
875,Team,"[478, 192, 516, 205]",MISC
876,to,"[517, 192, 535, 205]",MISC
877,run,"[537, 192, 566, 205]",MISC
878,banking,"[566, 192, 634, 205]",MISC
879,products,"[634, 192, 722, 205]",MISC
880,.,"[634, 192, 722, 205]",MISC
881,-,"[722, 192, 724, 205]",MISC
882,NL,"[722, 192, 724, 205]",MISC
883,-,"[722, 192, 724, 205]",MISC
884,Hand,"[235, 205, 320, 217]",MISC
885,##ling,"[235, 205, 320, 217]",MISC
886,6,"[320, 205, 329, 217]",MISC
887,Team,"[331, 205, 372, 217]",MISC
888,Leaders,"[373, 205, 457, 217]",MISC
889,.,"[373, 205, 457, 217]",MISC
890,-,"[457, 205, 459, 217]",MISC
891,NL,"[457, 205, 459, 217]",MISC
892,-,"[457, 205, 459, 217]",MISC
893,Over,"[67, 237, 164, 251]",MISC
894,##see,"[67, 237, 164, 251]",MISC
895,##ing,"[67, 237, 164, 251]",MISC
896,the,"[165, 237, 202, 251]",MISC
897,:,"[165, 237, 202, 251]",MISC
898,-,"[203, 237, 205, 251]",MISC
899,NL,"[203, 237, 205, 251]",MISC
900,-,"[203, 237, 205, 251]",MISC
901,Leading,"[197, 254, 261, 267]",MISC
902,the,"[262, 254, 289, 267]",MISC
903,territory,"[290, 254, 372, 267]",MISC
904,with,"[373, 254, 409, 267]",MISC
905,2,"[410, 254, 419, 267]",MISC
906,Di,"[420, 254, 540, 267]",MISC
907,##st,"[420, 254, 540, 267]",MISC
908,##ri,"[420, 254, 540, 267]",MISC
909,##but,"[420, 254, 540, 267]",MISC
910,##ors,"[420, 254, 540, 267]",MISC
911,",","[420, 254, 540, 267]",MISC
912,with,"[540, 254, 576, 267]",MISC
913,an,"[578, 254, 596, 267]",MISC
914,annual,"[596, 254, 652, 267]",MISC
915,turnover,"[652, 254, 725, 267]",MISC
916,of,"[726, 254, 744, 267]",MISC
917,IN,"[745, 254, 772, 267]",MISC
918,##R,"[745, 254, 772, 267]",MISC
919,40,"[773, 254, 791, 267]",MISC
920,C,"[791, 254, 856, 267]",MISC
921,##ro,"[791, 254, 856, 267]",MISC
922,##res,"[791, 254, 856, 267]",MISC
923,.,"[791, 254, 856, 267]",MISC
924,-,"[856, 254, 858, 267]",MISC
925,NL,"[856, 254, 858, 267]",MISC
926,-,"[856, 254, 858, 267]",MISC
927,Hand,"[197, 271, 261, 283]",MISC
928,##led,"[197, 271, 261, 283]",MISC
929,a,"[261, 271, 270, 283]",MISC
930,base,"[270, 271, 306, 283]",MISC
931,of,"[307, 271, 325, 283]",MISC
932,750,"[326, 271, 353, 283]",MISC
933,Re,"[353, 271, 445, 283]",MISC
934,##tail,"[353, 271, 445, 283]",MISC
935,##ers,"[353, 271, 445, 283]",MISC
936,",","[353, 271, 445, 283]",MISC
937,and,"[446, 271, 473, 283]",MISC
938,22,"[473, 271, 491, 283]",MISC
939,Field,"[492, 271, 537, 283]",MISC
940,sales,"[538, 271, 583, 283]",MISC
941,executives,"[584, 271, 675, 283]",MISC
942,across,"[677, 271, 730, 283]",MISC
943,territory,"[732, 271, 823, 283]",MISC
944,.,"[732, 271, 823, 283]",MISC
945,-,"[824, 271, 826, 283]",MISC
946,NL,"[824, 271, 826, 283]",MISC
947,-,"[824, 271, 826, 283]",MISC
948,Currently,"[198, 288, 289, 300]",MISC
949,having,"[290, 288, 351, 300]",MISC
950,a,"[351, 288, 360, 300]",MISC
951,team,"[361, 288, 401, 300]",MISC
952,of,"[402, 288, 422, 300]",MISC
953,110,"[423, 288, 453, 300]",MISC
954,Pro,"[453, 288, 545, 300]",MISC
955,##mote,"[453, 288, 545, 300]",MISC
956,##rs,"[453, 288, 545, 300]",MISC
957,and,"[546, 288, 576, 300]",MISC
958,6,"[576, 288, 585, 300]",MISC
959,T,"[586, 288, 626, 300]",MISC
960,##L,"[586, 288, 626, 300]",MISC
961,##s,"[586, 288, 626, 300]",MISC
962,.,"[586, 288, 626, 300]",MISC
963,-,"[627, 288, 629, 300]",MISC
964,NL,"[627, 288, 629, 300]",MISC
965,-,"[627, 288, 629, 300]",MISC
966,On,"[197, 304, 215, 317]",MISC
967,boarded,"[216, 304, 282, 317]",MISC
968,over,"[282, 304, 320, 317]",MISC
969,4,"[320, 304, 329, 317]",MISC
970,quality,"[330, 304, 396, 317]",MISC
971,distributor,"[396, 304, 509, 317]",MISC
972,##s,"[396, 304, 509, 317]",MISC
973,to,"[510, 304, 528, 317]",MISC
974,ex,"[529, 304, 576, 317]",MISC
975,##cel,"[529, 304, 576, 317]",MISC
976,business,"[577, 304, 652, 317]",MISC
977,K,"[653, 304, 690, 317]",MISC
978,##PI,"[653, 304, 690, 317]",MISC
979,##s,"[653, 304, 690, 317]",MISC
980,during,"[691, 304, 746, 317]",MISC
981,my,"[748, 304, 765, 317]",MISC
982,3,"[767, 304, 793, 317]",MISC
983,.,"[767, 304, 793, 317]",MISC
984,5,"[767, 304, 793, 317]",MISC
985,years,"[795, 304, 842, 317]",MISC
986,of,"[842, 304, 860, 317]",MISC
987,tenure,"[861, 304, 928, 317]",MISC
988,.,"[861, 304, 928, 317]",MISC
989,-,"[928, 304, 930, 317]",MISC
990,NL,"[928, 304, 930, 317]",MISC
991,-,"[928, 304, 930, 317]",MISC
992,Hand,"[197, 320, 272, 334]",MISC
993,##ling,"[197, 320, 272, 334]",MISC
994,B,"[272, 320, 328, 334]",MISC
995,##hart,"[272, 320, 328, 334]",MISC
996,##i,"[272, 320, 328, 334]",MISC
997,Air,"[329, 320, 395, 334]",MISC
998,##tel,"[329, 320, 395, 334]",MISC
999,-,"[329, 320, 395, 334]",MISC
1000,Pay,"[395, 320, 470, 334]",MISC
1001,##ments,"[395, 320, 470, 334]",MISC
1002,Bank,"[471, 320, 518, 334]",MISC
1003,.,"[471, 320, 518, 334]",MISC
1004,-,"[518, 320, 520, 334]",MISC
1005,NL,"[518, 320, 520, 334]",MISC
1006,-,"[518, 320, 520, 334]",MISC
1007,Lia,"[196, 337, 259, 349]",MISC
1008,##ison,"[196, 337, 259, 349]",MISC
1009,with,"[260, 337, 296, 349]",MISC
1010,all,"[297, 337, 324, 349]",MISC
1011,channel,"[324, 337, 387, 349]",MISC
1012,partners,"[388, 337, 460, 349]",MISC
1013,and,"[461, 337, 488, 349]",MISC
1014,retailers,"[488, 337, 569, 349]",MISC
1015,so,"[571, 337, 588, 349]",MISC
1016,as,"[589, 337, 607, 349]",MISC
1017,to,"[607, 337, 625, 349]",MISC
1018,promote,"[625, 337, 688, 349]",MISC
1019,the,"[689, 337, 716, 349]",MISC
1020,Brand,"[717, 337, 779, 349]",MISC
1021,##s,"[717, 337, 779, 349]",MISC
1022,;,"[717, 337, 779, 349]",MISC
1023,carrying,"[780, 337, 852, 349]",MISC
1024,out,"[853, 337, 880, 349]",MISC
1025,various,"[881, 337, 943, 349]",MISC
1026,launch,"[945, 337, 998, 349]",MISC
1027,-,"[999, 337, 1001, 349]",MISC
1028,NL,"[999, 337, 1001, 349]",MISC
1029,-,"[999, 337, 1001, 349]",MISC
1030,of,"[220, 349, 237, 361]",MISC
1031,company,"[239, 349, 307, 361]",MISC
1032,products,"[307, 349, 384, 361]",MISC
1033,in,"[385, 349, 403, 361]",MISC
1034,the,"[405, 349, 433, 361]",MISC
1035,market,"[434, 349, 491, 361]",MISC
1036,and,"[492, 349, 521, 361]",MISC
1037,creating,"[522, 349, 598, 361]",MISC
1038,demand,"[600, 349, 657, 361]",MISC
1039,for,"[658, 349, 687, 361]",MISC
1040,the,"[687, 349, 716, 361]",MISC
1041,same,"[716, 349, 765, 361]",MISC
1042,.,"[716, 349, 765, 361]",MISC
1043,-,"[765, 349, 767, 361]",MISC
1044,NL,"[765, 349, 767, 361]",MISC
1045,-,"[765, 349, 767, 361]",MISC
1046,De,"[197, 364, 254, 378]",MISC
1047,##ft,"[197, 364, 254, 378]",MISC
1048,##ly,"[197, 364, 254, 378]",MISC
1049,conducting,"[255, 364, 352, 378]",MISC
1050,the,"[352, 364, 380, 378]",MISC
1051,market,"[381, 364, 438, 378]",MISC
1052,audit,"[439, 364, 487, 378]",MISC
1053,and,"[487, 364, 516, 378]",MISC
1054,survey,"[516, 364, 573, 378]",MISC
1055,of,"[574, 364, 592, 378]",MISC
1056,current,"[593, 364, 660, 378]",MISC
1057,marketing,"[661, 364, 747, 378]",MISC
1058,trends,"[748, 364, 805, 378]",MISC
1059,for,"[806, 364, 835, 378]",MISC
1060,implementation,"[835, 364, 969, 378]",MISC
1061,for,"[970, 364, 999, 378]",MISC
1062,-,"[1000, 364, 1001, 378]",MISC
1063,NL,"[1000, 364, 1001, 378]",MISC
1064,-,"[1000, 364, 1001, 378]",MISC
1065,business,"[220, 378, 288, 390]",MISC
1066,growth,"[288, 378, 347, 390]",MISC
1067,.,"[288, 378, 347, 390]",MISC
1068,-,"[348, 378, 350, 390]",MISC
1069,NL,"[348, 378, 350, 390]",MISC
1070,-,"[348, 378, 350, 390]",MISC
1071,Pro,"[196, 391, 291, 404]",MISC
1072,##active,"[196, 391, 291, 404]",MISC
1073,##ly,"[196, 391, 291, 404]",MISC
1074,appoint,"[292, 391, 378, 404]",MISC
1075,##ing,"[292, 391, 378, 404]",MISC
1076,and,"[379, 391, 404, 404]",MISC
1077,imp,"[405, 391, 482, 404]",MISC
1078,##art,"[405, 391, 482, 404]",MISC
1079,##ing,"[405, 391, 482, 404]",MISC
1080,training,"[483, 391, 551, 404]",MISC
1081,of,"[552, 391, 569, 404]",MISC
1082,efficient,"[570, 391, 647, 404]",MISC
1083,distributor,"[648, 391, 743, 404]",MISC
1084,as,"[744, 391, 760, 404]",MISC
1085,well,"[761, 391, 795, 404]",MISC
1086,as,"[796, 391, 812, 404]",MISC
1087,F,"[813, 391, 865, 404]",MISC
1088,##SE,"[813, 391, 865, 404]",MISC
1089,’,"[813, 391, 865, 404]",MISC
1090,s,"[813, 391, 865, 404]",MISC
1091,.,"[813, 391, 865, 404]",MISC
1092,-,"[865, 391, 867, 404]",MISC
1093,NL,"[865, 391, 867, 404]",MISC
1094,-,"[865, 391, 867, 404]",MISC
1095,Revenue,"[197, 405, 265, 419]",MISC
1096,generation,"[267, 405, 365, 419]",MISC
1097,through,"[366, 405, 433, 419]",MISC
1098,the,"[435, 405, 463, 419]",MISC
1099,Channel,"[464, 405, 532, 419]",MISC
1100,and,"[534, 405, 562, 419]",MISC
1101,to,"[563, 405, 583, 419]",MISC
1102,meet,"[583, 405, 623, 419]",MISC
1103,the,"[623, 405, 651, 419]",MISC
1104,Z,"[653, 405, 701, 419]",MISC
1105,##onal,"[653, 405, 701, 419]",MISC
1106,Revenue,"[702, 405, 770, 419]",MISC
1107,and,"[771, 405, 800, 419]",MISC
1108,Sales,"[801, 405, 849, 419]",MISC
1109,Target,"[851, 405, 929, 419]",MISC
1110,##s,"[851, 405, 929, 419]",MISC
1111,.,"[851, 405, 929, 419]",MISC
1112,-,"[930, 405, 932, 419]",MISC
1113,NL,"[930, 405, 932, 419]",MISC
1114,-,"[930, 405, 932, 419]",MISC
1115,Meeting,"[197, 420, 261, 432]",MISC
1116,All,"[263, 420, 290, 432]",MISC
1117,Channel,"[291, 420, 356, 432]",MISC
1118,Partners,"[357, 420, 433, 432]",MISC
1119,and,"[433, 420, 460, 432]",MISC
1120,retailers,"[461, 420, 546, 432]",MISC
1121,to,"[546, 420, 564, 432]",MISC
1122,get,"[565, 420, 592, 432]",MISC
1123,promote,"[594, 420, 658, 432]",MISC
1124,our,"[660, 420, 687, 432]",MISC
1125,brands,"[688, 420, 753, 432]",MISC
1126,.,"[688, 420, 753, 432]",MISC
1127,-,"[754, 420, 756, 432]",MISC
1128,NL,"[754, 420, 756, 432]",MISC
1129,-,"[754, 420, 756, 432]",MISC
1130,Launch,"[197, 434, 287, 446]",MISC
1131,##ing,"[197, 434, 287, 446]",MISC
1132,of,"[287, 434, 307, 446]",MISC
1133,company,"[307, 434, 377, 446]",MISC
1134,products,"[377, 434, 456, 446]",MISC
1135,in,"[457, 434, 477, 446]",MISC
1136,the,"[477, 434, 506, 446]",MISC
1137,market,"[507, 434, 566, 446]",MISC
1138,and,"[567, 434, 596, 446]",MISC
1139,creating,"[597, 434, 676, 446]",MISC
1140,demand,"[677, 434, 736, 446]",MISC
1141,for,"[737, 434, 766, 446]",MISC
1142,the,"[767, 434, 796, 446]",MISC
1143,same,"[797, 434, 846, 446]",MISC
1144,.,"[797, 434, 846, 446]",MISC
1145,-,"[847, 434, 849, 446]",MISC
1146,NL,"[847, 434, 849, 446]",MISC
1147,-,"[847, 434, 849, 446]",MISC
1148,A,"[197, 447, 294, 461]",MISC
1149,##pp,"[197, 447, 294, 461]",MISC
1150,##oint,"[197, 447, 294, 461]",MISC
1151,##ing,"[197, 447, 294, 461]",MISC
1152,and,"[294, 447, 322, 461]",MISC
1153,training,"[323, 447, 400, 461]",MISC
1154,Pro,"[400, 447, 486, 461]",MISC
1155,##mote,"[400, 447, 486, 461]",MISC
1156,##rs,"[400, 447, 486, 461]",MISC
1157,and,"[487, 447, 516, 461]",MISC
1158,Team,"[516, 447, 554, 461]",MISC
1159,Leaders,"[555, 447, 632, 461]",MISC
1160,",","[555, 447, 632, 461]",MISC
1161,m,"[632, 447, 729, 461]",MISC
1162,##ot,"[632, 447, 729, 461]",MISC
1163,##ivating,"[632, 447, 729, 461]",MISC
1164,the,"[729, 447, 757, 461]",MISC
1165,sales,"[758, 447, 806, 461]",MISC
1166,team,"[806, 447, 844, 461]",MISC
1167,towards,"[845, 447, 911, 461]",MISC
1168,achieving,"[912, 447, 998, 461]",MISC
1169,-,"[1000, 447, 1001, 461]",MISC
1170,NL,"[1000, 447, 1001, 461]",MISC
1171,-,"[1000, 447, 1001, 461]",MISC
1172,higher,"[220, 461, 268, 473]",MISC
1173,sales,"[268, 461, 307, 473]",MISC
1174,productivity,"[308, 461, 412, 473]",MISC
1175,.,"[308, 461, 412, 473]",MISC
1176,-,"[413, 461, 415, 473]",MISC
1177,NL,"[413, 461, 415, 473]",MISC
1178,-,"[413, 461, 415, 473]",MISC
1179,Promotion,"[197, 475, 381, 487]",MISC
1180,##al,"[197, 475, 381, 487]",MISC
1181,/,"[197, 475, 381, 487]",MISC
1182,Brand,"[197, 475, 381, 487]",MISC
1183,##ing,"[197, 475, 381, 487]",MISC
1184,activities,"[382, 475, 474, 487]",MISC
1185,of,"[475, 475, 493, 487]",MISC
1186,the,"[494, 475, 521, 487]",MISC
1187,product,"[522, 475, 586, 487]",MISC
1188,in,"[587, 475, 605, 487]",MISC
1189,and,"[605, 475, 632, 487]",MISC
1190,around,"[633, 475, 689, 487]",MISC
1191,the,"[689, 475, 716, 487]",MISC
1192,Zone,"[717, 475, 762, 487]",MISC
1193,.,"[717, 475, 762, 487]",MISC
1194,-,"[763, 475, 765, 487]",MISC
1195,NL,"[763, 475, 765, 487]",MISC
1196,-,"[763, 475, 765, 487]",MISC
1197,Drive,"[197, 493, 243, 506]",MISC
1198,business,"[244, 493, 319, 506]",MISC
1199,in,"[320, 493, 338, 506]",MISC
1200,Modern,"[339, 493, 395, 506]",MISC
1201,trade,"[396, 493, 443, 506]",MISC
1202,stores,"[444, 493, 499, 506]",MISC
1203,by,"[501, 493, 519, 506]",MISC
1204,placing,"[520, 493, 586, 506]",MISC
1205,promoter,"[586, 493, 681, 506]",MISC
1206,##s,"[586, 493, 681, 506]",MISC
1207,.,"[586, 493, 681, 506]",MISC
1208,-,"[681, 493, 683, 506]",MISC
1209,NL,"[681, 493, 683, 506]",MISC
1210,-,"[681, 493, 683, 506]",MISC
1211,En,"[197, 514, 252, 527]",MISC
1212,##sure,"[197, 514, 252, 527]",MISC
1213,zero,"[253, 514, 288, 527]",MISC
1214,tolerance,"[290, 514, 372, 527]",MISC
1215,policy,"[374, 514, 429, 527]",MISC
1216,for,"[430, 514, 457, 527]",MISC
1217,regulatory,"[458, 514, 551, 527]",MISC
1218,guidelines,"[551, 514, 644, 527]",MISC
1219,and,"[645, 514, 672, 527]",MISC
1220,ensure,"[673, 514, 728, 527]",MISC
1221,100,"[729, 514, 765, 527]",MISC
1222,%,"[729, 514, 765, 527]",MISC
1223,compliance,"[766, 514, 859, 527]",MISC
1224,on,"[859, 514, 877, 527]",MISC
1225,all,"[878, 514, 905, 527]",MISC
1226,parameters,"[906, 514, 999, 527]",MISC
1227,-,"[1000, 514, 1001, 527]",MISC
1228,NL,"[1000, 514, 1001, 527]",MISC
1229,-,"[1000, 514, 1001, 527]",MISC
1230,of,"[220, 529, 237, 542]",MISC
1231,documents,"[239, 529, 323, 542]",MISC
1232,etc,"[324, 529, 362, 542]",MISC
1233,.,"[324, 529, 362, 542]",MISC
1234,Go,"[362, 529, 380, 542]",MISC
1235,an,"[381, 529, 399, 542]",MISC
1236,extra,"[400, 529, 447, 542]",MISC
1237,mile,"[448, 529, 485, 542]",MISC
1238,for,"[486, 529, 513, 542]",MISC
1239,es,"[514, 529, 609, 542]",MISC
1240,##cal,"[514, 529, 609, 542]",MISC
1241,##ating,"[514, 529, 609, 542]",MISC
1242,the,"[610, 529, 636, 542]",MISC
1243,breach,"[638, 529, 694, 542]",MISC
1244,of,"[695, 529, 713, 542]",MISC
1245,compliance,"[714, 529, 809, 542]",MISC
1246,and,"[809, 529, 836, 542]",MISC
1247,create,"[838, 529, 893, 542]",MISC
1248,influence,"[895, 529, 979, 542]",MISC
1249,to,"[980, 529, 998, 542]",MISC
1250,-,"[1000, 529, 1001, 542]",MISC
1251,NL,"[1000, 529, 1001, 542]",MISC
1252,-,"[1000, 529, 1001, 542]",MISC
1253,correct,"[220, 544, 275, 557]",MISC
1254,the,"[275, 544, 299, 557]",MISC
1255,situation,"[299, 544, 378, 557]",MISC
1256,.,"[299, 544, 378, 557]",MISC
1257,-,"[379, 544, 381, 557]",MISC
1258,NL,"[379, 544, 381, 557]",MISC
1259,-,"[379, 544, 381, 557]",MISC
1260,AC,"[64, 583, 153, 597]",B-education_heading
1261,##AD,"[64, 583, 153, 597]",I-education_heading
1262,##EM,"[64, 583, 153, 597]",I-education_heading
1263,##IC,"[64, 583, 153, 597]",I-education_heading
1264,CR,"[155, 583, 280, 597]",I-education_heading
1265,##ED,"[155, 583, 280, 597]",I-education_heading
1266,##EN,"[155, 583, 280, 597]",I-education_heading
1267,##TI,"[155, 583, 280, 597]",I-education_heading
1268,##AL,"[155, 583, 280, 597]",I-education_heading
1269,##S,"[155, 583, 280, 597]",I-education_heading
1270,-,"[280, 583, 282, 597]",MISC
1271,NL,"[280, 583, 282, 597]",MISC
1272,-,"[280, 583, 282, 597]",MISC
1273,MBA,"[74, 601, 102, 614]",B-education_degree
1274,in,"[103, 601, 123, 614]",MISC
1275,Marketing,"[123, 601, 211, 614]",B-education_course
1276,and,"[212, 601, 241, 614]",I-education_course
1277,Finance,"[242, 601, 310, 614]",I-education_course
1278,from,"[311, 601, 350, 614]",MISC
1279,T,"[351, 601, 360, 614]",MISC
1280,John,"[361, 601, 400, 614]",MISC
1281,Institute,"[400, 601, 488, 614]",MISC
1282,of,"[489, 601, 509, 614]",MISC
1283,Management,"[509, 601, 607, 614]",MISC
1284,and,"[608, 601, 636, 614]",MISC
1285,Science,"[637, 601, 705, 614]",MISC
1286,in,"[707, 601, 726, 614]",MISC
1287,2011,"[726, 601, 775, 614]",MISC
1288,.,"[726, 601, 775, 614]",MISC
1289,-,"[776, 601, 778, 614]",MISC
1290,NL,"[776, 601, 778, 614]",MISC
1291,-,"[776, 601, 778, 614]",MISC
1292,B,"[73, 615, 120, 629]",B-education_degree
1293,.,"[73, 615, 120, 629]",I-education_degree
1294,Sc,"[73, 615, 120, 629]",I-education_degree
1295,.,"[73, 615, 120, 629]",MISC
1296,from,"[121, 615, 159, 629]",MISC
1297,Ku,"[159, 615, 225, 629]",B-education_institute
1298,##ve,"[159, 615, 225, 629]",I-education_institute
1299,##mp,"[159, 615, 225, 629]",I-education_institute
1300,##u,"[159, 615, 225, 629]",I-education_institute
1301,Ma,"[226, 615, 358, 629]",I-education_institute
1302,##ha,"[226, 615, 358, 629]",I-education_institute
1303,##vid,"[226, 615, 358, 629]",I-education_institute
1304,##hya,"[226, 615, 358, 629]",I-education_institute
1305,##lay,"[226, 615, 358, 629]",I-education_institute
1306,##a,"[226, 615, 358, 629]",I-education_institute
1307,Bangalore,"[360, 615, 446, 629]",I-education_institute
1308,University,"[446, 615, 540, 629]",I-education_institute
1309,in,"[541, 615, 559, 629]",MISC
1310,2008,"[560, 615, 607, 629]",MISC
1311,.,"[560, 615, 607, 629]",MISC
1312,-,"[608, 615, 610, 629]",MISC
1313,NL,"[608, 615, 610, 629]",MISC
1314,-,"[608, 615, 610, 629]",MISC
1315,12th,"[74, 630, 113, 643]",B-education_degree
1316,from,"[113, 630, 153, 643]",MISC
1317,Govt,"[153, 630, 192, 643]",B-education_institute
1318,College,"[192, 630, 271, 643]",I-education_institute
1319,",","[192, 630, 271, 643]",I-education_institute
1320,Rama,"[271, 630, 359, 643]",I-education_institute
1321,##nagar,"[271, 630, 359, 643]",I-education_institute
1322,in,"[360, 630, 379, 643]",MISC
1323,2005,"[380, 630, 428, 643]",MISC
1324,.,"[380, 630, 428, 643]",MISC
1325,-,"[429, 630, 431, 643]",MISC
1326,NL,"[429, 630, 431, 643]",MISC
1327,-,"[429, 630, 431, 643]",MISC
1328,10th,"[74, 644, 113, 656]",B-education_degree
1329,from,"[115, 644, 154, 656]",MISC
1330,S,"[155, 644, 194, 656]",B-education_institute
1331,##US,"[155, 644, 194, 656]",I-education_institute
1332,##R,"[155, 644, 194, 656]",I-education_institute
1333,high,"[196, 644, 235, 656]",I-education_institute
1334,School,"[236, 644, 297, 656]",I-education_institute
1335,Ma,"[297, 644, 358, 656]",I-education_institute
1336,##ga,"[297, 644, 358, 656]",I-education_institute
1337,##di,"[297, 644, 358, 656]",I-education_institute
1338,in,"[358, 644, 378, 656]",MISC
1339,2002,"[378, 644, 428, 656]",MISC
1340,.,"[378, 644, 428, 656]",MISC
1341,-,"[429, 644, 431, 656]",MISC
1342,NL,"[429, 644, 431, 656]",MISC
1343,-,"[429, 644, 431, 656]",MISC
1344,IT,"[64, 676, 85, 689]",MISC
1345,CR,"[86, 676, 206, 689]",MISC
1346,##ED,"[86, 676, 206, 689]",MISC
1347,##EN,"[86, 676, 206, 689]",MISC
1348,##TI,"[86, 676, 206, 689]",MISC
1349,##AL,"[86, 676, 206, 689]",MISC
1350,##S,"[86, 676, 206, 689]",MISC
1351,-,"[207, 676, 209, 689]",MISC
1352,NL,"[207, 676, 209, 689]",MISC
1353,-,"[207, 676, 209, 689]",MISC
1354,Pack,"[64, 694, 141, 707]",MISC
1355,##ages,"[64, 694, 141, 707]",MISC
1356,:,"[64, 694, 141, 707]",MISC
1357,-,"[141, 694, 143, 707]",MISC
1358,NL,"[141, 694, 143, 707]",MISC
1359,-,"[141, 694, 143, 707]",MISC
1360,Computer,"[322, 694, 389, 707]",MISC
1361,Application,"[390, 694, 483, 707]",MISC
1362,-,"[484, 694, 486, 707]",MISC
1363,NL,"[484, 694, 486, 707]",MISC
1364,-,"[484, 694, 486, 707]",MISC
1365,Operating,"[64, 708, 144, 721]",MISC
1366,System,"[145, 708, 208, 721]",MISC
1367,:,"[145, 708, 208, 721]",MISC
1368,-,"[209, 708, 211, 721]",MISC
1369,NL,"[209, 708, 211, 721]",MISC
1370,-,"[209, 708, 211, 721]",MISC
1371,Windows,"[322, 708, 389, 721]",MISC
1372,X,"[390, 708, 419, 721]",MISC
1373,##P,"[390, 708, 419, 721]",MISC
1374,",","[390, 708, 419, 721]",MISC
1375,Windows,"[420, 708, 499, 721]",MISC
1376,",","[420, 708, 499, 721]",MISC
1377,-,"[499, 708, 500, 721]",MISC
1378,NL,"[499, 708, 500, 721]",MISC
1379,-,"[499, 708, 500, 721]",MISC
1380,Doc,"[64, 722, 186, 735]",MISC
1381,##ume,"[64, 722, 186, 735]",MISC
1382,##ntation,"[64, 722, 186, 735]",MISC
1383,:,"[64, 722, 186, 735]",MISC
1384,-,"[186, 722, 187, 735]",MISC
1385,NL,"[186, 722, 187, 735]",MISC
1386,-,"[186, 722, 187, 735]",MISC
1387,MS,"[322, 722, 338, 735]",MISC
1388,office,"[339, 722, 391, 735]",MISC
1389,-,"[391, 722, 393, 735]",MISC
1390,NL,"[391, 722, 393, 735]",MISC
1391,-,"[391, 722, 393, 735]",MISC
1392,Internet,"[64, 736, 128, 749]",MISC
1393,Too,"[128, 736, 177, 749]",MISC
1394,##ls,"[128, 736, 177, 749]",MISC
1395,:,"[128, 736, 177, 749]",MISC
1396,-,"[177, 736, 178, 749]",MISC
1397,NL,"[177, 736, 178, 749]",MISC
1398,-,"[177, 736, 178, 749]",MISC
1399,Knowledge,"[322, 736, 404, 749]",MISC
1400,of,"[405, 736, 422, 749]",MISC
1401,Out,"[423, 736, 487, 749]",MISC
1402,##look,"[423, 736, 487, 749]",MISC
1403,Express,"[488, 736, 552, 749]",MISC
1404,-,"[552, 736, 554, 749]",MISC
1405,NL,"[552, 736, 554, 749]",MISC
1406,-,"[552, 736, 554, 749]",MISC
1407,P,"[64, 768, 155, 782]",B-personal_details_heading
1408,##ER,"[64, 768, 155, 782]",I-personal_details_heading
1409,##SO,"[64, 768, 155, 782]",I-personal_details_heading
1410,##NA,"[64, 768, 155, 782]",I-personal_details_heading
1411,##L,"[64, 768, 155, 782]",I-personal_details_heading
1412,DOS,"[156, 768, 237, 782]",I-personal_details_heading
1413,##SI,"[156, 768, 237, 782]",I-personal_details_heading
1414,##ER,"[156, 768, 237, 782]",I-personal_details_heading
1415,-,"[237, 768, 239, 782]",MISC
1416,NL,"[237, 768, 239, 782]",MISC
1417,-,"[237, 768, 239, 782]",MISC
1418,Date,"[64, 787, 98, 799]",MISC
1419,of,"[98, 787, 115, 799]",MISC
1420,Birth,"[116, 787, 168, 799]",MISC
1421,:,"[116, 787, 168, 799]",MISC
1422,-,"[168, 787, 169, 799]",MISC
1423,NL,"[168, 787, 169, 799]",MISC
1424,-,"[168, 787, 169, 799]",MISC
1425,30th,"[313, 787, 352, 799]",MISC
1426,May,"[352, 787, 381, 799]",MISC
1427,1986,"[382, 787, 421, 799]",MISC
1428,-,"[422, 787, 423, 799]",MISC
1429,NL,"[422, 787, 423, 799]",MISC
1430,-,"[422, 787, 423, 799]",MISC
1431,Home,"[64, 815, 101, 828]",MISC
1432,Ad,"[103, 815, 180, 828]",MISC
1433,##dress,"[103, 815, 180, 828]",MISC
1434,:,"[103, 815, 180, 828]",MISC
1435,-,"[180, 815, 182, 828]",MISC
1436,NL,"[180, 815, 182, 828]",MISC
1437,-,"[180, 815, 182, 828]",MISC
1438,#,"[309, 815, 318, 828]",MISC
1439,80,"[318, 815, 336, 828]",MISC
1440,E,"[336, 815, 354, 828]",MISC
1441,",","[336, 815, 354, 828]",MISC
1442,Near,"[354, 815, 390, 828]",MISC
1443,Su,"[390, 815, 453, 828]",MISC
1444,##ja,"[390, 815, 453, 828]",MISC
1445,##tha,"[390, 815, 453, 828]",MISC
1446,School,"[454, 815, 516, 828]",MISC
1447,",","[454, 815, 516, 828]",MISC
1448,U,"[517, 815, 562, 828]",MISC
1449,##lla,"[517, 815, 562, 828]",MISC
1450,##l,"[517, 815, 562, 828]",MISC
1451,Satellite,"[562, 815, 643, 828]",MISC
1452,Town,"[644, 815, 688, 828]",MISC
1453,",","[644, 815, 688, 828]",MISC
1454,Bangalore,"[689, 815, 778, 828]",MISC
1455,.,"[689, 815, 778, 828]",MISC
1456,-,"[779, 815, 781, 828]",MISC
1457,NL,"[779, 815, 781, 828]",MISC
1458,-,"[779, 815, 781, 828]",MISC
1459,Languages,"[64, 843, 150, 856]",B-skills_heading
1460,Known,"[151, 843, 208, 856]",I-skills_heading
1461,:,"[151, 843, 208, 856]",I-skills_heading
1462,-,"[209, 843, 211, 856]",MISC
1463,NL,"[209, 843, 211, 856]",MISC
1464,-,"[209, 843, 211, 856]",MISC
1465,English,"[311, 843, 382, 856]",MISC
1466,",","[311, 843, 382, 856]",MISC
1467,Hindi,"[383, 843, 437, 856]",MISC
1468,",","[383, 843, 437, 856]",MISC
1469,Telugu,"[438, 843, 491, 856]",MISC
1470,and,"[492, 843, 519, 856]",MISC
1471,Kannada,"[519, 843, 582, 856]",MISC
1472,-,"[583, 843, 584, 856]",MISC
1473,NL,"[583, 843, 584, 856]",MISC
1474,-,"[583, 843, 584, 856]",MISC
1475,DE,"[366, 888, 483, 901]",B-others_heading
1476,##CL,"[366, 888, 483, 901]",I-others_heading
1477,##AR,"[366, 888, 483, 901]",I-others_heading
1478,##AT,"[366, 888, 483, 901]",I-others_heading
1479,##ION,"[366, 888, 483, 901]",I-others_heading
1480,-,"[483, 888, 484, 901]",MISC
1481,NL,"[483, 888, 484, 901]",MISC
1482,-,"[483, 888, 484, 901]",MISC
1483,I,"[64, 917, 73, 931]",MISC
1484,P,"[74, 917, 135, 931]",MISC
1485,##ram,"[74, 917, 135, 931]",MISC
1486,##od,"[74, 917, 135, 931]",MISC
1487,Raj,"[135, 917, 165, 931]",MISC
1488,here,"[166, 917, 226, 931]",MISC
1489,##by,"[166, 917, 226, 931]",MISC
1490,declare,"[227, 917, 296, 931]",MISC
1491,that,"[298, 917, 337, 931]",MISC
1492,the,"[338, 917, 369, 931]",MISC
1493,information,"[369, 917, 480, 931]",MISC
1494,given,"[481, 917, 531, 931]",MISC
1495,above,"[532, 917, 582, 931]",MISC
1496,is,"[583, 917, 602, 931]",MISC
1497,true,"[603, 917, 642, 931]",MISC
1498,to,"[644, 917, 663, 931]",MISC
1499,the,"[664, 917, 694, 931]",MISC
1500,best,"[694, 917, 734, 931]",MISC
1501,of,"[735, 917, 755, 931]",MISC
1502,my,"[755, 917, 775, 931]",MISC
1503,knowledge,"[776, 917, 876, 931]",MISC
1504,.,"[776, 917, 876, 931]",MISC
1505,I,"[877, 917, 886, 931]",MISC
1506,am,"[888, 917, 907, 931]",MISC
1507,honest,"[908, 917, 969, 931]",MISC
1508,and,"[969, 917, 999, 931]",MISC
1509,-,"[1000, 917, 1001, 931]",MISC
1510,NL,"[1000, 917, 1001, 931]",MISC
1511,-,"[1000, 917, 1001, 931]",MISC
1512,hard,"[64, 931, 186, 945]",MISC
1513,##working,"[64, 931, 186, 945]",MISC
1514,.,"[64, 931, 186, 945]",MISC
1515,I,"[186, 931, 195, 945]",MISC
1516,am,"[196, 931, 216, 945]",MISC
1517,a,"[216, 931, 225, 945]",MISC
1518,good,"[226, 931, 266, 945]",MISC
1519,organizer,"[267, 931, 358, 945]",MISC
1520,and,"[358, 931, 389, 945]",MISC
1521,a,"[389, 931, 398, 945]",MISC
1522,good,"[399, 931, 438, 945]",MISC
1523,leader,"[439, 931, 509, 945]",MISC
1524,.,"[439, 931, 509, 945]",MISC
1525,I,"[511, 931, 519, 945]",MISC
1526,am,"[521, 931, 540, 945]",MISC
1527,a,"[541, 931, 550, 945]",MISC
1528,good,"[551, 931, 590, 945]",MISC
1529,learn,"[592, 931, 661, 945]",MISC
1530,##er,"[592, 931, 661, 945]",MISC
1531,with,"[663, 931, 702, 945]",MISC
1532,an,"[703, 931, 723, 945]",MISC
1533,attitude,"[724, 931, 804, 945]",MISC
1534,of,"[805, 931, 825, 945]",MISC
1535,competitive,"[825, 931, 986, 945]",MISC
1536,##ness,"[825, 931, 986, 945]",MISC
1537,.,"[825, 931, 986, 945]",MISC
1538,I,"[988, 931, 997, 945]",MISC
1539,-,"[998, 931, 1000, 945]",MISC
1540,NL,"[998, 931, 1000, 945]",MISC
1541,-,"[998, 931, 1000, 945]",MISC
1542,enjoy,"[64, 945, 110, 958]",MISC
1543,travelling,"[112, 945, 215, 958]",MISC
1544,",","[112, 945, 215, 958]",MISC
1545,meeting,"[217, 945, 283, 958]",MISC
1546,new,"[284, 945, 312, 958]",MISC
1547,people,"[312, 945, 370, 958]",MISC
1548,and,"[370, 945, 398, 958]",MISC
1549,learning,"[398, 945, 473, 958]",MISC
1550,new,"[475, 945, 503, 958]",MISC
1551,things,"[503, 945, 569, 958]",MISC
1552,.,"[503, 945, 569, 958]",MISC
1553,-,"[570, 945, 572, 958]",MISC
1554,NL,"[570, 945, 572, 958]",MISC
1555,-,"[570, 945, 572, 958]",MISC
