,token,box,label
0,ME,"[305, 40, 464, 55]",B-name
1,##H,"[305, 40, 464, 55]",I-name
2,##J,"[305, 40, 464, 55]",I-name
3,##AB,"[305, 40, 464, 55]",I-name
4,##EE,"[305, 40, 464, 55]",I-name
5,##N,"[305, 40, 464, 55]",I-name
6,-,"[464, 40, 465, 55]",MISC
7,NL,"[464, 40, 465, 55]",MISC
8,-,"[464, 40, 465, 55]",MISC
9,2014,"[823, 40, 930, 54]",MISC
10,##UE,"[823, 40, 930, 54]",MISC
11,##C,"[823, 40, 930, 54]",MISC
12,##12,"[823, 40, 930, 54]",MISC
13,##21,"[823, 40, 930, 54]",MISC
14,-,"[930, 40, 931, 54]",MISC
15,NL,"[930, 40, 931, 54]",MISC
16,-,"[930, 40, 931, 54]",MISC
17,Electronics,"[305, 59, 399, 73]",MISC
18,and,"[400, 59, 426, 73]",MISC
19,communication,"[426, 59, 536, 73]",MISC
20,Engineering,"[538, 59, 632, 73]",MISC
21,-,"[633, 59, 635, 73]",MISC
22,NL,"[633, 59, 635, 73]",MISC
23,-,"[633, 59, 635, 73]",MISC
24,B,"[826, 59, 880, 73]",MISC
25,.,"[826, 59, 880, 73]",MISC
26,Tech,"[826, 59, 880, 73]",MISC
27,-,"[880, 59, 882, 73]",MISC
28,NL,"[880, 59, 882, 73]",MISC
29,-,"[880, 59, 882, 73]",MISC
30,Mal,"[305, 77, 373, 91]",MISC
31,##avi,"[305, 77, 373, 91]",MISC
32,##ya,"[305, 77, 373, 91]",MISC
33,National,"[375, 77, 443, 91]",MISC
34,Institute,"[445, 77, 522, 91]",MISC
35,of,"[523, 77, 540, 91]",MISC
36,Technology,"[541, 77, 627, 91]",MISC
37,Jai,"[628, 77, 679, 91]",MISC
38,##pur,"[628, 77, 679, 91]",MISC
39,(,"[680, 77, 732, 91]",MISC
40,M,"[680, 77, 732, 91]",MISC
41,##NI,"[680, 77, 732, 91]",MISC
42,##T,"[680, 77, 732, 91]",MISC
43,),"[680, 77, 732, 91]",MISC
44,-,"[732, 77, 734, 91]",MISC
45,NL,"[732, 77, 734, 91]",MISC
46,-,"[732, 77, 734, 91]",MISC
47,Female,"[826, 77, 878, 91]",MISC
48,-,"[878, 77, 880, 91]",MISC
49,NL,"[878, 77, 880, 91]",MISC
50,-,"[878, 77, 880, 91]",MISC
51,Em,"[305, 114, 349, 128]",MISC
52,##ail,"[305, 114, 349, 128]",MISC
53,ID,"[350, 114, 376, 128]",MISC
54,:,"[350, 114, 376, 128]",MISC
55,me,"[377, 114, 637, 128]",B-emails_email
56,##h,"[377, 114, 637, 128]",I-emails_email
57,##za,"[377, 114, 637, 128]",I-emails_email
58,##bee,"[377, 114, 637, 128]",I-emails_email
59,##nan,"[377, 114, 637, 128]",I-emails_email
60,##sar,"[377, 114, 637, 128]",I-emails_email
61,##i,"[377, 114, 637, 128]",I-emails_email
62,##19,"[377, 114, 637, 128]",I-emails_email
63,##9,"[377, 114, 637, 128]",I-emails_email
64,##7,"[377, 114, 637, 128]",I-emails_email
65,@,"[377, 114, 637, 128]",I-emails_email
66,g,"[377, 114, 637, 128]",I-emails_email
67,##mail,"[377, 114, 637, 128]",I-emails_email
68,.,"[377, 114, 637, 128]",I-emails_email
69,com,"[377, 114, 637, 128]",I-emails_email
70,-,"[639, 114, 640, 128]",MISC
71,NL,"[639, 114, 640, 128]",MISC
72,-,"[639, 114, 640, 128]",MISC
73,D,"[804, 114, 848, 128]",MISC
74,##O,"[804, 114, 848, 128]",MISC
75,##B,"[804, 114, 848, 128]",MISC
76,:,"[804, 114, 848, 128]",MISC
77,23,"[850, 114, 872, 128]",MISC
78,MA,"[873, 114, 906, 128]",MISC
79,##Y,"[873, 114, 906, 128]",MISC
80,1997,"[908, 114, 952, 128]",MISC
81,-,"[953, 114, 955, 128]",MISC
82,NL,"[953, 114, 955, 128]",MISC
83,-,"[953, 114, 955, 128]",MISC
84,Ad,"[305, 132, 364, 146]",MISC
85,##dress,"[305, 132, 364, 146]",MISC
86,:,"[366, 132, 373, 146]",MISC
87,3,"[374, 132, 442, 146]",MISC
88,-,"[374, 132, 442, 146]",MISC
89,RA,"[374, 132, 442, 146]",MISC
90,-,"[374, 132, 442, 146]",MISC
91,-,"[374, 132, 442, 146]",MISC
92,48,"[374, 132, 442, 146]",MISC
93,v,"[443, 132, 495, 146]",MISC
94,##ig,"[443, 132, 495, 146]",MISC
95,##yan,"[443, 132, 495, 146]",MISC
96,na,"[495, 132, 538, 146]",MISC
97,##gar,"[495, 132, 538, 146]",MISC
98,k,"[538, 132, 572, 146]",MISC
99,##ota,"[538, 132, 572, 146]",MISC
100,(,"[573, 132, 667, 146]",MISC
101,r,"[573, 132, 667, 146]",MISC
102,##aja,"[573, 132, 667, 146]",MISC
103,##st,"[573, 132, 667, 146]",MISC
104,##han,"[573, 132, 667, 146]",MISC
105,),"[573, 132, 667, 146]",MISC
106,-,"[668, 132, 670, 146]",MISC
107,NL,"[668, 132, 670, 146]",MISC
108,-,"[668, 132, 670, 146]",MISC
109,phone,"[806, 132, 850, 146]",MISC
110,no,"[851, 132, 877, 146]",MISC
111,.,"[851, 132, 877, 146]",MISC
112,80,"[878, 132, 967, 146]",B-phones_phone
113,##5,"[878, 132, 967, 146]",I-phones_phone
114,##8,"[878, 132, 967, 146]",I-phones_phone
115,##86,"[878, 132, 967, 146]",I-phones_phone
116,##53,"[878, 132, 967, 146]",I-phones_phone
117,##00,"[878, 132, 967, 146]",I-phones_phone
118,-,"[968, 132, 970, 146]",MISC
119,NL,"[968, 132, 970, 146]",MISC
120,-,"[968, 132, 970, 146]",MISC
121,CA,"[454, 171, 539, 193]",B-summary_heading
122,##RE,"[454, 171, 539, 193]",I-summary_heading
123,##ER,"[454, 171, 539, 193]",I-summary_heading
124,O,"[541, 171, 669, 193]",I-summary_heading
125,##B,"[541, 171, 669, 193]",I-summary_heading
126,##J,"[541, 171, 669, 193]",I-summary_heading
127,##EC,"[541, 171, 669, 193]",I-summary_heading
128,##TI,"[541, 171, 669, 193]",I-summary_heading
129,##VE,"[541, 171, 669, 193]",I-summary_heading
130,-,"[670, 171, 672, 193]",MISC
131,NL,"[670, 171, 672, 193]",MISC
132,-,"[670, 171, 672, 193]",MISC
133,To,"[136, 193, 155, 213]",MISC
134,exercise,"[156, 193, 233, 213]",MISC
135,innovative,"[234, 193, 350, 213]",MISC
136,##ly,"[234, 193, 350, 213]",MISC
137,my,"[351, 193, 370, 213]",MISC
138,intellectual,"[371, 193, 487, 213]",MISC
139,ability,"[488, 193, 556, 213]",MISC
140,supported,"[556, 193, 643, 213]",MISC
141,by,"[644, 193, 663, 213]",MISC
142,my,"[664, 193, 682, 213]",MISC
143,strengths,"[683, 193, 770, 213]",MISC
144,of,"[771, 193, 790, 213]",MISC
145,rational,"[791, 193, 898, 213]",MISC
146,##ity,"[791, 193, 898, 213]",MISC
147,and,"[898, 193, 926, 213]",MISC
148,-,"[928, 193, 930, 213]",MISC
149,NL,"[928, 193, 930, 213]",MISC
150,-,"[928, 193, 930, 213]",MISC
151,integrity,"[158, 216, 244, 231]",MISC
152,to,"[246, 216, 264, 231]",MISC
153,achieve,"[266, 216, 334, 231]",MISC
154,quality,"[334, 216, 402, 231]",MISC
155,output,"[403, 216, 460, 231]",MISC
156,as,"[462, 216, 480, 231]",MISC
157,an,"[481, 216, 500, 231]",MISC
158,analyst,"[501, 216, 569, 231]",MISC
159,and,"[569, 216, 597, 231]",MISC
160,develop,"[599, 216, 667, 231]",MISC
161,continually,"[667, 216, 774, 231]",MISC
162,as,"[775, 216, 794, 231]",MISC
163,a,"[795, 216, 804, 231]",MISC
164,professional,"[805, 216, 921, 231]",MISC
165,and,"[922, 216, 950, 231]",MISC
166,-,"[952, 216, 953, 231]",MISC
167,NL,"[952, 216, 953, 231]",MISC
168,-,"[952, 216, 953, 231]",MISC
169,a,"[158, 235, 167, 250]",MISC
170,person,"[168, 235, 234, 250]",MISC
171,.,"[168, 235, 234, 250]",MISC
172,-,"[235, 235, 237, 250]",MISC
173,NL,"[235, 235, 237, 250]",MISC
174,-,"[235, 235, 237, 250]",MISC
175,AC,"[469, 268, 600, 289]",B-education_heading
176,##AD,"[469, 268, 600, 289]",I-education_heading
177,##EM,"[469, 268, 600, 289]",I-education_heading
178,##IC,"[469, 268, 600, 289]",I-education_heading
179,##S,"[469, 268, 600, 289]",I-education_heading
180,-,"[600, 268, 602, 289]",MISC
181,NL,"[600, 268, 602, 289]",MISC
182,-,"[600, 268, 602, 289]",MISC
183,Examination,"[138, 310, 296, 324]",MISC
184,-,"[296, 310, 309, 324]",MISC
185,University,"[311, 310, 541, 324]",MISC
186,/,"[311, 310, 541, 324]",MISC
187,Board,"[311, 310, 541, 324]",MISC
188,-,"[541, 310, 554, 324]",MISC
189,Institute,"[556, 310, 684, 324]",MISC
190,-,"[685, 310, 698, 324]",MISC
191,Pass,"[700, 310, 799, 324]",MISC
192,##ing,"[700, 310, 799, 324]",MISC
193,Year,"[800, 310, 858, 324]",MISC
194,-,"[858, 310, 871, 324]",MISC
195,C,"[873, 310, 930, 324]",MISC
196,##GP,"[873, 310, 930, 324]",MISC
197,##A,"[873, 310, 930, 324]",MISC
198,/,"[930, 310, 943, 324]",MISC
199,%,"[945, 310, 957, 324]",MISC
200,-,"[959, 310, 961, 324]",MISC
201,NL,"[959, 310, 961, 324]",MISC
202,-,"[959, 310, 961, 324]",MISC
203,G,"[138, 332, 187, 379]",B-education_degree
204,##rad,"[138, 332, 187, 379]",I-education_degree
205,##uation,"[138, 332, 187, 379]",I-education_degree
206,Intermediate,"[188, 332, 261, 379]",B-education_degree
207,/,"[188, 332, 261, 379]",MISC
208,+,"[188, 332, 261, 379]",MISC
209,2,"[188, 332, 261, 379]",MISC
210,Mat,"[263, 332, 327, 379]",B-education_degree
211,##ric,"[263, 332, 327, 379]",I-education_degree
212,##ulation,"[263, 332, 327, 379]",I-education_degree
213,-,"[327, 332, 331, 379]",MISC
214,N,"[332, 332, 347, 379]",B-education_institute
215,##IT,"[332, 332, 347, 379]",I-education_institute
216,Jai,"[347, 332, 377, 379]",I-education_institute
217,##pur,"[347, 332, 377, 379]",I-education_institute
218,(,"[377, 332, 407, 379]",MISC
219,M,"[377, 332, 407, 379]",MISC
220,##NI,"[377, 332, 407, 379]",MISC
221,##T,"[377, 332, 407, 379]",MISC
222,),"[377, 332, 407, 379]",MISC
223,RB,"[407, 332, 426, 379]",MISC
224,##SE,"[407, 332, 426, 379]",MISC
225,RB,"[427, 332, 446, 379]",MISC
226,##SE,"[427, 332, 446, 379]",MISC
227,-,"[447, 332, 451, 379]",MISC
228,N,"[452, 332, 467, 379]",B-education_institute
229,##IT,"[452, 332, 467, 379]",I-education_institute
230,Jai,"[467, 332, 497, 379]",I-education_institute
231,##pur,"[467, 332, 497, 379]",I-education_institute
232,(,"[497, 332, 527, 379]",MISC
233,M,"[497, 332, 527, 379]",MISC
234,##NI,"[497, 332, 527, 379]",MISC
235,##T,"[497, 332, 527, 379]",MISC
236,),"[497, 332, 527, 379]",MISC
237,J,"[527, 332, 560, 379]",B-education_institute
238,##awa,"[527, 332, 560, 379]",I-education_institute
239,##har,"[527, 332, 560, 379]",I-education_institute
240,children,"[562, 332, 601, 379]",I-education_institute
241,school,"[602, 332, 656, 379]",I-education_institute
242,",","[602, 332, 656, 379]",I-education_institute
243,k,"[602, 332, 656, 379]",I-education_institute
244,##ota,"[602, 332, 656, 379]",I-education_institute
245,J,"[657, 332, 690, 379]",B-education_institute
246,##awa,"[657, 332, 690, 379]",I-education_institute
247,##har,"[657, 332, 690, 379]",I-education_institute
248,children,"[692, 332, 731, 379]",I-education_institute
249,school,"[732, 332, 785, 379]",I-education_institute
250,",","[732, 332, 785, 379]",I-education_institute
251,k,"[732, 332, 785, 379]",I-education_institute
252,##ota,"[732, 332, 785, 379]",I-education_institute
253,-,"[787, 332, 791, 379]",MISC
254,2018,"[792, 332, 810, 379]",MISC
255,2014,"[812, 332, 830, 379]",MISC
256,2012,"[832, 332, 850, 379]",MISC
257,-,"[852, 332, 856, 379]",MISC
258,6,"[857, 332, 875, 379]",MISC
259,.,"[857, 332, 875, 379]",MISC
260,87,"[857, 332, 875, 379]",MISC
261,91,"[877, 332, 901, 379]",MISC
262,.,"[877, 332, 901, 379]",MISC
263,40,"[877, 332, 901, 379]",MISC
264,%,"[902, 332, 906, 379]",MISC
265,89,"[907, 332, 936, 379]",MISC
266,.,"[907, 332, 936, 379]",MISC
267,83,"[907, 332, 936, 379]",MISC
268,%,"[907, 332, 936, 379]",MISC
269,-,"[937, 332, 939, 379]",MISC
270,NL,"[937, 332, 939, 379]",MISC
271,-,"[937, 332, 939, 379]",MISC
272,T,"[423, 408, 546, 429]",B-skills_heading
273,##EC,"[423, 408, 546, 429]",I-skills_heading
274,##H,"[423, 408, 546, 429]",I-skills_heading
275,##NI,"[423, 408, 546, 429]",I-skills_heading
276,##CA,"[423, 408, 546, 429]",I-skills_heading
277,##L,"[423, 408, 546, 429]",I-skills_heading
278,SK,"[548, 408, 631, 429]",I-skills_heading
279,##IL,"[548, 408, 631, 429]",I-skills_heading
280,##LS,"[548, 408, 631, 429]",I-skills_heading
281,-,"[631, 408, 633, 429]",MISC
282,NL,"[631, 408, 633, 429]",MISC
283,-,"[631, 408, 633, 429]",MISC
284,•,"[132, 436, 141, 454]",MISC
285,Computer,"[143, 436, 225, 454]",MISC
286,Programming,"[227, 436, 341, 454]",MISC
287,Languages,"[343, 436, 448, 454]",MISC
288,:,"[343, 436, 448, 454]",MISC
289,C,"[448, 436, 457, 454]",MISC
290,language,"[458, 436, 541, 454]",MISC
291,",","[543, 436, 552, 454]",MISC
292,Data,"[553, 436, 594, 454]",MISC
293,Structure,"[595, 436, 689, 454]",MISC
294,-,"[690, 436, 692, 454]",MISC
295,NL,"[690, 436, 692, 454]",MISC
296,-,"[690, 436, 692, 454]",MISC
297,•,"[132, 455, 141, 475]",MISC
298,Basic,"[142, 455, 190, 475]",MISC
299,pro,"[191, 455, 298, 475]",MISC
300,##ficiency,"[191, 455, 298, 475]",MISC
301,:,"[299, 455, 308, 475]",MISC
302,object,"[309, 455, 366, 475]",MISC
303,oriented,"[368, 455, 445, 475]",MISC
304,programming,"[446, 455, 621, 475]",MISC
305,(,"[446, 455, 621, 475]",MISC
306,O,"[446, 455, 621, 475]",MISC
307,##OP,"[446, 455, 621, 475]",MISC
308,##s,"[446, 455, 621, 475]",MISC
309,),"[446, 455, 621, 475]",MISC
310,",","[446, 455, 621, 475]",MISC
311,DB,"[623, 455, 739, 475]",MISC
312,##MS,"[623, 455, 739, 475]",MISC
313,(,"[623, 455, 739, 475]",MISC
314,basic,"[623, 455, 739, 475]",MISC
315,),"[623, 455, 739, 475]",MISC
316,",","[623, 455, 739, 475]",MISC
317,mathematics,"[741, 455, 847, 475]",MISC
318,-,"[848, 455, 850, 475]",MISC
319,NL,"[848, 455, 850, 475]",MISC
320,-,"[848, 455, 850, 475]",MISC
321,•,"[132, 476, 141, 494]",MISC
322,Web,"[143, 476, 174, 494]",MISC
323,designing,"[174, 476, 268, 494]",MISC
324,and,"[270, 476, 301, 494]",MISC
325,development,"[301, 476, 417, 494]",MISC
326,:,"[418, 476, 427, 494]",MISC
327,H,"[428, 476, 587, 494]",MISC
328,##TM,"[428, 476, 587, 494]",MISC
329,##L,"[428, 476, 587, 494]",MISC
330,",","[428, 476, 587, 494]",MISC
331,CS,"[428, 476, 587, 494]",MISC
332,##S,"[428, 476, 587, 494]",MISC
333,(,"[428, 476, 587, 494]",MISC
334,basic,"[428, 476, 587, 494]",MISC
335,),"[428, 476, 587, 494]",MISC
336,-,"[587, 476, 589, 494]",MISC
337,NL,"[587, 476, 589, 494]",MISC
338,-,"[587, 476, 589, 494]",MISC
339,•,"[132, 495, 141, 513]",MISC
340,Software,"[142, 495, 215, 513]",MISC
341,Platform,"[217, 495, 311, 513]",MISC
342,##s,"[217, 495, 311, 513]",MISC
343,:,"[217, 495, 311, 513]",MISC
344,MA,"[311, 495, 375, 513]",MISC
345,##TL,"[311, 495, 375, 513]",MISC
346,##AB,"[311, 495, 375, 513]",MISC
347,",","[311, 495, 375, 513]",MISC
348,Auto,"[377, 495, 498, 513]",MISC
349,##A,"[377, 495, 498, 513]",MISC
350,##uto,"[377, 495, 498, 513]",MISC
351,-,"[377, 495, 498, 513]",MISC
352,CA,"[377, 495, 498, 513]",MISC
353,##D,"[377, 495, 498, 513]",MISC
354,",","[377, 495, 498, 513]",MISC
355,H,"[499, 495, 563, 513]",MISC
356,-,"[499, 495, 563, 513]",MISC
357,S,"[499, 495, 563, 513]",MISC
358,##pice,"[499, 495, 563, 513]",MISC
359,-,"[565, 495, 567, 513]",MISC
360,NL,"[565, 495, 567, 513]",MISC
361,-,"[565, 495, 567, 513]",MISC
362,•,"[132, 516, 141, 534]",MISC
363,Platform,"[143, 516, 248, 534]",MISC
364,##s,"[143, 516, 248, 534]",MISC
365,:,"[143, 516, 248, 534]",MISC
366,Unix,"[249, 516, 301, 534]",MISC
367,",","[249, 516, 301, 534]",MISC
368,MS,"[303, 516, 323, 534]",MISC
369,Do,"[324, 516, 387, 534]",MISC
370,##s,"[324, 516, 387, 534]",MISC
371,",","[324, 516, 387, 534]",MISC
372,s,"[324, 516, 387, 534]",MISC
373,",","[324, 516, 387, 534]",MISC
374,MS,"[388, 516, 408, 534]",MISC
375,Windows,"[409, 516, 514, 534]",MISC
376,##9,"[409, 516, 514, 534]",MISC
377,##8,"[409, 516, 514, 534]",MISC
378,",","[409, 516, 514, 534]",MISC
379,Window,"[516, 516, 590, 534]",MISC
380,##7,"[516, 516, 590, 534]",MISC
381,-,"[591, 516, 593, 534]",MISC
382,NL,"[591, 516, 593, 534]",MISC
383,-,"[591, 516, 593, 534]",MISC
384,•,"[132, 536, 143, 554]",MISC
385,MS,"[143, 536, 166, 554]",MISC
386,Office,"[166, 536, 245, 554]",MISC
387,:,"[166, 536, 245, 554]",MISC
388,MS,"[245, 536, 267, 554]",MISC
389,Word,"[268, 536, 323, 554]",MISC
390,",","[268, 536, 323, 554]",MISC
391,MS,"[325, 536, 347, 554]",MISC
392,Power,"[347, 536, 403, 554]",MISC
393,Point,"[404, 536, 470, 554]",MISC
394,",","[404, 536, 470, 554]",MISC
395,MS,"[472, 536, 494, 554]",MISC
396,Ex,"[495, 536, 561, 554]",MISC
397,##cel,"[495, 536, 561, 554]",MISC
398,",","[495, 536, 561, 554]",MISC
399,MS,"[563, 536, 585, 554]",MISC
400,Access,"[585, 536, 652, 554]",MISC
401,-,"[653, 536, 655, 554]",MISC
402,NL,"[653, 536, 655, 554]",MISC
403,-,"[653, 536, 655, 554]",MISC
404,•,"[132, 555, 141, 573]",MISC
405,O,"[142, 555, 203, 573]",MISC
406,##TH,"[142, 555, 203, 573]",MISC
407,##ER,"[142, 555, 203, 573]",MISC
408,##S,"[142, 555, 203, 573]",MISC
409,:,"[203, 555, 212, 573]",MISC
410,Present,"[213, 555, 335, 573]",MISC
411,##ation,"[213, 555, 335, 573]",MISC
412,skill,"[335, 555, 385, 573]",MISC
413,-,"[386, 555, 388, 573]",MISC
414,NL,"[386, 555, 388, 573]",MISC
415,-,"[386, 555, 388, 573]",MISC
416,K,"[429, 599, 473, 620]",MISC
417,##E,"[429, 599, 473, 620]",MISC
418,##Y,"[429, 599, 473, 620]",MISC
419,PR,"[473, 599, 576, 620]",MISC
420,##O,"[473, 599, 576, 620]",MISC
421,##J,"[473, 599, 576, 620]",MISC
422,##EC,"[473, 599, 576, 620]",MISC
423,##T,"[473, 599, 576, 620]",MISC
424,-,"[576, 599, 578, 620]",MISC
425,NL,"[576, 599, 578, 620]",MISC
426,-,"[576, 599, 578, 620]",MISC
427,Internet,"[161, 621, 257, 641]",MISC
428,of,"[258, 621, 282, 641]",MISC
429,things,"[283, 621, 354, 641]",MISC
430,in,"[356, 621, 380, 641]",MISC
431,industry,"[380, 621, 489, 641]",MISC
432,:,"[380, 621, 489, 641]",MISC
433,A,"[490, 621, 501, 641]",MISC
434,survey,"[502, 621, 586, 641]",MISC
435,-,"[587, 621, 589, 641]",MISC
436,NL,"[587, 621, 589, 641]",MISC
437,-,"[587, 621, 589, 641]",MISC
438,(,"[180, 641, 246, 659]",MISC
439,Guide,"[180, 641, 246, 659]",MISC
440,:,"[180, 641, 246, 659]",MISC
441,pro,"[247, 641, 293, 659]",MISC
442,##f,"[247, 641, 293, 659]",MISC
443,.,"[247, 641, 293, 659]",MISC
444,am,"[295, 641, 331, 659]",MISC
445,##it,"[295, 641, 331, 659]",MISC
446,j,"[333, 641, 379, 659]",MISC
447,##oshi,"[333, 641, 379, 659]",MISC
448,",","[380, 641, 390, 659]",MISC
449,De,"[390, 641, 436, 659]",MISC
450,##pt,"[390, 641, 436, 659]",MISC
451,.,"[390, 641, 436, 659]",MISC
452,electronics,"[438, 641, 543, 659]",MISC
453,and,"[543, 641, 570, 659]",MISC
454,communication,"[571, 641, 695, 659]",MISC
455,engineering,"[695, 641, 810, 659]",MISC
456,",","[695, 641, 810, 659]",MISC
457,M,"[810, 641, 856, 659]",MISC
458,##NI,"[810, 641, 856, 659]",MISC
459,##T,"[810, 641, 856, 659]",MISC
460,),"[810, 641, 856, 659]",MISC
461,-,"[858, 641, 860, 659]",MISC
462,NL,"[858, 641, 860, 659]",MISC
463,-,"[858, 641, 860, 659]",MISC
464,Internet,"[160, 680, 248, 699]",MISC
465,of,"[249, 680, 271, 699]",MISC
466,things,"[271, 680, 337, 699]",MISC
467,(,"[337, 680, 404, 699]",MISC
468,I,"[337, 680, 404, 699]",MISC
469,##OT,"[337, 680, 404, 699]",MISC
470,),"[337, 680, 404, 699]",MISC
471,:,"[337, 680, 404, 699]",MISC
472,Based,"[404, 680, 459, 699]",B-project_title
473,hand,"[460, 680, 504, 699]",I-project_title
474,gesture,"[504, 680, 581, 699]",I-project_title
475,enabled,"[582, 680, 659, 699]",I-project_title
476,input,"[660, 680, 715, 699]",I-project_title
477,device,"[715, 680, 781, 699]",I-project_title
478,device,"[782, 680, 859, 699]",MISC
479,-,"[860, 680, 861, 699]",MISC
480,NL,"[860, 680, 861, 699]",MISC
481,-,"[860, 680, 861, 699]",MISC
482,(,"[180, 699, 248, 717]",MISC
483,Guide,"[180, 699, 248, 717]",MISC
484,:,"[180, 699, 248, 717]",MISC
485,Mr,"[249, 699, 278, 717]",MISC
486,.,"[249, 699, 278, 717]",MISC
487,San,"[278, 699, 346, 717]",MISC
488,##jee,"[278, 699, 346, 717]",MISC
489,##v,"[278, 699, 346, 717]",MISC
490,A,"[347, 699, 415, 717]",MISC
491,##gar,"[347, 699, 415, 717]",MISC
492,##wal,"[347, 699, 415, 717]",MISC
493,",","[416, 699, 425, 717]",MISC
494,De,"[426, 699, 474, 717]",MISC
495,##pt,"[426, 699, 474, 717]",MISC
496,.,"[426, 699, 474, 717]",MISC
497,electronics,"[475, 699, 582, 717]",MISC
498,and,"[583, 699, 612, 717]",MISC
499,communication,"[613, 699, 740, 717]",MISC
500,engineering,"[740, 699, 858, 717]",MISC
501,",","[740, 699, 858, 717]",MISC
502,M,"[858, 699, 906, 717]",MISC
503,##NI,"[858, 699, 906, 717]",MISC
504,##T,"[858, 699, 906, 717]",MISC
505,),"[858, 699, 906, 717]",MISC
506,-,"[907, 699, 909, 717]",MISC
507,NL,"[907, 699, 909, 717]",MISC
508,-,"[907, 699, 909, 717]",MISC
509,IN,"[429, 740, 567, 761]",B-work_experience_heading
510,##TE,"[429, 740, 567, 761]",I-work_experience_heading
511,##R,"[429, 740, 567, 761]",I-work_experience_heading
512,##NS,"[429, 740, 567, 761]",I-work_experience_heading
513,##H,"[429, 740, 567, 761]",I-work_experience_heading
514,##IP,"[429, 740, 567, 761]",I-work_experience_heading
515,-,"[567, 740, 569, 761]",MISC
516,NL,"[567, 740, 569, 761]",MISC
517,-,"[567, 740, 569, 761]",MISC
518,Sky,"[159, 763, 224, 779]",B-employer_company_name
519,##phi,"[159, 763, 224, 779]",I-employer_company_name
520,Technologies,"[224, 763, 364, 779]",I-employer_company_name
521,-,"[364, 763, 366, 779]",MISC
522,NL,"[364, 763, 366, 779]",MISC
523,-,"[364, 763, 366, 779]",MISC
524,Java,"[184, 779, 220, 795]",B-employer_role
525,Technology,"[222, 779, 315, 795]",I-employer_role
526,-,"[316, 779, 318, 795]",MISC
527,NL,"[316, 779, 318, 795]",MISC
528,-,"[316, 779, 318, 795]",MISC
529,Du,"[861, 779, 944, 795]",MISC
530,##ration,"[861, 779, 944, 795]",MISC
531,:,"[861, 779, 944, 795]",MISC
532,56,"[944, 779, 963, 795]",MISC
533,days,"[963, 779, 1000, 795]",MISC
534,-,"[1000, 779, 1001, 795]",MISC
535,NL,"[1000, 779, 1001, 795]",MISC
536,-,"[1000, 779, 1001, 795]",MISC
537,Project,"[180, 797, 267, 814]",MISC
538,:,"[180, 797, 267, 814]",MISC
539,Bank,"[267, 797, 310, 814]",MISC
540,Management,"[311, 797, 420, 814]",MISC
541,System,"[420, 797, 485, 814]",MISC
542,-,"[486, 797, 488, 814]",MISC
543,NL,"[486, 797, 488, 814]",MISC
544,-,"[486, 797, 488, 814]",MISC
545,E,"[425, 832, 493, 853]",B-others_heading
546,##XT,"[425, 832, 493, 853]",I-others_heading
547,##RA,"[425, 832, 493, 853]",I-others_heading
548,C,"[494, 832, 783, 853]",I-others_heading
549,##UR,"[494, 832, 783, 853]",I-others_heading
550,##RI,"[494, 832, 783, 853]",I-others_heading
551,##CU,"[494, 832, 783, 853]",I-others_heading
552,##LA,"[494, 832, 783, 853]",I-others_heading
553,##R,"[494, 832, 783, 853]",I-others_heading
554,-,"[494, 832, 783, 853]",I-others_heading
555,ACT,"[494, 832, 783, 853]",I-others_heading
556,##I,"[494, 832, 783, 853]",I-others_heading
557,##VI,"[494, 832, 783, 853]",I-others_heading
558,##TI,"[494, 832, 783, 853]",I-others_heading
559,##ES,"[494, 832, 783, 853]",I-others_heading
560,-,"[784, 832, 786, 853]",MISC
561,NL,"[784, 832, 786, 853]",MISC
562,-,"[784, 832, 786, 853]",MISC
563,Score,"[158, 853, 213, 872]",MISC
564,##d,"[158, 853, 213, 872]",MISC
565,116,"[215, 853, 261, 872]",MISC
566,##0,"[215, 853, 261, 872]",MISC
567,##5,"[215, 853, 261, 872]",MISC
568,rank,"[262, 853, 299, 872]",MISC
569,in,"[300, 853, 318, 872]",MISC
570,II,"[318, 853, 346, 872]",MISC
571,##T,"[318, 853, 346, 872]",MISC
572,J,"[347, 853, 374, 872]",MISC
573,##EE,"[347, 853, 374, 872]",MISC
574,2014,"[375, 853, 460, 872]",MISC
575,##20,"[375, 853, 460, 872]",MISC
576,##14,"[375, 853, 460, 872]",MISC
577,-,"[460, 853, 462, 872]",MISC
578,NL,"[460, 853, 462, 872]",MISC
579,-,"[460, 853, 462, 872]",MISC
580,Re,"[159, 873, 244, 893]",MISC
581,##ward,"[159, 873, 244, 893]",MISC
582,##ed,"[159, 873, 244, 893]",MISC
583,with,"[246, 873, 288, 893]",MISC
584,GA,"[289, 873, 342, 893]",MISC
585,##R,"[289, 873, 342, 893]",MISC
586,##GI,"[289, 873, 342, 893]",MISC
587,P,"[343, 873, 438, 893]",MISC
588,##UR,"[343, 873, 438, 893]",MISC
589,##AS,"[343, 873, 438, 893]",MISC
590,##KA,"[343, 873, 438, 893]",MISC
591,##R,"[343, 873, 438, 893]",MISC
592,.,"[343, 873, 438, 893]",MISC
593,(,"[440, 873, 460, 893]",MISC
594,X,"[440, 873, 460, 893]",MISC
595,and,"[461, 873, 493, 893]",MISC
596,XII,"[494, 873, 525, 893]",MISC
597,s,"[526, 873, 590, 893]",MISC
598,##t,"[526, 873, 590, 893]",MISC
599,##d,"[526, 873, 590, 893]",MISC
600,.,"[526, 873, 590, 893]",MISC
601,),"[526, 873, 590, 893]",MISC
602,-,"[591, 873, 593, 893]",MISC
603,NL,"[591, 873, 593, 893]",MISC
604,-,"[591, 873, 593, 893]",MISC
605,Re,"[159, 896, 240, 915]",MISC
606,##ceived,"[159, 896, 240, 915]",MISC
607,Bali,"[240, 896, 301, 915]",MISC
608,##ka,"[240, 896, 301, 915]",MISC
609,Pro,"[301, 896, 391, 915]",MISC
610,##ts,"[301, 896, 391, 915]",MISC
611,##ahan,"[301, 896, 391, 915]",MISC
612,pu,"[392, 896, 473, 915]",MISC
613,##ras,"[392, 896, 473, 915]",MISC
614,##kar,"[392, 896, 473, 915]",MISC
615,in,"[474, 896, 494, 915]",MISC
616,2012,"[494, 896, 544, 915]",MISC
617,-,"[545, 896, 546, 915]",MISC
618,NL,"[545, 896, 546, 915]",MISC
619,-,"[545, 896, 546, 915]",MISC
620,Won,"[159, 916, 188, 936]",MISC
621,certificate,"[189, 916, 300, 936]",MISC
622,of,"[301, 916, 321, 936]",MISC
623,clay,"[321, 916, 362, 936]",MISC
624,modeling,"[362, 916, 443, 936]",MISC
625,competition,"[443, 916, 553, 936]",MISC
626,in,"[555, 916, 575, 936]",MISC
627,M,"[575, 916, 625, 936]",MISC
628,##NI,"[575, 916, 625, 936]",MISC
629,##T,"[575, 916, 625, 936]",MISC
630,-,"[626, 916, 627, 936]",MISC
631,NL,"[626, 916, 627, 936]",MISC
632,-,"[626, 916, 627, 936]",MISC
633,Won,"[159, 939, 188, 958]",MISC
634,certificate,"[189, 939, 300, 958]",MISC
635,of,"[300, 939, 318, 958]",MISC
636,T,"[320, 939, 329, 958]",MISC
637,shirts,"[330, 939, 389, 958]",MISC
638,competition,"[391, 939, 501, 958]",MISC
639,in,"[502, 939, 520, 958]",MISC
640,M,"[522, 939, 572, 958]",MISC
641,##NI,"[522, 939, 572, 958]",MISC
642,##T,"[522, 939, 572, 958]",MISC
643,-,"[572, 939, 574, 958]",MISC
644,NL,"[572, 939, 574, 958]",MISC
645,-,"[572, 939, 574, 958]",MISC
646,District,"[159, 959, 240, 979]",MISC
647,merit,"[240, 959, 290, 979]",MISC
648,in,"[290, 959, 311, 979]",MISC
649,class,"[311, 959, 360, 979]",MISC
650,10th,"[361, 959, 402, 979]",MISC
651,and,"[402, 959, 431, 979]",MISC
652,12th,"[432, 959, 473, 979]",MISC
653,r,"[473, 959, 563, 979]",MISC
654,##aja,"[473, 959, 563, 979]",MISC
655,##st,"[473, 959, 563, 979]",MISC
656,##han,"[473, 959, 563, 979]",MISC
657,board,"[564, 959, 614, 979]",MISC
658,2012,"[615, 959, 655, 979]",MISC
659,&,"[655, 959, 664, 979]",MISC
660,2014,"[665, 959, 715, 979]",MISC
661,-,"[716, 959, 718, 979]",MISC
662,NL,"[716, 959, 718, 979]",MISC
663,-,"[716, 959, 718, 979]",MISC
664,A,"[159, 981, 242, 1000]",MISC
665,##c,"[159, 981, 242, 1000]",MISC
666,##quire,"[159, 981, 242, 1000]",MISC
667,##d,"[159, 981, 242, 1000]",MISC
668,2,"[243, 981, 274, 1000]",MISC
669,##st,"[243, 981, 274, 1000]",MISC
670,rank,"[274, 981, 315, 1000]",MISC
671,in,"[316, 981, 337, 1000]",MISC
672,CH,"[337, 981, 389, 1000]",MISC
673,##OT,"[337, 981, 389, 1000]",MISC
674,##A,"[337, 981, 389, 1000]",MISC
675,RAM,"[390, 981, 484, 1000]",MISC
676,##AN,"[390, 981, 484, 1000]",MISC
677,##U,"[390, 981, 484, 1000]",MISC
678,##J,"[390, 981, 484, 1000]",MISC
679,##AN,"[390, 981, 484, 1000]",MISC
680,p,"[484, 981, 598, 1000]",MISC
681,##rat,"[484, 981, 598, 1000]",MISC
682,##i,"[484, 981, 598, 1000]",MISC
683,##yo,"[484, 981, 598, 1000]",MISC
684,##git,"[484, 981, 598, 1000]",MISC
685,##a,"[484, 981, 598, 1000]",MISC
686,(,"[599, 981, 725, 1000]",MISC
687,resonance,"[599, 981, 725, 1000]",MISC
688,),"[599, 981, 725, 1000]",MISC
689,-,"[725, 981, 727, 1000]",MISC
690,NL,"[725, 981, 727, 1000]",MISC
691,-,"[725, 981, 727, 1000]",MISC
692,P,"[421, 84, 532, 106]",B-others_heading
693,##OS,"[421, 84, 532, 106]",I-others_heading
694,##IT,"[421, 84, 532, 106]",I-others_heading
695,##ION,"[421, 84, 532, 106]",I-others_heading
696,OF,"[532, 84, 560, 106]",I-others_heading
697,R,"[560, 84, 753, 106]",I-others_heading
698,##ES,"[560, 84, 753, 106]",I-others_heading
699,##PO,"[560, 84, 753, 106]",I-others_heading
700,##NS,"[560, 84, 753, 106]",I-others_heading
701,##IB,"[560, 84, 753, 106]",I-others_heading
702,##IL,"[560, 84, 753, 106]",I-others_heading
703,##IT,"[560, 84, 753, 106]",I-others_heading
704,##Y,"[560, 84, 753, 106]",I-others_heading
705,-,"[755, 84, 756, 106]",MISC
706,NL,"[755, 84, 756, 106]",MISC
707,-,"[755, 84, 756, 106]",MISC
708,Part,"[159, 106, 200, 126]",MISC
709,of,"[201, 106, 221, 126]",MISC
710,Ex,"[222, 106, 314, 126]",MISC
711,##ec,"[222, 106, 314, 126]",MISC
712,##uti,"[222, 106, 314, 126]",MISC
713,##ng,"[222, 106, 314, 126]",MISC
714,team,"[315, 106, 356, 126]",MISC
715,in,"[357, 106, 377, 126]",MISC
716,Global,"[378, 106, 439, 126]",MISC
717,Al,"[441, 106, 512, 126]",MISC
718,##umi,"[441, 106, 512, 126]",MISC
719,##ni,"[441, 106, 512, 126]",MISC
720,meet,"[514, 106, 554, 126]",MISC
721,2015,"[555, 106, 596, 126]",MISC
722,in,"[597, 106, 617, 126]",MISC
723,M,"[618, 106, 658, 126]",MISC
724,##NI,"[618, 106, 658, 126]",MISC
725,##T,"[618, 106, 658, 126]",MISC
726,j,"[659, 106, 731, 126]",MISC
727,##ai,"[659, 106, 731, 126]",MISC
728,##pur,"[659, 106, 731, 126]",MISC
729,-,"[732, 106, 734, 126]",MISC
730,NL,"[732, 106, 734, 126]",MISC
731,-,"[732, 106, 734, 126]",MISC
732,Coordinator,"[159, 127, 273, 146]",MISC
733,in,"[275, 127, 295, 146]",MISC
734,Blood,"[296, 127, 347, 146]",MISC
735,Don,"[348, 127, 431, 146]",MISC
736,##ation,"[348, 127, 431, 146]",MISC
737,Camp,"[432, 127, 473, 146]",MISC
738,in,"[474, 127, 495, 146]",MISC
739,M,"[495, 127, 536, 146]",MISC
740,##NI,"[495, 127, 536, 146]",MISC
741,##T,"[495, 127, 536, 146]",MISC
742,j,"[537, 127, 609, 146]",MISC
743,##ai,"[537, 127, 609, 146]",MISC
744,##pur,"[537, 127, 609, 146]",MISC
745,-,"[611, 127, 613, 146]",MISC
746,NL,"[611, 127, 613, 146]",MISC
747,-,"[611, 127, 613, 146]",MISC
748,AR,"[436, 159, 495, 180]",B-skills_heading
749,##EA,"[436, 159, 495, 180]",I-skills_heading
750,OF,"[496, 159, 525, 180]",I-skills_heading
751,IN,"[526, 159, 660, 180]",I-skills_heading
752,##TE,"[526, 159, 660, 180]",I-skills_heading
753,##RE,"[526, 159, 660, 180]",I-skills_heading
754,##ST,"[526, 159, 660, 180]",I-skills_heading
755,##S,"[526, 159, 660, 180]",I-skills_heading
756,-,"[661, 159, 662, 180]",MISC
757,NL,"[661, 159, 662, 180]",MISC
758,-,"[661, 159, 662, 180]",MISC
759,Teaching,"[164, 181, 246, 199]",MISC
760,chemistry,"[247, 181, 348, 199]",MISC
761,-,"[349, 181, 351, 199]",MISC
762,NL,"[349, 181, 351, 199]",MISC
763,-,"[349, 181, 351, 199]",MISC
764,Home,"[165, 200, 210, 220]",MISC
765,tuition,"[210, 200, 299, 220]",MISC
766,-,"[300, 200, 302, 220]",MISC
767,NL,"[300, 200, 302, 220]",MISC
768,-,"[300, 200, 302, 220]",MISC
769,Playing,"[165, 221, 238, 240]",MISC
770,badminton,"[239, 221, 343, 240]",MISC
771,-,"[344, 221, 346, 240]",MISC
772,NL,"[344, 221, 346, 240]",MISC
773,-,"[344, 221, 346, 240]",MISC
774,Travel,"[164, 243, 269, 263]",MISC
775,##ling,"[164, 243, 269, 263]",MISC
776,-,"[270, 243, 272, 263]",MISC
777,NL,"[270, 243, 272, 263]",MISC
778,-,"[270, 243, 272, 263]",MISC
779,P,"[421, 275, 535, 296]",B-personal_details_heading
780,##ER,"[421, 275, 535, 296]",I-personal_details_heading
781,##SO,"[421, 275, 535, 296]",I-personal_details_heading
782,##NA,"[421, 275, 535, 296]",I-personal_details_heading
783,##L,"[421, 275, 535, 296]",I-personal_details_heading
784,DE,"[537, 275, 638, 296]",I-personal_details_heading
785,##TA,"[537, 275, 638, 296]",I-personal_details_heading
786,##IL,"[537, 275, 638, 296]",I-personal_details_heading
787,##S,"[537, 275, 638, 296]",I-personal_details_heading
788,-,"[639, 275, 640, 296]",MISC
789,NL,"[639, 275, 640, 296]",MISC
790,-,"[639, 275, 640, 296]",MISC
791,Home,"[154, 300, 253, 317]",MISC
792,##town,"[154, 300, 253, 317]",MISC
793,:,"[254, 300, 265, 317]",MISC
794,Kota,"[267, 300, 316, 317]",MISC
795,(,"[317, 300, 453, 317]",MISC
796,RA,"[317, 300, 453, 317]",MISC
797,##J,"[317, 300, 453, 317]",MISC
798,##AS,"[317, 300, 453, 317]",MISC
799,##TH,"[317, 300, 453, 317]",MISC
800,##AN,"[317, 300, 453, 317]",MISC
801,),"[317, 300, 453, 317]",MISC
802,-,"[454, 300, 456, 317]",MISC
803,NL,"[454, 300, 456, 317]",MISC
804,-,"[454, 300, 456, 317]",MISC
805,Languages,"[152, 321, 250, 339]",MISC
806,known,"[251, 321, 305, 339]",MISC
807,:,"[306, 321, 315, 339]",MISC
808,English,"[317, 321, 404, 339]",MISC
809,",","[317, 321, 404, 339]",MISC
810,Hindi,"[405, 321, 458, 339]",MISC
811,-,"[460, 321, 462, 339]",MISC
812,NL,"[460, 321, 462, 339]",MISC
813,-,"[460, 321, 462, 339]",MISC
