,token,box,label
0,Mobile,"[89, 107, 296, 125]",MISC
1,:,"[89, 107, 296, 125]",MISC
2,+,"[89, 107, 296, 125]",MISC
3,91,"[89, 107, 296, 125]",B-phones_phone
4,-,"[89, 107, 296, 125]",I-phones_phone
5,84,"[89, 107, 296, 125]",I-phones_phone
6,##55,"[89, 107, 296, 125]",I-phones_phone
7,##0,"[89, 107, 296, 125]",I-phones_phone
8,##8,"[89, 107, 296, 125]",I-phones_phone
9,##17,"[89, 107, 296, 125]",I-phones_phone
10,##47,"[89, 107, 296, 125]",I-phones_phone
11,-,"[296, 107, 298, 125]",MISC
12,NL,"[296, 107, 298, 125]",MISC
13,-,"[296, 107, 298, 125]",MISC
14,E,"[89, 144, 152, 161]",MISC
15,-,"[89, 144, 152, 161]",MISC
16,mail,"[89, 144, 152, 161]",MISC
17,:,"[89, 144, 152, 161]",MISC
18,-,"[152, 144, 153, 161]",MISC
19,NL,"[152, 144, 153, 161]",MISC
20,-,"[152, 144, 153, 161]",MISC
21,g,"[89, 163, 328, 180]",B-emails_email
22,##uru,"[89, 163, 328, 180]",I-emails_email
23,##kal,"[89, 163, 328, 180]",I-emails_email
24,##yan,"[89, 163, 328, 180]",I-emails_email
25,##9,"[89, 163, 328, 180]",I-emails_email
26,##11,"[89, 163, 328, 180]",I-emails_email
27,@,"[89, 163, 328, 180]",I-emails_email
28,g,"[89, 163, 328, 180]",I-emails_email
29,##mail,"[89, 163, 328, 180]",I-emails_email
30,.,"[89, 163, 328, 180]",I-emails_email
31,com,"[89, 163, 328, 180]",I-emails_email
32,-,"[328, 163, 330, 180]",MISC
33,NL,"[328, 163, 330, 180]",MISC
34,-,"[328, 163, 330, 180]",MISC
35,sky,"[89, 180, 150, 200]",MISC
36,##pe,"[89, 180, 150, 200]",MISC
37,:,"[89, 180, 150, 200]",MISC
38,-,"[150, 180, 152, 200]",MISC
39,NL,"[150, 180, 152, 200]",MISC
40,-,"[150, 180, 152, 200]",MISC
41,g,"[89, 200, 328, 217]",B-emails_email
42,##uru,"[89, 200, 328, 217]",I-emails_email
43,##kal,"[89, 200, 328, 217]",I-emails_email
44,##yan,"[89, 200, 328, 217]",I-emails_email
45,##9,"[89, 200, 328, 217]",I-emails_email
46,##11,"[89, 200, 328, 217]",I-emails_email
47,@,"[89, 200, 328, 217]",I-emails_email
48,g,"[89, 200, 328, 217]",I-emails_email
49,##mail,"[89, 200, 328, 217]",I-emails_email
50,.,"[89, 200, 328, 217]",I-emails_email
51,com,"[89, 200, 328, 217]",I-emails_email
52,-,"[328, 200, 330, 217]",MISC
53,NL,"[328, 200, 330, 217]",MISC
54,-,"[328, 200, 330, 217]",MISC
55,Total,"[89, 218, 144, 237]",MISC
56,work,"[144, 218, 189, 237]",MISC
57,Experience,"[189, 218, 311, 237]",MISC
58,:,"[189, 218, 311, 237]",MISC
59,-,"[311, 218, 313, 237]",MISC
60,NL,"[311, 218, 313, 237]",MISC
61,-,"[311, 218, 313, 237]",MISC
62,3,"[155, 257, 176, 276]",MISC
63,+,"[155, 257, 176, 276]",MISC
64,years,"[177, 257, 231, 276]",MISC
65,of,"[231, 257, 252, 276]",MISC
66,Experience,"[253, 257, 360, 276]",MISC
67,-,"[361, 257, 363, 276]",MISC
68,NL,"[361, 257, 363, 276]",MISC
69,-,"[361, 257, 363, 276]",MISC
70,as,"[155, 276, 176, 296]",MISC
71,a,"[177, 276, 186, 296]",MISC
72,Software,"[188, 276, 273, 296]",MISC
73,-,"[274, 276, 276, 296]",MISC
74,NL,"[274, 276, 276, 296]",MISC
75,-,"[274, 276, 276, 296]",MISC
76,Dev,"[155, 296, 252, 315]",MISC
77,##elo,"[155, 296, 252, 315]",MISC
78,##per,"[155, 296, 252, 315]",MISC
79,.,"[155, 296, 252, 315]",MISC
80,-,"[252, 296, 254, 315]",MISC
81,NL,"[252, 296, 254, 315]",MISC
82,-,"[252, 296, 254, 315]",MISC
83,Project,"[89, 332, 170, 352]",MISC
84,:,"[89, 332, 170, 352]",MISC
85,Al,"[171, 332, 252, 352]",MISC
86,##ad,"[171, 332, 252, 352]",MISC
87,##din,"[171, 332, 252, 352]",MISC
88,##®,"[171, 332, 252, 352]",MISC
89,Enterprise,"[253, 332, 355, 352]",MISC
90,-,"[356, 332, 358, 352]",MISC
91,NL,"[356, 332, 358, 352]",MISC
92,-,"[356, 332, 358, 352]",MISC
93,Investment,"[89, 352, 192, 372]",MISC
94,.,"[89, 352, 192, 372]",MISC
95,-,"[192, 352, 194, 372]",MISC
96,NL,"[192, 352, 194, 372]",MISC
97,-,"[192, 352, 194, 372]",MISC
98,Technical,"[89, 409, 176, 428]",B-skills_heading
99,Skills,"[176, 409, 243, 428]",I-skills_heading
100,:,"[176, 409, 243, 428]",I-skills_heading
101,-,"[244, 409, 246, 428]",MISC
102,NL,"[244, 409, 246, 428]",MISC
103,-,"[244, 409, 246, 428]",MISC
104,Programming,"[136, 450, 286, 465]",MISC
105,-,"[287, 450, 289, 465]",MISC
106,NL,"[287, 450, 289, 465]",MISC
107,-,"[287, 450, 289, 465]",MISC
108,Languages,"[155, 467, 276, 485]",MISC
109,:,"[155, 467, 276, 485]",MISC
110,C,"[276, 467, 384, 485]",MISC
111,",","[276, 467, 384, 485]",MISC
112,C,"[276, 467, 384, 485]",MISC
113,+,"[276, 467, 384, 485]",MISC
114,+,"[276, 467, 384, 485]",MISC
115,",","[276, 467, 384, 485]",MISC
116,VC,"[276, 467, 384, 485]",MISC
117,+,"[276, 467, 384, 485]",MISC
118,-,"[385, 467, 387, 485]",MISC
119,NL,"[385, 467, 387, 485]",MISC
120,-,"[385, 467, 387, 485]",MISC
121,+,"[155, 484, 241, 505]",MISC
122,",","[155, 484, 241, 505]",MISC
123,C,"[155, 484, 241, 505]",MISC
124,+,"[155, 484, 241, 505]",MISC
125,+,"[155, 484, 241, 505]",MISC
126,11,"[155, 484, 241, 505]",MISC
127,.,"[155, 484, 241, 505]",MISC
128,-,"[241, 484, 243, 505]",MISC
129,NL,"[241, 484, 243, 505]",MISC
130,-,"[241, 484, 243, 505]",MISC
131,Technologies,"[133, 529, 349, 544]",MISC
132,:,"[133, 529, 349, 544]",MISC
133,Win,"[133, 529, 349, 544]",MISC
134,##32,"[133, 529, 349, 544]",MISC
135,",","[133, 529, 349, 544]",MISC
136,-,"[350, 529, 352, 544]",MISC
137,NL,"[350, 529, 352, 544]",MISC
138,-,"[350, 529, 352, 544]",MISC
139,M,"[155, 545, 263, 563]",MISC
140,##FC,"[155, 545, 263, 563]",MISC
141,",","[155, 545, 263, 563]",MISC
142,CO,"[155, 545, 263, 563]",MISC
143,##M,"[155, 545, 263, 563]",MISC
144,",","[155, 545, 263, 563]",MISC
145,ST,"[263, 545, 317, 563]",MISC
146,##L,"[263, 545, 317, 563]",MISC
147,",","[263, 545, 317, 563]",MISC
148,Doc,"[317, 545, 356, 563]",MISC
149,-,"[358, 545, 359, 563]",MISC
150,NL,"[358, 545, 359, 563]",MISC
151,-,"[358, 545, 359, 563]",MISC
152,View,"[155, 565, 213, 583]",MISC
153,",","[155, 565, 213, 583]",MISC
154,DL,"[214, 565, 353, 583]",MISC
155,##L,"[214, 565, 353, 583]",MISC
156,",","[214, 565, 353, 583]",MISC
157,SD,"[214, 565, 353, 583]",MISC
158,##I,"[214, 565, 353, 583]",MISC
159,",","[214, 565, 353, 583]",MISC
160,MD,"[214, 565, 353, 583]",MISC
161,##I,"[214, 565, 353, 583]",MISC
162,",","[214, 565, 353, 583]",MISC
163,-,"[354, 565, 356, 583]",MISC
164,NL,"[354, 565, 356, 583]",MISC
165,-,"[354, 565, 356, 583]",MISC
166,Design,"[155, 585, 213, 603]",MISC
167,Pat,"[213, 585, 299, 603]",MISC
168,##tern,"[213, 585, 299, 603]",MISC
169,##s,"[213, 585, 299, 603]",MISC
170,.,"[213, 585, 299, 603]",MISC
171,-,"[300, 585, 302, 603]",MISC
172,NL,"[300, 585, 302, 603]",MISC
173,-,"[300, 585, 302, 603]",MISC
174,Libraries,"[134, 627, 251, 642]",MISC
175,:,"[134, 627, 251, 642]",MISC
176,Win,"[251, 627, 368, 642]",MISC
177,##32,"[251, 627, 368, 642]",MISC
178,##AP,"[251, 627, 368, 642]",MISC
179,##I,"[251, 627, 368, 642]",MISC
180,’,"[251, 627, 368, 642]",MISC
181,s,"[251, 627, 368, 642]",MISC
182,-,"[369, 627, 371, 642]",MISC
183,NL,"[369, 627, 371, 642]",MISC
184,-,"[369, 627, 371, 642]",MISC
185,Development,"[134, 666, 266, 681]",MISC
186,Too,"[266, 666, 326, 681]",MISC
187,##l,"[266, 666, 326, 681]",MISC
188,:,"[266, 666, 326, 681]",MISC
189,Visual,"[326, 666, 397, 681]",MISC
190,-,"[398, 666, 400, 681]",MISC
191,NL,"[398, 666, 400, 681]",MISC
192,-,"[398, 666, 400, 681]",MISC
193,Studio,"[155, 683, 217, 701]",MISC
194,2008,"[218, 683, 290, 701]",MISC
195,/,"[218, 683, 290, 701]",MISC
196,12,"[218, 683, 290, 701]",MISC
197,-,"[291, 683, 293, 701]",MISC
198,NL,"[291, 683, 293, 701]",MISC
199,-,"[291, 683, 293, 701]",MISC
200,Source,"[134, 723, 207, 742]",MISC
201,Control,"[208, 723, 293, 742]",MISC
202,Too,"[294, 723, 355, 742]",MISC
203,##l,"[294, 723, 355, 742]",MISC
204,:,"[294, 723, 355, 742]",MISC
205,-,"[356, 723, 358, 742]",MISC
206,NL,"[356, 723, 358, 742]",MISC
207,-,"[356, 723, 358, 742]",MISC
208,Tor,"[155, 744, 244, 762]",MISC
209,##to,"[155, 744, 244, 762]",MISC
210,##ise,"[155, 744, 244, 762]",MISC
211,SV,"[246, 744, 279, 762]",MISC
212,##N,"[246, 744, 279, 762]",MISC
213,-,"[280, 744, 282, 762]",MISC
214,NL,"[280, 744, 282, 762]",MISC
215,-,"[280, 744, 282, 762]",MISC
216,Operating,"[134, 782, 244, 802]",MISC
217,System,"[245, 782, 331, 802]",MISC
218,:,"[245, 782, 331, 802]",MISC
219,-,"[332, 782, 333, 802]",MISC
220,NL,"[332, 782, 333, 802]",MISC
221,-,"[332, 782, 333, 802]",MISC
222,Windows,"[155, 802, 233, 822]",MISC
223,7,"[234, 802, 290, 822]",MISC
224,/,"[234, 802, 290, 822]",MISC
225,10,"[234, 802, 290, 822]",MISC
226,.,"[234, 802, 290, 822]",MISC
227,-,"[291, 802, 293, 822]",MISC
228,NL,"[291, 802, 293, 822]",MISC
229,-,"[291, 802, 293, 822]",MISC
230,Data,"[135, 840, 187, 860]",MISC
231,Base,"[187, 840, 252, 860]",MISC
232,:,"[187, 840, 252, 860]",MISC
233,S,"[252, 840, 291, 860]",MISC
234,##QL,"[252, 840, 291, 860]",MISC
235,Server,"[291, 840, 369, 860]",MISC
236,-,"[369, 840, 371, 860]",MISC
237,NL,"[369, 840, 371, 860]",MISC
238,-,"[369, 840, 371, 860]",MISC
239,2008,"[155, 860, 200, 880]",MISC
240,-,"[200, 860, 202, 880]",MISC
241,NL,"[200, 860, 202, 880]",MISC
242,-,"[200, 860, 202, 880]",MISC
243,Personal,"[89, 914, 176, 936]",B-personal_details_heading
244,Det,"[176, 914, 263, 936]",I-personal_details_heading
245,##ails,"[176, 914, 263, 936]",I-personal_details_heading
246,:,"[176, 914, 263, 936]",I-personal_details_heading
247,-,"[263, 914, 265, 936]",MISC
248,NL,"[263, 914, 265, 936]",MISC
249,-,"[263, 914, 265, 936]",MISC
250,D,"[89, 936, 144, 955]",MISC
251,.,"[89, 936, 144, 955]",MISC
252,O,"[89, 936, 144, 955]",MISC
253,.,"[89, 936, 144, 955]",MISC
254,B,"[89, 936, 144, 955]",MISC
255,:,"[146, 936, 272, 955]",MISC
256,11,"[146, 936, 272, 955]",MISC
257,/,"[146, 936, 272, 955]",MISC
258,04,"[146, 936, 272, 955]",MISC
259,/,"[146, 936, 272, 955]",MISC
260,1991,"[146, 936, 272, 955]",MISC
261,-,"[272, 936, 274, 955]",MISC
262,NL,"[272, 936, 274, 955]",MISC
263,-,"[272, 936, 274, 955]",MISC
264,Language,"[89, 955, 191, 974]",B-skills_heading
265,Known,"[191, 955, 254, 974]",I-skills_heading
266,:,"[256, 955, 267, 974]",I-skills_heading
267,-,"[269, 955, 270, 974]",MISC
268,NL,"[269, 955, 270, 974]",MISC
269,-,"[269, 955, 270, 974]",MISC
270,Hindi,"[89, 975, 269, 994]",MISC
271,",","[89, 975, 269, 994]",MISC
272,English,"[89, 975, 269, 994]",MISC
273,",","[89, 975, 269, 994]",MISC
274,Or,"[89, 975, 269, 994]",MISC
275,##iya,"[89, 975, 269, 994]",MISC
276,-,"[269, 975, 270, 994]",MISC
277,NL,"[269, 975, 270, 994]",MISC
278,-,"[269, 975, 270, 994]",MISC
279,Guru,"[547, 102, 779, 137]",B-name
280,##kal,"[547, 102, 779, 137]",I-name
281,##yan,"[547, 102, 779, 137]",I-name
282,pan,"[779, 102, 987, 137]",I-name
283,##ig,"[779, 102, 987, 137]",I-name
284,##rah,"[779, 102, 987, 137]",I-name
285,##i,"[779, 102, 987, 137]",I-name
286,-,"[988, 102, 990, 137]",MISC
287,NL,"[988, 102, 990, 137]",MISC
288,-,"[988, 102, 990, 137]",MISC
289,Software,"[458, 163, 593, 180]",B-employer_role
290,Dev,"[594, 163, 746, 180]",I-employer_role
291,##elo,"[594, 163, 746, 180]",I-employer_role
292,##per,"[594, 163, 746, 180]",I-employer_role
293,-,"[747, 163, 749, 180]",MISC
294,NL,"[747, 163, 749, 180]",MISC
295,-,"[747, 163, 749, 180]",MISC
296,Career,"[474, 218, 549, 238]",B-summary_heading
297,O,"[550, 218, 674, 238]",I-summary_heading
298,##bject,"[550, 218, 674, 238]",I-summary_heading
299,##ive,"[550, 218, 674, 238]",I-summary_heading
300,:,"[550, 218, 674, 238]",I-summary_heading
301,-,"[675, 218, 677, 238]",MISC
302,NL,"[675, 218, 677, 238]",MISC
303,-,"[675, 218, 677, 238]",MISC
304,See,"[541, 269, 619, 288]",MISC
305,##king,"[541, 269, 619, 288]",MISC
306,new,"[619, 269, 653, 288]",MISC
307,challenging,"[653, 269, 775, 288]",MISC
308,job,"[776, 269, 809, 288]",MISC
309,which,"[809, 269, 865, 288]",MISC
310,is,"[865, 269, 888, 288]",MISC
311,parallel,"[888, 269, 977, 288]",MISC
312,to,"[977, 269, 999, 288]",MISC
313,-,"[1000, 269, 1001, 288]",MISC
314,NL,"[1000, 269, 1001, 288]",MISC
315,-,"[1000, 269, 1001, 288]",MISC
316,my,"[474, 288, 497, 308]",MISC
317,professional,"[497, 288, 630, 308]",MISC
318,experience,"[631, 288, 742, 308]",MISC
319,and,"[743, 288, 776, 308]",MISC
320,abilities,"[776, 288, 887, 308]",MISC
321,.,"[776, 288, 887, 308]",MISC
322,Be,"[888, 288, 910, 308]",MISC
323,one,"[910, 288, 944, 308]",MISC
324,of,"[944, 288, 966, 308]",MISC
325,the,"[966, 288, 999, 308]",MISC
326,-,"[1000, 288, 1001, 308]",MISC
327,NL,"[1000, 288, 1001, 308]",MISC
328,-,"[1000, 288, 1001, 308]",MISC
329,key,"[474, 308, 508, 326]",MISC
330,to,"[509, 308, 532, 326]",MISC
331,the,"[533, 308, 566, 326]",MISC
332,company,"[568, 308, 672, 326]",MISC
333,’,"[568, 308, 672, 326]",MISC
334,s,"[568, 308, 672, 326]",MISC
335,vision,"[673, 308, 741, 326]",MISC
336,into,"[743, 308, 789, 326]",MISC
337,realization,"[789, 308, 917, 326]",MISC
338,through,"[918, 308, 999, 326]",MISC
339,-,"[1000, 308, 1001, 326]",MISC
340,NL,"[1000, 308, 1001, 326]",MISC
341,-,"[1000, 308, 1001, 326]",MISC
342,strong,"[474, 328, 536, 346]",MISC
343,dedication,"[537, 328, 652, 346]",MISC
344,",","[537, 328, 652, 346]",MISC
345,hard,"[653, 328, 694, 346]",MISC
346,work,"[695, 328, 736, 346]",MISC
347,and,"[737, 328, 767, 346]",MISC
348,good,"[768, 328, 809, 346]",MISC
349,leadership,"[810, 328, 914, 346]",MISC
350,skills,"[915, 328, 977, 346]",MISC
351,to,"[978, 328, 999, 346]",MISC
352,-,"[1000, 328, 1001, 346]",MISC
353,NL,"[1000, 328, 1001, 346]",MISC
354,-,"[1000, 328, 1001, 346]",MISC
355,enable,"[474, 348, 534, 366]",MISC
356,the,"[534, 348, 564, 366]",MISC
357,organization,"[564, 348, 682, 366]",MISC
358,to,"[682, 348, 701, 366]",MISC
359,deliver,"[702, 348, 771, 366]",MISC
360,strategic,"[772, 348, 861, 366]",MISC
361,new,"[861, 348, 890, 366]",MISC
362,initiatives,"[891, 348, 998, 366]",MISC
363,-,"[1000, 348, 1001, 366]",MISC
364,NL,"[1000, 348, 1001, 366]",MISC
365,-,"[1000, 348, 1001, 366]",MISC
366,on,"[474, 367, 495, 386]",MISC
367,time,"[495, 367, 545, 386]",MISC
368,.,"[495, 367, 545, 386]",MISC
369,-,"[547, 367, 549, 386]",MISC
370,NL,"[547, 367, 549, 386]",MISC
371,-,"[547, 367, 549, 386]",MISC
372,Professional,"[467, 409, 623, 428]",B-summary_heading
373,Su,"[623, 409, 727, 428]",I-summary_heading
374,##mma,"[623, 409, 727, 428]",I-summary_heading
375,##ry,"[623, 409, 727, 428]",I-summary_heading
376,:,"[623, 409, 727, 428]",I-summary_heading
377,-,"[727, 409, 729, 428]",MISC
378,NL,"[727, 409, 729, 428]",MISC
379,-,"[727, 409, 729, 428]",MISC
380,3,"[471, 443, 560, 458]",MISC
381,+,"[471, 443, 560, 458]",MISC
382,Years,"[471, 443, 560, 458]",MISC
383,of,"[561, 443, 585, 458]",MISC
384,Development,"[587, 443, 728, 458]",MISC
385,experience,"[728, 443, 856, 458]",MISC
386,in,"[857, 443, 881, 458]",MISC
387,C,"[883, 443, 933, 458]",MISC
388,",","[883, 443, 933, 458]",MISC
389,C,"[883, 443, 933, 458]",MISC
390,+,"[883, 443, 933, 458]",MISC
391,-,"[935, 443, 936, 458]",MISC
392,NL,"[935, 443, 936, 458]",MISC
393,-,"[935, 443, 936, 458]",MISC
394,+,"[491, 461, 595, 481]",MISC
395,",","[491, 461, 595, 481]",MISC
396,Visual,"[491, 461, 595, 481]",MISC
397,C,"[597, 461, 649, 481]",MISC
398,+,"[597, 461, 649, 481]",MISC
399,+,"[597, 461, 649, 481]",MISC
400,",","[597, 461, 649, 481]",MISC
401,W,"[650, 461, 728, 481]",MISC
402,##IN,"[650, 461, 728, 481]",MISC
403,##32,"[650, 461, 728, 481]",MISC
404,",","[650, 461, 728, 481]",MISC
405,M,"[729, 461, 781, 481]",MISC
406,##FC,"[729, 461, 781, 481]",MISC
407,",","[729, 461, 781, 481]",MISC
408,ST,"[782, 461, 834, 481]",MISC
409,##L,"[782, 461, 834, 481]",MISC
410,",","[782, 461, 834, 481]",MISC
411,CO,"[834, 461, 886, 481]",MISC
412,##M,"[834, 461, 886, 481]",MISC
413,",","[834, 461, 886, 481]",MISC
414,DL,"[887, 461, 939, 481]",MISC
415,##L,"[887, 461, 939, 481]",MISC
416,",","[887, 461, 939, 481]",MISC
417,-,"[940, 461, 942, 481]",MISC
418,NL,"[940, 461, 942, 481]",MISC
419,-,"[940, 461, 942, 481]",MISC
420,So,"[491, 484, 560, 502]",MISC
421,##cket,"[491, 484, 560, 502]",MISC
422,Programming,"[561, 484, 687, 502]",MISC
423,based,"[689, 484, 746, 502]",MISC
424,Software,"[747, 484, 840, 502]",MISC
425,Development,"[840, 484, 979, 502]",MISC
426,.,"[840, 484, 979, 502]",MISC
427,-,"[979, 484, 981, 502]",MISC
428,NL,"[979, 484, 981, 502]",MISC
429,-,"[979, 484, 981, 502]",MISC
430,Used,"[470, 529, 518, 546]",MISC
431,O,"[520, 529, 594, 546]",MISC
432,##bject,"[520, 529, 594, 546]",MISC
433,Orient,"[594, 529, 692, 546]",MISC
434,##ed,"[594, 529, 692, 546]",MISC
435,Programming,"[693, 529, 829, 546]",MISC
436,Concept,"[830, 529, 928, 546]",MISC
437,##s,"[830, 529, 928, 546]",MISC
438,-,"[929, 529, 931, 546]",MISC
439,NL,"[929, 529, 931, 546]",MISC
440,-,"[929, 529, 931, 546]",MISC
441,(,"[491, 545, 627, 566]",MISC
442,A,"[491, 545, 627, 566]",MISC
443,##bs,"[491, 545, 627, 566]",MISC
444,##traction,"[491, 545, 627, 566]",MISC
445,",","[491, 545, 627, 566]",MISC
446,En,"[627, 545, 772, 566]",MISC
447,##cap,"[627, 545, 772, 566]",MISC
448,##sul,"[627, 545, 772, 566]",MISC
449,##ation,"[627, 545, 772, 566]",MISC
450,",","[627, 545, 772, 566]",MISC
451,In,"[773, 545, 887, 566]",MISC
452,##her,"[773, 545, 887, 566]",MISC
453,##ita,"[773, 545, 887, 566]",MISC
454,##nce,"[773, 545, 887, 566]",MISC
455,and,"[888, 545, 918, 566]",MISC
456,-,"[920, 545, 922, 566]",MISC
457,NL,"[920, 545, 922, 566]",MISC
458,-,"[920, 545, 922, 566]",MISC
459,Pol,"[491, 565, 643, 585]",MISC
460,##ym,"[491, 565, 643, 585]",MISC
461,##or,"[491, 565, 643, 585]",MISC
462,##phism,"[491, 565, 643, 585]",MISC
463,),"[491, 565, 643, 585]",MISC
464,.,"[491, 565, 643, 585]",MISC
465,-,"[643, 565, 645, 585]",MISC
466,NL,"[643, 565, 645, 585]",MISC
467,-,"[643, 565, 645, 585]",MISC
468,Technical,"[470, 609, 582, 625]",MISC
469,Concept,"[582, 609, 681, 625]",MISC
470,##s,"[582, 609, 681, 625]",MISC
471,of,"[682, 609, 706, 625]",MISC
472,C,"[707, 609, 744, 625]",MISC
473,+,"[707, 609, 744, 625]",MISC
474,+,"[707, 609, 744, 625]",MISC
475,as,"[744, 609, 768, 625]",MISC
476,Type,"[769, 609, 817, 625]",MISC
477,Cast,"[819, 609, 917, 625]",MISC
478,##ing,"[819, 609, 917, 625]",MISC
479,",","[819, 609, 917, 625]",MISC
480,Smart,"[919, 609, 980, 625]",MISC
481,-,"[981, 609, 983, 625]",MISC
482,NL,"[981, 609, 983, 625]",MISC
483,-,"[981, 609, 983, 625]",MISC
484,Point,"[491, 627, 588, 644]",MISC
485,##ers,"[491, 627, 588, 644]",MISC
486,",","[491, 627, 588, 644]",MISC
487,Point,"[588, 627, 716, 644]",MISC
488,##ers,"[588, 627, 716, 644]",MISC
489,/,"[588, 627, 716, 644]",MISC
490,Re,"[588, 627, 716, 644]",MISC
491,##f,"[588, 627, 716, 644]",MISC
492,type,"[718, 627, 772, 644]",MISC
493,",","[718, 627, 772, 644]",MISC
494,Deep,"[772, 627, 815, 644]",MISC
495,Co,"[815, 627, 901, 644]",MISC
496,##py,"[815, 627, 901, 644]",MISC
497,##ing,"[815, 627, 901, 644]",MISC
498,",","[815, 627, 901, 644]",MISC
499,Shall,"[902, 627, 976, 644]",MISC
500,##ow,"[902, 627, 976, 644]",MISC
501,-,"[977, 627, 979, 644]",MISC
502,NL,"[977, 627, 979, 644]",MISC
503,-,"[977, 627, 979, 644]",MISC
504,Co,"[491, 644, 576, 664]",MISC
505,##py,"[491, 644, 576, 664]",MISC
506,##ing,"[491, 644, 576, 664]",MISC
507,",","[491, 644, 576, 664]",MISC
508,Virtual,"[577, 644, 651, 664]",MISC
509,Des,"[652, 644, 780, 664]",MISC
510,##truct,"[652, 644, 780, 664]",MISC
511,##ors,"[652, 644, 780, 664]",MISC
512,",","[652, 644, 780, 664]",MISC
513,Mu,"[781, 644, 866, 664]",MISC
514,##table,"[781, 644, 866, 664]",MISC
515,",","[781, 644, 866, 664]",MISC
516,Con,"[867, 644, 930, 664]",MISC
517,##st,"[867, 644, 930, 664]",MISC
518,",","[867, 644, 930, 664]",MISC
519,-,"[931, 644, 933, 664]",MISC
520,NL,"[931, 644, 933, 664]",MISC
521,-,"[931, 644, 933, 664]",MISC
522,Vol,"[491, 666, 582, 683]",MISC
523,##ati,"[491, 666, 582, 683]",MISC
524,##le,"[491, 666, 582, 683]",MISC
525,and,"[583, 666, 616, 683]",MISC
526,Auto,"[617, 666, 662, 683]",MISC
527,Key,"[663, 666, 765, 683]",MISC
528,##words,"[663, 666, 765, 683]",MISC
529,.,"[663, 666, 765, 683]",MISC
530,-,"[766, 666, 768, 683]",MISC
531,NL,"[766, 666, 768, 683]",MISC
532,-,"[766, 666, 768, 683]",MISC
533,Work,"[470, 707, 542, 723]",MISC
534,##ed,"[470, 707, 542, 723]",MISC
535,on,"[543, 707, 567, 723]",MISC
536,Mo,"[567, 707, 736, 723]",MISC
537,##dal,"[567, 707, 736, 723]",MISC
538,/,"[567, 707, 736, 723]",MISC
539,Model,"[567, 707, 736, 723]",MISC
540,##ess,"[567, 707, 736, 723]",MISC
541,Di,"[737, 707, 810, 723]",MISC
542,##alog,"[737, 707, 810, 723]",MISC
543,boxes,"[810, 707, 869, 723]",MISC
544,creation,"[871, 707, 967, 723]",MISC
545,-,"[968, 707, 970, 723]",MISC
546,NL,"[968, 707, 970, 723]",MISC
547,-,"[968, 707, 970, 723]",MISC
548,Using,"[491, 723, 556, 742]",MISC
549,Win,"[556, 723, 660, 742]",MISC
550,##32,"[556, 723, 660, 742]",MISC
551,##AP,"[556, 723, 660, 742]",MISC
552,##I,"[556, 723, 660, 742]",MISC
553,and,"[660, 723, 699, 742]",MISC
554,M,"[699, 723, 751, 742]",MISC
555,##FC,"[699, 723, 751, 742]",MISC
556,.,"[699, 723, 751, 742]",MISC
557,-,"[751, 723, 753, 742]",MISC
558,NL,"[751, 723, 753, 742]",MISC
559,-,"[751, 723, 753, 742]",MISC
560,Good,"[469, 765, 516, 781]",MISC
561,knowledge,"[516, 765, 620, 781]",MISC
562,on,"[622, 765, 644, 781]",MISC
563,DL,"[645, 765, 749, 781]",MISC
564,##L,"[645, 765, 749, 781]",MISC
565,’,"[645, 765, 749, 781]",MISC
566,s,"[645, 765, 749, 781]",MISC
567,##like,"[645, 765, 749, 781]",MISC
568,regular,"[750, 765, 843, 781]",MISC
569,",","[750, 765, 843, 781]",MISC
570,Extension,"[844, 765, 948, 781]",MISC
571,-,"[949, 765, 951, 781]",MISC
572,NL,"[949, 765, 951, 781]",MISC
573,-,"[949, 765, 951, 781]",MISC
574,DL,"[491, 782, 543, 801]",MISC
575,##L,"[491, 782, 543, 801]",MISC
576,’,"[491, 782, 543, 801]",MISC
577,s,"[491, 782, 543, 801]",MISC
578,and,"[545, 782, 576, 801]",MISC
579,I,"[577, 782, 759, 801]",MISC
580,##mp,"[577, 782, 759, 801]",MISC
581,##licit,"[577, 782, 759, 801]",MISC
582,/,"[577, 782, 759, 801]",MISC
583,Ex,"[577, 782, 759, 801]",MISC
584,##p,"[577, 782, 759, 801]",MISC
585,##licit,"[577, 782, 759, 801]",MISC
586,linking,"[759, 782, 833, 801]",MISC
587,of,"[834, 782, 854, 801]",MISC
588,DL,"[855, 782, 919, 801]",MISC
589,##L,"[855, 782, 919, 801]",MISC
590,’,"[855, 782, 919, 801]",MISC
591,s,"[855, 782, 919, 801]",MISC
592,.,"[855, 782, 919, 801]",MISC
593,-,"[920, 782, 922, 801]",MISC
594,NL,"[920, 782, 922, 801]",MISC
595,-,"[920, 782, 922, 801]",MISC
596,Work,"[471, 825, 549, 840]",MISC
597,##ed,"[471, 825, 549, 840]",MISC
598,on,"[550, 825, 576, 840]",MISC
599,VC,"[577, 825, 629, 840]",MISC
600,+,"[577, 825, 629, 840]",MISC
601,+,"[577, 825, 629, 840]",MISC
602,and,"[630, 825, 669, 840]",MISC
603,M,"[670, 825, 709, 840]",MISC
604,##FC,"[670, 825, 709, 840]",MISC
605,designed,"[709, 825, 815, 840]",MISC
606,on,"[815, 825, 841, 840]",MISC
607,basis,"[842, 825, 907, 840]",MISC
608,of,"[908, 825, 934, 840]",MISC
609,-,"[935, 825, 936, 840]",MISC
610,NL,"[935, 825, 936, 840]",MISC
611,-,"[935, 825, 936, 840]",MISC
612,Doc,"[491, 840, 632, 860]",MISC
613,##ume,"[491, 840, 632, 860]",MISC
614,##nt,"[491, 840, 632, 860]",MISC
615,/,"[491, 840, 632, 860]",MISC
616,View,"[491, 840, 632, 860]",MISC
617,Architecture,"[634, 840, 864, 860]",MISC
618,(,"[634, 840, 864, 860]",MISC
619,SD,"[634, 840, 864, 860]",MISC
620,##I,"[634, 840, 864, 860]",MISC
621,/,"[634, 840, 864, 860]",MISC
622,MD,"[634, 840, 864, 860]",MISC
623,##I,"[634, 840, 864, 860]",MISC
624,),"[634, 840, 864, 860]",MISC
625,Of,"[864, 840, 885, 860]",MISC
626,-,"[886, 840, 888, 860]",MISC
627,NL,"[886, 840, 888, 860]",MISC
628,-,"[886, 840, 888, 860]",MISC
629,M,"[491, 860, 645, 879]",MISC
630,##FC,"[491, 860, 645, 879]",MISC
631,##F,"[491, 860, 645, 879]",MISC
632,##ram,"[491, 860, 645, 879]",MISC
633,##ew,"[491, 860, 645, 879]",MISC
634,##or,"[491, 860, 645, 879]",MISC
635,##k,"[491, 860, 645, 879]",MISC
636,.,"[491, 860, 645, 879]",MISC
637,-,"[645, 860, 647, 879]",MISC
638,NL,"[645, 860, 647, 879]",MISC
639,-,"[645, 860, 647, 879]",MISC
640,Having,"[470, 906, 547, 921]",MISC
641,good,"[547, 906, 597, 921]",MISC
642,knowledge,"[597, 906, 710, 921]",MISC
643,on,"[711, 906, 735, 921]",MISC
644,Co,"[737, 906, 850, 921]",MISC
645,##mpo,"[737, 906, 850, 921]",MISC
646,##nent,"[737, 906, 850, 921]",MISC
647,O,"[851, 906, 927, 921]",MISC
648,##bject,"[851, 906, 927, 921]",MISC
649,Model,"[927, 906, 990, 921]",MISC
650,-,"[990, 906, 992, 921]",MISC
651,NL,"[990, 906, 992, 921]",MISC
652,-,"[990, 906, 992, 921]",MISC
653,(,"[491, 921, 562, 941]",MISC
654,CO,"[491, 921, 562, 941]",MISC
655,##M,"[491, 921, 562, 941]",MISC
656,),"[491, 921, 562, 941]",MISC
657,.,"[491, 921, 562, 941]",MISC
658,-,"[562, 921, 564, 941]",MISC
659,NL,"[562, 921, 564, 941]",MISC
660,-,"[562, 921, 564, 941]",MISC
661,Good,"[470, 964, 518, 980]",MISC
662,knowledge,"[518, 964, 626, 980]",MISC
663,on,"[628, 964, 652, 980]",MISC
664,Worker,"[652, 964, 724, 980]",MISC
665,T,"[725, 964, 808, 980]",MISC
666,##hr,"[725, 964, 808, 980]",MISC
667,##ead,"[725, 964, 808, 980]",MISC
668,",","[725, 964, 808, 980]",MISC
669,Use,"[810, 964, 858, 980]",MISC
670,##r,"[810, 964, 858, 980]",MISC
671,Inter,"[859, 964, 966, 980]",MISC
672,##face,"[859, 964, 966, 980]",MISC
673,-,"[968, 964, 970, 980]",MISC
674,NL,"[968, 964, 970, 980]",MISC
675,-,"[968, 964, 970, 980]",MISC
676,T,"[491, 981, 556, 1000]",MISC
677,##hr,"[491, 981, 556, 1000]",MISC
678,##ead,"[491, 981, 556, 1000]",MISC
679,and,"[557, 981, 589, 1000]",MISC
680,S,"[590, 981, 755, 1000]",MISC
681,##ync,"[590, 981, 755, 1000]",MISC
682,##hr,"[590, 981, 755, 1000]",MISC
683,##oni,"[590, 981, 755, 1000]",MISC
684,##zation,"[590, 981, 755, 1000]",MISC
685,O,"[756, 981, 843, 1000]",MISC
686,##bject,"[756, 981, 843, 1000]",MISC
687,##s,"[756, 981, 843, 1000]",MISC
688,.,"[756, 981, 843, 1000]",MISC
689,-,"[844, 981, 846, 1000]",MISC
690,NL,"[844, 981, 846, 1000]",MISC
691,-,"[844, 981, 846, 1000]",MISC
692,Good,"[133, 102, 191, 120]",MISC
693,Understanding,"[191, 102, 341, 120]",MISC
694,in,"[341, 102, 364, 120]",MISC
695,So,"[365, 102, 433, 120]",MISC
696,##cket,"[365, 102, 433, 120]",MISC
697,Programming,"[434, 102, 571, 120]",MISC
698,.,"[434, 102, 571, 120]",MISC
699,-,"[573, 102, 575, 120]",MISC
700,NL,"[573, 102, 575, 120]",MISC
701,-,"[573, 102, 575, 120]",MISC
702,Dev,"[133, 142, 241, 160]",MISC
703,##elo,"[133, 142, 241, 160]",MISC
704,##ped,"[133, 142, 241, 160]",MISC
705,template,"[242, 142, 338, 160]",MISC
706,##s,"[242, 142, 338, 160]",MISC
707,classes,"[340, 142, 416, 160]",MISC
708,using,"[416, 142, 470, 160]",MISC
709,Standard,"[470, 142, 556, 160]",MISC
710,Te,"[558, 142, 786, 160]",MISC
711,##mp,"[558, 142, 786, 160]",MISC
712,##late,"[558, 142, 786, 160]",MISC
713,##L,"[558, 142, 786, 160]",MISC
714,##ib,"[558, 142, 786, 160]",MISC
715,##rary,"[558, 142, 786, 160]",MISC
716,(,"[558, 142, 786, 160]",MISC
717,ST,"[558, 142, 786, 160]",MISC
718,##L,"[558, 142, 786, 160]",MISC
719,),"[558, 142, 786, 160]",MISC
720,.,"[558, 142, 786, 160]",MISC
721,-,"[786, 142, 788, 160]",MISC
722,NL,"[786, 142, 788, 160]",MISC
723,-,"[786, 142, 788, 160]",MISC
724,Knowledge,"[133, 180, 294, 200]",MISC
725,##able,"[133, 180, 294, 200]",MISC
726,in,"[295, 180, 317, 200]",MISC
727,Control,"[318, 180, 409, 200]",MISC
728,##s,"[318, 180, 409, 200]",MISC
729,Custom,"[411, 180, 561, 200]",MISC
730,##ization,"[411, 180, 561, 200]",MISC
731,on,"[561, 180, 583, 200]",MISC
732,M,"[584, 180, 618, 200]",MISC
733,##FC,"[584, 180, 618, 200]",MISC
734,Control,"[619, 180, 723, 200]",MISC
735,##s,"[619, 180, 723, 200]",MISC
736,.,"[619, 180, 723, 200]",MISC
737,-,"[723, 180, 725, 200]",MISC
738,NL,"[723, 180, 725, 200]",MISC
739,-,"[723, 180, 725, 200]",MISC
740,Academic,"[133, 218, 231, 240]",B-education_heading
741,Profile,"[232, 218, 331, 240]",I-education_heading
742,:,"[232, 218, 331, 240]",I-education_heading
743,-,"[332, 218, 333, 240]",MISC
744,NL,"[332, 218, 333, 240]",MISC
745,-,"[332, 218, 333, 240]",MISC
746,B,"[133, 248, 300, 267]",B-education_degree
747,.,"[133, 248, 300, 267]",I-education_degree
748,Tech,"[133, 248, 300, 267]",I-education_degree
749,(,"[133, 248, 300, 267]",MISC
750,E,"[133, 248, 300, 267]",B-education_course
751,##EE,"[133, 248, 300, 267]",I-education_course
752,),"[133, 248, 300, 267]",MISC
753,:,"[133, 248, 300, 267]",MISC
754,From,"[301, 248, 351, 267]",MISC
755,Oxford,"[353, 248, 429, 267]",MISC
756,College,"[430, 248, 520, 267]",MISC
757,Of,"[521, 248, 545, 267]",MISC
758,En,"[547, 248, 688, 267]",MISC
759,##gee,"[547, 248, 688, 267]",MISC
760,##ner,"[547, 248, 688, 267]",MISC
761,##ing,"[547, 248, 688, 267]",MISC
762,BP,"[689, 248, 739, 267]",MISC
763,##UT,"[689, 248, 739, 267]",MISC
764,with,"[741, 248, 791, 267]",MISC
765,80,"[793, 248, 869, 267]",MISC
766,.,"[793, 248, 869, 267]",MISC
767,04,"[793, 248, 869, 267]",MISC
768,%,"[793, 248, 869, 267]",MISC
769,of,"[870, 248, 894, 267]",MISC
770,marks,"[896, 248, 959, 267]",MISC
771,in,"[961, 248, 985, 267]",MISC
772,-,"[987, 248, 988, 267]",MISC
773,NL,"[987, 248, 988, 267]",MISC
774,-,"[987, 248, 988, 267]",MISC
775,2016,"[166, 267, 211, 286]",MISC
776,-,"[211, 267, 213, 286]",MISC
777,NL,"[211, 267, 213, 286]",MISC
778,-,"[211, 267, 213, 286]",MISC
779,Diploma,"[133, 286, 230, 305]",B-education_degree
780,(,"[230, 286, 386, 305]",MISC
781,Electrical,"[230, 286, 386, 305]",B-education_course
782,),"[230, 286, 386, 305]",MISC
783,:,"[230, 286, 386, 305]",MISC
784,From,"[388, 286, 436, 305]",MISC
785,DR,"[436, 286, 508, 305]",B-education_institute
786,##IE,"[436, 286, 508, 305]",I-education_institute
787,##MS,"[436, 286, 508, 305]",I-education_institute
788,of,"[509, 286, 533, 305]",I-education_institute
789,SC,"[533, 286, 616, 305]",I-education_institute
790,##TE,"[533, 286, 616, 305]",I-education_institute
791,&,"[533, 286, 616, 305]",I-education_institute
792,V,"[533, 286, 616, 305]",I-education_institute
793,##T,"[533, 286, 616, 305]",I-education_institute
794,with,"[618, 286, 666, 305]",MISC
795,65,"[666, 286, 739, 305]",MISC
796,.,"[666, 286, 739, 305]",MISC
797,02,"[666, 286, 739, 305]",MISC
798,%,"[666, 286, 739, 305]",MISC
799,of,"[739, 286, 763, 305]",MISC
800,marks,"[763, 286, 823, 305]",MISC
801,in,"[824, 286, 848, 305]",MISC
802,2013,"[848, 286, 907, 305]",MISC
803,.,"[848, 286, 907, 305]",MISC
804,-,"[909, 286, 910, 305]",MISC
805,NL,"[909, 286, 910, 305]",MISC
806,-,"[909, 286, 910, 305]",MISC
807,I,"[133, 306, 389, 325]",B-education_degree
808,.,"[133, 306, 389, 325]",I-education_degree
809,T,"[133, 306, 389, 325]",I-education_degree
810,.,"[133, 306, 389, 325]",I-education_degree
811,I,"[133, 306, 389, 325]",I-education_degree
812,(,"[133, 306, 389, 325]",MISC
813,Electrical,"[133, 306, 389, 325]",B-education_course
814,),"[133, 306, 389, 325]",MISC
815,:,"[133, 306, 389, 325]",MISC
816,From,"[133, 306, 389, 325]",MISC
817,B,"[389, 306, 467, 325]",MISC
818,.,"[389, 306, 467, 325]",MISC
819,I,"[389, 306, 467, 325]",MISC
820,.,"[389, 306, 467, 325]",MISC
821,T,"[389, 306, 467, 325]",MISC
822,.,"[389, 306, 467, 325]",MISC
823,C,"[389, 306, 467, 325]",MISC
824,of,"[467, 306, 489, 325]",MISC
825,SC,"[489, 306, 556, 325]",MISC
826,##TE,"[489, 306, 556, 325]",MISC
827,##V,"[489, 306, 556, 325]",MISC
828,##T,"[489, 306, 556, 325]",MISC
829,with,"[556, 306, 601, 325]",MISC
830,80,"[601, 306, 667, 325]",MISC
831,.,"[601, 306, 667, 325]",MISC
832,02,"[601, 306, 667, 325]",MISC
833,%,"[601, 306, 667, 325]",MISC
834,of,"[667, 306, 690, 325]",MISC
835,marks,"[690, 306, 745, 325]",MISC
836,in,"[745, 306, 768, 325]",MISC
837,2010,"[768, 306, 823, 325]",MISC
838,.,"[768, 306, 823, 325]",MISC
839,-,"[823, 306, 825, 325]",MISC
840,NL,"[823, 306, 825, 325]",MISC
841,-,"[823, 306, 825, 325]",MISC
842,Work,"[133, 365, 187, 387]",B-work_experience_heading
843,Experience,"[187, 365, 334, 387]",I-work_experience_heading
844,:,"[187, 365, 334, 387]",I-work_experience_heading
845,-,"[335, 365, 337, 387]",MISC
846,NL,"[335, 365, 337, 387]",MISC
847,-,"[335, 365, 337, 387]",MISC
848,A,"[133, 394, 187, 414]",B-employer_company_name
849,.,"[133, 394, 187, 414]",I-employer_company_name
850,D,"[133, 394, 187, 414]",I-employer_company_name
851,.,"[133, 394, 187, 414]",I-employer_company_name
852,S,"[133, 394, 187, 414]",I-employer_company_name
853,Sol,"[188, 394, 275, 414]",I-employer_company_name
854,##ution,"[188, 394, 275, 414]",I-employer_company_name
855,Private,"[276, 394, 352, 414]",I-employer_company_name
856,Limited,"[353, 394, 550, 414]",I-employer_company_name
857,(,"[353, 394, 550, 414]",MISC
858,Bangalore,"[353, 394, 550, 414]",MISC
859,),"[353, 394, 550, 414]",MISC
860,Software,"[551, 394, 639, 414]",B-employer_role
861,Dev,"[639, 394, 749, 414]",I-employer_role
862,##elo,"[639, 394, 749, 414]",I-employer_role
863,##per,"[639, 394, 749, 414]",I-employer_role
864,",","[639, 394, 749, 414]",MISC
865,June,"[749, 394, 792, 414]",MISC
866,2016,"[793, 394, 836, 414]",MISC
867,–,"[837, 394, 847, 414]",MISC
868,Till,"[848, 394, 891, 414]",MISC
869,date,"[893, 394, 946, 414]",MISC
870,.,"[893, 394, 946, 414]",MISC
871,-,"[948, 394, 949, 414]",MISC
872,NL,"[948, 394, 949, 414]",MISC
873,-,"[948, 394, 949, 414]",MISC
874,Project,"[133, 434, 215, 457]",MISC
875,Det,"[215, 434, 308, 457]",MISC
876,##ails,"[215, 434, 308, 457]",MISC
877,:,"[215, 434, 308, 457]",MISC
878,-,"[309, 434, 311, 457]",MISC
879,NL,"[309, 434, 311, 457]",MISC
880,-,"[309, 434, 311, 457]",MISC
881,.,"[118, 464, 124, 482]",MISC
882,-,"[124, 464, 126, 482]",MISC
883,NL,"[124, 464, 126, 482]",MISC
884,-,"[124, 464, 126, 482]",MISC
885,Project,"[129, 484, 209, 502]",MISC
886,Name,"[209, 484, 265, 502]",MISC
887,:,"[209, 484, 265, 502]",MISC
888,-,"[267, 484, 269, 502]",MISC
889,NL,"[267, 484, 269, 502]",MISC
890,-,"[267, 484, 269, 502]",MISC
891,Al,"[569, 484, 651, 502]",MISC
892,##ad,"[569, 484, 651, 502]",MISC
893,##din,"[569, 484, 651, 502]",MISC
894,##®,"[569, 484, 651, 502]",MISC
895,Enterprise,"[651, 484, 753, 502]",MISC
896,Investment,"[753, 484, 865, 502]",MISC
897,.,"[753, 484, 865, 502]",MISC
898,-,"[866, 484, 868, 502]",MISC
899,NL,"[866, 484, 868, 502]",MISC
900,-,"[866, 484, 868, 502]",MISC
901,Du,"[129, 504, 224, 524]",MISC
902,##ration,"[129, 504, 224, 524]",MISC
903,:,"[129, 504, 224, 524]",MISC
904,-,"[224, 504, 226, 524]",MISC
905,NL,"[224, 504, 226, 524]",MISC
906,-,"[224, 504, 226, 524]",MISC
907,August,"[569, 504, 632, 524]",MISC
908,2016,"[633, 504, 673, 524]",MISC
909,to,"[675, 504, 695, 524]",MISC
910,till,"[696, 504, 737, 524]",MISC
911,date,"[738, 504, 779, 524]",MISC
912,-,"[781, 504, 782, 524]",MISC
913,NL,"[781, 504, 782, 524]",MISC
914,-,"[781, 504, 782, 524]",MISC
915,Team,"[129, 525, 176, 544]",MISC
916,Si,"[176, 525, 234, 544]",MISC
917,##ze,"[176, 525, 234, 544]",MISC
918,:,"[176, 525, 234, 544]",MISC
919,-,"[235, 525, 237, 544]",MISC
920,NL,"[235, 525, 237, 544]",MISC
921,-,"[235, 525, 237, 544]",MISC
922,09,"[569, 525, 591, 544]",MISC
923,-,"[591, 525, 593, 544]",MISC
924,NL,"[591, 525, 593, 544]",MISC
925,-,"[591, 525, 593, 544]",MISC
926,C,"[129, 545, 187, 563]",MISC
927,##lient,"[129, 545, 187, 563]",MISC
928,-,"[187, 545, 189, 563]",MISC
929,NL,"[187, 545, 189, 563]",MISC
930,-,"[187, 545, 189, 563]",MISC
931,Black,"[569, 545, 675, 563]",MISC
932,##R,"[569, 545, 675, 563]",MISC
933,##ock,"[569, 545, 675, 563]",MISC
934,-,"[676, 545, 782, 563]",MISC
935,New,"[676, 545, 782, 563]",MISC
936,##Y,"[676, 545, 782, 563]",MISC
937,##or,"[676, 545, 782, 563]",MISC
938,##k,"[676, 545, 782, 563]",MISC
939,",","[676, 545, 782, 563]",MISC
940,USA,"[783, 545, 829, 563]",MISC
941,.,"[783, 545, 829, 563]",MISC
942,-,"[831, 545, 833, 563]",MISC
943,NL,"[831, 545, 833, 563]",MISC
944,-,"[831, 545, 833, 563]",MISC
945,Role,"[129, 565, 172, 583]",MISC
946,-,"[172, 565, 174, 583]",MISC
947,NL,"[172, 565, 174, 583]",MISC
948,-,"[172, 565, 174, 583]",MISC
949,Software,"[569, 565, 651, 583]",B-employer_role
950,Dev,"[652, 565, 754, 583]",I-employer_role
951,##elo,"[652, 565, 754, 583]",I-employer_role
952,##per,"[652, 565, 754, 583]",I-employer_role
953,.,"[652, 565, 754, 583]",MISC
954,-,"[755, 565, 756, 583]",MISC
955,NL,"[755, 565, 756, 583]",MISC
956,-,"[755, 565, 756, 583]",MISC
957,Environment,"[129, 585, 256, 605]",MISC
958,-,"[256, 585, 257, 605]",MISC
959,NL,"[256, 585, 257, 605]",MISC
960,-,"[256, 585, 257, 605]",MISC
961,C,"[569, 585, 647, 605]",MISC
962,/,"[569, 585, 647, 605]",MISC
963,C,"[569, 585, 647, 605]",MISC
964,+,"[569, 585, 647, 605]",MISC
965,+,"[569, 585, 647, 605]",MISC
966,",","[569, 585, 647, 605]",MISC
967,VC,"[648, 585, 713, 605]",MISC
968,+,"[648, 585, 713, 605]",MISC
969,+,"[648, 585, 713, 605]",MISC
970,",","[648, 585, 713, 605]",MISC
971,M,"[713, 585, 765, 605]",MISC
972,##FC,"[713, 585, 765, 605]",MISC
973,",","[713, 585, 765, 605]",MISC
974,CO,"[766, 585, 818, 605]",MISC
975,##M,"[766, 585, 818, 605]",MISC
976,",","[766, 585, 818, 605]",MISC
977,W,"[818, 585, 935, 605]",MISC
978,##IN,"[818, 585, 935, 605]",MISC
979,##32,"[818, 585, 935, 605]",MISC
980,##AP,"[818, 585, 935, 605]",MISC
981,##I,"[818, 585, 935, 605]",MISC
982,",","[818, 585, 935, 605]",MISC
983,ST,"[936, 585, 988, 605]",MISC
984,##L,"[936, 585, 988, 605]",MISC
985,",","[936, 585, 988, 605]",MISC
986,-,"[988, 585, 990, 605]",MISC
987,NL,"[988, 585, 990, 605]",MISC
988,-,"[988, 585, 990, 605]",MISC
989,DL,"[569, 607, 634, 627]",MISC
990,##L,"[569, 607, 634, 627]",MISC
991,’,"[569, 607, 634, 627]",MISC
992,s,"[569, 607, 634, 627]",MISC
993,",","[569, 607, 634, 627]",MISC
994,-,"[634, 607, 636, 627]",MISC
995,NL,"[634, 607, 636, 627]",MISC
996,-,"[634, 607, 636, 627]",MISC
997,So,"[580, 630, 640, 649]",MISC
998,##cket,"[580, 630, 640, 649]",MISC
999,Programming,"[641, 630, 762, 649]",MISC
1000,",","[641, 630, 762, 649]",MISC
1001,Multi,"[763, 630, 977, 649]",MISC
1002,##th,"[763, 630, 977, 649]",MISC
1003,##read,"[763, 630, 977, 649]",MISC
1004,##ing,"[763, 630, 977, 649]",MISC
1005,",","[763, 630, 977, 649]",MISC
1006,Visual,"[763, 630, 977, 649]",MISC
1007,-,"[977, 630, 979, 649]",MISC
1008,NL,"[977, 630, 979, 649]",MISC
1009,-,"[977, 630, 979, 649]",MISC
1010,Studio,"[569, 653, 630, 671]",MISC
1011,2008,"[630, 653, 712, 671]",MISC
1012,/,"[630, 653, 712, 671]",MISC
1013,12,"[630, 653, 712, 671]",MISC
1014,",","[630, 653, 712, 671]",MISC
1015,-,"[712, 653, 714, 671]",MISC
1016,NL,"[712, 653, 714, 671]",MISC
1017,-,"[712, 653, 714, 671]",MISC
1018,S,"[569, 676, 602, 694]",MISC
1019,##QL,"[569, 676, 602, 694]",MISC
1020,Server,"[604, 676, 672, 694]",MISC
1021,2008,"[673, 676, 730, 694]",MISC
1022,.,"[673, 676, 730, 694]",MISC
1023,-,"[730, 676, 732, 694]",MISC
1024,NL,"[730, 676, 732, 694]",MISC
1025,-,"[730, 676, 732, 694]",MISC
1026,Des,"[133, 715, 250, 734]",MISC
1027,##cription,"[133, 715, 250, 734]",MISC
1028,:,"[133, 715, 250, 734]",MISC
1029,-,"[250, 715, 252, 734]",MISC
1030,NL,"[250, 715, 252, 734]",MISC
1031,-,"[250, 715, 252, 734]",MISC
1032,The,"[200, 752, 231, 771]",MISC
1033,Al,"[232, 752, 318, 771]",MISC
1034,##ad,"[232, 752, 318, 771]",MISC
1035,##din,"[232, 752, 318, 771]",MISC
1036,##®,"[232, 752, 318, 771]",MISC
1037,Enterprise,"[319, 752, 426, 771]",MISC
1038,Investment,"[427, 752, 534, 771]",MISC
1039,System,"[535, 752, 598, 771]",MISC
1040,is,"[600, 752, 620, 771]",MISC
1041,a,"[621, 752, 631, 771]",MISC
1042,suite,"[632, 752, 686, 771]",MISC
1043,of,"[686, 752, 707, 771]",MISC
1044,products,"[708, 752, 793, 771]",MISC
1045,consists,"[794, 752, 880, 771]",MISC
1046,of,"[881, 752, 901, 771]",MISC
1047,Trade,"[902, 752, 999, 771]",MISC
1048,##AL,"[902, 752, 999, 771]",MISC
1049,##O,"[902, 752, 999, 771]",MISC
1050,",","[902, 752, 999, 771]",MISC
1051,-,"[1000, 752, 1001, 771]",MISC
1052,NL,"[1000, 752, 1001, 771]",MISC
1053,-,"[1000, 752, 1001, 771]",MISC
1054,Port,"[133, 775, 222, 794]",MISC
1055,##fo,"[133, 775, 222, 794]",MISC
1056,##lio,"[133, 775, 222, 794]",MISC
1057,Administration,"[223, 775, 363, 794]",MISC
1058,and,"[364, 775, 394, 794]",MISC
1059,Risk,"[394, 775, 433, 794]",MISC
1060,Analysis,"[434, 775, 523, 794]",MISC
1061,.,"[434, 775, 523, 794]",MISC
1062,-,"[525, 775, 526, 794]",MISC
1063,NL,"[525, 775, 526, 794]",MISC
1064,-,"[525, 775, 526, 794]",MISC
1065,A,"[133, 812, 142, 830]",MISC
1066,desktop,"[144, 812, 218, 830]",MISC
1067,and,"[219, 812, 250, 830]",MISC
1068,network,"[251, 812, 388, 830]",MISC
1069,-,"[251, 812, 388, 830]",MISC
1070,based,"[251, 812, 388, 830]",MISC
1071,Di,"[390, 812, 507, 830]",MISC
1072,##st,"[390, 812, 507, 830]",MISC
1073,##ri,"[390, 812, 507, 830]",MISC
1074,##buted,"[390, 812, 507, 830]",MISC
1075,Process,"[507, 812, 613, 830]",MISC
1076,##ing,"[507, 812, 613, 830]",MISC
1077,System,"[614, 812, 689, 830]",MISC
1078,",","[614, 812, 689, 830]",MISC
1079,this,"[689, 812, 732, 830]",MISC
1080,database,"[732, 812, 892, 830]",MISC
1081,-,"[732, 812, 892, 830]",MISC
1082,driven,"[732, 812, 892, 830]",MISC
1083,Enterprise,"[893, 812, 998, 830]",MISC
1084,-,"[1000, 812, 1001, 830]",MISC
1085,NL,"[1000, 812, 1001, 830]",MISC
1086,-,"[1000, 812, 1001, 830]",MISC
1087,System,"[133, 833, 202, 853]",MISC
1088,can,"[202, 833, 236, 853]",MISC
1089,be,"[237, 833, 259, 853]",MISC
1090,scaled,"[260, 833, 329, 853]",MISC
1091,to,"[329, 833, 352, 853]",MISC
1092,meet,"[353, 833, 397, 853]",MISC
1093,the,"[399, 833, 432, 853]",MISC
1094,needs,"[433, 833, 491, 853]",MISC
1095,of,"[491, 833, 513, 853]",MISC
1096,small,"[514, 833, 572, 853]",MISC
1097,hedge,"[572, 833, 630, 853]",MISC
1098,funds,"[630, 833, 687, 853]",MISC
1099,as,"[688, 833, 710, 853]",MISC
1100,well,"[711, 833, 755, 853]",MISC
1101,as,"[757, 833, 779, 853]",MISC
1102,major,"[780, 833, 838, 853]",MISC
1103,market,"[838, 833, 906, 853]",MISC
1104,dealers,"[907, 833, 998, 853]",MISC
1105,.,"[907, 833, 998, 853]",MISC
1106,-,"[1000, 833, 1001, 853]",MISC
1107,NL,"[1000, 833, 1001, 853]",MISC
1108,-,"[1000, 833, 1001, 853]",MISC
1109,Al,"[133, 856, 217, 876]",MISC
1110,##ad,"[133, 856, 217, 876]",MISC
1111,##din,"[133, 856, 217, 876]",MISC
1112,##®,"[133, 856, 217, 876]",MISC
1113,is,"[217, 856, 237, 876]",MISC
1114,a,"[237, 856, 247, 876]",MISC
1115,versatile,"[248, 856, 341, 876]",MISC
1116,and,"[342, 856, 372, 876]",MISC
1117,easy,"[373, 856, 414, 876]",MISC
1118,to,"[415, 856, 435, 876]",MISC
1119,use,"[436, 856, 465, 876]",MISC
1120,tool,"[467, 856, 508, 876]",MISC
1121,for,"[509, 856, 539, 876]",MISC
1122,both,"[540, 856, 581, 876]",MISC
1123,front,"[582, 856, 634, 876]",MISC
1124,office,"[634, 856, 695, 876]",MISC
1125,and,"[697, 856, 726, 876]",MISC
1126,middle,"[728, 856, 864, 876]",MISC
1127,-,"[728, 856, 864, 876]",MISC
1128,office,"[728, 856, 864, 876]",MISC
1129,functions,"[864, 856, 968, 876]",MISC
1130,.,"[864, 856, 968, 876]",MISC
1131,The,"[968, 856, 998, 876]",MISC
1132,-,"[1000, 856, 1001, 876]",MISC
1133,NL,"[1000, 856, 1001, 876]",MISC
1134,-,"[1000, 856, 1001, 876]",MISC
1135,Al,"[133, 879, 230, 897]",MISC
1136,##ad,"[133, 879, 230, 897]",MISC
1137,##din,"[133, 879, 230, 897]",MISC
1138,##®,"[133, 879, 230, 897]",MISC
1139,solution,"[231, 879, 327, 897]",MISC
1140,is,"[328, 879, 352, 897]",MISC
1141,a,"[353, 879, 364, 897]",MISC
1142,comprehensive,"[365, 879, 523, 897]",MISC
1143,Microsoft,"[524, 879, 633, 897]",MISC
1144,Technology,"[633, 879, 754, 897]",MISC
1145,(,"[755, 879, 998, 897]",MISC
1146,M,"[755, 879, 998, 897]",MISC
1147,##FC,"[755, 879, 998, 897]",MISC
1148,-,"[755, 879, 998, 897]",MISC
1149,Doc,"[755, 879, 998, 897]",MISC
1150,/,"[755, 879, 998, 897]",MISC
1151,View,"[755, 879, 998, 897]",MISC
1152,),"[755, 879, 998, 897]",MISC
1153,-,"[755, 879, 998, 897]",MISC
1154,based,"[755, 879, 998, 897]",MISC
1155,-,"[1000, 879, 1001, 897]",MISC
1156,NL,"[1000, 879, 1001, 897]",MISC
1157,-,"[1000, 879, 1001, 897]",MISC
1158,application,"[133, 901, 243, 920]",MISC
1159,for,"[244, 901, 274, 920]",MISC
1160,v,"[274, 901, 354, 920]",MISC
1161,##al,"[274, 901, 354, 920]",MISC
1162,##uing,"[274, 901, 354, 920]",MISC
1163,",","[274, 901, 354, 920]",MISC
1164,and,"[355, 901, 384, 920]",MISC
1165,managing,"[385, 901, 465, 920]",MISC
1166,risk,"[466, 901, 505, 920]",MISC
1167,of,"[506, 901, 524, 920]",MISC
1168,structured,"[526, 901, 626, 920]",MISC
1169,finance,"[627, 901, 697, 920]",MISC
1170,products,"[697, 901, 786, 920]",MISC
1171,.,"[697, 901, 786, 920]",MISC
1172,-,"[788, 901, 790, 920]",MISC
1173,NL,"[788, 901, 790, 920]",MISC
1174,-,"[788, 901, 790, 920]",MISC
1175,Its,"[200, 938, 233, 957]",MISC
1176,underlying,"[234, 938, 345, 957]",MISC
1177,industry,"[346, 938, 435, 957]",MISC
1178,standard,"[436, 938, 525, 957]",MISC
1179,models,"[526, 938, 593, 957]",MISC
1180,are,"[594, 938, 627, 957]",MISC
1181,powered,"[628, 938, 706, 957]",MISC
1182,by,"[707, 938, 729, 957]",MISC
1183,the,"[729, 938, 763, 957]",MISC
1184,state,"[763, 938, 943, 957]",MISC
1185,-,"[763, 938, 943, 957]",MISC
1186,of,"[763, 938, 943, 957]",MISC
1187,-,"[763, 938, 943, 957]",MISC
1188,the,"[763, 938, 943, 957]",MISC
1189,-,"[763, 938, 943, 957]",MISC
1190,art,"[763, 938, 943, 957]",MISC
1191,high,"[943, 938, 999, 957]",MISC
1192,-,"[943, 938, 999, 957]",MISC
1193,-,"[1000, 938, 1001, 957]",MISC
1194,NL,"[1000, 938, 1001, 957]",MISC
1195,-,"[1000, 938, 1001, 957]",MISC
1196,performance,"[133, 961, 252, 980]",MISC
1197,Black,"[252, 961, 349, 980]",MISC
1198,##R,"[252, 961, 349, 980]",MISC
1199,##ock,"[252, 961, 349, 980]",MISC
1200,anal,"[350, 961, 446, 980]",MISC
1201,##ytic,"[350, 961, 446, 980]",MISC
1202,##s,"[350, 961, 446, 980]",MISC
1203,and,"[447, 961, 479, 980]",MISC
1204,it,"[480, 961, 500, 980]",MISC
1205,is,"[501, 961, 522, 980]",MISC
1206,designed,"[523, 961, 608, 980]",MISC
1207,to,"[610, 961, 630, 980]",MISC
1208,integrate,"[631, 961, 728, 980]",MISC
1209,sea,"[729, 961, 836, 980]",MISC
1210,##m,"[729, 961, 836, 980]",MISC
1211,##lessly,"[729, 961, 836, 980]",MISC
1212,into,"[837, 961, 880, 980]",MISC
1213,Black,"[880, 961, 999, 980]",MISC
1214,##rock,"[880, 961, 999, 980]",MISC
1215,’,"[880, 961, 999, 980]",MISC
1216,s,"[880, 961, 999, 980]",MISC
1217,-,"[1000, 961, 1001, 980]",MISC
1218,NL,"[1000, 961, 1001, 980]",MISC
1219,-,"[1000, 961, 1001, 980]",MISC
1220,database,"[133, 102, 220, 120]",MISC
1221,and,"[221, 102, 252, 120]",MISC
1222,cash,"[254, 102, 296, 120]",MISC
1223,flow,"[298, 102, 340, 120]",MISC
1224,engine,"[341, 102, 418, 120]",MISC
1225,.,"[341, 102, 418, 120]",MISC
1226,Al,"[418, 102, 505, 120]",MISC
1227,##ad,"[418, 102, 505, 120]",MISC
1228,##din,"[418, 102, 505, 120]",MISC
1229,##®,"[418, 102, 505, 120]",MISC
1230,runs,"[506, 102, 549, 120]",MISC
1231,using,"[550, 102, 604, 120]",MISC
1232,a,"[605, 102, 614, 120]",MISC
1233,user,"[616, 102, 757, 120]",MISC
1234,-,"[616, 102, 757, 120]",MISC
1235,provided,"[616, 102, 757, 120]",MISC
1236,loan,"[758, 102, 801, 120]",MISC
1237,level,"[802, 102, 856, 120]",MISC
1238,pre,"[857, 102, 922, 120]",MISC
1239,##pa,"[857, 102, 922, 120]",MISC
1240,##y,"[857, 102, 922, 120]",MISC
1241,model,"[923, 102, 988, 120]",MISC
1242,",","[923, 102, 988, 120]",MISC
1243,a,"[989, 102, 998, 120]",MISC
1244,-,"[1000, 102, 1001, 120]",MISC
1245,NL,"[1000, 102, 1001, 120]",MISC
1246,-,"[1000, 102, 1001, 120]",MISC
1247,loan,"[133, 125, 174, 143]",MISC
1248,level,"[175, 125, 225, 143]",MISC
1249,loss,"[226, 125, 267, 143]",MISC
1250,model,"[268, 125, 318, 143]",MISC
1251,as,"[319, 125, 340, 143]",MISC
1252,well,"[340, 125, 381, 143]",MISC
1253,as,"[382, 125, 402, 143]",MISC
1254,a,"[402, 125, 412, 143]",MISC
1255,custom,"[413, 125, 474, 143]",MISC
1256,interest,"[475, 125, 556, 143]",MISC
1257,rate,"[558, 125, 598, 143]",MISC
1258,generator,"[599, 125, 701, 143]",MISC
1259,.,"[599, 125, 701, 143]",MISC
1260,-,"[703, 125, 705, 143]",MISC
1261,NL,"[703, 125, 705, 143]",MISC
1262,-,"[703, 125, 705, 143]",MISC
1263,Integration,"[133, 161, 246, 180]",MISC
1264,of,"[247, 161, 267, 180]",MISC
1265,Pre,"[267, 161, 338, 180]",MISC
1266,##pa,"[267, 161, 338, 180]",MISC
1267,##y,"[267, 161, 338, 180]",MISC
1268,",","[267, 161, 338, 180]",MISC
1269,Loss,"[339, 161, 389, 180]",MISC
1270,",","[339, 161, 389, 180]",MISC
1271,and,"[391, 161, 421, 180]",MISC
1272,Se,"[422, 161, 504, 180]",MISC
1273,##ver,"[422, 161, 504, 180]",MISC
1274,##ity,"[422, 161, 504, 180]",MISC
1275,models,"[504, 161, 566, 180]",MISC
1276,at,"[566, 161, 587, 180]",MISC
1277,custom,"[587, 161, 648, 180]",MISC
1278,co,"[649, 161, 751, 180]",MISC
1279,##lla,"[649, 161, 751, 180]",MISC
1280,##teral,"[649, 161, 751, 180]",MISC
1281,grouping,"[752, 161, 834, 180]",MISC
1282,levels,"[834, 161, 905, 180]",MISC
1283,.,"[834, 161, 905, 180]",MISC
1284,Port,"[907, 161, 999, 180]",MISC
1285,##fo,"[907, 161, 999, 180]",MISC
1286,##lio,"[907, 161, 999, 180]",MISC
1287,-,"[1000, 161, 1001, 180]",MISC
1288,NL,"[1000, 161, 1001, 180]",MISC
1289,-,"[1000, 161, 1001, 180]",MISC
1290,Management,"[133, 184, 243, 203]",MISC
1291,capability,"[244, 184, 354, 203]",MISC
1292,so,"[355, 184, 376, 203]",MISC
1293,users,"[377, 184, 431, 203]",MISC
1294,can,"[433, 184, 465, 203]",MISC
1295,manage,"[466, 184, 531, 203]",MISC
1296,and,"[533, 184, 565, 203]",MISC
1297,run,"[566, 184, 598, 203]",MISC
1298,multiple,"[600, 184, 687, 203]",MISC
1299,scenarios,"[688, 184, 787, 203]",MISC
1300,on,"[788, 184, 809, 203]",MISC
1301,entire,"[811, 184, 876, 203]",MISC
1302,portfolio,"[877, 184, 976, 203]",MISC
1303,of,"[977, 184, 998, 203]",MISC
1304,-,"[1000, 184, 1001, 203]",MISC
1305,NL,"[1000, 184, 1001, 203]",MISC
1306,-,"[1000, 184, 1001, 203]",MISC
1307,securities,"[133, 205, 231, 225]",MISC
1308,",","[133, 205, 231, 225]",MISC
1309,even,"[232, 205, 268, 225]",MISC
1310,multiple,"[269, 205, 339, 225]",MISC
1311,portfolio,"[341, 205, 439, 225]",MISC
1312,##s,"[341, 205, 439, 225]",MISC
1313,",","[341, 205, 439, 225]",MISC
1314,efficiently,"[440, 205, 548, 225]",MISC
1315,.,"[440, 205, 548, 225]",MISC
1316,-,"[549, 205, 551, 225]",MISC
1317,NL,"[549, 205, 551, 225]",MISC
1318,-,"[549, 205, 551, 225]",MISC
1319,An,"[200, 242, 220, 262]",MISC
1320,open,"[221, 242, 262, 262]",MISC
1321,architecture,"[264, 242, 390, 262]",MISC
1322,Col,"[392, 242, 498, 262]",MISC
1323,##late,"[392, 242, 498, 262]",MISC
1324,##ral,"[392, 242, 498, 262]",MISC
1325,Co,"[498, 242, 582, 262]",MISC
1326,##mp,"[498, 242, 582, 262]",MISC
1327,##iler,"[498, 242, 582, 262]",MISC
1328,that,"[584, 242, 625, 262]",MISC
1329,incorporates,"[626, 242, 752, 262]",MISC
1330,data,"[754, 242, 795, 262]",MISC
1331,from,"[797, 242, 838, 262]",MISC
1332,multiple,"[840, 242, 923, 262]",MISC
1333,sources,"[925, 242, 999, 262]",MISC
1334,-,"[1000, 242, 1001, 262]",MISC
1335,NL,"[1000, 242, 1001, 262]",MISC
1336,-,"[1000, 242, 1001, 262]",MISC
1337,including,"[133, 265, 228, 284]",MISC
1338,Risk,"[229, 265, 389, 284]",MISC
1339,/,"[229, 265, 389, 284]",MISC
1340,Pre,"[229, 265, 389, 284]",MISC
1341,##pa,"[229, 265, 389, 284]",MISC
1342,##yme,"[229, 265, 389, 284]",MISC
1343,##nt,"[229, 265, 389, 284]",MISC
1344,models,"[390, 265, 464, 284]",MISC
1345,",","[390, 265, 464, 284]",MISC
1346,loan,"[465, 265, 507, 284]",MISC
1347,level,"[507, 265, 559, 284]",MISC
1348,data,"[561, 265, 604, 284]",MISC
1349,providers,"[604, 265, 709, 284]",MISC
1350,",","[604, 265, 709, 284]",MISC
1351,credit,"[711, 265, 774, 284]",MISC
1352,bureau,"[775, 265, 860, 284]",MISC
1353,##s,"[775, 265, 860, 284]",MISC
1354,",","[775, 265, 860, 284]",MISC
1355,service,"[860, 265, 966, 284]",MISC
1356,##rs,"[860, 265, 966, 284]",MISC
1357,",","[860, 265, 966, 284]",MISC
1358,and,"[967, 265, 999, 284]",MISC
1359,-,"[1000, 265, 1001, 284]",MISC
1360,NL,"[1000, 265, 1001, 284]",MISC
1361,-,"[1000, 265, 1001, 284]",MISC
1362,rating,"[133, 288, 189, 306]",MISC
1363,agencies,"[189, 288, 272, 306]",MISC
1364,.,"[189, 288, 272, 306]",MISC
1365,-,"[272, 288, 274, 306]",MISC
1366,NL,"[272, 288, 274, 306]",MISC
1367,-,"[272, 288, 274, 306]",MISC
1368,Role,"[133, 325, 183, 343]",MISC
1369,##s,"[133, 325, 183, 343]",MISC
1370,and,"[184, 325, 214, 343]",MISC
1371,Re,"[214, 325, 387, 343]",MISC
1372,##sp,"[214, 325, 387, 343]",MISC
1373,##ons,"[214, 325, 387, 343]",MISC
1374,##ibi,"[214, 325, 387, 343]",MISC
1375,##lities,"[214, 325, 387, 343]",MISC
1376,:,"[214, 325, 387, 343]",MISC
1377,-,"[387, 325, 389, 343]",MISC
1378,NL,"[387, 325, 389, 343]",MISC
1379,-,"[387, 325, 389, 343]",MISC
1380,Dev,"[183, 362, 281, 377]",MISC
1381,##elo,"[183, 362, 281, 377]",MISC
1382,##ped,"[183, 362, 281, 377]",MISC
1383,interest,"[282, 362, 370, 377]",MISC
1384,rate,"[371, 362, 413, 377]",MISC
1385,model,"[415, 362, 469, 377]",MISC
1386,using,"[470, 362, 524, 377]",MISC
1387,Hull,"[525, 362, 635, 377]",MISC
1388,-,"[525, 362, 635, 377]",MISC
1389,White,"[525, 362, 635, 377]",MISC
1390,dynamic,"[635, 362, 723, 377]",MISC
1391,",","[635, 362, 723, 377]",MISC
1392,Built,"[724, 362, 777, 377]",MISC
1393,C,"[779, 362, 810, 377]",MISC
1394,+,"[779, 362, 810, 377]",MISC
1395,+,"[779, 362, 810, 377]",MISC
1396,library,"[812, 362, 888, 377]",MISC
1397,of,"[889, 362, 910, 377]",MISC
1398,generic,"[911, 362, 998, 377]",MISC
1399,##s,"[911, 362, 998, 377]",MISC
1400,-,"[1000, 362, 1001, 377]",MISC
1401,NL,"[1000, 362, 1001, 377]",MISC
1402,-,"[1000, 362, 1001, 377]",MISC
1403,and,"[205, 377, 235, 397]",MISC
1404,developed,"[237, 377, 330, 397]",MISC
1405,pricing,"[331, 377, 403, 397]",MISC
1406,tools,"[404, 377, 456, 397]",MISC
1407,for,"[456, 377, 486, 397]",MISC
1408,Call,"[488, 377, 571, 397]",MISC
1409,##able,"[488, 377, 571, 397]",MISC
1410,Bond,"[571, 377, 612, 397]",MISC
1411,and,"[613, 377, 643, 397]",MISC
1412,other,"[644, 377, 696, 397]",MISC
1413,interest,"[697, 377, 780, 397]",MISC
1414,rate,"[780, 377, 821, 397]",MISC
1415,derivatives,"[822, 377, 946, 397]",MISC
1416,.,"[822, 377, 946, 397]",MISC
1417,-,"[948, 377, 949, 397]",MISC
1418,NL,"[948, 377, 949, 397]",MISC
1419,-,"[948, 377, 949, 397]",MISC
1420,Dev,"[184, 401, 294, 417]",MISC
1421,##elo,"[184, 401, 294, 417]",MISC
1422,##ped,"[184, 401, 294, 417]",MISC
1423,C,"[294, 401, 329, 417]",MISC
1424,+,"[294, 401, 329, 417]",MISC
1425,+,"[294, 401, 329, 417]",MISC
1426,high,"[330, 401, 378, 417]",MISC
1427,dimensional,"[379, 401, 512, 417]",MISC
1428,robust,"[513, 401, 585, 417]",MISC
1429,portfolio,"[586, 401, 695, 417]",MISC
1430,optimization,"[695, 401, 840, 417]",MISC
1431,engine,"[841, 401, 914, 417]",MISC
1432,with,"[914, 401, 963, 417]",MISC
1433,ST,"[963, 401, 998, 417]",MISC
1434,##L,"[963, 401, 998, 417]",MISC
1435,-,"[1000, 401, 1001, 417]",MISC
1436,NL,"[1000, 401, 1001, 417]",MISC
1437,-,"[1000, 401, 1001, 417]",MISC
1438,algorithms,"[205, 417, 365, 436]",MISC
1439,/,"[205, 417, 365, 436]",MISC
1440,data,"[205, 417, 365, 436]",MISC
1441,structures,"[367, 417, 472, 436]",MISC
1442,and,"[474, 417, 506, 436]",MISC
1443,interface,"[507, 417, 612, 436]",MISC
1444,##d,"[507, 417, 612, 436]",MISC
1445,in,"[614, 417, 634, 436]",MISC
1446,.,"[636, 417, 678, 436]",MISC
1447,NE,"[636, 417, 678, 436]",MISC
1448,##T,"[636, 417, 678, 436]",MISC
1449,Fr,"[679, 417, 731, 436]",MISC
1450,##ame,"[679, 417, 731, 436]",MISC
1451,work,"[732, 417, 784, 436]",MISC
1452,.,"[732, 417, 784, 436]",MISC
1453,-,"[786, 417, 788, 436]",MISC
1454,NL,"[786, 417, 788, 436]",MISC
1455,-,"[786, 417, 788, 436]",MISC
1456,Ana,"[183, 440, 268, 455]",MISC
1457,##ly,"[183, 440, 268, 455]",MISC
1458,##sed,"[183, 440, 268, 455]",MISC
1459,liquid,"[269, 440, 365, 455]",MISC
1460,##ity,"[269, 440, 365, 455]",MISC
1461,events,"[365, 440, 428, 455]",MISC
1462,(,"[430, 440, 493, 455]",MISC
1463,index,"[430, 440, 493, 455]",MISC
1464,review,"[494, 440, 579, 455]",MISC
1465,),"[494, 440, 579, 455]",MISC
1466,;,"[494, 440, 579, 455]",MISC
1467,Dev,"[580, 440, 676, 455]",MISC
1468,##elo,"[580, 440, 676, 455]",MISC
1469,##ped,"[580, 440, 676, 455]",MISC
1470,back,"[676, 440, 719, 455]",MISC
1471,testing,"[719, 440, 794, 455]",MISC
1472,software,"[794, 440, 880, 455]",MISC
1473,in,"[880, 440, 901, 455]",MISC
1474,C,"[902, 440, 965, 455]",MISC
1475,/,"[902, 440, 965, 455]",MISC
1476,C,"[902, 440, 965, 455]",MISC
1477,+,"[902, 440, 965, 455]",MISC
1478,+,"[902, 440, 965, 455]",MISC
1479,.,"[902, 440, 965, 455]",MISC
1480,-,"[966, 440, 968, 455]",MISC
1481,NL,"[966, 440, 968, 455]",MISC
1482,-,"[966, 440, 968, 455]",MISC
1483,Ex,"[184, 460, 277, 475]",MISC
1484,##amine,"[184, 460, 277, 475]",MISC
1485,##d,"[184, 460, 277, 475]",MISC
1486,a,"[278, 460, 290, 475]",MISC
1487,duration,"[290, 460, 467, 475]",MISC
1488,-,"[290, 460, 467, 475]",MISC
1489,hedge,"[290, 460, 467, 475]",MISC
1490,##d,"[290, 460, 467, 475]",MISC
1491,portfolio,"[468, 460, 597, 475]",MISC
1492,’,"[468, 460, 597, 475]",MISC
1493,s,"[468, 460, 597, 475]",MISC
1494,interest,"[598, 460, 690, 475]",MISC
1495,rate,"[692, 460, 739, 475]",MISC
1496,exposure,"[739, 460, 832, 475]",MISC
1497,using,"[834, 460, 892, 475]",MISC
1498,Principal,"[893, 460, 999, 475]",MISC
1499,-,"[1000, 460, 1001, 475]",MISC
1500,NL,"[1000, 460, 1001, 475]",MISC
1501,-,"[1000, 460, 1001, 475]",MISC
1502,Co,"[205, 475, 302, 495]",MISC
1503,##mpo,"[205, 475, 302, 495]",MISC
1504,##nent,"[205, 475, 302, 495]",MISC
1505,Analysis,"[302, 475, 398, 495]",MISC
1506,.,"[302, 475, 398, 495]",MISC
1507,-,"[398, 475, 400, 495]",MISC
1508,NL,"[398, 475, 400, 495]",MISC
1509,-,"[398, 475, 400, 495]",MISC
1510,Cal,"[184, 500, 307, 515]",MISC
1511,##culate,"[184, 500, 307, 515]",MISC
1512,##d,"[184, 500, 307, 515]",MISC
1513,Op,"[308, 500, 492, 515]",MISC
1514,##tion,"[308, 500, 492, 515]",MISC
1515,-,"[308, 500, 492, 515]",MISC
1516,Ad,"[308, 500, 492, 515]",MISC
1517,##ju,"[308, 500, 492, 515]",MISC
1518,##sted,"[308, 500, 492, 515]",MISC
1519,S,"[493, 500, 566, 515]",MISC
1520,##p,"[493, 500, 566, 515]",MISC
1521,##read,"[493, 500, 566, 515]",MISC
1522,for,"[567, 500, 602, 515]",MISC
1523,an,"[604, 500, 628, 515]",MISC
1524,MB,"[629, 500, 664, 515]",MISC
1525,##S,"[629, 500, 664, 515]",MISC
1526,by,"[666, 500, 690, 515]",MISC
1527,generating,"[691, 500, 813, 515]",MISC
1528,500,"[814, 500, 849, 515]",MISC
1529,paths,"[851, 500, 913, 515]",MISC
1530,for,"[913, 500, 948, 515]",MISC
1531,1,"[950, 500, 998, 515]",MISC
1532,##m,"[950, 500, 998, 515]",MISC
1533,##th,"[950, 500, 998, 515]",MISC
1534,-,"[1000, 500, 1001, 515]",MISC
1535,NL,"[1000, 500, 1001, 515]",MISC
1536,-,"[1000, 500, 1001, 515]",MISC
1537,L,"[205, 515, 265, 534]",MISC
1538,##IB,"[205, 515, 265, 534]",MISC
1539,##OR,"[205, 515, 265, 534]",MISC
1540,forwards,"[266, 515, 360, 534]",MISC
1541,and,"[362, 515, 397, 534]",MISC
1542,inter,"[398, 515, 554, 534]",MISC
1543,##pol,"[398, 515, 554, 534]",MISC
1544,##ating,"[398, 515, 554, 534]",MISC
1545,the,"[554, 515, 590, 534]",MISC
1546,pre,"[590, 515, 709, 534]",MISC
1547,##pa,"[590, 515, 709, 534]",MISC
1548,##yme,"[590, 515, 709, 534]",MISC
1549,##nt,"[590, 515, 709, 534]",MISC
1550,speeds,"[711, 515, 781, 534]",MISC
1551,with,"[783, 515, 829, 534]",MISC
1552,Bloomberg,"[831, 515, 963, 534]",MISC
1553,’,"[831, 515, 963, 534]",MISC
1554,s,"[831, 515, 963, 534]",MISC
1555,PS,"[963, 515, 999, 534]",MISC
1556,##A,"[963, 515, 999, 534]",MISC
1557,-,"[1000, 515, 1001, 534]",MISC
1558,NL,"[1000, 515, 1001, 534]",MISC
1559,-,"[1000, 515, 1001, 534]",MISC
1560,For,"[205, 535, 285, 553]",MISC
1561,##eca,"[205, 535, 285, 553]",MISC
1562,##st,"[205, 535, 285, 553]",MISC
1563,.,"[205, 535, 285, 553]",MISC
1564,-,"[285, 535, 287, 553]",MISC
1565,NL,"[285, 535, 287, 553]",MISC
1566,-,"[285, 535, 287, 553]",MISC
1567,Gene,"[183, 558, 289, 573]",MISC
1568,##rating,"[183, 558, 289, 573]",MISC
1569,risk,"[290, 558, 333, 573]",MISC
1570,anal,"[333, 558, 430, 573]",MISC
1571,##ytic,"[333, 558, 430, 573]",MISC
1572,##s,"[333, 558, 430, 573]",MISC
1573,reports,"[430, 558, 504, 573]",MISC
1574,for,"[505, 558, 537, 573]",MISC
1575,portfolio,"[537, 558, 634, 573]",MISC
1576,managers,"[634, 558, 719, 573]",MISC
1577,on,"[720, 558, 741, 573]",MISC
1578,fixed,"[742, 558, 794, 573]",MISC
1579,income,"[795, 558, 858, 573]",MISC
1580,securities,"[860, 558, 966, 573]",MISC
1581,and,"[967, 558, 999, 573]",MISC
1582,-,"[1000, 558, 1001, 573]",MISC
1583,NL,"[1000, 558, 1001, 573]",MISC
1584,-,"[1000, 558, 1001, 573]",MISC
1585,e,"[205, 573, 285, 593]",MISC
1586,##quities,"[205, 573, 285, 593]",MISC
1587,in,"[286, 573, 304, 593]",MISC
1588,more,"[306, 573, 345, 593]",MISC
1589,than,"[346, 573, 385, 593]",MISC
1590,50,"[386, 573, 405, 593]",MISC
1591,portfolio,"[407, 573, 516, 593]",MISC
1592,##s,"[407, 573, 516, 593]",MISC
1593,.,"[407, 573, 516, 593]",MISC
1594,-,"[517, 573, 519, 593]",MISC
1595,NL,"[517, 573, 519, 593]",MISC
1596,-,"[517, 573, 519, 593]",MISC
1597,Written,"[183, 598, 255, 613]",MISC
1598,S,"[256, 598, 288, 613]",MISC
1599,##QL,"[256, 598, 288, 613]",MISC
1600,que,"[288, 598, 360, 613]",MISC
1601,##ries,"[288, 598, 360, 613]",MISC
1602,to,"[361, 598, 382, 613]",MISC
1603,generate,"[382, 598, 466, 613]",MISC
1604,loan,"[466, 598, 507, 613]",MISC
1605,portfolio,"[508, 598, 603, 613]",MISC
1606,anal,"[603, 598, 687, 613]",MISC
1607,##ytic,"[603, 598, 687, 613]",MISC
1608,reports,"[687, 598, 771, 613]",MISC
1609,.,"[687, 598, 771, 613]",MISC
1610,-,"[771, 598, 773, 613]",MISC
1611,NL,"[771, 598, 773, 613]",MISC
1612,-,"[771, 598, 773, 613]",MISC
1613,Op,"[183, 620, 279, 634]",MISC
1614,##ti,"[183, 620, 279, 634]",MISC
1615,##mized,"[183, 620, 279, 634]",MISC
1616,S,"[281, 620, 312, 634]",MISC
1617,##QL,"[281, 620, 312, 634]",MISC
1618,que,"[314, 620, 390, 634]",MISC
1619,##ries,"[314, 620, 390, 634]",MISC
1620,used,"[390, 620, 432, 634]",MISC
1621,to,"[433, 620, 454, 634]",MISC
1622,calculate,"[455, 620, 551, 634]",MISC
1623,various,"[553, 620, 629, 634]",MISC
1624,metric,"[629, 620, 705, 634]",MISC
1625,##s,"[629, 620, 705, 634]",MISC
1626,of,"[705, 620, 726, 634]",MISC
1627,reverse,"[727, 620, 803, 634]",MISC
1628,mortgage,"[803, 620, 900, 634]",MISC
1629,.,"[803, 620, 900, 634]",MISC
1630,-,"[901, 620, 903, 634]",MISC
1631,NL,"[901, 620, 903, 634]",MISC
1632,-,"[901, 620, 903, 634]",MISC
1633,Guru,"[788, 690, 938, 713]",MISC
1634,##kal,"[788, 690, 938, 713]",MISC
1635,##yan,"[788, 690, 938, 713]",MISC
1636,-,"[938, 690, 940, 713]",MISC
1637,NL,"[938, 690, 940, 713]",MISC
1638,-,"[938, 690, 940, 713]",MISC
1639,pan,"[133, 717, 256, 740]",MISC
1640,##ig,"[133, 717, 256, 740]",MISC
1641,##rah,"[133, 717, 256, 740]",MISC
1642,##i,"[133, 717, 256, 740]",MISC
1643,-,"[256, 717, 257, 740]",MISC
1644,NL,"[256, 717, 257, 740]",MISC
1645,-,"[256, 717, 257, 740]",MISC
