,token,box,label
0,P,"[98, 64, 198, 77]",B-name
1,##rash,"[98, 64, 198, 77]",I-name
2,##ant,"[98, 64, 198, 77]",I-name
3,Pan,"[199, 64, 274, 77]",I-name
4,##de,"[199, 64, 274, 77]",I-name
5,##y,"[199, 64, 274, 77]",I-name
6,-,"[275, 64, 276, 77]",MISC
7,NL,"[275, 64, 276, 77]",MISC
8,-,"[275, 64, 276, 77]",MISC
9,Em,"[688, 64, 743, 77]",MISC
10,##ail,"[688, 64, 743, 77]",MISC
11,:,"[688, 64, 743, 77]",MISC
12,p,"[743, 64, 989, 77]",B-emails_email
13,##rash,"[743, 64, 989, 77]",I-emails_email
14,##ant,"[743, 64, 989, 77]",I-emails_email
15,##pan,"[743, 64, 989, 77]",I-emails_email
16,##de,"[743, 64, 989, 77]",I-emails_email
17,##y,"[743, 64, 989, 77]",I-emails_email
18,##9,"[743, 64, 989, 77]",I-emails_email
19,##23,"[743, 64, 989, 77]",I-emails_email
20,@,"[743, 64, 989, 77]",I-emails_email
21,g,"[743, 64, 989, 77]",I-emails_email
22,##mail,"[743, 64, 989, 77]",I-emails_email
23,.,"[743, 64, 989, 77]",I-emails_email
24,com,"[743, 64, 989, 77]",I-emails_email
25,-,"[990, 64, 992, 77]",MISC
26,NL,"[990, 64, 992, 77]",MISC
27,-,"[990, 64, 992, 77]",MISC
28,OR,"[98, 82, 174, 96]",B-employer_company_name
29,##AC,"[98, 82, 174, 96]",I-employer_company_name
30,##LE,"[98, 82, 174, 96]",I-employer_company_name
31,F,"[176, 82, 293, 96]",I-employer_company_name
32,##IN,"[176, 82, 293, 96]",I-employer_company_name
33,##AN,"[176, 82, 293, 96]",I-employer_company_name
34,##CI,"[176, 82, 293, 96]",I-employer_company_name
35,##AL,"[176, 82, 293, 96]",I-employer_company_name
36,SE,"[293, 82, 397, 96]",I-employer_company_name
37,##R,"[293, 82, 397, 96]",I-employer_company_name
38,##VI,"[293, 82, 397, 96]",I-employer_company_name
39,##CE,"[293, 82, 397, 96]",I-employer_company_name
40,##S,"[293, 82, 397, 96]",I-employer_company_name
41,S,"[397, 82, 501, 96]",I-employer_company_name
42,##O,"[397, 82, 501, 96]",I-employer_company_name
43,##FT,"[397, 82, 501, 96]",I-employer_company_name
44,##WA,"[397, 82, 501, 96]",I-employer_company_name
45,##RE,"[397, 82, 501, 96]",I-employer_company_name
46,L,"[501, 82, 552, 96]",I-employer_company_name
47,##T,"[501, 82, 552, 96]",I-employer_company_name
48,##D,"[501, 82, 552, 96]",I-employer_company_name
49,",","[501, 82, 552, 96]",MISC
50,-,"[553, 82, 555, 96]",MISC
51,NL,"[553, 82, 555, 96]",MISC
52,-,"[553, 82, 555, 96]",MISC
53,Mobile,"[686, 82, 746, 96]",MISC
54,:,"[686, 82, 746, 96]",MISC
55,+,"[748, 82, 863, 96]",MISC
56,91,"[748, 82, 863, 96]",MISC
57,##9,"[748, 82, 863, 96]",MISC
58,##7,"[748, 82, 863, 96]",MISC
59,##39,"[748, 82, 863, 96]",MISC
60,##7,"[748, 82, 863, 96]",MISC
61,##65,"[748, 82, 863, 96]",MISC
62,##24,"[748, 82, 863, 96]",MISC
63,##2,"[748, 82, 863, 96]",MISC
64,-,"[863, 82, 865, 96]",MISC
65,NL,"[863, 82, 865, 96]",MISC
66,-,"[863, 82, 865, 96]",MISC
67,Bangalore,"[98, 99, 189, 113]",MISC
68,-,"[189, 99, 191, 113]",MISC
69,NL,"[189, 99, 191, 113]",MISC
70,-,"[189, 99, 191, 113]",MISC
71,CA,"[105, 143, 194, 159]",B-summary_heading
72,##RE,"[105, 143, 194, 159]",I-summary_heading
73,##ER,"[105, 143, 194, 159]",I-summary_heading
74,O,"[196, 143, 347, 159]",I-summary_heading
75,##B,"[196, 143, 347, 159]",I-summary_heading
76,##J,"[196, 143, 347, 159]",I-summary_heading
77,##EC,"[196, 143, 347, 159]",I-summary_heading
78,##TI,"[196, 143, 347, 159]",I-summary_heading
79,##VE,"[196, 143, 347, 159]",I-summary_heading
80,:,"[196, 143, 347, 159]",I-summary_heading
81,-,"[347, 143, 349, 159]",MISC
82,NL,"[347, 143, 349, 159]",MISC
83,-,"[347, 143, 349, 159]",MISC
84,To,"[98, 169, 112, 181]",MISC
85,give,"[114, 169, 145, 181]",MISC
86,effective,"[147, 169, 220, 181]",MISC
87,as,"[221, 169, 235, 181]",MISC
88,well,"[237, 169, 268, 181]",MISC
89,as,"[270, 169, 284, 181]",MISC
90,efficient,"[286, 169, 359, 181]",MISC
91,efforts,"[360, 169, 416, 181]",MISC
92,towards,"[417, 169, 474, 181]",MISC
93,attain,"[474, 169, 555, 181]",MISC
94,##ment,"[474, 169, 555, 181]",MISC
95,of,"[556, 169, 571, 181]",MISC
96,organizational,"[573, 169, 686, 181]",MISC
97,goals,"[687, 169, 727, 181]",MISC
98,with,"[728, 169, 759, 181]",MISC
99,exploring,"[761, 169, 834, 181]",MISC
100,wide,"[835, 169, 866, 181]",MISC
101,scope,"[868, 169, 908, 181]",MISC
102,of,"[908, 169, 923, 181]",MISC
103,-,"[925, 169, 927, 181]",MISC
104,NL,"[925, 169, 927, 181]",MISC
105,-,"[925, 169, 927, 181]",MISC
106,knowledge,"[98, 181, 174, 194]",MISC
107,and,"[175, 181, 201, 194]",MISC
108,intelligence,"[201, 181, 312, 194]",MISC
109,.,"[201, 181, 312, 194]",MISC
110,To,"[313, 181, 330, 194]",MISC
111,work,"[331, 181, 364, 194]",MISC
112,in,"[365, 181, 382, 194]",MISC
113,an,"[382, 181, 399, 194]",MISC
114,environment,"[400, 181, 494, 194]",MISC
115,that,"[495, 181, 527, 194]",MISC
116,provides,"[529, 181, 597, 194]",MISC
117,a,"[598, 181, 605, 194]",MISC
118,challenging,"[607, 181, 701, 194]",MISC
119,and,"[702, 181, 727, 194]",MISC
120,reward,"[728, 181, 804, 194]",MISC
121,##ing,"[728, 181, 804, 194]",MISC
122,career,"[805, 181, 856, 194]",MISC
123,ensuring,"[857, 181, 924, 194]",MISC
124,a,"[926, 181, 933, 194]",MISC
125,high,"[935, 181, 976, 194]",MISC
126,-,"[935, 181, 976, 194]",MISC
127,-,"[978, 181, 979, 194]",MISC
128,NL,"[978, 181, 979, 194]",MISC
129,-,"[978, 181, 979, 194]",MISC
130,level,"[98, 195, 138, 207]",MISC
131,job,"[140, 195, 163, 207]",MISC
132,satisfaction,"[165, 195, 272, 207]",MISC
133,.,"[165, 195, 272, 207]",MISC
134,In,"[273, 195, 290, 207]",MISC
135,the,"[290, 195, 314, 207]",MISC
136,process,"[315, 195, 374, 207]",MISC
137,apart,"[374, 195, 414, 207]",MISC
138,from,"[416, 195, 448, 207]",MISC
139,benefit,"[449, 195, 531, 207]",MISC
140,##ing,"[449, 195, 531, 207]",MISC
141,my,"[533, 195, 549, 207]",MISC
142,employer,"[549, 195, 624, 207]",MISC
143,",","[549, 195, 624, 207]",MISC
144,I,"[625, 195, 632, 207]",MISC
145,also,"[633, 195, 666, 207]",MISC
146,expect,"[666, 195, 716, 207]",MISC
147,to,"[717, 195, 733, 207]",MISC
148,learn,"[733, 195, 773, 207]",MISC
149,for,"[775, 195, 799, 207]",MISC
150,my,"[800, 195, 817, 207]",MISC
151,overall,"[817, 195, 875, 207]",MISC
152,development,"[875, 195, 976, 207]",MISC
153,.,"[875, 195, 976, 207]",MISC
154,-,"[976, 195, 978, 207]",MISC
155,NL,"[976, 195, 978, 207]",MISC
156,-,"[976, 195, 978, 207]",MISC
157,PR,"[105, 220, 304, 237]",B-summary_heading
158,##O,"[105, 220, 304, 237]",I-summary_heading
159,##F,"[105, 220, 304, 237]",I-summary_heading
160,##ES,"[105, 220, 304, 237]",I-summary_heading
161,##SI,"[105, 220, 304, 237]",I-summary_heading
162,##ON,"[105, 220, 304, 237]",I-summary_heading
163,##AL,"[105, 220, 304, 237]",I-summary_heading
164,S,"[304, 220, 435, 237]",I-summary_heading
165,##UM,"[304, 220, 435, 237]",I-summary_heading
166,##MA,"[304, 220, 435, 237]",I-summary_heading
167,##R,"[304, 220, 435, 237]",I-summary_heading
168,##Y,"[304, 220, 435, 237]",I-summary_heading
169,:,"[304, 220, 435, 237]",I-summary_heading
170,-,"[437, 220, 438, 237]",MISC
171,NL,"[437, 220, 438, 237]",MISC
172,-,"[437, 220, 438, 237]",MISC
173,Over,"[140, 259, 174, 268]",MISC
174,5,"[176, 259, 183, 268]",MISC
175,years,"[185, 259, 229, 268]",MISC
176,of,"[231, 259, 247, 268]",MISC
177,experience,"[249, 259, 338, 268]",MISC
178,in,"[340, 259, 356, 268]",MISC
179,IT,"[358, 259, 374, 268]",MISC
180,testing,"[376, 259, 438, 268]",MISC
181,and,"[440, 259, 465, 268]",MISC
182,development,"[467, 259, 565, 268]",MISC
183,and,"[567, 259, 592, 268]",MISC
184,currently,"[594, 259, 674, 268]",MISC
185,associated,"[676, 259, 765, 268]",MISC
186,with,"[767, 259, 801, 268]",MISC
187,OR,"[803, 259, 856, 268]",MISC
188,##AC,"[803, 259, 856, 268]",MISC
189,##LE,"[803, 259, 856, 268]",MISC
190,F,"[858, 259, 938, 268]",MISC
191,##IN,"[858, 259, 938, 268]",MISC
192,##AN,"[858, 259, 938, 268]",MISC
193,##CI,"[858, 259, 938, 268]",MISC
194,##AL,"[858, 259, 938, 268]",MISC
195,-,"[939, 259, 941, 268]",MISC
196,NL,"[939, 259, 941, 268]",MISC
197,-,"[939, 259, 941, 268]",MISC
198,SE,"[163, 269, 240, 279]",MISC
199,##R,"[163, 269, 240, 279]",MISC
200,##VI,"[163, 269, 240, 279]",MISC
201,##CE,"[163, 269, 240, 279]",MISC
202,##S,"[163, 269, 240, 279]",MISC
203,S,"[240, 269, 317, 279]",MISC
204,##O,"[240, 269, 317, 279]",MISC
205,##FT,"[240, 269, 317, 279]",MISC
206,##WA,"[240, 269, 317, 279]",MISC
207,##RE,"[240, 269, 317, 279]",MISC
208,L,"[317, 269, 344, 279]",MISC
209,##T,"[317, 269, 344, 279]",MISC
210,##D,"[317, 269, 344, 279]",MISC
211,-,"[346, 269, 347, 279]",MISC
212,NL,"[346, 269, 347, 279]",MISC
213,-,"[346, 269, 347, 279]",MISC
214,Ex,"[140, 284, 218, 294]",MISC
215,##tensive,"[140, 284, 218, 294]",MISC
216,experience,"[219, 284, 307, 294]",MISC
217,in,"[308, 284, 324, 294]",MISC
218,entire,"[326, 284, 378, 294]",MISC
219,Q,"[379, 284, 395, 294]",MISC
220,##A,"[379, 284, 395, 294]",MISC
221,Life,"[397, 284, 431, 294]",MISC
222,cycle,"[432, 284, 476, 294]",MISC
223,which,"[476, 284, 520, 294]",MISC
224,includes,"[521, 284, 590, 294]",MISC
225,Design,"[592, 284, 679, 294]",MISC
226,##ing,"[592, 284, 679, 294]",MISC
227,",","[592, 284, 679, 294]",MISC
228,Dev,"[680, 284, 768, 294]",MISC
229,##elo,"[680, 284, 768, 294]",MISC
230,##ping,"[680, 284, 768, 294]",MISC
231,and,"[769, 284, 794, 294]",MISC
232,Ex,"[795, 284, 874, 294]",MISC
233,##ec,"[795, 284, 874, 294]",MISC
234,##ution,"[795, 284, 874, 294]",MISC
235,of,"[875, 284, 892, 294]",MISC
236,the,"[893, 284, 918, 294]",MISC
237,entire,"[919, 284, 972, 294]",MISC
238,Q,"[973, 284, 989, 294]",MISC
239,##A,"[973, 284, 989, 294]",MISC
240,-,"[990, 284, 992, 294]",MISC
241,NL,"[990, 284, 992, 294]",MISC
242,-,"[990, 284, 992, 294]",MISC
243,process,"[163, 294, 222, 306]",MISC
244,and,"[223, 294, 249, 306]",MISC
245,documentation,"[249, 294, 360, 306]",MISC
246,of,"[360, 294, 377, 306]",MISC
247,Test,"[377, 294, 410, 306]",MISC
248,Plans,"[411, 294, 462, 306]",MISC
249,",","[411, 294, 462, 306]",MISC
250,Test,"[463, 294, 496, 306]",MISC
251,Case,"[497, 294, 548, 306]",MISC
252,##s,"[497, 294, 548, 306]",MISC
253,",","[497, 294, 548, 306]",MISC
254,Test,"[548, 294, 581, 306]",MISC
255,Sc,"[582, 294, 650, 306]",MISC
256,##rip,"[582, 294, 650, 306]",MISC
257,##ts,"[582, 294, 650, 306]",MISC
258,",","[582, 294, 650, 306]",MISC
259,Test,"[651, 294, 684, 306]",MISC
260,E,"[685, 294, 769, 306]",MISC
261,##st,"[685, 294, 769, 306]",MISC
262,##imation,"[685, 294, 769, 306]",MISC
263,&,"[771, 294, 778, 306]",MISC
264,Re,"[779, 294, 872, 306]",MISC
265,##quire,"[779, 294, 872, 306]",MISC
266,##ment,"[779, 294, 872, 306]",MISC
267,Trace,"[873, 294, 975, 306]",MISC
268,##ability,"[873, 294, 975, 306]",MISC
269,-,"[976, 294, 978, 306]",MISC
270,NL,"[976, 294, 978, 306]",MISC
271,-,"[976, 294, 978, 306]",MISC
272,Matrix,"[163, 308, 211, 320]",MISC
273,for,"[212, 308, 235, 320]",MISC
274,the,"[236, 308, 259, 320]",MISC
275,web,"[260, 308, 283, 320]",MISC
276,application,"[284, 308, 379, 320]",MISC
277,.,"[284, 308, 379, 320]",MISC
278,-,"[380, 308, 382, 320]",MISC
279,NL,"[380, 308, 382, 320]",MISC
280,-,"[380, 308, 382, 320]",MISC
281,Strong,"[140, 324, 193, 334]",MISC
282,Experience,"[194, 324, 283, 334]",MISC
283,in,"[285, 324, 301, 334]",MISC
284,Auto,"[303, 324, 392, 334]",MISC
285,##mat,"[303, 324, 392, 334]",MISC
286,##ing,"[303, 324, 392, 334]",MISC
287,Web,"[393, 324, 419, 334]",MISC
288,Application,"[420, 324, 519, 334]",MISC
289,Testing,"[520, 324, 582, 334]",MISC
290,using,"[583, 324, 627, 334]",MISC
291,Java,"[628, 324, 663, 334]",MISC
292,Programming,"[665, 324, 772, 334]",MISC
293,",","[665, 324, 772, 334]",MISC
294,Se,"[773, 324, 844, 334]",MISC
295,##len,"[773, 324, 844, 334]",MISC
296,##ium,"[773, 324, 844, 334]",MISC
297,Web,"[846, 324, 926, 334]",MISC
298,##D,"[846, 324, 926, 334]",MISC
299,##river,"[846, 324, 926, 334]",MISC
300,with,"[927, 324, 962, 334]",MISC
301,Test,"[963, 324, 998, 334]",MISC
302,-,"[1000, 324, 1001, 334]",MISC
303,NL,"[1000, 324, 1001, 334]",MISC
304,-,"[1000, 324, 1001, 334]",MISC
305,N,"[163, 334, 183, 346]",MISC
306,##G,"[163, 334, 183, 346]",MISC
307,and,"[183, 334, 213, 346]",MISC
308,B,"[214, 334, 243, 346]",MISC
309,##D,"[214, 334, 243, 346]",MISC
310,##D,"[214, 334, 243, 346]",MISC
311,framework,"[244, 334, 344, 346]",MISC
312,.,"[244, 334, 344, 346]",MISC
313,-,"[344, 334, 346, 346]",MISC
314,NL,"[344, 334, 346, 346]",MISC
315,-,"[344, 334, 346, 346]",MISC
316,Experience,"[139, 351, 234, 361]",MISC
317,##d,"[139, 351, 234, 361]",MISC
318,with,"[234, 351, 267, 361]",MISC
319,Ma,"[268, 351, 310, 361]",MISC
320,##ven,"[268, 351, 310, 361]",MISC
321,for,"[312, 351, 337, 361]",MISC
322,Project,"[337, 351, 398, 361]",MISC
323,building,"[398, 351, 465, 361]",MISC
324,tool,"[467, 351, 499, 361]",MISC
325,and,"[501, 351, 527, 361]",MISC
326,Jenkins,"[527, 351, 647, 361]",MISC
327,/,"[527, 351, 647, 361]",MISC
328,Hudson,"[527, 351, 647, 361]",MISC
329,for,"[648, 351, 673, 361]",MISC
330,Con,"[673, 351, 759, 361]",MISC
331,##tin,"[673, 351, 759, 361]",MISC
332,##uous,"[673, 351, 759, 361]",MISC
333,Integration,"[760, 351, 862, 361]",MISC
334,.,"[760, 351, 862, 361]",MISC
335,-,"[863, 351, 865, 361]",MISC
336,NL,"[863, 351, 865, 361]",MISC
337,-,"[863, 351, 865, 361]",MISC
338,I,"[140, 366, 236, 375]",MISC
339,##dent,"[140, 366, 236, 375]",MISC
340,##ified,"[140, 366, 236, 375]",MISC
341,",","[140, 366, 236, 375]",MISC
342,Report,"[237, 366, 309, 375]",MISC
343,##ed,"[237, 366, 309, 375]",MISC
344,and,"[309, 366, 334, 375]",MISC
345,Track,"[335, 366, 397, 375]",MISC
346,##ed,"[335, 366, 397, 375]",MISC
347,De,"[398, 366, 460, 375]",MISC
348,##fect,"[398, 366, 460, 375]",MISC
349,##s,"[398, 366, 460, 375]",MISC
350,using,"[460, 366, 504, 375]",MISC
351,HP,"[505, 366, 619, 375]",MISC
352,##AL,"[505, 366, 619, 375]",MISC
353,##M,"[505, 366, 619, 375]",MISC
354,/,"[505, 366, 619, 375]",MISC
355,Quality,"[505, 366, 619, 375]",MISC
356,Center,"[620, 366, 673, 375]",MISC
357,test,"[674, 366, 708, 375]",MISC
358,management,"[709, 366, 797, 375]",MISC
359,tool,"[798, 366, 842, 375]",MISC
360,.,"[798, 366, 842, 375]",MISC
361,-,"[843, 366, 845, 375]",MISC
362,NL,"[843, 366, 845, 375]",MISC
363,-,"[843, 366, 845, 375]",MISC
364,Experience,"[140, 379, 238, 388]",MISC
365,##d,"[140, 379, 238, 388]",MISC
366,with,"[238, 379, 273, 388]",MISC
367,SD,"[274, 379, 309, 388]",MISC
368,##LC,"[274, 379, 309, 388]",MISC
369,which,"[310, 379, 354, 388]",MISC
370,includes,"[355, 379, 426, 388]",MISC
371,method,"[427, 379, 543, 388]",MISC
372,##ologies,"[427, 379, 543, 388]",MISC
373,like,"[544, 379, 578, 388]",MISC
374,A,"[580, 379, 632, 388]",MISC
375,##gi,"[580, 379, 632, 388]",MISC
376,##le,"[580, 379, 632, 388]",MISC
377,.,"[580, 379, 632, 388]",MISC
378,-,"[633, 379, 635, 388]",MISC
379,NL,"[633, 379, 635, 388]",MISC
380,-,"[633, 379, 635, 388]",MISC
381,Re,"[140, 393, 236, 403]",MISC
382,##sponsible,"[140, 393, 236, 403]",MISC
383,for,"[237, 393, 262, 403]",MISC
384,identifying,"[263, 393, 360, 403]",MISC
385,test,"[361, 393, 395, 403]",MISC
386,cases,"[396, 393, 440, 403]",MISC
387,for,"[440, 393, 466, 403]",MISC
388,manual,"[467, 393, 520, 403]",MISC
389,and,"[520, 393, 546, 403]",MISC
390,Auto,"[547, 393, 634, 403]",MISC
391,##mation,"[547, 393, 634, 403]",MISC
392,for,"[635, 393, 661, 403]",MISC
393,Smoke,"[662, 393, 706, 403]",MISC
394,Test,"[706, 393, 750, 403]",MISC
395,",","[706, 393, 750, 403]",MISC
396,Fun,"[750, 393, 838, 403]",MISC
397,##ctional,"[750, 393, 838, 403]",MISC
398,and,"[839, 393, 864, 403]",MISC
399,Reg,"[865, 393, 953, 403]",MISC
400,##ression,"[865, 393, 953, 403]",MISC
401,-,"[954, 393, 956, 403]",MISC
402,NL,"[954, 393, 956, 403]",MISC
403,-,"[954, 393, 956, 403]",MISC
404,Tests,"[163, 403, 207, 415]",MISC
405,.,"[163, 403, 207, 415]",MISC
406,-,"[207, 403, 209, 415]",MISC
407,NL,"[207, 403, 209, 415]",MISC
408,-,"[207, 403, 209, 415]",MISC
409,Per,"[141, 420, 230, 429]",MISC
410,##formed,"[141, 420, 230, 429]",MISC
411,CR,"[231, 420, 269, 429]",MISC
412,##U,"[231, 420, 269, 429]",MISC
413,##D,"[231, 420, 269, 429]",MISC
414,operations,"[271, 420, 369, 429]",MISC
415,using,"[370, 420, 420, 429]",MISC
416,S,"[420, 420, 450, 429]",MISC
417,##QL,"[420, 420, 450, 429]",MISC
418,commands,"[450, 420, 529, 429]",MISC
419,in,"[530, 420, 548, 429]",MISC
420,Oracle,"[550, 420, 609, 429]",MISC
421,10,"[610, 420, 639, 429]",MISC
422,##g,"[610, 420, 639, 429]",MISC
423,and,"[640, 420, 669, 429]",MISC
424,S,"[670, 420, 699, 429]",MISC
425,##QL,"[670, 420, 699, 429]",MISC
426,databases,"[700, 420, 789, 429]",MISC
427,-,"[790, 420, 792, 429]",MISC
428,NL,"[790, 420, 792, 429]",MISC
429,-,"[790, 420, 792, 429]",MISC
430,Knowledge,"[140, 434, 226, 444]",MISC
431,in,"[228, 434, 246, 444]",MISC
432,R,"[247, 434, 285, 444]",MISC
433,##ES,"[247, 434, 285, 444]",MISC
434,##T,"[247, 434, 285, 444]",MISC
435,API,"[286, 434, 324, 444]",MISC
436,##s,"[286, 434, 324, 444]",MISC
437,testing,"[325, 434, 392, 444]",MISC
438,using,"[393, 434, 440, 444]",MISC
439,Post,"[441, 434, 518, 444]",MISC
440,##man,"[441, 434, 518, 444]",MISC
441,.,"[441, 434, 518, 444]",MISC
442,-,"[519, 434, 520, 444]",MISC
443,NL,"[519, 434, 520, 444]",MISC
444,-,"[519, 434, 520, 444]",MISC
445,Excellent,"[139, 449, 214, 457]",MISC
446,team,"[215, 449, 247, 457]",MISC
447,management,"[248, 449, 332, 457]",MISC
448,and,"[332, 449, 356, 457]",MISC
449,delivery,"[357, 449, 423, 457]",MISC
450,driving,"[425, 449, 483, 457]",MISC
451,skills,"[483, 449, 542, 457]",MISC
452,",","[483, 449, 542, 457]",MISC
453,good,"[542, 449, 575, 457]",MISC
454,analytical,"[576, 449, 667, 457]",MISC
455,",","[576, 449, 667, 457]",MISC
456,problem,"[668, 449, 727, 457]",MISC
457,solving,"[727, 449, 785, 457]",MISC
458,and,"[786, 449, 810, 457]",MISC
459,inter,"[811, 449, 919, 457]",MISC
460,##person,"[811, 449, 919, 457]",MISC
461,##al,"[811, 449, 919, 457]",MISC
462,effective,"[920, 449, 995, 457]",MISC
463,-,"[996, 449, 998, 457]",MISC
464,NL,"[996, 449, 998, 457]",MISC
465,-,"[996, 449, 998, 457]",MISC
466,skills,"[163, 457, 211, 470]",MISC
467,with,"[212, 457, 243, 470]",MISC
468,ability,"[245, 457, 301, 470]",MISC
469,to,"[302, 457, 316, 470]",MISC
470,interact,"[318, 457, 382, 470]",MISC
471,and,"[383, 457, 407, 470]",MISC
472,communicate,"[407, 457, 497, 470]",MISC
473,&,"[497, 457, 504, 470]",MISC
474,convince,"[505, 457, 569, 470]",MISC
475,with,"[570, 457, 601, 470]",MISC
476,all,"[602, 457, 626, 470]",MISC
477,stakeholders,"[627, 457, 723, 470]",MISC
478,and,"[724, 457, 748, 470]",MISC
479,clients,"[749, 457, 812, 470]",MISC
480,.,"[749, 457, 812, 470]",MISC
481,-,"[814, 457, 816, 470]",MISC
482,NL,"[814, 457, 816, 470]",MISC
483,-,"[814, 457, 816, 470]",MISC
484,A,"[139, 475, 197, 485]",MISC
485,##bility,"[139, 475, 197, 485]",MISC
486,to,"[199, 475, 215, 485]",MISC
487,deliver,"[215, 475, 274, 485]",MISC
488,under,"[275, 475, 317, 485]",MISC
489,tremendous,"[317, 475, 401, 485]",MISC
490,pressure,"[402, 475, 477, 485]",MISC
491,",","[402, 475, 477, 485]",MISC
492,complex,"[479, 475, 579, 485]",MISC
493,##ities,"[479, 475, 579, 485]",MISC
494,and,"[580, 475, 604, 485]",MISC
495,challenging,"[606, 475, 699, 485]",MISC
496,environment,"[699, 475, 799, 485]",MISC
497,.,"[699, 475, 799, 485]",MISC
498,-,"[801, 475, 803, 485]",MISC
499,NL,"[801, 475, 803, 485]",MISC
500,-,"[801, 475, 803, 485]",MISC
501,IT,"[105, 535, 136, 553]",B-skills_heading
502,SK,"[137, 535, 232, 553]",I-skills_heading
503,##IL,"[137, 535, 232, 553]",I-skills_heading
504,##LS,"[137, 535, 232, 553]",I-skills_heading
505,&,"[232, 535, 247, 553]",I-skills_heading
506,TO,"[248, 535, 343, 553]",I-skills_heading
507,##OL,"[248, 535, 343, 553]",I-skills_heading
508,##S,"[248, 535, 343, 553]",I-skills_heading
509,:,"[248, 535, 343, 553]",I-skills_heading
510,-,"[344, 535, 346, 553]",MISC
511,NL,"[344, 535, 346, 553]",MISC
512,-,"[344, 535, 346, 553]",MISC
513,Testing,"[114, 568, 171, 581]",MISC
514,Too,"[172, 568, 212, 581]",MISC
515,##ls,"[172, 568, 212, 581]",MISC
516,-,"[213, 568, 214, 581]",MISC
517,NL,"[213, 568, 214, 581]",MISC
518,-,"[213, 568, 214, 581]",MISC
519,Se,"[391, 568, 460, 580]",MISC
520,##len,"[391, 568, 460, 580]",MISC
521,##ium,"[391, 568, 460, 580]",MISC
522,Web,"[461, 568, 540, 580]",MISC
523,##D,"[461, 568, 540, 580]",MISC
524,##river,"[461, 568, 540, 580]",MISC
525,-,"[540, 568, 542, 580]",MISC
526,NL,"[540, 568, 542, 580]",MISC
527,-,"[540, 568, 542, 580]",MISC
528,Languages,"[114, 584, 196, 597]",B-others_heading
529,-,"[196, 584, 198, 597]",MISC
530,NL,"[196, 584, 198, 597]",MISC
531,-,"[196, 584, 198, 597]",MISC
532,J,"[391, 584, 442, 596]",MISC
533,##AV,"[391, 584, 442, 596]",MISC
534,##A,"[391, 584, 442, 596]",MISC
535,",","[391, 584, 442, 596]",MISC
536,S,"[442, 584, 471, 596]",MISC
537,##QL,"[442, 584, 471, 596]",MISC
538,-,"[473, 584, 475, 596]",MISC
539,NL,"[473, 584, 475, 596]",MISC
540,-,"[473, 584, 475, 596]",MISC
541,ID,"[114, 601, 142, 615]",MISC
542,##E,"[114, 601, 142, 615]",MISC
543,-,"[142, 601, 143, 615]",MISC
544,NL,"[142, 601, 143, 615]",MISC
545,-,"[142, 601, 143, 615]",MISC
546,Intel,"[391, 601, 448, 613]",MISC
547,##li,"[391, 601, 448, 613]",MISC
548,##J,"[391, 601, 448, 613]",MISC
549,I,"[449, 601, 483, 613]",MISC
550,##dea,"[449, 601, 483, 613]",MISC
551,",","[449, 601, 483, 613]",MISC
552,Eclipse,"[485, 601, 534, 613]",MISC
553,-,"[535, 601, 537, 613]",MISC
554,NL,"[535, 601, 537, 613]",MISC
555,-,"[535, 601, 537, 613]",MISC
556,Test,"[114, 617, 151, 631]",MISC
557,Framework,"[151, 617, 233, 631]",MISC
558,-,"[233, 617, 234, 631]",MISC
559,NL,"[233, 617, 234, 631]",MISC
560,-,"[233, 617, 234, 631]",MISC
561,Test,"[391, 617, 428, 629]",MISC
562,N,"[428, 617, 455, 629]",MISC
563,##G,"[428, 617, 455, 629]",MISC
564,",","[428, 617, 455, 629]",MISC
565,Jun,"[456, 617, 510, 629]",MISC
566,##it,"[456, 617, 510, 629]",MISC
567,",","[456, 617, 510, 629]",MISC
568,Data,"[511, 617, 548, 629]",MISC
569,Drive,"[548, 617, 603, 629]",MISC
570,##n,"[548, 617, 603, 629]",MISC
571,Framework,"[603, 617, 694, 629]",MISC
572,",","[603, 617, 694, 629]",MISC
573,B,"[696, 617, 723, 629]",MISC
574,##D,"[696, 617, 723, 629]",MISC
575,##D,"[696, 617, 723, 629]",MISC
576,Framework,"[723, 617, 805, 629]",MISC
577,-,"[806, 617, 808, 629]",MISC
578,NL,"[806, 617, 808, 629]",MISC
579,-,"[806, 617, 808, 629]",MISC
580,Web,"[114, 633, 142, 647]",MISC
581,De,"[143, 633, 229, 647]",MISC
582,##bu,"[143, 633, 229, 647]",MISC
583,##gging,"[143, 633, 229, 647]",MISC
584,Too,"[230, 633, 269, 647]",MISC
585,##l,"[230, 633, 269, 647]",MISC
586,-,"[269, 633, 271, 647]",MISC
587,NL,"[269, 633, 271, 647]",MISC
588,-,"[269, 633, 271, 647]",MISC
589,X,"[391, 633, 440, 646]",MISC
590,##P,"[391, 633, 440, 646]",MISC
591,##ath,"[391, 633, 440, 646]",MISC
592,",","[391, 633, 440, 646]",MISC
593,Fire,"[441, 633, 474, 646]",MISC
594,path,"[474, 633, 514, 646]",MISC
595,",","[474, 633, 514, 646]",MISC
596,Fire,"[515, 633, 572, 646]",MISC
597,##bu,"[515, 633, 572, 646]",MISC
598,##g,"[515, 633, 572, 646]",MISC
599,-,"[573, 633, 575, 646]",MISC
600,NL,"[573, 633, 575, 646]",MISC
601,-,"[573, 633, 575, 646]",MISC
602,B,"[114, 650, 154, 664]",MISC
603,##uild,"[114, 650, 154, 664]",MISC
604,Too,"[155, 650, 186, 664]",MISC
605,##l,"[155, 650, 186, 664]",MISC
606,-,"[187, 650, 189, 664]",MISC
607,NL,"[187, 650, 189, 664]",MISC
608,-,"[187, 650, 189, 664]",MISC
609,Ma,"[391, 650, 440, 663]",MISC
610,##ven,"[391, 650, 440, 663]",MISC
611,-,"[440, 650, 442, 663]",MISC
612,NL,"[440, 650, 442, 663]",MISC
613,-,"[440, 650, 442, 663]",MISC
614,Process,"[114, 667, 191, 680]",MISC
615,##es,"[114, 667, 191, 680]",MISC
616,-,"[191, 667, 193, 680]",MISC
617,NL,"[191, 667, 193, 680]",MISC
618,-,"[191, 667, 193, 680]",MISC
619,A,"[391, 667, 479, 679]",MISC
620,##gi,"[391, 667, 479, 679]",MISC
621,##le,"[391, 667, 479, 679]",MISC
622,-,"[391, 667, 479, 679]",MISC
623,Sc,"[391, 667, 479, 679]",MISC
624,##rum,"[391, 667, 479, 679]",MISC
625,-,"[479, 667, 480, 679]",MISC
626,NL,"[479, 667, 480, 679]",MISC
627,-,"[479, 667, 480, 679]",MISC
628,B,"[114, 683, 140, 696]",MISC
629,##ug,"[114, 683, 140, 696]",MISC
630,Track,"[141, 683, 212, 696]",MISC
631,##ing,"[141, 683, 212, 696]",MISC
632,Too,"[212, 683, 256, 696]",MISC
633,##ls,"[212, 683, 256, 696]",MISC
634,-,"[256, 683, 258, 696]",MISC
635,NL,"[256, 683, 258, 696]",MISC
636,-,"[256, 683, 258, 696]",MISC
637,J,"[391, 683, 433, 695]",MISC
638,##IR,"[391, 683, 433, 695]",MISC
639,##A,"[391, 683, 433, 695]",MISC
640,",","[391, 683, 433, 695]",MISC
641,Quality,"[434, 683, 492, 695]",MISC
642,Centre,"[493, 683, 544, 695]",MISC
643,(,"[545, 683, 577, 695]",MISC
644,Q,"[545, 683, 577, 695]",MISC
645,##C,"[545, 683, 577, 695]",MISC
646,),"[545, 683, 577, 695]",MISC
647,-,"[579, 683, 581, 695]",MISC
648,NL,"[579, 683, 581, 695]",MISC
649,-,"[579, 683, 581, 695]",MISC
650,Con,"[114, 700, 194, 714]",MISC
651,##tin,"[114, 700, 194, 714]",MISC
652,##uous,"[114, 700, 194, 714]",MISC
653,Integration,"[195, 700, 282, 714]",MISC
654,Too,"[283, 700, 324, 714]",MISC
655,##ls,"[283, 700, 324, 714]",MISC
656,-,"[324, 700, 326, 714]",MISC
657,NL,"[324, 700, 326, 714]",MISC
658,-,"[324, 700, 326, 714]",MISC
659,Jenkins,"[391, 700, 446, 712]",MISC
660,-,"[446, 700, 448, 712]",MISC
661,NL,"[446, 700, 448, 712]",MISC
662,-,"[446, 700, 448, 712]",MISC
663,Version,"[114, 716, 171, 730]",MISC
664,Control,"[171, 716, 227, 730]",MISC
665,-,"[227, 716, 229, 730]",MISC
666,NL,"[227, 716, 229, 730]",MISC
667,-,"[227, 716, 229, 730]",MISC
668,G,"[391, 716, 417, 728]",MISC
669,##IT,"[391, 716, 417, 728]",MISC
670,-,"[417, 716, 418, 728]",MISC
671,NL,"[417, 716, 418, 728]",MISC
672,-,"[417, 716, 418, 728]",MISC
673,Data,"[114, 732, 151, 746]",MISC
674,Base,"[151, 732, 197, 746]",MISC
675,##s,"[151, 732, 197, 746]",MISC
676,-,"[198, 732, 200, 746]",MISC
677,NL,"[198, 732, 200, 746]",MISC
678,-,"[198, 732, 200, 746]",MISC
679,Oracle,"[391, 732, 444, 745]",MISC
680,10,"[445, 732, 470, 745]",MISC
681,##g,"[445, 732, 470, 745]",MISC
682,-,"[471, 732, 473, 745]",MISC
683,NL,"[471, 732, 473, 745]",MISC
684,-,"[471, 732, 473, 745]",MISC
685,Operating,"[114, 750, 193, 763]",MISC
686,Systems,"[193, 750, 253, 763]",MISC
687,-,"[255, 750, 256, 763]",MISC
688,NL,"[255, 750, 256, 763]",MISC
689,-,"[255, 750, 256, 763]",MISC
690,Windows,"[391, 750, 457, 762]",MISC
691,-,"[457, 750, 459, 762]",MISC
692,NL,"[457, 750, 459, 762]",MISC
693,-,"[457, 750, 459, 762]",MISC
694,W,"[98, 783, 162, 800]",B-work_experience_heading
695,##OR,"[98, 783, 162, 800]",I-work_experience_heading
696,##K,"[98, 783, 162, 800]",I-work_experience_heading
697,E,"[163, 783, 341, 800]",I-work_experience_heading
698,##X,"[163, 783, 341, 800]",I-work_experience_heading
699,##P,"[163, 783, 341, 800]",I-work_experience_heading
700,##ER,"[163, 783, 341, 800]",I-work_experience_heading
701,##IE,"[163, 783, 341, 800]",I-work_experience_heading
702,##NC,"[163, 783, 341, 800]",I-work_experience_heading
703,##E,"[163, 783, 341, 800]",I-work_experience_heading
704,:,"[163, 783, 341, 800]",I-work_experience_heading
705,-,"[342, 783, 344, 800]",MISC
706,NL,"[342, 783, 344, 800]",MISC
707,-,"[342, 783, 344, 800]",MISC
708,Company,"[114, 820, 262, 832]",MISC
709,Name,"[262, 820, 346, 832]",MISC
710,-,"[347, 820, 367, 832]",MISC
711,Du,"[368, 820, 535, 832]",MISC
712,##ration,"[368, 820, 535, 832]",MISC
713,-,"[537, 820, 557, 832]",MISC
714,Design,"[558, 820, 789, 832]",MISC
715,##ation,"[558, 820, 789, 832]",MISC
716,-,"[790, 820, 792, 832]",MISC
717,NL,"[790, 820, 792, 832]",MISC
718,-,"[790, 820, 792, 832]",MISC
719,OR,"[114, 836, 176, 849]",B-employer_company_name
720,##AC,"[114, 836, 176, 849]",I-employer_company_name
721,##LE,"[114, 836, 176, 849]",I-employer_company_name
722,F,"[177, 836, 270, 849]",I-employer_company_name
723,##IN,"[177, 836, 270, 849]",I-employer_company_name
724,##AN,"[177, 836, 270, 849]",I-employer_company_name
725,##CI,"[177, 836, 270, 849]",I-employer_company_name
726,##AL,"[177, 836, 270, 849]",I-employer_company_name
727,SE,"[270, 836, 352, 849]",I-employer_company_name
728,##R,"[270, 836, 352, 849]",I-employer_company_name
729,##VI,"[270, 836, 352, 849]",I-employer_company_name
730,##CE,"[270, 836, 352, 849]",I-employer_company_name
731,##S,"[270, 836, 352, 849]",I-employer_company_name
732,S,"[354, 836, 436, 849]",I-employer_company_name
733,##O,"[354, 836, 436, 849]",I-employer_company_name
734,##FT,"[354, 836, 436, 849]",I-employer_company_name
735,##WA,"[354, 836, 436, 849]",I-employer_company_name
736,##RE,"[354, 836, 436, 849]",I-employer_company_name
737,L,"[437, 836, 468, 849]",I-employer_company_name
738,##T,"[437, 836, 468, 849]",I-employer_company_name
739,##D,"[437, 836, 468, 849]",I-employer_company_name
740,-,"[468, 836, 477, 849]",MISC
741,Feb,"[479, 836, 510, 849]",MISC
742,2017,"[510, 836, 550, 849]",MISC
743,–,"[552, 836, 561, 849]",MISC
744,Till,"[562, 836, 602, 849]",MISC
745,date,"[604, 836, 644, 849]",MISC
746,-,"[645, 836, 654, 849]",MISC
747,Staff,"[656, 836, 707, 849]",B-employer_role
748,Consul,"[708, 836, 812, 849]",I-employer_role
749,##tant,"[708, 836, 812, 849]",I-employer_role
750,-,"[812, 836, 814, 849]",MISC
751,NL,"[812, 836, 814, 849]",MISC
752,-,"[812, 836, 814, 849]",MISC
753,In,"[114, 865, 225, 877]",B-project_company_name
754,##fo,"[114, 865, 225, 877]",I-project_company_name
755,##sy,"[114, 865, 225, 877]",I-project_company_name
756,##s,"[114, 865, 225, 877]",I-project_company_name
757,Ltd,"[227, 865, 274, 877]",I-project_company_name
758,-,"[275, 865, 290, 877]",MISC
759,Feb,"[292, 865, 339, 877]",MISC
760,2014,"[340, 865, 404, 877]",MISC
761,-,"[404, 865, 419, 877]",MISC
762,Jan,"[421, 865, 468, 877]",MISC
763,2017,"[469, 865, 533, 877]",MISC
764,-,"[533, 865, 548, 877]",MISC
765,Senior,"[550, 865, 646, 877]",B-employer_role
766,System,"[646, 865, 743, 877]",I-employer_role
767,Engineer,"[743, 865, 871, 877]",I-employer_role
768,-,"[872, 865, 874, 877]",MISC
769,NL,"[872, 865, 874, 877]",MISC
770,-,"[872, 865, 874, 877]",MISC
771,R,"[98, 982, 222, 1000]",MISC
772,##EL,"[98, 982, 222, 1000]",MISC
773,##E,"[98, 982, 222, 1000]",MISC
774,##VA,"[98, 982, 222, 1000]",MISC
775,##NT,"[98, 982, 222, 1000]",MISC
776,PR,"[223, 982, 333, 1000]",MISC
777,##O,"[223, 982, 333, 1000]",MISC
778,##J,"[223, 982, 333, 1000]",MISC
779,##EC,"[223, 982, 333, 1000]",MISC
780,##T,"[223, 982, 333, 1000]",MISC
781,E,"[333, 982, 504, 1000]",MISC
782,##X,"[333, 982, 504, 1000]",MISC
783,##P,"[333, 982, 504, 1000]",MISC
784,##ER,"[333, 982, 504, 1000]",MISC
785,##IE,"[333, 982, 504, 1000]",MISC
786,##NC,"[333, 982, 504, 1000]",MISC
787,##E,"[333, 982, 504, 1000]",MISC
788,:,"[333, 982, 504, 1000]",MISC
789,-,"[506, 982, 508, 1000]",MISC
790,NL,"[506, 982, 508, 1000]",MISC
791,-,"[506, 982, 508, 1000]",MISC
792,Project,"[114, 96, 171, 108]",MISC
793,1,"[172, 96, 179, 108]",MISC
794,-,"[180, 96, 182, 108]",MISC
795,NL,"[180, 96, 182, 108]",MISC
796,-,"[180, 96, 182, 108]",MISC
797,F,"[360, 96, 431, 108]",B-project_title
798,##lex,"[360, 96, 431, 108]",I-project_title
799,##cu,"[360, 96, 431, 108]",I-project_title
800,##be,"[360, 96, 431, 108]",I-project_title
801,11,"[431, 96, 466, 108]",I-project_title
802,.,"[431, 96, 466, 108]",I-project_title
803,x,"[431, 96, 466, 108]",I-project_title
804,Up,"[467, 96, 529, 108]",I-project_title
805,##grade,"[467, 96, 529, 108]",I-project_title
806,-,"[530, 96, 531, 108]",MISC
807,NL,"[530, 96, 531, 108]",MISC
808,-,"[530, 96, 531, 108]",MISC
809,Custom,"[114, 112, 185, 125]",MISC
810,##er,"[114, 112, 185, 125]",MISC
811,-,"[185, 112, 187, 125]",MISC
812,NL,"[185, 112, 187, 125]",MISC
813,-,"[185, 112, 187, 125]",MISC
814,Wells,"[360, 112, 404, 125]",MISC
815,Fargo,"[404, 112, 448, 125]",MISC
816,-,"[448, 112, 449, 125]",MISC
817,NL,"[448, 112, 449, 125]",MISC
818,-,"[448, 112, 449, 125]",MISC
819,Organization,"[114, 128, 207, 141]",B-work_experience_heading
820,-,"[207, 128, 209, 141]",MISC
821,NL,"[207, 128, 209, 141]",MISC
822,-,"[207, 128, 209, 141]",MISC
823,OR,"[360, 128, 426, 141]",B-employer_company_name
824,##AC,"[360, 128, 426, 141]",I-employer_company_name
825,##LE,"[360, 128, 426, 141]",I-employer_company_name
826,F,"[427, 128, 525, 141]",I-employer_company_name
827,##IN,"[427, 128, 525, 141]",I-employer_company_name
828,##AN,"[427, 128, 525, 141]",I-employer_company_name
829,##CI,"[427, 128, 525, 141]",I-employer_company_name
830,##AL,"[427, 128, 525, 141]",I-employer_company_name
831,SE,"[527, 128, 614, 141]",I-employer_company_name
832,##R,"[527, 128, 614, 141]",I-employer_company_name
833,##VI,"[527, 128, 614, 141]",I-employer_company_name
834,##CE,"[527, 128, 614, 141]",I-employer_company_name
835,##S,"[527, 128, 614, 141]",I-employer_company_name
836,S,"[615, 128, 703, 141]",I-employer_company_name
837,##O,"[615, 128, 703, 141]",I-employer_company_name
838,##FT,"[615, 128, 703, 141]",I-employer_company_name
839,##WA,"[615, 128, 703, 141]",I-employer_company_name
840,##RE,"[615, 128, 703, 141]",I-employer_company_name
841,L,"[704, 128, 737, 141]",I-employer_company_name
842,##T,"[704, 128, 737, 141]",I-employer_company_name
843,##D,"[704, 128, 737, 141]",I-employer_company_name
844,-,"[737, 128, 739, 141]",MISC
845,NL,"[737, 128, 739, 141]",MISC
846,-,"[737, 128, 739, 141]",MISC
847,Testing,"[114, 144, 174, 157]",MISC
848,A,"[175, 144, 242, 157]",MISC
849,##pp,"[175, 144, 242, 157]",MISC
850,##roach,"[175, 144, 242, 157]",MISC
851,-,"[244, 144, 245, 157]",MISC
852,NL,"[244, 144, 245, 157]",MISC
853,-,"[244, 144, 245, 157]",MISC
854,Auto,"[360, 144, 448, 157]",MISC
855,##mation,"[360, 144, 448, 157]",MISC
856,(,"[449, 144, 484, 157]",MISC
857,B,"[449, 144, 484, 157]",MISC
858,##D,"[449, 144, 484, 157]",MISC
859,##D,"[449, 144, 484, 157]",MISC
860,framework,"[484, 144, 572, 157]",MISC
861,),"[484, 144, 572, 157]",MISC
862,-,"[573, 144, 575, 157]",MISC
863,NL,"[573, 144, 575, 157]",MISC
864,-,"[573, 144, 575, 157]",MISC
865,Technology,"[114, 160, 200, 173]",MISC
866,-,"[200, 160, 202, 173]",MISC
867,NL,"[200, 160, 202, 173]",MISC
868,-,"[200, 160, 202, 173]",MISC
869,Web,"[360, 160, 393, 173]",MISC
870,-,"[393, 160, 395, 173]",MISC
871,NL,"[393, 160, 395, 173]",MISC
872,-,"[393, 160, 395, 173]",MISC
873,Too,"[114, 176, 160, 189]",MISC
874,##ls,"[114, 176, 160, 189]",MISC
875,Used,"[161, 176, 197, 189]",MISC
876,-,"[198, 176, 200, 189]",MISC
877,NL,"[198, 176, 200, 189]",MISC
878,-,"[198, 176, 200, 189]",MISC
879,Se,"[360, 176, 429, 189]",MISC
880,##len,"[360, 176, 429, 189]",MISC
881,##ium,"[360, 176, 429, 189]",MISC
882,Web,"[430, 176, 509, 189]",MISC
883,##D,"[430, 176, 509, 189]",MISC
884,##river,"[430, 176, 509, 189]",MISC
885,-,"[510, 176, 511, 189]",MISC
886,NL,"[510, 176, 511, 189]",MISC
887,-,"[510, 176, 511, 189]",MISC
888,SD,"[114, 193, 153, 205]",MISC
889,##LC,"[114, 193, 153, 205]",MISC
890,Process,"[153, 193, 221, 205]",MISC
891,-,"[222, 193, 224, 205]",MISC
892,NL,"[222, 193, 224, 205]",MISC
893,-,"[222, 193, 224, 205]",MISC
894,A,"[360, 193, 402, 205]",MISC
895,##gi,"[360, 193, 402, 205]",MISC
896,##le,"[360, 193, 402, 205]",MISC
897,Method,"[402, 193, 493, 205]",MISC
898,##ology,"[402, 193, 493, 205]",MISC
899,-,"[495, 193, 497, 205]",MISC
900,NL,"[495, 193, 497, 205]",MISC
901,-,"[495, 193, 497, 205]",MISC
902,Role,"[114, 210, 149, 222]",MISC
903,-,"[149, 210, 151, 222]",MISC
904,NL,"[149, 210, 151, 222]",MISC
905,-,"[149, 210, 151, 222]",MISC
906,Test,"[360, 210, 391, 222]",MISC
907,Ana,"[393, 210, 449, 222]",MISC
908,##ly,"[393, 210, 449, 222]",MISC
909,##st,"[393, 210, 449, 222]",MISC
910,-,"[449, 210, 451, 222]",MISC
911,NL,"[449, 210, 451, 222]",MISC
912,-,"[449, 210, 451, 222]",MISC
913,Period,"[114, 226, 162, 238]",MISC
914,-,"[162, 226, 163, 238]",MISC
915,NL,"[162, 226, 163, 238]",MISC
916,-,"[162, 226, 163, 238]",MISC
917,Feb,"[360, 226, 387, 238]",MISC
918,2017,"[388, 226, 424, 238]",MISC
919,–,"[425, 226, 434, 238]",MISC
920,Till,"[434, 226, 470, 238]",MISC
921,Date,"[471, 226, 507, 238]",MISC
922,-,"[508, 226, 510, 238]",MISC
923,NL,"[508, 226, 510, 238]",MISC
924,-,"[508, 226, 510, 238]",MISC
925,Des,"[114, 241, 196, 254]",MISC
926,##cription,"[114, 241, 196, 254]",MISC
927,-,"[196, 241, 198, 254]",MISC
928,NL,"[196, 241, 198, 254]",MISC
929,-,"[196, 241, 198, 254]",MISC
930,C,"[360, 241, 409, 253]",MISC
931,##lient,"[360, 241, 409, 253]",MISC
932,is,"[410, 241, 426, 253]",MISC
933,up,"[426, 241, 499, 253]",MISC
934,##grading,"[426, 241, 499, 253]",MISC
935,their,"[501, 241, 541, 253]",MISC
936,core,"[542, 241, 575, 253]",MISC
937,banking,"[575, 241, 632, 253]",MISC
938,solution,"[633, 241, 699, 253]",MISC
939,(,"[699, 241, 781, 253]",MISC
940,F,"[699, 241, 781, 253]",MISC
941,##lex,"[699, 241, 781, 253]",MISC
942,##cu,"[699, 241, 781, 253]",MISC
943,##be,"[699, 241, 781, 253]",MISC
944,),"[699, 241, 781, 253]",MISC
945,version,"[782, 241, 839, 253]",MISC
946,from,"[840, 241, 873, 253]",MISC
947,6,"[873, 241, 897, 253]",MISC
948,.,"[873, 241, 897, 253]",MISC
949,0,"[873, 241, 897, 253]",MISC
950,to,"[898, 241, 914, 253]",MISC
951,11,"[914, 241, 954, 253]",MISC
952,.,"[914, 241, 954, 253]",MISC
953,0,"[914, 241, 954, 253]",MISC
954,.,"[914, 241, 954, 253]",MISC
955,-,"[956, 241, 958, 253]",MISC
956,NL,"[956, 241, 958, 253]",MISC
957,-,"[956, 241, 958, 253]",MISC
958,Auto,"[360, 253, 444, 266]",MISC
959,##mation,"[360, 253, 444, 266]",MISC
960,and,"[444, 253, 468, 266]",MISC
961,Fun,"[469, 253, 553, 266]",MISC
962,##ctional,"[469, 253, 553, 266]",MISC
963,testing,"[553, 253, 612, 266]",MISC
964,of,"[612, 253, 629, 266]",MISC
965,the,"[629, 253, 653, 266]",MISC
966,various,"[654, 253, 713, 266]",MISC
967,modules,"[713, 253, 771, 266]",MISC
968,of,"[772, 253, 788, 266]",MISC
969,product,"[789, 253, 847, 266]",MISC
970,including,"[848, 253, 922, 266]",MISC
971,screens,"[923, 253, 989, 266]",MISC
972,",","[923, 253, 989, 266]",MISC
973,-,"[990, 253, 992, 266]",MISC
974,NL,"[990, 253, 992, 266]",MISC
975,-,"[990, 253, 992, 266]",MISC
976,API,"[360, 266, 393, 278]",MISC
977,##s,"[360, 266, 393, 278]",MISC
978,&,"[394, 266, 401, 278]",MISC
979,Reports,"[402, 266, 470, 278]",MISC
980,.,"[402, 266, 470, 278]",MISC
981,Testing,"[470, 266, 529, 278]",MISC
982,involved,"[529, 266, 597, 278]",MISC
983,automation,"[597, 266, 681, 278]",MISC
984,script,"[682, 266, 766, 278]",MISC
985,##ing,"[682, 266, 766, 278]",MISC
986,",","[682, 266, 766, 278]",MISC
987,de,"[767, 266, 841, 278]",MISC
988,##bu,"[767, 266, 841, 278]",MISC
989,##gging,"[767, 266, 841, 278]",MISC
990,and,"[843, 266, 866, 278]",MISC
991,execution,"[868, 266, 943, 278]",MISC
992,of,"[944, 266, 961, 278]",MISC
993,-,"[961, 266, 963, 278]",MISC
994,NL,"[961, 266, 963, 278]",MISC
995,-,"[961, 266, 963, 278]",MISC
996,scripts,"[360, 279, 417, 292]",MISC
997,during,"[418, 279, 467, 292]",MISC
998,Fun,"[467, 279, 549, 292]",MISC
999,##ctional,"[467, 279, 549, 292]",MISC
1000,and,"[550, 279, 573, 292]",MISC
1001,Reg,"[574, 279, 656, 292]",MISC
1002,##ression,"[574, 279, 656, 292]",MISC
1003,testing,"[657, 279, 713, 292]",MISC
1004,phases,"[714, 279, 771, 292]",MISC
1005,.,"[714, 279, 771, 292]",MISC
1006,-,"[772, 279, 774, 292]",MISC
1007,NL,"[772, 279, 774, 292]",MISC
1008,-,"[772, 279, 774, 292]",MISC
1009,Re,"[114, 297, 229, 306]",MISC
1010,##sp,"[114, 297, 229, 306]",MISC
1011,##ons,"[114, 297, 229, 306]",MISC
1012,##ibi,"[114, 297, 229, 306]",MISC
1013,##lities,"[114, 297, 229, 306]",MISC
1014,-,"[229, 297, 231, 306]",MISC
1015,NL,"[229, 297, 231, 306]",MISC
1016,-,"[229, 297, 231, 306]",MISC
1017,Main,"[402, 297, 487, 306]",MISC
1018,##tain,"[402, 297, 487, 306]",MISC
1019,##ed,"[402, 297, 487, 306]",MISC
1020,Trace,"[488, 297, 590, 306]",MISC
1021,##ability,"[488, 297, 590, 306]",MISC
1022,Matrix,"[591, 297, 642, 306]",MISC
1023,to,"[643, 297, 659, 306]",MISC
1024,track,"[660, 297, 702, 306]",MISC
1025,the,"[703, 297, 729, 306]",MISC
1026,requirements,"[729, 297, 831, 306]",MISC
1027,to,"[832, 297, 849, 306]",MISC
1028,the,"[850, 297, 875, 306]",MISC
1029,test,"[876, 297, 908, 306]",MISC
1030,cases,"[910, 297, 952, 306]",MISC
1031,to,"[953, 297, 970, 306]",MISC
1032,-,"[970, 297, 972, 306]",MISC
1033,NL,"[970, 297, 972, 306]",MISC
1034,-,"[970, 297, 972, 306]",MISC
1035,ensure,"[426, 306, 477, 319]",MISC
1036,complete,"[477, 306, 544, 319]",MISC
1037,test,"[545, 306, 578, 319]",MISC
1038,coverage,"[579, 306, 646, 319]",MISC
1039,in,"[647, 306, 663, 319]",MISC
1040,the,"[664, 306, 689, 319]",MISC
1041,Quality,"[689, 306, 748, 319]",MISC
1042,Center,"[749, 306, 807, 319]",MISC
1043,.,"[749, 306, 807, 319]",MISC
1044,-,"[808, 306, 810, 319]",MISC
1045,NL,"[808, 306, 810, 319]",MISC
1046,-,"[808, 306, 810, 319]",MISC
1047,Used,"[402, 324, 434, 334]",MISC
1048,Se,"[436, 324, 503, 334]",MISC
1049,##len,"[436, 324, 503, 334]",MISC
1050,##ium,"[436, 324, 503, 334]",MISC
1051,Web,"[505, 324, 582, 334]",MISC
1052,##D,"[505, 324, 582, 334]",MISC
1053,##river,"[505, 324, 582, 334]",MISC
1054,for,"[583, 324, 608, 334]",MISC
1055,writing,"[609, 324, 669, 334]",MISC
1056,test,"[669, 324, 702, 334]",MISC
1057,scripts,"[704, 324, 764, 334]",MISC
1058,for,"[764, 324, 790, 334]",MISC
1059,re,"[790, 324, 876, 334]",MISC
1060,##gression,"[790, 324, 876, 334]",MISC
1061,test,"[876, 324, 909, 334]",MISC
1062,coverage,"[911, 324, 987, 334]",MISC
1063,.,"[911, 324, 987, 334]",MISC
1064,-,"[989, 324, 990, 334]",MISC
1065,NL,"[989, 324, 990, 334]",MISC
1066,-,"[989, 324, 990, 334]",MISC
1067,Used,"[403, 339, 441, 347]",MISC
1068,Ma,"[441, 339, 488, 347]",MISC
1069,##ven,"[441, 339, 488, 347]",MISC
1070,to,"[489, 339, 507, 347]",MISC
1071,build,"[508, 339, 555, 347]",MISC
1072,and,"[556, 339, 583, 347]",MISC
1073,run,"[585, 339, 612, 347]",MISC
1074,the,"[613, 339, 641, 347]",MISC
1075,Se,"[642, 339, 719, 347]",MISC
1076,##len,"[642, 339, 719, 347]",MISC
1077,##ium,"[642, 339, 719, 347]",MISC
1078,automation,"[719, 339, 814, 347]",MISC
1079,framework,"[815, 339, 900, 347]",MISC
1080,-,"[901, 339, 903, 347]",MISC
1081,NL,"[901, 339, 903, 347]",MISC
1082,-,"[901, 339, 903, 347]",MISC
1083,Updated,"[402, 352, 468, 361]",MISC
1084,Test,"[469, 352, 505, 361]",MISC
1085,Plans,"[506, 352, 552, 361]",MISC
1086,and,"[554, 352, 581, 361]",MISC
1087,Test,"[582, 352, 618, 361]",MISC
1088,Case,"[620, 352, 665, 361]",MISC
1089,##s,"[620, 352, 665, 361]",MISC
1090,periodically,"[667, 352, 780, 361]",MISC
1091,to,"[781, 352, 799, 361]",MISC
1092,manage,"[799, 352, 856, 361]",MISC
1093,changes,"[856, 352, 922, 361]",MISC
1094,in,"[922, 352, 941, 361]",MISC
1095,-,"[941, 352, 943, 361]",MISC
1096,NL,"[941, 352, 943, 361]",MISC
1097,-,"[941, 352, 943, 361]",MISC
1098,requirements,"[426, 362, 526, 375]",MISC
1099,.,"[426, 362, 526, 375]",MISC
1100,-,"[526, 362, 528, 375]",MISC
1101,NL,"[526, 362, 528, 375]",MISC
1102,-,"[526, 362, 528, 375]",MISC
1103,Created,"[402, 379, 466, 388]",MISC
1104,and,"[466, 379, 494, 388]",MISC
1105,enhanced,"[494, 379, 567, 388]",MISC
1106,numerous,"[567, 379, 640, 388]",MISC
1107,test,"[640, 379, 677, 388]",MISC
1108,scripts,"[677, 379, 741, 388]",MISC
1109,to,"[741, 379, 759, 388]",MISC
1110,handle,"[759, 379, 814, 388]",MISC
1111,changes,"[814, 379, 878, 388]",MISC
1112,in,"[879, 379, 897, 388]",MISC
1113,the,"[897, 379, 924, 388]",MISC
1114,objects,"[924, 379, 997, 388]",MISC
1115,",","[924, 379, 997, 388]",MISC
1116,-,"[998, 379, 1000, 388]",MISC
1117,NL,"[998, 379, 1000, 388]",MISC
1118,-,"[998, 379, 1000, 388]",MISC
1119,in,"[426, 388, 442, 400]",MISC
1120,the,"[442, 388, 466, 400]",MISC
1121,tested,"[467, 388, 517, 400]",MISC
1122,applications,"[518, 388, 618, 400]",MISC
1123,G,"[618, 388, 641, 400]",MISC
1124,##UI,"[618, 388, 641, 400]",MISC
1125,and,"[643, 388, 667, 400]",MISC
1126,in,"[668, 388, 684, 400]",MISC
1127,the,"[685, 388, 708, 400]",MISC
1128,testing,"[710, 388, 775, 400]",MISC
1129,",","[710, 388, 775, 400]",MISC
1130,environment,"[776, 388, 868, 400]",MISC
1131,-,"[868, 388, 870, 400]",MISC
1132,NL,"[868, 388, 870, 400]",MISC
1133,-,"[868, 388, 870, 400]",MISC
1134,using,"[426, 402, 468, 414]",MISC
1135,Se,"[469, 402, 536, 414]",MISC
1136,##len,"[469, 402, 536, 414]",MISC
1137,##ium,"[469, 402, 536, 414]",MISC
1138,Web,"[538, 402, 624, 414]",MISC
1139,##D,"[538, 402, 624, 414]",MISC
1140,##river,"[538, 402, 624, 414]",MISC
1141,.,"[538, 402, 624, 414]",MISC
1142,-,"[624, 402, 626, 414]",MISC
1143,NL,"[624, 402, 626, 414]",MISC
1144,-,"[624, 402, 626, 414]",MISC
1145,In,"[402, 419, 471, 428]",MISC
1146,##volved,"[402, 419, 471, 428]",MISC
1147,in,"[472, 419, 489, 428]",MISC
1148,the,"[490, 419, 515, 428]",MISC
1149,Con,"[516, 419, 604, 428]",MISC
1150,##tin,"[516, 419, 604, 428]",MISC
1151,##uous,"[516, 419, 604, 428]",MISC
1152,Integration,"[604, 419, 701, 428]",MISC
1153,of,"[701, 419, 717, 428]",MISC
1154,the,"[718, 419, 744, 428]",MISC
1155,automation,"[745, 419, 832, 428]",MISC
1156,framework,"[833, 419, 911, 428]",MISC
1157,-,"[912, 419, 914, 428]",MISC
1158,NL,"[912, 419, 914, 428]",MISC
1159,-,"[912, 419, 914, 428]",MISC
1160,with,"[426, 428, 457, 440]",MISC
1161,Jenkins,"[457, 428, 519, 440]",MISC
1162,.,"[457, 428, 519, 440]",MISC
1163,-,"[519, 428, 520, 440]",MISC
1164,NL,"[519, 428, 520, 440]",MISC
1165,-,"[519, 428, 520, 440]",MISC
1166,Created,"[402, 445, 462, 455]",MISC
1167,test,"[462, 445, 497, 455]",MISC
1168,cases,"[497, 445, 539, 455]",MISC
1169,for,"[541, 445, 566, 455]",MISC
1170,U,"[567, 445, 592, 455]",MISC
1171,##AT,"[567, 445, 592, 455]",MISC
1172,environment,"[593, 445, 687, 455]",MISC
1173,at,"[688, 445, 705, 455]",MISC
1174,client,"[706, 445, 757, 455]",MISC
1175,site,"[758, 445, 792, 455]",MISC
1176,in,"[793, 445, 809, 455]",MISC
1177,collaboration,"[810, 445, 923, 455]",MISC
1178,with,"[923, 445, 957, 455]",MISC
1179,-,"[958, 445, 959, 455]",MISC
1180,NL,"[958, 445, 959, 455]",MISC
1181,-,"[958, 445, 959, 455]",MISC
1182,client,"[426, 455, 484, 467]",MISC
1183,’,"[426, 455, 484, 467]",MISC
1184,s,"[426, 455, 484, 467]",MISC
1185,functional,"[485, 455, 558, 467]",MISC
1186,team,"[558, 455, 595, 467]",MISC
1187,.,"[558, 455, 595, 467]",MISC
1188,-,"[595, 455, 597, 467]",MISC
1189,NL,"[595, 455, 597, 467]",MISC
1190,-,"[595, 455, 597, 467]",MISC
1191,Was,"[402, 472, 430, 481]",MISC
1192,part,"[430, 472, 467, 481]",MISC
1193,of,"[468, 472, 486, 481]",MISC
1194,A,"[486, 472, 532, 481]",MISC
1195,##gi,"[486, 472, 532, 481]",MISC
1196,##le,"[486, 472, 532, 481]",MISC
1197,Sc,"[533, 472, 579, 481]",MISC
1198,##rum,"[533, 472, 579, 481]",MISC
1199,methodology,"[580, 472, 682, 481]",MISC
1200,and,"[682, 472, 710, 481]",MISC
1201,was,"[710, 472, 738, 481]",MISC
1202,part,"[738, 472, 775, 481]",MISC
1203,of,"[776, 472, 794, 481]",MISC
1204,Daily,"[794, 472, 840, 481]",MISC
1205,Sc,"[841, 472, 887, 481]",MISC
1206,##rum,"[841, 472, 887, 481]",MISC
1207,call,"[888, 472, 933, 481]",MISC
1208,",","[888, 472, 933, 481]",MISC
1209,Sprint,"[934, 472, 989, 481]",MISC
1210,-,"[990, 472, 992, 481]",MISC
1211,NL,"[990, 472, 992, 481]",MISC
1212,-,"[990, 472, 992, 481]",MISC
1213,planning,"[426, 482, 489, 495]",MISC
1214,and,"[490, 482, 513, 495]",MISC
1215,Sprint,"[514, 482, 561, 495]",MISC
1216,Re,"[562, 482, 665, 495]",MISC
1217,##tro,"[562, 482, 665, 495]",MISC
1218,##spective,"[562, 482, 665, 495]",MISC
1219,calls,"[666, 482, 713, 495]",MISC
1220,.,"[666, 482, 713, 495]",MISC
1221,-,"[714, 482, 715, 495]",MISC
1222,NL,"[714, 482, 715, 495]",MISC
1223,-,"[714, 482, 715, 495]",MISC
1224,Project,"[114, 527, 171, 539]",MISC
1225,2,"[172, 527, 179, 539]",MISC
1226,-,"[180, 527, 182, 539]",MISC
1227,NL,"[180, 527, 182, 539]",MISC
1228,-,"[180, 527, 182, 539]",MISC
1229,V,"[360, 527, 400, 539]",B-project_title
1230,##ault,"[360, 527, 400, 539]",I-project_title
1231,Sol,"[401, 527, 465, 539]",I-project_title
1232,##ution,"[401, 527, 465, 539]",I-project_title
1233,Services,"[466, 527, 571, 539]",I-project_title
1234,(,"[466, 527, 571, 539]",I-project_title
1235,V,"[466, 527, 571, 539]",I-project_title
1236,##SS,"[466, 527, 571, 539]",I-project_title
1237,),"[466, 527, 571, 539]",I-project_title
1238,-,"[571, 527, 573, 539]",MISC
1239,NL,"[571, 527, 573, 539]",MISC
1240,-,"[571, 527, 573, 539]",MISC
1241,Custom,"[114, 543, 185, 555]",MISC
1242,##er,"[114, 543, 185, 555]",MISC
1243,-,"[185, 543, 187, 555]",MISC
1244,NL,"[185, 543, 187, 555]",MISC
1245,-,"[185, 543, 187, 555]",MISC
1246,Bank,"[360, 543, 397, 555]",MISC
1247,Of,"[398, 543, 416, 555]",MISC
1248,America,"[417, 543, 483, 555]",MISC
1249,-,"[484, 543, 486, 555]",MISC
1250,NL,"[484, 543, 486, 555]",MISC
1251,-,"[484, 543, 486, 555]",MISC
1252,Organization,"[114, 560, 207, 573]",MISC
1253,-,"[207, 560, 209, 573]",MISC
1254,NL,"[207, 560, 209, 573]",MISC
1255,-,"[207, 560, 209, 573]",MISC
1256,In,"[360, 560, 415, 573]",B-project_company_name
1257,##fo,"[360, 560, 415, 573]",I-project_company_name
1258,##sy,"[360, 560, 415, 573]",I-project_company_name
1259,##s,"[360, 560, 415, 573]",I-project_company_name
1260,Ltd,"[415, 560, 437, 573]",I-project_company_name
1261,-,"[438, 560, 440, 573]",MISC
1262,NL,"[438, 560, 440, 573]",MISC
1263,-,"[438, 560, 440, 573]",MISC
1264,Testing,"[114, 576, 174, 589]",MISC
1265,A,"[175, 576, 242, 589]",MISC
1266,##pp,"[175, 576, 242, 589]",MISC
1267,##roach,"[175, 576, 242, 589]",MISC
1268,-,"[244, 576, 245, 589]",MISC
1269,NL,"[244, 576, 245, 589]",MISC
1270,-,"[244, 576, 245, 589]",MISC
1271,Auto,"[360, 576, 448, 589]",MISC
1272,##mation,"[360, 576, 448, 589]",MISC
1273,(,"[449, 576, 484, 589]",MISC
1274,B,"[449, 576, 484, 589]",MISC
1275,##D,"[449, 576, 484, 589]",MISC
1276,##D,"[449, 576, 484, 589]",MISC
1277,framework,"[484, 576, 572, 589]",MISC
1278,),"[484, 576, 572, 589]",MISC
1279,-,"[573, 576, 575, 589]",MISC
1280,NL,"[573, 576, 575, 589]",MISC
1281,-,"[573, 576, 575, 589]",MISC
1282,Technology,"[114, 592, 200, 605]",MISC
1283,-,"[200, 592, 202, 605]",MISC
1284,NL,"[200, 592, 202, 605]",MISC
1285,-,"[200, 592, 202, 605]",MISC
1286,Web,"[360, 592, 393, 605]",MISC
1287,-,"[393, 592, 395, 605]",MISC
1288,NL,"[393, 592, 395, 605]",MISC
1289,-,"[393, 592, 395, 605]",MISC
1290,Too,"[114, 608, 160, 621]",MISC
1291,##ls,"[114, 608, 160, 621]",MISC
1292,Used,"[161, 608, 197, 621]",MISC
1293,-,"[198, 608, 200, 621]",MISC
1294,NL,"[198, 608, 200, 621]",MISC
1295,-,"[198, 608, 200, 621]",MISC
1296,Se,"[360, 608, 429, 621]",MISC
1297,##len,"[360, 608, 429, 621]",MISC
1298,##ium,"[360, 608, 429, 621]",MISC
1299,Web,"[430, 608, 509, 621]",MISC
1300,##D,"[430, 608, 509, 621]",MISC
1301,##river,"[430, 608, 509, 621]",MISC
1302,-,"[510, 608, 511, 621]",MISC
1303,NL,"[510, 608, 511, 621]",MISC
1304,-,"[510, 608, 511, 621]",MISC
1305,SD,"[114, 625, 153, 637]",MISC
1306,##LC,"[114, 625, 153, 637]",MISC
1307,Process,"[153, 625, 221, 637]",MISC
1308,-,"[222, 625, 224, 637]",MISC
1309,NL,"[222, 625, 224, 637]",MISC
1310,-,"[222, 625, 224, 637]",MISC
1311,A,"[360, 625, 402, 637]",MISC
1312,##gi,"[360, 625, 402, 637]",MISC
1313,##le,"[360, 625, 402, 637]",MISC
1314,Method,"[402, 625, 493, 637]",MISC
1315,##ology,"[402, 625, 493, 637]",MISC
1316,-,"[495, 625, 497, 637]",MISC
1317,NL,"[495, 625, 497, 637]",MISC
1318,-,"[495, 625, 497, 637]",MISC
1319,Role,"[114, 641, 149, 653]",MISC
1320,-,"[149, 641, 151, 653]",MISC
1321,NL,"[149, 641, 151, 653]",MISC
1322,-,"[149, 641, 151, 653]",MISC
1323,Senior,"[360, 641, 413, 653]",B-employer_role
1324,System,"[413, 641, 466, 653]",I-employer_role
1325,Engineer,"[466, 641, 535, 653]",I-employer_role
1326,-,"[537, 641, 539, 653]",MISC
1327,NL,"[537, 641, 539, 653]",MISC
1328,-,"[537, 641, 539, 653]",MISC
1329,Period,"[114, 657, 162, 669]",MISC
1330,-,"[162, 657, 163, 669]",MISC
1331,NL,"[162, 657, 163, 669]",MISC
1332,-,"[162, 657, 163, 669]",MISC
1333,Dec,"[360, 657, 389, 669]",MISC
1334,2016,"[390, 657, 430, 669]",MISC
1335,-,"[431, 657, 440, 669]",MISC
1336,Jan,"[441, 657, 470, 669]",MISC
1337,2017,"[471, 657, 511, 669]",MISC
1338,-,"[511, 657, 513, 669]",MISC
1339,NL,"[511, 657, 513, 669]",MISC
1340,-,"[511, 657, 513, 669]",MISC
1341,Des,"[114, 673, 196, 685]",MISC
1342,##cription,"[114, 673, 196, 685]",MISC
1343,-,"[196, 673, 198, 685]",MISC
1344,NL,"[196, 673, 198, 685]",MISC
1345,-,"[196, 673, 198, 685]",MISC
1346,This,"[360, 673, 393, 685]",MISC
1347,banking,"[393, 673, 450, 685]",MISC
1348,application,"[452, 673, 543, 685]",MISC
1349,provides,"[543, 673, 608, 685]",MISC
1350,central,"[609, 673, 666, 685]",MISC
1351,place,"[667, 673, 708, 685]",MISC
1352,for,"[709, 673, 733, 685]",MISC
1353,all,"[734, 673, 758, 685]",MISC
1354,cash,"[759, 673, 792, 685]",MISC
1355,vault,"[792, 673, 849, 685]",MISC
1356,##s,"[792, 673, 849, 685]",MISC
1357,.,"[792, 673, 849, 685]",MISC
1358,To,"[850, 673, 867, 685]",MISC
1359,meet,"[867, 673, 900, 685]",MISC
1360,the,"[900, 673, 924, 685]",MISC
1361,day,"[925, 673, 981, 685]",MISC
1362,-,"[925, 673, 981, 685]",MISC
1363,to,"[925, 673, 981, 685]",MISC
1364,-,"[925, 673, 981, 685]",MISC
1365,-,"[983, 673, 985, 685]",MISC
1366,NL,"[983, 673, 985, 685]",MISC
1367,-,"[983, 673, 985, 685]",MISC
1368,day,"[360, 686, 386, 699]",MISC
1369,business,"[386, 686, 455, 699]",MISC
1370,needs,"[455, 686, 506, 699]",MISC
1371,.,"[455, 686, 506, 699]",MISC
1372,Cash,"[507, 686, 542, 699]",MISC
1373,vault,"[542, 686, 593, 699]",MISC
1374,##s,"[542, 686, 593, 699]",MISC
1375,providing,"[594, 686, 671, 699]",MISC
1376,safe,"[672, 686, 714, 699]",MISC
1377,",","[672, 686, 714, 699]",MISC
1378,secure,"[715, 686, 766, 699]",MISC
1379,and,"[767, 686, 793, 699]",MISC
1380,accurate,"[793, 686, 863, 699]",MISC
1381,processing,"[863, 686, 948, 699]",MISC
1382,of,"[949, 686, 966, 699]",MISC
1383,-,"[967, 686, 969, 699]",MISC
1384,NL,"[967, 686, 969, 699]",MISC
1385,-,"[967, 686, 969, 699]",MISC
1386,coin,"[360, 699, 402, 711]",MISC
1387,",","[360, 699, 402, 711]",MISC
1388,currency,"[402, 699, 470, 711]",MISC
1389,and,"[470, 699, 493, 711]",MISC
1390,check,"[495, 699, 537, 711]",MISC
1391,deposits,"[537, 699, 612, 711]",MISC
1392,.,"[537, 699, 612, 711]",MISC
1393,Auto,"[613, 699, 697, 711]",MISC
1394,##mation,"[613, 699, 697, 711]",MISC
1395,and,"[697, 699, 721, 711]",MISC
1396,Fun,"[722, 699, 806, 711]",MISC
1397,##ctional,"[722, 699, 806, 711]",MISC
1398,testing,"[807, 699, 865, 711]",MISC
1399,of,"[866, 699, 882, 711]",MISC
1400,the,"[882, 699, 906, 711]",MISC
1401,various,"[908, 699, 966, 711]",MISC
1402,-,"[967, 699, 969, 711]",MISC
1403,NL,"[967, 699, 969, 711]",MISC
1404,-,"[967, 699, 969, 711]",MISC
1405,modules,"[360, 711, 415, 724]",MISC
1406,of,"[416, 711, 431, 724]",MISC
1407,Virtual,"[433, 711, 487, 724]",MISC
1408,V,"[489, 711, 536, 724]",MISC
1409,##end,"[489, 711, 536, 724]",MISC
1410,##or,"[489, 711, 536, 724]",MISC
1411,V,"[537, 711, 577, 724]",MISC
1412,##ault,"[537, 711, 577, 724]",MISC
1413,application,"[577, 711, 674, 724]",MISC
1414,.,"[577, 711, 674, 724]",MISC
1415,Testing,"[674, 711, 729, 724]",MISC
1416,involved,"[730, 711, 794, 724]",MISC
1417,automation,"[795, 711, 875, 724]",MISC
1418,script,"[875, 711, 955, 724]",MISC
1419,##ing,"[875, 711, 955, 724]",MISC
1420,",","[875, 711, 955, 724]",MISC
1421,-,"[956, 711, 958, 724]",MISC
1422,NL,"[956, 711, 958, 724]",MISC
1423,-,"[956, 711, 958, 724]",MISC
1424,de,"[360, 725, 435, 737]",MISC
1425,##bu,"[360, 725, 435, 737]",MISC
1426,##gging,"[360, 725, 435, 737]",MISC
1427,and,"[436, 725, 460, 737]",MISC
1428,execution,"[462, 725, 536, 737]",MISC
1429,of,"[538, 725, 554, 737]",MISC
1430,scripts,"[555, 725, 613, 737]",MISC
1431,during,"[614, 725, 663, 737]",MISC
1432,Fun,"[665, 725, 748, 737]",MISC
1433,##ctional,"[665, 725, 748, 737]",MISC
1434,and,"[749, 725, 773, 737]",MISC
1435,Reg,"[775, 725, 858, 737]",MISC
1436,##ression,"[775, 725, 858, 737]",MISC
1437,testing,"[859, 725, 918, 737]",MISC
1438,phases,"[918, 725, 977, 737]",MISC
1439,.,"[918, 725, 977, 737]",MISC
1440,-,"[978, 725, 979, 737]",MISC
1441,NL,"[978, 725, 979, 737]",MISC
1442,-,"[978, 725, 979, 737]",MISC
1443,Role,"[114, 743, 240, 753]",MISC
1444,(,"[114, 743, 240, 753]",MISC
1445,Dev,"[114, 743, 240, 753]",MISC
1446,##elo,"[114, 743, 240, 753]",MISC
1447,##per,"[114, 743, 240, 753]",MISC
1448,),"[114, 743, 240, 753]",MISC
1449,&,"[241, 743, 248, 753]",MISC
1450,-,"[249, 743, 251, 753]",MISC
1451,NL,"[249, 743, 251, 753]",MISC
1452,-,"[249, 743, 251, 753]",MISC
1453,El,"[402, 743, 494, 753]",MISC
1454,##ab,"[402, 743, 494, 753]",MISC
1455,##ora,"[402, 743, 494, 753]",MISC
1456,##ting,"[402, 743, 494, 753]",MISC
1457,the,"[496, 743, 521, 753]",MISC
1458,features,"[522, 743, 589, 753]",MISC
1459,to,"[590, 743, 607, 753]",MISC
1460,positive,"[608, 743, 675, 753]",MISC
1461,and,"[676, 743, 702, 753]",MISC
1462,negative,"[702, 743, 769, 753]",MISC
1463,scenarios,"[771, 743, 847, 753]",MISC
1464,with,"[848, 743, 881, 753]",MISC
1465,parameter,"[882, 743, 994, 753]",MISC
1466,##ized,"[882, 743, 994, 753]",MISC
1467,-,"[994, 743, 996, 753]",MISC
1468,NL,"[994, 743, 996, 753]",MISC
1469,-,"[994, 743, 996, 753]",MISC
1470,Re,"[114, 753, 229, 766]",MISC
1471,##sp,"[114, 753, 229, 766]",MISC
1472,##ons,"[114, 753, 229, 766]",MISC
1473,##ibi,"[114, 753, 229, 766]",MISC
1474,##lities,"[114, 753, 229, 766]",MISC
1475,-,"[229, 753, 231, 766]",MISC
1476,NL,"[229, 753, 231, 766]",MISC
1477,-,"[229, 753, 231, 766]",MISC
1478,Data,"[426, 753, 460, 766]",MISC
1479,-,"[460, 753, 462, 766]",MISC
1480,NL,"[460, 753, 462, 766]",MISC
1481,-,"[460, 753, 462, 766]",MISC
1482,I,"[402, 771, 504, 779]",MISC
1483,##mple,"[402, 771, 504, 779]",MISC
1484,##mented,"[402, 771, 504, 779]",MISC
1485,Page,"[504, 771, 541, 779]",MISC
1486,O,"[541, 771, 605, 779]",MISC
1487,##bject,"[541, 771, 605, 779]",MISC
1488,##s,"[541, 771, 605, 779]",MISC
1489,framework,"[606, 771, 697, 779]",MISC
1490,",","[606, 771, 697, 779]",MISC
1491,module,"[699, 771, 810, 779]",MISC
1492,-,"[699, 771, 810, 779]",MISC
1493,based,"[699, 771, 810, 779]",MISC
1494,framework,"[810, 771, 901, 779]",MISC
1495,.,"[810, 771, 901, 779]",MISC
1496,-,"[903, 771, 905, 779]",MISC
1497,NL,"[903, 771, 905, 779]",MISC
1498,-,"[903, 771, 905, 779]",MISC
1499,Auto,"[402, 784, 491, 794]",MISC
1500,##mat,"[402, 784, 491, 794]",MISC
1501,##ing,"[402, 784, 491, 794]",MISC
1502,the,"[492, 784, 517, 794]",MISC
1503,features,"[518, 784, 589, 794]",MISC
1504,using,"[590, 784, 634, 794]",MISC
1505,Se,"[635, 784, 706, 794]",MISC
1506,##len,"[635, 784, 706, 794]",MISC
1507,##ium,"[635, 784, 706, 794]",MISC
1508,and,"[707, 784, 732, 794]",MISC
1509,developed,"[734, 784, 814, 794]",MISC
1510,re,"[814, 784, 885, 794]",MISC
1511,##usa,"[814, 784, 885, 794]",MISC
1512,##ble,"[814, 784, 885, 794]",MISC
1513,functions,"[886, 784, 966, 794]",MISC
1514,-,"[967, 784, 969, 794]",MISC
1515,NL,"[967, 784, 969, 794]",MISC
1516,-,"[967, 784, 969, 794]",MISC
1517,used,"[426, 794, 459, 806]",MISC
1518,across,"[459, 794, 508, 806]",MISC
1519,the,"[508, 794, 532, 806]",MISC
1520,project,"[533, 794, 598, 806]",MISC
1521,.,"[533, 794, 598, 806]",MISC
1522,-,"[599, 794, 601, 806]",MISC
1523,NL,"[599, 794, 601, 806]",MISC
1524,-,"[599, 794, 601, 806]",MISC
1525,Tests,"[402, 811, 448, 820]",MISC
1526,execution,"[448, 811, 530, 820]",MISC
1527,and,"[530, 811, 557, 820]",MISC
1528,Rai,"[557, 811, 621, 820]",MISC
1529,##sing,"[557, 811, 621, 820]",MISC
1530,New,"[621, 811, 648, 820]",MISC
1531,De,"[648, 811, 712, 820]",MISC
1532,##fect,"[648, 811, 712, 820]",MISC
1533,##s,"[648, 811, 712, 820]",MISC
1534,and,"[712, 811, 739, 820]",MISC
1535,Track,"[739, 811, 812, 820]",MISC
1536,##ing,"[739, 811, 812, 820]",MISC
1537,De,"[812, 811, 876, 820]",MISC
1538,##fect,"[812, 811, 876, 820]",MISC
1539,##s,"[812, 811, 876, 820]",MISC
1540,using,"[876, 811, 921, 820]",MISC
1541,Ji,"[921, 811, 967, 820]",MISC
1542,##ra,"[921, 811, 967, 820]",MISC
1543,.,"[921, 811, 967, 820]",MISC
1544,-,"[967, 811, 969, 820]",MISC
1545,NL,"[967, 811, 969, 820]",MISC
1546,-,"[967, 811, 969, 820]",MISC
1547,Schedule,"[402, 825, 486, 835]",MISC
1548,##d,"[402, 825, 486, 835]",MISC
1549,Review,"[487, 825, 541, 835]",MISC
1550,Meeting,"[543, 825, 607, 835]",MISC
1551,for,"[608, 825, 636, 835]",MISC
1552,Test,"[636, 825, 673, 835]",MISC
1553,Sc,"[674, 825, 767, 835]",MISC
1554,##ena,"[674, 825, 767, 835]",MISC
1555,##rio,"[674, 825, 767, 835]",MISC
1556,##s,"[674, 825, 767, 835]",MISC
1557,",","[674, 825, 767, 835]",MISC
1558,Test,"[767, 825, 804, 835]",MISC
1559,Case,"[805, 825, 860, 835]",MISC
1560,##s,"[805, 825, 860, 835]",MISC
1561,",","[805, 825, 860, 835]",MISC
1562,and,"[861, 825, 888, 835]",MISC
1563,Test,"[889, 825, 926, 835]",MISC
1564,-,"[927, 825, 928, 835]",MISC
1565,NL,"[927, 825, 928, 835]",MISC
1566,-,"[927, 825, 928, 835]",MISC
1567,Con,"[426, 835, 508, 847]",MISC
1568,##ditions,"[426, 835, 508, 847]",MISC
1569,covered,"[509, 835, 565, 847]",MISC
1570,based,"[567, 835, 607, 847]",MISC
1571,on,"[608, 835, 625, 847]",MISC
1572,Fun,"[625, 835, 707, 847]",MISC
1573,##ctional,"[625, 835, 707, 847]",MISC
1574,specifications,"[708, 835, 823, 847]",MISC
1575,with,"[824, 835, 857, 847]",MISC
1576,Sub,"[857, 835, 914, 847]",MISC
1577,##ject,"[857, 835, 914, 847]",MISC
1578,Matter,"[915, 835, 964, 847]",MISC
1579,-,"[965, 835, 967, 847]",MISC
1580,NL,"[965, 835, 967, 847]",MISC
1581,-,"[965, 835, 967, 847]",MISC
1582,Ex,"[426, 849, 484, 861]",MISC
1583,##pert,"[426, 849, 484, 861]",MISC
1584,",","[426, 849, 484, 861]",MISC
1585,Development,"[485, 849, 578, 861]",MISC
1586,offshore,"[578, 849, 645, 861]",MISC
1587,team,"[646, 849, 688, 861]",MISC
1588,.,"[646, 849, 688, 861]",MISC
1589,-,"[688, 849, 690, 861]",MISC
1590,NL,"[688, 849, 690, 861]",MISC
1591,-,"[688, 849, 690, 861]",MISC
1592,In,"[402, 865, 471, 875]",MISC
1593,##volved,"[402, 865, 471, 875]",MISC
1594,in,"[472, 865, 489, 875]",MISC
1595,the,"[490, 865, 515, 875]",MISC
1596,Con,"[516, 865, 604, 875]",MISC
1597,##tin,"[516, 865, 604, 875]",MISC
1598,##uous,"[516, 865, 604, 875]",MISC
1599,Integration,"[604, 865, 701, 875]",MISC
1600,of,"[701, 865, 717, 875]",MISC
1601,the,"[718, 865, 744, 875]",MISC
1602,automation,"[745, 865, 832, 875]",MISC
1603,framework,"[833, 865, 911, 875]",MISC
1604,-,"[912, 865, 914, 875]",MISC
1605,NL,"[912, 865, 914, 875]",MISC
1606,-,"[912, 865, 914, 875]",MISC
1607,with,"[426, 875, 457, 887]",MISC
1608,Jenkins,"[457, 875, 519, 887]",MISC
1609,.,"[457, 875, 519, 887]",MISC
1610,-,"[519, 875, 520, 887]",MISC
1611,NL,"[519, 875, 520, 887]",MISC
1612,-,"[519, 875, 520, 887]",MISC
1613,Was,"[402, 892, 430, 902]",MISC
1614,part,"[430, 892, 467, 902]",MISC
1615,of,"[468, 892, 486, 902]",MISC
1616,A,"[486, 892, 532, 902]",MISC
1617,##gi,"[486, 892, 532, 902]",MISC
1618,##le,"[486, 892, 532, 902]",MISC
1619,Sc,"[533, 892, 579, 902]",MISC
1620,##rum,"[533, 892, 579, 902]",MISC
1621,methodology,"[580, 892, 682, 902]",MISC
1622,and,"[682, 892, 710, 902]",MISC
1623,was,"[710, 892, 738, 902]",MISC
1624,part,"[738, 892, 775, 902]",MISC
1625,of,"[776, 892, 794, 902]",MISC
1626,Daily,"[794, 892, 840, 902]",MISC
1627,Sc,"[841, 892, 887, 902]",MISC
1628,##rum,"[841, 892, 887, 902]",MISC
1629,call,"[888, 892, 933, 902]",MISC
1630,",","[888, 892, 933, 902]",MISC
1631,Sprint,"[934, 892, 989, 902]",MISC
1632,-,"[990, 892, 992, 902]",MISC
1633,NL,"[990, 892, 992, 902]",MISC
1634,-,"[990, 892, 992, 902]",MISC
1635,planning,"[426, 902, 489, 914]",MISC
1636,and,"[490, 902, 513, 914]",MISC
1637,Sprint,"[514, 902, 561, 914]",MISC
1638,Re,"[562, 902, 665, 914]",MISC
1639,##tro,"[562, 902, 665, 914]",MISC
1640,##spective,"[562, 902, 665, 914]",MISC
1641,calls,"[666, 902, 713, 914]",MISC
1642,.,"[666, 902, 713, 914]",MISC
1643,-,"[714, 902, 715, 914]",MISC
1644,NL,"[714, 902, 715, 914]",MISC
1645,-,"[714, 902, 715, 914]",MISC
1646,Project,"[114, 964, 171, 976]",MISC
1647,3,"[172, 964, 179, 976]",MISC
1648,-,"[180, 964, 182, 976]",MISC
1649,NL,"[180, 964, 182, 976]",MISC
1650,-,"[180, 964, 182, 976]",MISC
1651,Trans,"[360, 964, 460, 976]",B-project_title
1652,##action,"[360, 964, 460, 976]",I-project_title
1653,Ware,"[461, 964, 543, 976]",I-project_title
1654,##house,"[461, 964, 543, 976]",I-project_title
1655,Global,"[544, 964, 599, 976]",I-project_title
1656,S,"[599, 964, 645, 976]",I-project_title
1657,##wa,"[599, 964, 645, 976]",I-project_title
1658,##ps,"[599, 964, 645, 976]",I-project_title
1659,Report,"[645, 964, 727, 976]",I-project_title
1660,##ing,"[645, 964, 727, 976]",I-project_title
1661,(,"[728, 964, 791, 976]",I-project_title
1662,T,"[728, 964, 791, 976]",I-project_title
1663,##W,"[728, 964, 791, 976]",I-project_title
1664,##GS,"[728, 964, 791, 976]",I-project_title
1665,##R,"[728, 964, 791, 976]",I-project_title
1666,),"[728, 964, 791, 976]",I-project_title
1667,-,"[792, 964, 794, 976]",MISC
1668,NL,"[792, 964, 794, 976]",MISC
1669,-,"[792, 964, 794, 976]",MISC
1670,Custom,"[114, 980, 185, 992]",MISC
1671,##er,"[114, 980, 185, 992]",MISC
1672,-,"[185, 980, 187, 992]",MISC
1673,NL,"[185, 980, 187, 992]",MISC
1674,-,"[185, 980, 187, 992]",MISC
1675,Deutsche,"[360, 980, 433, 992]",MISC
1676,Bank,"[434, 980, 471, 992]",MISC
1677,-,"[471, 980, 473, 992]",MISC
1678,NL,"[471, 980, 473, 992]",MISC
1679,-,"[471, 980, 473, 992]",MISC
1680,Organization,"[114, 63, 207, 75]",MISC
1681,-,"[207, 63, 209, 75]",MISC
1682,NL,"[207, 63, 209, 75]",MISC
1683,-,"[207, 63, 209, 75]",MISC
1684,In,"[360, 63, 415, 75]",B-project_company_name
1685,##fo,"[360, 63, 415, 75]",I-project_company_name
1686,##sy,"[360, 63, 415, 75]",I-project_company_name
1687,##s,"[360, 63, 415, 75]",I-project_company_name
1688,Ltd,"[415, 63, 437, 75]",I-project_company_name
1689,-,"[438, 63, 440, 75]",MISC
1690,NL,"[438, 63, 440, 75]",MISC
1691,-,"[438, 63, 440, 75]",MISC
1692,SD,"[114, 80, 153, 92]",MISC
1693,##LC,"[114, 80, 153, 92]",MISC
1694,Process,"[153, 80, 221, 92]",MISC
1695,-,"[222, 80, 224, 92]",MISC
1696,NL,"[222, 80, 224, 92]",MISC
1697,-,"[222, 80, 224, 92]",MISC
1698,A,"[360, 80, 402, 92]",MISC
1699,##gi,"[360, 80, 402, 92]",MISC
1700,##le,"[360, 80, 402, 92]",MISC
1701,Method,"[402, 80, 493, 92]",MISC
1702,##ology,"[402, 80, 493, 92]",MISC
1703,-,"[495, 80, 497, 92]",MISC
1704,NL,"[495, 80, 497, 92]",MISC
1705,-,"[495, 80, 497, 92]",MISC
1706,Role,"[114, 96, 149, 108]",MISC
1707,-,"[149, 96, 151, 108]",MISC
1708,NL,"[149, 96, 151, 108]",MISC
1709,-,"[149, 96, 151, 108]",MISC
1710,Systems,"[360, 96, 422, 108]",MISC
1711,Engineer,"[422, 96, 491, 108]",MISC
1712,-,"[493, 96, 495, 108]",MISC
1713,NL,"[493, 96, 495, 108]",MISC
1714,-,"[493, 96, 495, 108]",MISC
1715,Period,"[114, 112, 162, 125]",MISC
1716,-,"[162, 112, 163, 125]",MISC
1717,NL,"[162, 112, 163, 125]",MISC
1718,-,"[162, 112, 163, 125]",MISC
1719,July,"[360, 112, 398, 125]",MISC
1720,2014,"[399, 112, 437, 125]",MISC
1721,-,"[438, 112, 447, 125]",MISC
1722,Dec,"[447, 112, 475, 125]",MISC
1723,2016,"[476, 112, 515, 125]",MISC
1724,-,"[515, 112, 517, 125]",MISC
1725,NL,"[515, 112, 517, 125]",MISC
1726,-,"[515, 112, 517, 125]",MISC
1727,Des,"[114, 128, 196, 141]",MISC
1728,##cription,"[114, 128, 196, 141]",MISC
1729,-,"[196, 128, 198, 141]",MISC
1730,NL,"[196, 128, 198, 141]",MISC
1731,-,"[196, 128, 198, 141]",MISC
1732,D,"[360, 128, 393, 141]",MISC
1733,##TC,"[360, 128, 393, 141]",MISC
1734,##C,"[360, 128, 393, 141]",MISC
1735,is,"[394, 128, 411, 141]",MISC
1736,the,"[411, 128, 437, 141]",MISC
1737,portal,"[437, 128, 488, 141]",MISC
1738,for,"[488, 128, 513, 141]",MISC
1739,Trade,"[513, 128, 555, 141]",MISC
1740,submission,"[556, 128, 639, 141]",MISC
1741,for,"[641, 128, 666, 141]",MISC
1742,different,"[666, 128, 743, 141]",MISC
1743,asset,"[743, 128, 785, 141]",MISC
1744,classes,"[785, 128, 853, 141]",MISC
1745,.,"[785, 128, 853, 141]",MISC
1746,Trade,"[853, 128, 895, 141]",MISC
1747,submission,"[896, 128, 979, 141]",MISC
1748,is,"[981, 128, 997, 141]",MISC
1749,-,"[998, 128, 1000, 141]",MISC
1750,NL,"[998, 128, 1000, 141]",MISC
1751,-,"[998, 128, 1000, 141]",MISC
1752,mandatory,"[360, 141, 438, 153]",MISC
1753,task,"[439, 141, 473, 153]",MISC
1754,for,"[474, 141, 499, 153]",MISC
1755,all,"[500, 141, 526, 153]",MISC
1756,the,"[526, 141, 552, 153]",MISC
1757,banks,"[553, 141, 596, 153]",MISC
1758,to,"[596, 141, 613, 153]",MISC
1759,submit,"[614, 141, 665, 153]",MISC
1760,the,"[666, 141, 692, 153]",MISC
1761,trade,"[693, 141, 736, 153]",MISC
1762,report,"[736, 141, 787, 153]",MISC
1763,to,"[789, 141, 805, 153]",MISC
1764,D,"[806, 141, 841, 153]",MISC
1765,##TC,"[806, 141, 841, 153]",MISC
1766,##C,"[806, 141, 841, 153]",MISC
1767,portal,"[841, 141, 901, 153]",MISC
1768,.,"[841, 141, 901, 153]",MISC
1769,Trade,"[903, 141, 946, 153]",MISC
1770,data,"[946, 141, 981, 153]",MISC
1771,-,"[981, 141, 983, 153]",MISC
1772,NL,"[981, 141, 983, 153]",MISC
1773,-,"[981, 141, 983, 153]",MISC
1774,is,"[360, 154, 377, 167]",MISC
1775,coming,"[377, 154, 428, 167]",MISC
1776,from,"[428, 154, 461, 167]",MISC
1777,different,"[462, 154, 539, 167]",MISC
1778,upstream,"[539, 154, 606, 167]",MISC
1779,source,"[607, 154, 658, 167]",MISC
1780,system,"[658, 154, 716, 167]",MISC
1781,.,"[658, 154, 716, 167]",MISC
1782,-,"[717, 154, 719, 167]",MISC
1783,NL,"[717, 154, 719, 167]",MISC
1784,-,"[717, 154, 719, 167]",MISC
1785,First,"[360, 168, 408, 180]",MISC
1786,",","[360, 168, 408, 180]",MISC
1787,we,"[409, 168, 424, 180]",MISC
1788,import,"[426, 168, 473, 180]",MISC
1789,trade,"[475, 168, 515, 180]",MISC
1790,data,"[516, 168, 547, 180]",MISC
1791,into,"[548, 168, 579, 180]",MISC
1792,database,"[581, 168, 645, 180]",MISC
1793,then,"[647, 168, 678, 180]",MISC
1794,through,"[679, 168, 736, 180]",MISC
1795,our,"[737, 168, 760, 180]",MISC
1796,portal,"[761, 168, 809, 180]",MISC
1797,separate,"[810, 168, 874, 180]",MISC
1798,eligibility,"[876, 168, 965, 180]",MISC
1799,&,"[966, 168, 973, 180]",MISC
1800,-,"[974, 168, 976, 180]",MISC
1801,NL,"[974, 168, 976, 180]",MISC
1802,-,"[974, 168, 976, 180]",MISC
1803,non,"[360, 180, 479, 193]",MISC
1804,-,"[360, 180, 479, 193]",MISC
1805,eligibility,"[360, 180, 479, 193]",MISC
1806,trades,"[480, 180, 528, 193]",MISC
1807,by,"[528, 180, 543, 193]",MISC
1808,applying,"[544, 180, 608, 193]",MISC
1809,business,"[608, 180, 672, 193]",MISC
1810,rules,"[673, 180, 720, 193]",MISC
1811,.,"[673, 180, 720, 193]",MISC
1812,Then,"[721, 180, 752, 193]",MISC
1813,eligible,"[753, 180, 816, 193]",MISC
1814,trades,"[817, 180, 864, 193]",MISC
1815,will,"[865, 180, 896, 193]",MISC
1816,be,"[897, 180, 911, 193]",MISC
1817,processed,"[913, 180, 984, 193]",MISC
1818,-,"[985, 180, 987, 193]",MISC
1819,NL,"[985, 180, 987, 193]",MISC
1820,-,"[985, 180, 987, 193]",MISC
1821,via,"[360, 194, 382, 206]",MISC
1822,unit,"[384, 194, 415, 206]",MISC
1823,utility,"[415, 194, 470, 206]",MISC
1824,to,"[470, 194, 485, 206]",MISC
1825,identify,"[486, 194, 548, 206]",MISC
1826,the,"[549, 194, 571, 206]",MISC
1827,active,"[573, 194, 618, 206]",MISC
1828,trades,"[620, 194, 666, 206]",MISC
1829,information,"[667, 194, 760, 206]",MISC
1830,.,"[667, 194, 760, 206]",MISC
1831,All,"[762, 194, 784, 206]",MISC
1832,active,"[786, 194, 831, 206]",MISC
1833,trades,"[833, 194, 878, 206]",MISC
1834,will,"[880, 194, 911, 206]",MISC
1835,be,"[912, 194, 926, 206]",MISC
1836,moved,"[927, 194, 966, 206]",MISC
1837,-,"[967, 194, 969, 206]",MISC
1838,NL,"[967, 194, 969, 206]",MISC
1839,-,"[967, 194, 969, 206]",MISC
1840,copied,"[360, 206, 411, 219]",MISC
1841,to,"[412, 206, 428, 219]",MISC
1842,CS,"[429, 206, 455, 219]",MISC
1843,##V,"[429, 206, 455, 219]",MISC
1844,file,"[455, 206, 488, 219]",MISC
1845,from,"[489, 206, 522, 219]",MISC
1846,database,"[524, 206, 591, 219]",MISC
1847,using,"[593, 206, 635, 219]",MISC
1848,hi,"[636, 206, 721, 219]",MISC
1849,##ber,"[636, 206, 721, 219]",MISC
1850,##nate,"[636, 206, 721, 219]",MISC
1851,.,"[636, 206, 721, 219]",MISC
1852,This,"[722, 206, 755, 219]",MISC
1853,CS,"[756, 206, 782, 219]",MISC
1854,##V,"[756, 206, 782, 219]",MISC
1855,file,"[782, 206, 815, 219]",MISC
1856,will,"[817, 206, 849, 219]",MISC
1857,be,"[851, 206, 867, 219]",MISC
1858,submitted,"[868, 206, 945, 219]",MISC
1859,to,"[946, 206, 962, 219]",MISC
1860,-,"[963, 206, 965, 219]",MISC
1861,NL,"[963, 206, 965, 219]",MISC
1862,-,"[963, 206, 965, 219]",MISC
1863,D,"[360, 219, 395, 231]",MISC
1864,##TC,"[360, 219, 395, 231]",MISC
1865,##C,"[360, 219, 395, 231]",MISC
1866,system,"[396, 219, 449, 231]",MISC
1867,for,"[449, 219, 475, 231]",MISC
1868,valid,"[476, 219, 572, 231]",MISC
1869,##ation,"[476, 219, 572, 231]",MISC
1870,.,"[476, 219, 572, 231]",MISC
1871,Then,"[574, 219, 608, 231]",MISC
1872,D,"[609, 219, 644, 231]",MISC
1873,##TC,"[609, 219, 644, 231]",MISC
1874,##C,"[609, 219, 644, 231]",MISC
1875,system,"[645, 219, 698, 231]",MISC
1876,will,"[698, 219, 733, 231]",MISC
1877,acknowledge,"[734, 219, 830, 231]",MISC
1878,back,"[832, 219, 866, 231]",MISC
1879,with,"[867, 219, 902, 231]",MISC
1880,valid,"[903, 219, 974, 231]",MISC
1881,##ate,"[903, 219, 974, 231]",MISC
1882,-,"[974, 219, 976, 231]",MISC
1883,NL,"[974, 219, 976, 231]",MISC
1884,-,"[974, 219, 976, 231]",MISC
1885,status,"[360, 232, 413, 245]",MISC
1886,for,"[414, 232, 439, 245]",MISC
1887,every,"[440, 232, 484, 245]",MISC
1888,trade,"[485, 232, 538, 245]",MISC
1889,.,"[485, 232, 538, 245]",MISC
1890,Then,"[538, 232, 573, 245]",MISC
1891,end,"[574, 232, 599, 245]",MISC
1892,user,"[600, 232, 635, 245]",MISC
1893,can,"[636, 232, 662, 245]",MISC
1894,verify,"[663, 232, 716, 245]",MISC
1895,every,"[716, 232, 760, 245]",MISC
1896,trade,"[761, 232, 804, 245]",MISC
1897,status,"[805, 232, 858, 245]",MISC
1898,from,"[859, 232, 893, 245]",MISC
1899,D,"[894, 232, 929, 245]",MISC
1900,##TC,"[894, 232, 929, 245]",MISC
1901,##C,"[894, 232, 929, 245]",MISC
1902,from,"[930, 232, 964, 245]",MISC
1903,U,"[965, 232, 982, 245]",MISC
1904,##I,"[965, 232, 982, 245]",MISC
1905,-,"[983, 232, 985, 245]",MISC
1906,NL,"[983, 232, 985, 245]",MISC
1907,-,"[983, 232, 985, 245]",MISC
1908,portal,"[360, 245, 418, 257]",MISC
1909,.,"[360, 245, 418, 257]",MISC
1910,We,"[420, 245, 436, 257]",MISC
1911,are,"[437, 245, 462, 257]",MISC
1912,processing,"[462, 245, 546, 257]",MISC
1913,only,"[548, 245, 581, 257]",MISC
1914,European,"[582, 245, 649, 257]",MISC
1915,region,"[650, 245, 701, 257]",MISC
1916,trades,"[701, 245, 759, 257]",MISC
1917,.,"[701, 245, 759, 257]",MISC
1918,-,"[761, 245, 763, 257]",MISC
1919,NL,"[761, 245, 763, 257]",MISC
1920,-,"[761, 245, 763, 257]",MISC
1921,Project,"[114, 261, 176, 273]",MISC
1922,Sub,"[177, 261, 202, 273]",MISC
1923,Mo,"[203, 261, 265, 273]",MISC
1924,##du,"[203, 261, 265, 273]",MISC
1925,##les,"[203, 261, 265, 273]",MISC
1926,-,"[265, 261, 267, 273]",MISC
1927,NL,"[265, 261, 267, 273]",MISC
1928,-,"[265, 261, 267, 273]",MISC
1929,T,"[360, 261, 408, 274]",MISC
1930,##W,"[360, 261, 408, 274]",MISC
1931,##GS,"[360, 261, 408, 274]",MISC
1932,##R,"[360, 261, 408, 274]",MISC
1933,C,"[409, 261, 456, 274]",MISC
1934,##ache,"[409, 261, 456, 274]",MISC
1935,Re,"[457, 261, 572, 274]",MISC
1936,##f,"[457, 261, 572, 274]",MISC
1937,##resh,"[457, 261, 572, 274]",MISC
1938,##ment,"[457, 261, 572, 274]",MISC
1939,:,"[457, 261, 572, 274]",MISC
1940,Development,"[573, 261, 679, 274]",MISC
1941,and,"[680, 261, 707, 274]",MISC
1942,implemented,"[709, 261, 815, 274]",MISC
1943,new,"[816, 261, 843, 274]",MISC
1944,cache,"[845, 261, 892, 274]",MISC
1945,management,"[893, 261, 990, 274]",MISC
1946,-,"[990, 261, 992, 274]",MISC
1947,NL,"[990, 261, 992, 274]",MISC
1948,-,"[990, 261, 992, 274]",MISC
1949,system,"[360, 274, 409, 287]",MISC
1950,via,"[411, 274, 435, 287]",MISC
1951,eh,"[437, 274, 504, 287]",MISC
1952,-,"[437, 274, 504, 287]",MISC
1953,cache,"[437, 274, 504, 287]",MISC
1954,in,"[505, 274, 521, 287]",MISC
1955,spring,"[521, 274, 571, 287]",MISC
1956,and,"[572, 274, 596, 287]",MISC
1957,fixing,"[598, 274, 647, 287]",MISC
1958,existing,"[649, 274, 716, 287]",MISC
1959,issues,"[717, 274, 766, 287]",MISC
1960,in,"[768, 274, 784, 287]",MISC
1961,cache,"[785, 274, 827, 287]",MISC
1962,re,"[827, 274, 920, 287]",MISC
1963,##f,"[827, 274, 920, 287]",MISC
1964,##resh,"[827, 274, 920, 287]",MISC
1965,##ment,"[827, 274, 920, 287]",MISC
1966,of,"[921, 274, 937, 287]",MISC
1967,-,"[938, 274, 939, 287]",MISC
1968,NL,"[938, 274, 939, 287]",MISC
1969,-,"[938, 274, 939, 287]",MISC
1970,T,"[360, 288, 402, 300]",MISC
1971,##W,"[360, 288, 402, 300]",MISC
1972,##GS,"[360, 288, 402, 300]",MISC
1973,##R,"[360, 288, 402, 300]",MISC
1974,application,"[404, 288, 507, 300]",MISC
1975,.,"[404, 288, 507, 300]",MISC
1976,-,"[508, 288, 510, 300]",MISC
1977,NL,"[508, 288, 510, 300]",MISC
1978,-,"[508, 288, 510, 300]",MISC
1979,T,"[360, 300, 406, 313]",MISC
1980,##W,"[360, 300, 406, 313]",MISC
1981,##GS,"[360, 300, 406, 313]",MISC
1982,##R,"[360, 300, 406, 313]",MISC
1983,Delta,"[406, 300, 451, 313]",MISC
1984,File,"[451, 300, 488, 313]",MISC
1985,Sub,"[488, 300, 579, 313]",MISC
1986,##mission,"[488, 300, 579, 313]",MISC
1987,for,"[579, 300, 606, 313]",MISC
1988,E,"[606, 300, 642, 313]",MISC
1989,##SM,"[606, 300, 642, 313]",MISC
1990,##A,"[606, 300, 642, 313]",MISC
1991,jurisdiction,"[642, 300, 761, 313]",MISC
1992,:,"[642, 300, 761, 313]",MISC
1993,Dev,"[761, 300, 843, 313]",MISC
1994,##elo,"[761, 300, 843, 313]",MISC
1995,##ped,"[761, 300, 843, 313]",MISC
1996,a,"[843, 300, 852, 313]",MISC
1997,new,"[852, 300, 879, 313]",MISC
1998,module,"[879, 300, 934, 313]",MISC
1999,to,"[934, 300, 952, 313]",MISC
2000,-,"[952, 300, 954, 313]",MISC
2001,NL,"[952, 300, 954, 313]",MISC
2002,-,"[952, 300, 954, 313]",MISC
2003,report,"[360, 314, 408, 326]",MISC
2004,today,"[409, 314, 456, 326]",MISC
2005,##s,"[409, 314, 456, 326]",MISC
2006,trade,"[458, 314, 498, 326]",MISC
2007,only,"[498, 314, 529, 326]",MISC
2008,for,"[531, 314, 555, 326]",MISC
2009,E,"[555, 314, 586, 326]",MISC
2010,##SM,"[555, 314, 586, 326]",MISC
2011,##A,"[555, 314, 586, 326]",MISC
2012,jurisdiction,"[588, 314, 693, 326]",MISC
2013,.,"[588, 314, 693, 326]",MISC
2014,-,"[693, 314, 695, 326]",MISC
2015,NL,"[693, 314, 695, 326]",MISC
2016,-,"[693, 314, 695, 326]",MISC
2017,T,"[360, 326, 406, 339]",MISC
2018,##W,"[360, 326, 406, 339]",MISC
2019,##GS,"[360, 326, 406, 339]",MISC
2020,##R,"[360, 326, 406, 339]",MISC
2021,Back,"[406, 326, 442, 339]",MISC
2022,population,"[442, 326, 533, 339]",MISC
2023,of,"[534, 326, 552, 339]",MISC
2024,Data,"[552, 326, 598, 339]",MISC
2025,:,"[552, 326, 598, 339]",MISC
2026,Dev,"[598, 326, 680, 339]",MISC
2027,##elo,"[598, 326, 680, 339]",MISC
2028,##ped,"[598, 326, 680, 339]",MISC
2029,Store,"[680, 326, 735, 339]",MISC
2030,##d,"[680, 326, 735, 339]",MISC
2031,Pro,"[735, 326, 817, 339]",MISC
2032,##ced,"[735, 326, 817, 339]",MISC
2033,##ure,"[735, 326, 817, 339]",MISC
2034,to,"[817, 326, 835, 339]",MISC
2035,update,"[835, 326, 890, 339]",MISC
2036,impacted,"[890, 326, 963, 339]",MISC
2037,-,"[963, 326, 965, 339]",MISC
2038,NL,"[963, 326, 965, 339]",MISC
2039,-,"[963, 326, 965, 339]",MISC
2040,data,"[360, 339, 402, 351]",MISC
2041,",","[360, 339, 402, 351]",MISC
2042,S,"[403, 339, 428, 351]",MISC
2043,##QL,"[403, 339, 428, 351]",MISC
2044,load,"[428, 339, 479, 351]",MISC
2045,##er,"[428, 339, 479, 351]",MISC
2046,to,"[480, 339, 496, 351]",MISC
2047,load,"[497, 339, 530, 351]",MISC
2048,data,"[531, 339, 564, 351]",MISC
2049,from,"[565, 339, 598, 351]",MISC
2050,file,"[599, 339, 632, 351]",MISC
2051,into,"[633, 339, 666, 351]",MISC
2052,database,"[668, 339, 744, 351]",MISC
2053,.,"[668, 339, 744, 351]",MISC
2054,-,"[744, 339, 746, 351]",MISC
2055,NL,"[744, 339, 746, 351]",MISC
2056,-,"[744, 339, 746, 351]",MISC
2057,T,"[360, 352, 408, 365]",MISC
2058,##W,"[360, 352, 408, 365]",MISC
2059,##GS,"[360, 352, 408, 365]",MISC
2060,##R,"[360, 352, 408, 365]",MISC
2061,E,"[408, 352, 447, 365]",MISC
2062,##SM,"[408, 352, 447, 365]",MISC
2063,##A,"[408, 352, 447, 365]",MISC
2064,L,"[447, 352, 465, 365]",MISC
2065,##2,"[447, 352, 465, 365]",MISC
2066,Field,"[466, 352, 514, 365]",MISC
2067,Changes,"[515, 352, 591, 365]",MISC
2068,:,"[515, 352, 591, 365]",MISC
2069,New,"[592, 352, 619, 365]",MISC
2070,Re,"[621, 352, 736, 365]",MISC
2071,##quire,"[621, 352, 736, 365]",MISC
2072,##ments,"[621, 352, 736, 365]",MISC
2073,were,"[737, 352, 775, 365]",MISC
2074,implemented,"[776, 352, 881, 365]",MISC
2075,as,"[882, 352, 900, 365]",MISC
2076,the,"[901, 352, 928, 365]",MISC
2077,logic,"[930, 352, 977, 365]",MISC
2078,to,"[978, 352, 997, 365]",MISC
2079,-,"[998, 352, 1000, 365]",MISC
2080,NL,"[998, 352, 1000, 365]",MISC
2081,-,"[998, 352, 1000, 365]",MISC
2082,report,"[360, 365, 411, 377]",MISC
2083,several,"[412, 365, 472, 377]",MISC
2084,transaction,"[472, 365, 565, 377]",MISC
2085,data,"[566, 365, 599, 377]",MISC
2086,got,"[601, 365, 626, 377]",MISC
2087,changed,"[627, 365, 687, 377]",MISC
2088,for,"[687, 365, 712, 377]",MISC
2089,E,"[712, 365, 754, 377]",MISC
2090,##SM,"[712, 365, 754, 377]",MISC
2091,##A,"[712, 365, 754, 377]",MISC
2092,.,"[712, 365, 754, 377]",MISC
2093,-,"[755, 365, 757, 377]",MISC
2094,NL,"[755, 365, 757, 377]",MISC
2095,-,"[755, 365, 757, 377]",MISC
2096,Role,"[114, 386, 240, 394]",MISC
2097,(,"[114, 386, 240, 394]",MISC
2098,Dev,"[114, 386, 240, 394]",MISC
2099,##elo,"[114, 386, 240, 394]",MISC
2100,##per,"[114, 386, 240, 394]",MISC
2101,),"[114, 386, 240, 394]",MISC
2102,&,"[241, 386, 248, 394]",MISC
2103,-,"[249, 386, 251, 394]",MISC
2104,NL,"[249, 386, 251, 394]",MISC
2105,-,"[249, 386, 251, 394]",MISC
2106,In,"[401, 386, 467, 394]",MISC
2107,##volved,"[401, 386, 467, 394]",MISC
2108,in,"[468, 386, 484, 394]",MISC
2109,requirement,"[485, 386, 576, 394]",MISC
2110,gathering,"[576, 386, 658, 394]",MISC
2111,",","[576, 386, 658, 394]",MISC
2112,est,"[660, 386, 751, 394]",MISC
2113,##imation,"[660, 386, 751, 394]",MISC
2114,##s,"[660, 386, 751, 394]",MISC
2115,and,"[752, 386, 775, 394]",MISC
2116,planning,"[777, 386, 842, 394]",MISC
2117,activities,"[843, 386, 925, 394]",MISC
2118,-,"[927, 386, 928, 394]",MISC
2119,NL,"[927, 386, 928, 394]",MISC
2120,-,"[927, 386, 928, 394]",MISC
2121,Re,"[114, 394, 229, 407]",MISC
2122,##sp,"[114, 394, 229, 407]",MISC
2123,##ons,"[114, 394, 229, 407]",MISC
2124,##ibi,"[114, 394, 229, 407]",MISC
2125,##lities,"[114, 394, 229, 407]",MISC
2126,-,"[229, 394, 231, 407]",MISC
2127,NL,"[229, 394, 231, 407]",MISC
2128,-,"[229, 394, 231, 407]",MISC
2129,In,"[402, 399, 471, 408]",MISC
2130,##volved,"[402, 399, 471, 408]",MISC
2131,in,"[471, 399, 487, 408]",MISC
2132,development,"[488, 399, 583, 408]",MISC
2133,activities,"[583, 399, 669, 408]",MISC
2134,to,"[670, 399, 686, 408]",MISC
2135,implement,"[687, 399, 764, 408]",MISC
2136,business,"[765, 399, 834, 408]",MISC
2137,logic,"[835, 399, 876, 408]",MISC
2138,using,"[878, 399, 920, 408]",MISC
2139,core,"[921, 399, 956, 408]",MISC
2140,j,"[956, 399, 990, 408]",MISC
2141,##ava,"[956, 399, 990, 408]",MISC
2142,-,"[990, 399, 992, 408]",MISC
2143,NL,"[990, 399, 992, 408]",MISC
2144,-,"[990, 399, 992, 408]",MISC
2145,&,"[426, 409, 433, 422]",MISC
2146,spring,"[434, 409, 485, 422]",MISC
2147,framework,"[486, 409, 571, 422]",MISC
2148,.,"[486, 409, 571, 422]",MISC
2149,-,"[571, 409, 573, 422]",MISC
2150,NL,"[571, 409, 573, 422]",MISC
2151,-,"[571, 409, 573, 422]",MISC
2152,In,"[402, 426, 469, 435]",MISC
2153,##volved,"[402, 426, 469, 435]",MISC
2154,in,"[470, 426, 487, 435]",MISC
2155,data,"[488, 426, 520, 435]",MISC
2156,per,"[522, 426, 617, 435]",MISC
2157,##sistence,"[522, 426, 617, 435]",MISC
2158,and,"[617, 426, 642, 435]",MISC
2159,data,"[643, 426, 675, 435]",MISC
2160,re,"[677, 426, 754, 435]",MISC
2161,##tri,"[677, 426, 754, 435]",MISC
2162,##eval,"[677, 426, 754, 435]",MISC
2163,using,"[755, 426, 796, 435]",MISC
2164,hi,"[798, 426, 874, 435]",MISC
2165,##ber,"[798, 426, 874, 435]",MISC
2166,##nate,"[798, 426, 874, 435]",MISC
2167,framework,"[875, 426, 961, 435]",MISC
2168,.,"[875, 426, 961, 435]",MISC
2169,-,"[961, 426, 963, 435]",MISC
2170,NL,"[961, 426, 963, 435]",MISC
2171,-,"[961, 426, 963, 435]",MISC
2172,In,"[402, 440, 475, 449]",MISC
2173,##volved,"[402, 440, 475, 449]",MISC
2174,in,"[476, 440, 494, 449]",MISC
2175,Environment,"[494, 440, 594, 449]",MISC
2176,setup,"[595, 440, 641, 449]",MISC
2177,&,"[641, 440, 651, 449]",MISC
2178,deployment,"[651, 440, 742, 449]",MISC
2179,for,"[743, 440, 770, 449]",MISC
2180,S,"[770, 440, 798, 449]",MISC
2181,##IT,"[770, 440, 798, 449]",MISC
2182,and,"[798, 440, 825, 449]",MISC
2183,Production,"[825, 440, 917, 449]",MISC
2184,-,"[918, 440, 919, 449]",MISC
2185,NL,"[918, 440, 919, 449]",MISC
2186,-,"[918, 440, 919, 449]",MISC
2187,environments,"[426, 450, 528, 462]",MISC
2188,.,"[426, 450, 528, 462]",MISC
2189,-,"[528, 450, 530, 462]",MISC
2190,NL,"[528, 450, 530, 462]",MISC
2191,-,"[528, 450, 530, 462]",MISC
2192,E,"[98, 483, 280, 501]",B-education_heading
2193,##D,"[98, 483, 280, 501]",I-education_heading
2194,##UC,"[98, 483, 280, 501]",I-education_heading
2195,##AT,"[98, 483, 280, 501]",I-education_heading
2196,##ION,"[98, 483, 280, 501]",I-education_heading
2197,##AL,"[98, 483, 280, 501]",I-education_heading
2198,BA,"[280, 483, 462, 501]",I-education_heading
2199,##C,"[280, 483, 462, 501]",I-education_heading
2200,##K,"[280, 483, 462, 501]",I-education_heading
2201,##GR,"[280, 483, 462, 501]",I-education_heading
2202,##O,"[280, 483, 462, 501]",I-education_heading
2203,##UN,"[280, 483, 462, 501]",I-education_heading
2204,##D,"[280, 483, 462, 501]",I-education_heading
2205,:,"[280, 483, 462, 501]",I-education_heading
2206,-,"[462, 483, 464, 501]",MISC
2207,NL,"[462, 483, 464, 501]",MISC
2208,-,"[462, 483, 464, 501]",MISC
2209,Degree,"[123, 521, 185, 534]",MISC
2210,&,"[187, 521, 196, 534]",MISC
2211,Pass,"[197, 521, 270, 534]",MISC
2212,##ing,"[197, 521, 270, 534]",MISC
2213,Year,"[271, 521, 313, 534]",MISC
2214,-,"[313, 521, 315, 534]",MISC
2215,NL,"[313, 521, 315, 534]",MISC
2216,-,"[313, 521, 315, 534]",MISC
2217,Per,"[426, 521, 519, 534]",MISC
2218,##cent,"[426, 521, 519, 534]",MISC
2219,##age,"[426, 521, 519, 534]",MISC
2220,-,"[519, 521, 520, 534]",MISC
2221,NL,"[519, 521, 520, 534]",MISC
2222,-,"[519, 521, 520, 534]",MISC
2223,Special,"[630, 521, 743, 534]",MISC
2224,##ization,"[630, 521, 743, 534]",MISC
2225,-,"[743, 521, 744, 534]",MISC
2226,NL,"[743, 521, 744, 534]",MISC
2227,-,"[743, 521, 744, 534]",MISC
2228,B,"[123, 538, 236, 551]",B-education_degree
2229,.,"[123, 538, 236, 551]",I-education_degree
2230,Tech,"[123, 538, 236, 551]",I-education_degree
2231,",","[123, 538, 236, 551]",MISC
2232,Jun,"[237, 538, 301, 551]",MISC
2233,-,"[237, 538, 301, 551]",MISC
2234,2013,"[302, 538, 366, 551]",MISC
2235,-,"[367, 538, 381, 551]",MISC
2236,66,"[383, 538, 463, 551]",MISC
2237,.,"[383, 538, 463, 551]",MISC
2238,98,"[383, 538, 463, 551]",MISC
2239,-,"[464, 538, 479, 551]",MISC
2240,Information,"[480, 538, 657, 551]",B-education_course
2241,Technology,"[659, 538, 821, 551]",I-education_course
2242,-,"[821, 538, 823, 551]",MISC
2243,NL,"[821, 538, 823, 551]",MISC
2244,-,"[821, 538, 823, 551]",MISC
2245,Intermediate,"[123, 555, 511, 570]",B-education_degree
2246,(,"[123, 555, 511, 570]",MISC
2247,C,"[123, 555, 511, 570]",MISC
2248,.,"[123, 555, 511, 570]",MISC
2249,G,"[123, 555, 511, 570]",MISC
2250,.,"[123, 555, 511, 570]",MISC
2251,B,"[123, 555, 511, 570]",MISC
2252,.,"[123, 555, 511, 570]",MISC
2253,S,"[123, 555, 511, 570]",MISC
2254,.,"[123, 555, 511, 570]",MISC
2255,E,"[123, 555, 511, 570]",MISC
2256,.,"[123, 555, 511, 570]",MISC
2257,),"[123, 555, 511, 570]",MISC
2258,",","[123, 555, 511, 570]",MISC
2259,Apr,"[123, 555, 511, 570]",MISC
2260,-,"[123, 555, 511, 570]",MISC
2261,2009,"[123, 555, 511, 570]",MISC
2262,-,"[513, 555, 524, 570]",MISC
2263,61,"[525, 555, 570, 570]",MISC
2264,.,"[525, 555, 570, 570]",MISC
2265,8,"[525, 555, 570, 570]",MISC
2266,-,"[572, 555, 583, 570]",MISC
2267,Mathematics,"[584, 555, 724, 570]",B-education_course
2268,",","[584, 555, 724, 570]",I-education_course
2269,Science,"[726, 555, 808, 570]",I-education_course
2270,-,"[808, 555, 810, 570]",MISC
2271,NL,"[808, 555, 810, 570]",MISC
2272,-,"[808, 555, 810, 570]",MISC
2273,Secondary,"[123, 576, 253, 590]",B-education_degree
2274,(,"[253, 576, 424, 590]",MISC
2275,C,"[253, 576, 424, 590]",MISC
2276,.,"[253, 576, 424, 590]",MISC
2277,G,"[253, 576, 424, 590]",MISC
2278,.,"[253, 576, 424, 590]",MISC
2279,B,"[253, 576, 424, 590]",MISC
2280,.,"[253, 576, 424, 590]",MISC
2281,S,"[253, 576, 424, 590]",MISC
2282,.,"[253, 576, 424, 590]",MISC
2283,E,"[253, 576, 424, 590]",MISC
2284,),"[253, 576, 424, 590]",MISC
2285,",","[253, 576, 424, 590]",MISC
2286,May,"[425, 576, 540, 590]",MISC
2287,-,"[425, 576, 540, 590]",MISC
2288,2006,"[425, 576, 540, 590]",MISC
2289,-,"[540, 576, 553, 590]",MISC
2290,74,"[555, 576, 611, 590]",MISC
2291,.,"[555, 576, 611, 590]",MISC
2292,6,"[555, 576, 611, 590]",MISC
2293,-,"[612, 576, 625, 590]",MISC
2294,N,"[626, 576, 654, 590]",MISC
2295,##A,"[626, 576, 654, 590]",MISC
2296,-,"[655, 576, 657, 590]",MISC
2297,NL,"[655, 576, 657, 590]",MISC
2298,-,"[655, 576, 657, 590]",MISC
2299,P,"[98, 610, 222, 627]",B-personal_details_heading
2300,##ER,"[98, 610, 222, 627]",I-personal_details_heading
2301,##SO,"[98, 610, 222, 627]",I-personal_details_heading
2302,##NA,"[98, 610, 222, 627]",I-personal_details_heading
2303,##L,"[98, 610, 222, 627]",I-personal_details_heading
2304,DE,"[223, 610, 346, 627]",I-personal_details_heading
2305,##TA,"[223, 610, 346, 627]",I-personal_details_heading
2306,##IL,"[223, 610, 346, 627]",I-personal_details_heading
2307,##S,"[223, 610, 346, 627]",I-personal_details_heading
2308,:,"[223, 610, 346, 627]",I-personal_details_heading
2309,-,"[347, 610, 349, 627]",MISC
2310,NL,"[347, 610, 349, 627]",MISC
2311,-,"[347, 610, 349, 627]",MISC
2312,Date,"[114, 650, 147, 663]",MISC
2313,of,"[147, 650, 164, 663]",MISC
2314,Birth,"[164, 650, 204, 663]",MISC
2315,-,"[205, 650, 207, 663]",MISC
2316,NL,"[205, 650, 207, 663]",MISC
2317,-,"[205, 650, 207, 663]",MISC
2318,15,"[475, 650, 566, 663]",MISC
2319,-,"[475, 650, 566, 663]",MISC
2320,Apr,"[475, 650, 566, 663]",MISC
2321,-,"[475, 650, 566, 663]",MISC
2322,1991,"[475, 650, 566, 663]",MISC
2323,-,"[566, 650, 568, 663]",MISC
2324,NL,"[566, 650, 568, 663]",MISC
2325,-,"[566, 650, 568, 663]",MISC
2326,National,"[114, 669, 191, 681]",MISC
2327,##ity,"[114, 669, 191, 681]",MISC
2328,-,"[191, 669, 193, 681]",MISC
2329,NL,"[191, 669, 193, 681]",MISC
2330,-,"[191, 669, 193, 681]",MISC
2331,Indian,"[475, 669, 519, 681]",MISC
2332,-,"[519, 669, 520, 681]",MISC
2333,NL,"[519, 669, 520, 681]",MISC
2334,-,"[519, 669, 520, 681]",MISC
2335,Pass,"[114, 686, 187, 699]",MISC
2336,##port,"[114, 686, 187, 699]",MISC
2337,Number,"[187, 686, 242, 699]",MISC
2338,-,"[242, 686, 244, 699]",MISC
2339,NL,"[242, 686, 244, 699]",MISC
2340,-,"[242, 686, 244, 699]",MISC
2341,M,"[475, 686, 551, 699]",MISC
2342,##75,"[475, 686, 551, 699]",MISC
2343,##36,"[475, 686, 551, 699]",MISC
2344,##55,"[475, 686, 551, 699]",MISC
2345,##1,"[475, 686, 551, 699]",MISC
2346,-,"[551, 686, 553, 699]",MISC
2347,NL,"[551, 686, 553, 699]",MISC
2348,-,"[551, 686, 553, 699]",MISC
2349,Awards,"[98, 720, 189, 737]",B-others_heading
2350,and,"[191, 720, 236, 737]",I-others_heading
2351,Achievement,"[237, 720, 421, 737]",I-others_heading
2352,##s,"[237, 720, 421, 737]",I-others_heading
2353,:,"[423, 720, 438, 737]",I-others_heading
2354,-,"[438, 720, 440, 737]",MISC
2355,NL,"[438, 720, 440, 737]",MISC
2356,-,"[438, 720, 440, 737]",MISC
2357,*,"[98, 762, 109, 775]",MISC
2358,Re,"[110, 762, 205, 775]",MISC
2359,##ceived,"[110, 762, 205, 775]",MISC
2360,‘,"[205, 762, 371, 775]",MISC
2361,I,"[205, 762, 371, 775]",MISC
2362,-,"[205, 762, 371, 775]",MISC
2363,A,"[205, 762, 371, 775]",MISC
2364,##pp,"[205, 762, 371, 775]",MISC
2365,##re,"[205, 762, 371, 775]",MISC
2366,##cia,"[205, 762, 371, 775]",MISC
2367,##te,"[205, 762, 371, 775]",MISC
2368,’,"[205, 762, 371, 775]",MISC
2369,award,"[372, 762, 431, 775]",MISC
2370,from,"[432, 762, 479, 775]",MISC
2371,OF,"[480, 762, 527, 775]",MISC
2372,##SS,"[480, 762, 527, 775]",MISC
2373,for,"[527, 762, 562, 775]",MISC
2374,the,"[563, 762, 598, 775]",MISC
2375,project,"[599, 762, 681, 775]",MISC
2376,implementation,"[682, 762, 848, 775]",MISC
2377,at,"[849, 762, 873, 775]",MISC
2378,client,"[873, 762, 944, 775]",MISC
2379,-,"[945, 762, 947, 775]",MISC
2380,NL,"[945, 762, 947, 775]",MISC
2381,-,"[945, 762, 947, 775]",MISC
2382,location,"[98, 775, 185, 792]",MISC
2383,.,"[98, 775, 185, 792]",MISC
2384,-,"[185, 775, 187, 792]",MISC
2385,NL,"[185, 775, 187, 792]",MISC
2386,-,"[185, 775, 187, 792]",MISC
2387,*,"[98, 794, 107, 808]",MISC
2388,Re,"[107, 794, 184, 808]",MISC
2389,##ceived,"[107, 794, 184, 808]",MISC
2390,‘,"[184, 794, 241, 808]",MISC
2391,In,"[184, 794, 241, 808]",MISC
2392,##sta,"[184, 794, 241, 808]",MISC
2393,Award,"[242, 794, 298, 808]",MISC
2394,’,"[242, 794, 298, 808]",MISC
2395,in,"[299, 794, 317, 808]",MISC
2396,2nd,"[318, 794, 346, 808]",MISC
2397,cycle,"[347, 794, 395, 808]",MISC
2398,of,"[395, 794, 413, 808]",MISC
2399,2016,"[414, 794, 480, 808]",MISC
2400,-,"[414, 794, 480, 808]",MISC
2401,17,"[414, 794, 480, 808]",MISC
2402,for,"[481, 794, 509, 808]",MISC
2403,taking,"[510, 794, 567, 808]",MISC
2404,responsibility,"[568, 794, 701, 808]",MISC
2405,of,"[702, 794, 720, 808]",MISC
2406,Re,"[721, 794, 845, 808]",MISC
2407,##con,"[721, 794, 845, 808]",MISC
2408,##ci,"[721, 794, 845, 808]",MISC
2409,##lement,"[721, 794, 845, 808]",MISC
2410,Mo,"[846, 794, 902, 808]",MISC
2411,##du,"[846, 794, 902, 808]",MISC
2412,##le,"[846, 794, 902, 808]",MISC
2413,and,"[903, 794, 931, 808]",MISC
2414,-,"[932, 794, 934, 808]",MISC
2415,NL,"[932, 794, 934, 808]",MISC
2416,-,"[932, 794, 934, 808]",MISC
2417,completed,"[98, 809, 178, 823]",MISC
2418,it,"[179, 809, 196, 823]",MISC
2419,in,"[197, 809, 214, 823]",MISC
2420,estimated,"[215, 809, 296, 823]",MISC
2421,time,"[297, 809, 340, 823]",MISC
2422,.,"[297, 809, 340, 823]",MISC
2423,-,"[342, 809, 344, 823]",MISC
2424,NL,"[342, 809, 344, 823]",MISC
2425,-,"[342, 809, 344, 823]",MISC
2426,DE,"[98, 830, 280, 847]",B-others_heading
2427,##CL,"[98, 830, 280, 847]",I-others_heading
2428,##AR,"[98, 830, 280, 847]",I-others_heading
2429,##AT,"[98, 830, 280, 847]",I-others_heading
2430,##ION,"[98, 830, 280, 847]",I-others_heading
2431,:,"[98, 830, 280, 847]",I-others_heading
2432,-,"[280, 830, 282, 847]",MISC
2433,NL,"[280, 830, 282, 847]",MISC
2434,-,"[280, 830, 282, 847]",MISC
2435,I,"[102, 871, 109, 883]",MISC
2436,here,"[110, 871, 161, 883]",MISC
2437,##by,"[110, 871, 161, 883]",MISC
2438,declare,"[162, 871, 222, 883]",MISC
2439,that,"[223, 871, 258, 883]",MISC
2440,all,"[258, 871, 283, 883]",MISC
2441,the,"[284, 871, 309, 883]",MISC
2442,above,"[310, 871, 352, 883]",MISC
2443,information,"[353, 871, 448, 883]",MISC
2444,provided,"[448, 871, 518, 883]",MISC
2445,is,"[518, 871, 534, 883]",MISC
2446,true,"[535, 871, 570, 883]",MISC
2447,and,"[570, 871, 595, 883]",MISC
2448,to,"[596, 871, 612, 883]",MISC
2449,the,"[613, 871, 639, 883]",MISC
2450,best,"[639, 871, 674, 883]",MISC
2451,of,"[674, 871, 690, 883]",MISC
2452,my,"[691, 871, 708, 883]",MISC
2453,knowledge,"[709, 871, 794, 883]",MISC
2454,.,"[709, 871, 794, 883]",MISC
2455,-,"[795, 871, 797, 883]",MISC
2456,NL,"[795, 871, 797, 883]",MISC
2457,-,"[795, 871, 797, 883]",MISC
2458,Place,"[98, 891, 140, 903]",MISC
2459,-,"[141, 891, 148, 903]",MISC
2460,Bangalore,"[150, 891, 226, 903]",MISC
2461,-,"[227, 891, 229, 903]",MISC
2462,NL,"[227, 891, 229, 903]",MISC
2463,-,"[227, 891, 229, 903]",MISC
