,token,box,label
0,PA,"[78, 54, 161, 72]",B-name
1,##LA,"[78, 54, 161, 72]",I-name
2,##K,"[78, 54, 161, 72]",I-name
3,SA,"[162, 54, 245, 72]",I-name
4,##RA,"[162, 54, 245, 72]",I-name
5,##F,"[162, 54, 245, 72]",I-name
6,-,"[246, 54, 248, 72]",MISC
7,NL,"[246, 54, 248, 72]",MISC
8,-,"[246, 54, 248, 72]",MISC
9,Mobile,"[78, 75, 170, 89]",MISC
10,:,"[78, 75, 170, 89]",MISC
11,+,"[171, 75, 356, 89]",B-phones_phone
12,91,"[171, 75, 356, 89]",I-phones_phone
13,-,"[171, 75, 356, 89]",I-phones_phone
14,98,"[171, 75, 356, 89]",I-phones_phone
15,##33,"[171, 75, 356, 89]",I-phones_phone
16,##6,"[171, 75, 356, 89]",I-phones_phone
17,##25,"[171, 75, 356, 89]",I-phones_phone
18,##27,"[171, 75, 356, 89]",I-phones_phone
19,##2,"[171, 75, 356, 89]",I-phones_phone
20,E,"[370, 75, 463, 89]",MISC
21,-,"[370, 75, 463, 89]",MISC
22,Mail,"[370, 75, 463, 89]",MISC
23,:,"[370, 75, 463, 89]",MISC
24,sa,"[464, 75, 756, 89]",B-emails_email
25,##ra,"[464, 75, 756, 89]",I-emails_email
26,##f,"[464, 75, 756, 89]",I-emails_email
27,##pal,"[464, 75, 756, 89]",I-emails_email
28,##ak,"[464, 75, 756, 89]",I-emails_email
29,##8,"[464, 75, 756, 89]",I-emails_email
30,##8,"[464, 75, 756, 89]",I-emails_email
31,@,"[464, 75, 756, 89]",I-emails_email
32,g,"[464, 75, 756, 89]",I-emails_email
33,##mail,"[464, 75, 756, 89]",I-emails_email
34,.,"[464, 75, 756, 89]",I-emails_email
35,com,"[464, 75, 756, 89]",I-emails_email
36,-,"[756, 75, 758, 89]",MISC
37,NL,"[756, 75, 758, 89]",MISC
38,-,"[756, 75, 758, 89]",MISC
39,O,"[78, 107, 206, 125]",B-summary_heading
40,##B,"[78, 107, 206, 125]",I-summary_heading
41,##J,"[78, 107, 206, 125]",I-summary_heading
42,##EC,"[78, 107, 206, 125]",I-summary_heading
43,##TI,"[78, 107, 206, 125]",I-summary_heading
44,##VE,"[78, 107, 206, 125]",I-summary_heading
45,-,"[206, 107, 208, 125]",MISC
46,NL,"[206, 107, 208, 125]",MISC
47,-,"[206, 107, 208, 125]",MISC
48,To,"[78, 142, 103, 160]",MISC
49,capital,"[104, 142, 237, 160]",MISC
50,##ize,"[104, 142, 237, 160]",MISC
51,upon,"[238, 142, 291, 160]",MISC
52,my,"[291, 142, 317, 160]",MISC
53,strength,"[318, 142, 423, 160]",MISC
54,in,"[425, 142, 450, 160]",MISC
55,an,"[452, 142, 477, 160]",MISC
56,organization,"[478, 142, 638, 160]",MISC
57,that,"[639, 142, 691, 160]",MISC
58,provides,"[692, 142, 797, 160]",MISC
59,an,"[799, 142, 824, 160]",MISC
60,opportunity,"[826, 142, 971, 160]",MISC
61,to,"[973, 142, 998, 160]",MISC
62,-,"[1000, 142, 1001, 160]",MISC
63,NL,"[1000, 142, 1001, 160]",MISC
64,-,"[1000, 142, 1001, 160]",MISC
65,continue,"[78, 160, 181, 178]",MISC
66,build,"[182, 160, 245, 178]",MISC
67,my,"[247, 160, 272, 178]",MISC
68,operations,"[273, 160, 402, 178]",MISC
69,and,"[403, 160, 441, 178]",MISC
70,management,"[442, 160, 571, 178]",MISC
71,skills,"[573, 160, 663, 178]",MISC
72,.,"[573, 160, 663, 178]",MISC
73,-,"[664, 160, 666, 178]",MISC
74,NL,"[664, 160, 666, 178]",MISC
75,-,"[664, 160, 666, 178]",MISC
76,CO,"[78, 195, 143, 213]",B-skills_heading
77,##RE,"[78, 195, 143, 213]",I-skills_heading
78,CO,"[143, 195, 339, 213]",I-skills_heading
79,##MP,"[143, 195, 339, 213]",I-skills_heading
80,##ET,"[143, 195, 339, 213]",I-skills_heading
81,##EN,"[143, 195, 339, 213]",I-skills_heading
82,##CI,"[143, 195, 339, 213]",I-skills_heading
83,##ES,"[143, 195, 339, 213]",I-skills_heading
84,-,"[341, 195, 343, 213]",MISC
85,NL,"[341, 195, 343, 213]",MISC
86,-,"[341, 195, 343, 213]",MISC
87,Hard,"[90, 235, 230, 249]",MISC
88,##working,"[90, 235, 230, 249]",MISC
89,-,"[232, 235, 234, 249]",MISC
90,NL,"[232, 235, 234, 249]",MISC
91,-,"[232, 235, 234, 249]",MISC
92,Design,"[91, 252, 207, 266]",MISC
93,##ing,"[91, 252, 207, 266]",MISC
94,Pack,"[208, 252, 311, 266]",MISC
95,##ages,"[208, 252, 311, 266]",MISC
96,-,"[312, 252, 313, 266]",MISC
97,NL,"[312, 252, 313, 266]",MISC
98,-,"[312, 252, 313, 266]",MISC
99,E,"[90, 270, 201, 284]",MISC
100,##ff,"[90, 270, 201, 284]",MISC
101,##icient,"[90, 270, 201, 284]",MISC
102,and,"[201, 270, 237, 284]",MISC
103,to,"[238, 270, 262, 284]",MISC
104,do,"[263, 270, 286, 284]",MISC
105,attitude,"[287, 270, 385, 284]",MISC
106,-,"[386, 270, 388, 284]",MISC
107,NL,"[386, 270, 388, 284]",MISC
108,-,"[386, 270, 388, 284]",MISC
109,CA,"[78, 302, 179, 319]",B-work_experience_heading
110,##RE,"[78, 302, 179, 319]",I-work_experience_heading
111,##ER,"[78, 302, 179, 319]",I-work_experience_heading
112,S,"[179, 302, 314, 319]",I-work_experience_heading
113,##NA,"[179, 302, 314, 319]",I-work_experience_heading
114,##PS,"[179, 302, 314, 319]",I-work_experience_heading
115,##H,"[179, 302, 314, 319]",I-work_experience_heading
116,##OT,"[179, 302, 314, 319]",I-work_experience_heading
117,-,"[315, 302, 317, 319]",MISC
118,NL,"[315, 302, 317, 319]",MISC
119,-,"[315, 302, 317, 319]",MISC
120,The,"[78, 337, 121, 355]",MISC
121,Trip,"[123, 337, 183, 355]",MISC
122,Market,"[183, 337, 272, 355]",MISC
123,-,"[274, 337, 275, 355]",MISC
124,NL,"[274, 337, 275, 355]",MISC
125,-,"[274, 337, 275, 355]",MISC
126,July,"[78, 355, 132, 372]",MISC
127,2019,"[132, 355, 199, 372]",MISC
128,-,"[132, 355, 199, 372]",MISC
129,Till,"[201, 355, 255, 372]",MISC
130,Date,"[255, 355, 310, 372]",MISC
131,-,"[310, 355, 312, 372]",MISC
132,NL,"[310, 355, 312, 372]",MISC
133,-,"[310, 355, 312, 372]",MISC
134,Design,"[78, 390, 228, 408]",MISC
135,##ation,"[78, 390, 228, 408]",MISC
136,:,"[229, 390, 256, 408]",MISC
137,-,"[229, 390, 256, 408]",MISC
138,Operations,"[257, 390, 545, 408]",B-employer_role
139,-,"[257, 390, 545, 408]",I-employer_role
140,Executive,"[257, 390, 545, 408]",I-employer_role
141,-,"[257, 390, 545, 408]",I-employer_role
142,Leisure,"[546, 390, 642, 408]",I-employer_role
143,and,"[643, 390, 683, 408]",I-employer_role
144,Holiday,"[684, 390, 793, 408]",I-employer_role
145,##s,"[684, 390, 793, 408]",I-employer_role
146,-,"[794, 390, 796, 408]",MISC
147,NL,"[794, 390, 796, 408]",MISC
148,-,"[794, 390, 796, 408]",MISC
149,Job,"[78, 426, 116, 443]",B-others_heading
150,description,"[117, 426, 260, 443]",I-others_heading
151,-,"[261, 426, 263, 443]",MISC
152,NL,"[261, 426, 263, 443]",MISC
153,-,"[261, 426, 263, 443]",MISC
154,Hand,"[90, 447, 192, 461]",MISC
155,##ling,"[90, 447, 192, 461]",MISC
156,the,"[194, 447, 232, 461]",MISC
157,F,"[232, 447, 334, 461]",MISC
158,##IT,"[232, 447, 334, 461]",MISC
159,/,"[232, 447, 334, 461]",MISC
160,G,"[232, 447, 334, 461]",MISC
161,##IT,"[232, 447, 334, 461]",MISC
162,/,"[232, 447, 334, 461]",MISC
163,Sales,"[335, 447, 399, 461]",MISC
164,&,"[400, 447, 412, 461]",MISC
165,Corporate,"[413, 447, 527, 461]",MISC
166,Sales,"[529, 447, 592, 461]",MISC
167,-,"[593, 447, 595, 461]",MISC
168,NL,"[593, 447, 595, 461]",MISC
169,-,"[593, 447, 595, 461]",MISC
170,Co,"[90, 465, 173, 479]",MISC
171,##sting,"[90, 465, 173, 479]",MISC
172,it,"[174, 465, 307, 479]",MISC
173,##iner,"[174, 465, 307, 479]",MISC
174,##aries,"[174, 465, 307, 479]",MISC
175,and,"[308, 465, 344, 479]",MISC
176,optimization,"[344, 465, 489, 479]",MISC
177,of,"[489, 465, 513, 479]",MISC
178,cost,"[514, 465, 561, 479]",MISC
179,-,"[562, 465, 564, 479]",MISC
180,NL,"[562, 465, 564, 479]",MISC
181,-,"[562, 465, 564, 479]",MISC
182,A,"[90, 482, 177, 496]",MISC
183,##bility,"[90, 482, 177, 496]",MISC
184,to,"[178, 482, 201, 496]",MISC
185,understand,"[203, 482, 326, 496]",MISC
186,customer,"[327, 482, 427, 496]",MISC
187,requirements,"[427, 482, 576, 496]",MISC
188,to,"[577, 482, 601, 496]",MISC
189,custom,"[602, 482, 713, 496]",MISC
190,##ize,"[602, 482, 713, 496]",MISC
191,it,"[715, 482, 851, 496]",MISC
192,##iner,"[715, 482, 851, 496]",MISC
193,##aries,"[715, 482, 851, 496]",MISC
194,for,"[852, 482, 889, 496]",MISC
195,given,"[890, 482, 952, 496]",MISC
196,-,"[952, 482, 954, 496]",MISC
197,NL,"[952, 482, 954, 496]",MISC
198,-,"[952, 482, 954, 496]",MISC
199,destination,"[94, 496, 215, 514]",MISC
200,-,"[215, 496, 217, 514]",MISC
201,NL,"[215, 496, 217, 514]",MISC
202,-,"[215, 496, 217, 514]",MISC
203,Co,"[90, 518, 239, 532]",MISC
204,##ordination,"[90, 518, 239, 532]",MISC
205,with,"[240, 518, 289, 532]",MISC
206,D,"[290, 518, 426, 532]",MISC
207,##MC,"[290, 518, 426, 532]",MISC
208,##s,"[290, 518, 426, 532]",MISC
209,/,"[290, 518, 426, 532]",MISC
210,Online,"[290, 518, 426, 532]",MISC
211,companies,"[427, 518, 602, 532]",MISC
212,/,"[427, 518, 602, 532]",MISC
213,B,"[427, 518, 602, 532]",MISC
214,##2,"[427, 518, 602, 532]",MISC
215,##B,"[427, 518, 602, 532]",MISC
216,##s,"[427, 518, 602, 532]",MISC
217,for,"[602, 518, 639, 532]",MISC
218,custom,"[640, 518, 939, 532]",MISC
219,##ization,"[640, 518, 939, 532]",MISC
220,/,"[640, 518, 939, 532]",MISC
221,quota,"[640, 518, 939, 532]",MISC
222,##tions,"[640, 518, 939, 532]",MISC
223,-,"[940, 518, 941, 532]",MISC
224,NL,"[940, 518, 941, 532]",MISC
225,-,"[940, 518, 941, 532]",MISC
226,C,"[90, 536, 175, 549]",MISC
227,##lar,"[90, 536, 175, 549]",MISC
228,##ity,"[90, 536, 175, 549]",MISC
229,on,"[176, 536, 199, 549]",MISC
230,Inc,"[200, 536, 322, 549]",MISC
231,##lusion,"[200, 536, 322, 549]",MISC
232,##s,"[200, 536, 322, 549]",MISC
233,and,"[323, 536, 359, 549]",MISC
234,Ex,"[360, 536, 481, 549]",MISC
235,##c,"[360, 536, 481, 549]",MISC
236,##lusion,"[360, 536, 481, 549]",MISC
237,##s,"[360, 536, 481, 549]",MISC
238,-,"[482, 536, 484, 549]",MISC
239,NL,"[482, 536, 484, 549]",MISC
240,-,"[482, 536, 484, 549]",MISC
241,Use,"[91, 553, 131, 567]",MISC
242,of,"[131, 553, 157, 567]",MISC
243,B,"[158, 553, 198, 567]",MISC
244,##2,"[158, 553, 198, 567]",MISC
245,##B,"[158, 553, 198, 567]",MISC
246,log,"[198, 553, 278, 567]",MISC
247,##ins,"[198, 553, 278, 567]",MISC
248,for,"[279, 553, 319, 567]",MISC
249,booking,"[319, 553, 412, 567]",MISC
250,-,"[413, 553, 415, 567]",MISC
251,NL,"[413, 553, 415, 567]",MISC
252,-,"[413, 553, 415, 567]",MISC
253,Understanding,"[90, 571, 246, 585]",MISC
254,off,"[248, 571, 344, 585]",MISC
255,##light,"[248, 571, 344, 585]",MISC
256,sectors,"[345, 571, 441, 585]",MISC
257,",","[345, 571, 441, 585]",MISC
258,hotel,"[442, 571, 502, 585]",MISC
259,categories,"[503, 571, 635, 585]",MISC
260,",","[503, 571, 635, 585]",MISC
261,cu,"[636, 571, 769, 585]",MISC
262,##rre,"[636, 571, 769, 585]",MISC
263,##ncies,"[636, 571, 769, 585]",MISC
264,",","[636, 571, 769, 585]",MISC
265,things,"[770, 571, 842, 585]",MISC
266,to,"[842, 571, 866, 585]",MISC
267,do,"[867, 571, 890, 585]",MISC
268,etc,"[891, 571, 938, 585]",MISC
269,.,"[891, 571, 938, 585]",MISC
270,-,"[940, 571, 941, 585]",MISC
271,NL,"[940, 571, 941, 585]",MISC
272,-,"[940, 571, 941, 585]",MISC
273,destination,"[94, 585, 223, 603]",MISC
274,wise,"[224, 585, 271, 603]",MISC
275,-,"[272, 585, 274, 603]",MISC
276,NL,"[272, 585, 274, 603]",MISC
277,-,"[272, 585, 274, 603]",MISC
278,A,"[90, 606, 173, 620]",MISC
279,##bility,"[90, 606, 173, 620]",MISC
280,to,"[174, 606, 198, 620]",MISC
281,close,"[198, 606, 258, 620]",MISC
282,deals,"[259, 606, 318, 620]",MISC
283,-,"[319, 606, 321, 620]",MISC
284,NL,"[319, 606, 321, 620]",MISC
285,-,"[319, 606, 321, 620]",MISC
286,Pay,"[91, 624, 181, 638]",MISC
287,##ment,"[91, 624, 181, 638]",MISC
288,follow,"[182, 624, 298, 638]",MISC
289,##ups,"[182, 624, 298, 638]",MISC
290,-,"[299, 624, 301, 638]",MISC
291,NL,"[299, 624, 301, 638]",MISC
292,-,"[299, 624, 301, 638]",MISC
293,Visa,"[90, 642, 141, 656]",MISC
294,requirement,"[141, 642, 281, 656]",MISC
295,understanding,"[281, 642, 446, 656]",MISC
296,-,"[446, 642, 448, 656]",MISC
297,NL,"[446, 642, 448, 656]",MISC
298,-,"[446, 642, 448, 656]",MISC
299,Dev,"[90, 659, 215, 673]",MISC
300,##elo,"[90, 659, 215, 673]",MISC
301,##ping,"[90, 659, 215, 673]",MISC
302,and,"[216, 659, 252, 673]",MISC
303,building,"[253, 659, 353, 673]",MISC
304,cord,"[354, 659, 441, 673]",MISC
305,##ial,"[354, 659, 441, 673]",MISC
306,relationship,"[441, 659, 590, 673]",MISC
307,with,"[592, 659, 641, 673]",MISC
308,the,"[642, 659, 678, 673]",MISC
309,present,"[680, 659, 767, 673]",MISC
310,and,"[768, 659, 804, 673]",MISC
311,prospective,"[805, 659, 943, 673]",MISC
312,-,"[943, 659, 945, 673]",MISC
313,NL,"[943, 659, 945, 673]",MISC
314,-,"[943, 659, 945, 673]",MISC
315,clients,"[94, 673, 165, 691]",MISC
316,-,"[165, 673, 166, 691]",MISC
317,NL,"[165, 673, 166, 691]",MISC
318,-,"[165, 673, 166, 691]",MISC
319,The,"[78, 860, 121, 878]",B-employer_company_name
320,Trip,"[121, 860, 179, 878]",I-employer_company_name
321,Store,"[179, 860, 252, 878]",I-employer_company_name
322,-,"[252, 860, 254, 878]",MISC
323,NL,"[252, 860, 254, 878]",MISC
324,-,"[252, 860, 254, 878]",MISC
325,August,"[78, 878, 174, 896]",MISC
326,2018,"[174, 878, 254, 896]",MISC
327,-,"[174, 878, 254, 896]",MISC
328,March,"[255, 878, 335, 896]",MISC
329,2019,"[336, 878, 400, 896]",MISC
330,-,"[401, 878, 402, 896]",MISC
331,NL,"[401, 878, 402, 896]",MISC
332,-,"[401, 878, 402, 896]",MISC
333,Design,"[78, 914, 230, 931]",MISC
334,##ation,"[78, 914, 230, 931]",MISC
335,:,"[230, 914, 257, 931]",MISC
336,-,"[230, 914, 257, 931]",MISC
337,Sales,"[258, 914, 327, 931]",B-employer_role
338,/,"[327, 914, 340, 931]",I-employer_role
339,Operations,"[341, 914, 631, 931]",I-employer_role
340,-,"[341, 914, 631, 931]",I-employer_role
341,Executive,"[341, 914, 631, 931]",I-employer_role
342,-,"[341, 914, 631, 931]",MISC
343,Leisure,"[632, 914, 728, 931]",MISC
344,and,"[729, 914, 769, 931]",MISC
345,Holiday,"[771, 914, 881, 931]",MISC
346,##s,"[771, 914, 881, 931]",MISC
347,-,"[882, 914, 883, 931]",MISC
348,NL,"[882, 914, 883, 931]",MISC
349,-,"[882, 914, 883, 931]",MISC
350,N,"[91, 953, 234, 967]",MISC
351,##ego,"[91, 953, 234, 967]",MISC
352,##tia,"[91, 953, 234, 967]",MISC
353,##ting,"[91, 953, 234, 967]",MISC
354,with,"[234, 953, 285, 967]",MISC
355,supplier,"[287, 953, 390, 967]",MISC
356,and,"[391, 953, 429, 967]",MISC
357,vendors,"[430, 953, 521, 967]",MISC
358,with,"[522, 953, 573, 967]",MISC
359,best,"[574, 953, 625, 967]",MISC
360,Design,"[627, 953, 743, 967]",MISC
361,##ing,"[627, 953, 743, 967]",MISC
362,F,"[744, 953, 782, 967]",MISC
363,##IT,"[744, 953, 782, 967]",MISC
364,packages,"[783, 953, 887, 967]",MISC
365,for,"[888, 953, 926, 967]",MISC
366,long,"[927, 953, 978, 967]",MISC
367,-,"[980, 953, 981, 967]",MISC
368,NL,"[980, 953, 981, 967]",MISC
369,-,"[980, 953, 981, 967]",MISC
370,and,"[94, 967, 132, 984]",MISC
371,short,"[132, 967, 196, 984]",MISC
372,haul,"[196, 967, 247, 984]",MISC
373,international,"[247, 967, 412, 984]",MISC
374,destinations,"[412, 967, 565, 984]",MISC
375,like,"[565, 967, 616, 984]",MISC
376,Europe,"[616, 967, 705, 984]",MISC
377,",","[616, 967, 705, 984]",MISC
378,Singapore,"[705, 967, 946, 984]",MISC
379,",","[705, 967, 946, 984]",MISC
380,Thailand,"[705, 967, 946, 984]",MISC
381,",","[705, 967, 946, 984]",MISC
382,-,"[947, 967, 949, 984]",MISC
383,NL,"[947, 967, 949, 984]",MISC
384,-,"[947, 967, 949, 984]",MISC
385,UAE,"[94, 54, 210, 72]",MISC
386,",","[94, 54, 210, 72]",MISC
387,Hong,"[94, 54, 210, 72]",MISC
388,Kong,"[210, 54, 268, 72]",MISC
389,Macau,"[268, 54, 355, 72]",MISC
390,",","[268, 54, 355, 72]",MISC
391,Mal,"[355, 54, 471, 72]",MISC
392,##dives,"[355, 54, 471, 72]",MISC
393,",","[471, 54, 631, 72]",MISC
394,Se,"[471, 54, 631, 72]",MISC
395,##ych,"[471, 54, 631, 72]",MISC
396,##elles,"[471, 54, 631, 72]",MISC
397,",","[631, 54, 776, 72]",MISC
398,Mauritius,"[631, 54, 776, 72]",MISC
399,",","[776, 54, 936, 72]",MISC
400,Indonesia,"[776, 54, 936, 72]",MISC
401,",","[776, 54, 936, 72]",MISC
402,New,"[936, 54, 980, 72]",MISC
403,-,"[980, 54, 981, 72]",MISC
404,NL,"[980, 54, 981, 72]",MISC
405,-,"[980, 54, 981, 72]",MISC
406,Zealand,"[94, 72, 196, 89]",MISC
407,",","[94, 72, 196, 89]",MISC
408,Australia,"[197, 72, 326, 89]",MISC
409,.,"[197, 72, 326, 89]",MISC
410,-,"[326, 72, 328, 89]",MISC
411,NL,"[326, 72, 328, 89]",MISC
412,-,"[326, 72, 328, 89]",MISC
413,Pre,"[90, 108, 203, 122]",MISC
414,##par,"[90, 108, 203, 122]",MISC
415,##ing,"[90, 108, 203, 122]",MISC
416,quota,"[204, 108, 329, 122]",MISC
417,##tions,"[204, 108, 329, 122]",MISC
418,and,"[331, 108, 367, 122]",MISC
419,cost,"[369, 108, 418, 122]",MISC
420,sheets,"[420, 108, 494, 122]",MISC
421,as,"[496, 108, 519, 122]",MISC
422,per,"[521, 108, 557, 122]",MISC
423,destination,"[559, 108, 710, 122]",MISC
424,.,"[559, 108, 710, 122]",MISC
425,-,"[711, 108, 713, 122]",MISC
426,NL,"[711, 108, 713, 122]",MISC
427,-,"[711, 108, 713, 122]",MISC
428,C,"[90, 141, 188, 155]",MISC
429,##rea,"[90, 141, 188, 155]",MISC
430,##ting,"[90, 141, 188, 155]",MISC
431,quotes,"[188, 141, 273, 155]",MISC
432,/,"[188, 141, 273, 155]",MISC
433,it,"[274, 141, 382, 155]",MISC
434,##iner,"[274, 141, 382, 155]",MISC
435,##ary,"[274, 141, 382, 155]",MISC
436,for,"[384, 141, 420, 155]",MISC
437,the,"[421, 141, 457, 155]",MISC
438,international,"[457, 141, 615, 155]",MISC
439,destinations,"[617, 141, 764, 155]",MISC
440,and,"[764, 141, 800, 155]",MISC
441,taking,"[800, 141, 873, 155]",MISC
442,the,"[874, 141, 910, 155]",MISC
443,best,"[911, 141, 960, 155]",MISC
444,-,"[960, 141, 961, 155]",MISC
445,NL,"[960, 141, 961, 155]",MISC
446,-,"[960, 141, 961, 155]",MISC
447,price,"[94, 155, 156, 173]",MISC
448,from,"[157, 155, 206, 173]",MISC
449,different,"[207, 155, 319, 173]",MISC
450,websites,"[319, 155, 419, 173]",MISC
451,of,"[420, 155, 443, 173]",MISC
452,suppliers,"[445, 155, 557, 173]",MISC
453,to,"[557, 155, 581, 173]",MISC
454,make,"[582, 155, 631, 173]",MISC
455,the,"[633, 155, 669, 173]",MISC
456,it,"[670, 155, 783, 173]",MISC
457,##iner,"[670, 155, 783, 173]",MISC
458,##ary,"[670, 155, 783, 173]",MISC
459,as,"[783, 155, 806, 173]",MISC
460,cost,"[808, 155, 857, 173]",MISC
461,effective,"[858, 155, 971, 173]",MISC
462,as,"[971, 155, 994, 173]",MISC
463,-,"[996, 155, 998, 173]",MISC
464,NL,"[996, 155, 998, 173]",MISC
465,-,"[996, 155, 998, 173]",MISC
466,possible,"[94, 173, 186, 190]",MISC
467,(,"[188, 173, 469, 190]",MISC
468,Via,"[188, 173, 469, 190]",MISC
469,##tor,"[188, 173, 469, 190]",MISC
470,",","[188, 173, 469, 190]",MISC
471,O,"[188, 173, 469, 190]",MISC
472,##tti,"[188, 173, 469, 190]",MISC
473,##la,"[188, 173, 469, 190]",MISC
474,",","[188, 173, 469, 190]",MISC
475,T,"[188, 173, 469, 190]",MISC
476,##BO,"[188, 173, 469, 190]",MISC
477,",","[188, 173, 469, 190]",MISC
478,Room,"[188, 173, 469, 190]",MISC
479,##s,"[188, 173, 469, 190]",MISC
480,XML,"[471, 173, 505, 190]",MISC
481,etc,"[506, 173, 788, 190]",MISC
482,",","[506, 173, 788, 190]",MISC
483,G,"[506, 173, 788, 190]",MISC
484,##R,"[506, 173, 788, 190]",MISC
485,##N,"[506, 173, 788, 190]",MISC
486,",","[506, 173, 788, 190]",MISC
487,Ch,"[506, 173, 788, 190]",MISC
488,##eh,"[506, 173, 788, 190]",MISC
489,##ob,"[506, 173, 788, 190]",MISC
490,##o,"[506, 173, 788, 190]",MISC
491,",","[506, 173, 788, 190]",MISC
492,Pi,"[506, 173, 788, 190]",MISC
493,##jo,"[506, 173, 788, 190]",MISC
494,##li,"[506, 173, 788, 190]",MISC
495,),"[506, 173, 788, 190]",MISC
496,.,"[506, 173, 788, 190]",MISC
497,-,"[789, 173, 791, 190]",MISC
498,NL,"[789, 173, 791, 190]",MISC
499,-,"[789, 173, 791, 190]",MISC
500,Em,"[91, 209, 196, 223]",MISC
501,##ailing,"[91, 209, 196, 223]",MISC
502,sales,"[198, 209, 263, 223]",MISC
503,team,"[265, 209, 317, 223]",MISC
504,quotes,"[318, 209, 398, 223]",MISC
505,along,"[398, 209, 463, 223]",MISC
506,with,"[465, 209, 518, 223]",MISC
507,day,"[518, 209, 558, 223]",MISC
508,wise,"[558, 209, 611, 223]",MISC
509,it,"[612, 209, 732, 223]",MISC
510,##iner,"[612, 209, 732, 223]",MISC
511,##ary,"[612, 209, 732, 223]",MISC
512,by,"[732, 209, 757, 223]",MISC
513,keeping,"[759, 209, 851, 223]",MISC
514,in,"[852, 209, 878, 223]",MISC
515,mind,"[879, 209, 932, 223]",MISC
516,-,"[932, 209, 934, 223]",MISC
517,NL,"[932, 209, 934, 223]",MISC
518,-,"[932, 209, 934, 223]",MISC
519,client,"[94, 223, 192, 241]",MISC
520,’,"[94, 223, 192, 241]",MISC
521,s,"[94, 223, 192, 241]",MISC
522,budget,"[193, 223, 265, 241]",MISC
523,and,"[267, 223, 303, 241]",MISC
524,requirements,"[304, 223, 463, 241]",MISC
525,.,"[304, 223, 463, 241]",MISC
526,-,"[464, 223, 466, 241]",MISC
527,NL,"[464, 223, 466, 241]",MISC
528,-,"[464, 223, 466, 241]",MISC
529,Keeping,"[90, 260, 179, 274]",MISC
530,follow,"[181, 260, 257, 274]",MISC
531,up,"[259, 260, 284, 274]",MISC
532,with,"[285, 260, 336, 274]",MISC
533,the,"[337, 260, 375, 274]",MISC
534,clients,"[375, 260, 479, 274]",MISC
535,",","[375, 260, 479, 274]",MISC
536,for,"[479, 260, 517, 274]",MISC
537,the,"[518, 260, 556, 274]",MISC
538,quota,"[557, 260, 686, 274]",MISC
539,##tions,"[557, 260, 686, 274]",MISC
540,worked,"[686, 260, 762, 274]",MISC
541,out,"[764, 260, 802, 274]",MISC
542,on,"[803, 260, 841, 274]",MISC
543,.,"[803, 260, 841, 274]",MISC
544,-,"[842, 260, 843, 274]",MISC
545,NL,"[842, 260, 843, 274]",MISC
546,-,"[842, 260, 843, 274]",MISC
547,To,"[90, 293, 116, 307]",MISC
548,co,"[116, 293, 141, 307]",MISC
549,–,"[142, 293, 269, 307]",MISC
550,or,"[142, 293, 269, 307]",MISC
551,##dian,"[142, 293, 269, 307]",MISC
552,##ate,"[142, 293, 269, 307]",MISC
553,with,"[270, 293, 320, 307]",MISC
554,ticket,"[321, 293, 435, 307]",MISC
555,##ing,"[321, 293, 435, 307]",MISC
556,team,"[436, 293, 487, 307]",MISC
557,to,"[487, 293, 513, 307]",MISC
558,provide,"[513, 293, 602, 307]",MISC
559,best,"[603, 293, 653, 307]",MISC
560,Air,"[654, 293, 743, 307]",MISC
561,##line,"[654, 293, 743, 307]",MISC
562,and,"[744, 293, 782, 307]",MISC
563,R,"[782, 293, 871, 307]",MISC
564,##out,"[782, 293, 871, 307]",MISC
565,##ing,"[782, 293, 871, 307]",MISC
566,options,"[872, 293, 973, 307]",MISC
567,.,"[872, 293, 973, 307]",MISC
568,-,"[974, 293, 976, 307]",MISC
569,NL,"[974, 293, 976, 307]",MISC
570,-,"[974, 293, 976, 307]",MISC
571,Design,"[91, 326, 209, 340]",MISC
572,##ing,"[91, 326, 209, 340]",MISC
573,quotes,"[209, 326, 287, 340]",MISC
574,as,"[288, 326, 314, 340]",MISC
575,per,"[315, 326, 353, 340]",MISC
576,the,"[354, 326, 392, 340]",MISC
577,requirement,"[394, 326, 537, 340]",MISC
578,given,"[538, 326, 604, 340]",MISC
579,by,"[604, 326, 630, 340]",MISC
580,the,"[630, 326, 669, 340]",MISC
581,sales,"[670, 326, 735, 340]",MISC
582,team,"[736, 326, 894, 340]",MISC
583,/,"[736, 326, 894, 340]",MISC
584,C,"[736, 326, 894, 340]",MISC
585,##lient,"[736, 326, 894, 340]",MISC
586,##s,"[736, 326, 894, 340]",MISC
587,.,"[894, 326, 906, 340]",MISC
588,-,"[907, 326, 909, 340]",MISC
589,NL,"[907, 326, 909, 340]",MISC
590,-,"[907, 326, 909, 340]",MISC
591,Getting,"[90, 359, 175, 372]",MISC
592,best,"[176, 359, 225, 372]",MISC
593,rates,"[226, 359, 285, 372]",MISC
594,from,"[287, 359, 336, 372]",MISC
595,suppliers,"[336, 359, 447, 372]",MISC
596,for,"[447, 359, 484, 372]",MISC
597,specific,"[484, 359, 582, 372]",MISC
598,it,"[583, 359, 717, 372]",MISC
599,##iner,"[583, 359, 717, 372]",MISC
600,##aries,"[583, 359, 717, 372]",MISC
601,in,"[719, 359, 742, 372]",MISC
602,order,"[743, 359, 803, 372]",MISC
603,to,"[805, 359, 829, 372]",MISC
604,close,"[830, 359, 890, 372]",MISC
605,the,"[891, 359, 928, 372]",MISC
606,deal,"[928, 359, 977, 372]",MISC
607,-,"[978, 359, 980, 372]",MISC
608,NL,"[978, 359, 980, 372]",MISC
609,-,"[978, 359, 980, 372]",MISC
610,for,"[94, 372, 127, 390]",MISC
611,potential,"[127, 372, 225, 390]",MISC
612,clients,"[225, 372, 312, 390]",MISC
613,.,"[225, 372, 312, 390]",MISC
614,-,"[312, 372, 313, 390]",MISC
615,NL,"[312, 372, 313, 390]",MISC
616,-,"[312, 372, 313, 390]",MISC
617,Find,"[90, 409, 141, 423]",MISC
618,out,"[141, 409, 179, 423]",MISC
619,the,"[179, 409, 218, 423]",MISC
620,best,"[218, 409, 268, 423]",MISC
621,Air,"[269, 409, 357, 423]",MISC
622,##line,"[269, 409, 357, 423]",MISC
623,and,"[358, 409, 396, 423]",MISC
624,R,"[396, 409, 485, 423]",MISC
625,##out,"[396, 409, 485, 423]",MISC
626,##ing,"[396, 409, 485, 423]",MISC
627,options,"[485, 409, 574, 423]",MISC
628,on,"[574, 409, 599, 423]",MISC
629,Kay,"[600, 409, 917, 423]",MISC
630,##ak,"[600, 409, 917, 423]",MISC
631,.,"[600, 409, 917, 423]",MISC
632,co,"[600, 409, 917, 423]",MISC
633,.,"[600, 409, 917, 423]",MISC
634,in,"[600, 409, 917, 423]",MISC
635,",","[600, 409, 917, 423]",MISC
636,sky,"[600, 409, 917, 423]",MISC
637,##sca,"[600, 409, 917, 423]",MISC
638,##ner,"[600, 409, 917, 423]",MISC
639,.,"[600, 409, 917, 423]",MISC
640,com,"[600, 409, 917, 423]",MISC
641,-,"[918, 409, 920, 423]",MISC
642,NL,"[918, 409, 920, 423]",MISC
643,-,"[918, 409, 920, 423]",MISC
644,The,"[78, 491, 123, 509]",B-employer_company_name
645,Magnus,"[125, 491, 217, 509]",I-employer_company_name
646,Tours,"[218, 491, 296, 509]",I-employer_company_name
647,and,"[297, 491, 342, 509]",I-employer_company_name
648,Travel,"[344, 491, 453, 509]",I-employer_company_name
649,##s,"[344, 491, 453, 509]",I-employer_company_name
650,-,"[453, 491, 455, 509]",MISC
651,NL,"[453, 491, 455, 509]",MISC
652,-,"[453, 491, 455, 509]",MISC
653,April,"[78, 509, 152, 527]",MISC
654,2016,"[153, 509, 347, 527]",MISC
655,–,"[153, 509, 347, 527]",MISC
656,December,"[153, 509, 347, 527]",MISC
657,’,"[347, 509, 422, 527]",MISC
658,2017,"[347, 509, 422, 527]",MISC
659,-,"[422, 509, 424, 527]",MISC
660,NL,"[422, 509, 424, 527]",MISC
661,-,"[422, 509, 424, 527]",MISC
662,Design,"[78, 544, 228, 562]",MISC
663,##ation,"[78, 544, 228, 562]",MISC
664,:,"[230, 544, 257, 562]",MISC
665,-,"[230, 544, 257, 562]",MISC
666,Sales,"[257, 544, 326, 562]",B-employer_role
667,/,"[326, 544, 339, 562]",I-employer_role
668,Operations,"[340, 544, 616, 562]",I-employer_role
669,-,"[340, 544, 616, 562]",I-employer_role
670,Executive,"[340, 544, 616, 562]",I-employer_role
671,-,"[617, 544, 618, 562]",MISC
672,NL,"[617, 544, 618, 562]",MISC
673,-,"[617, 544, 618, 562]",MISC
674,Hand,"[90, 584, 173, 597]",MISC
675,##led,"[90, 584, 173, 597]",MISC
676,operations,"[174, 584, 367, 597]",MISC
677,/,"[174, 584, 367, 597]",MISC
678,sales,"[174, 584, 367, 597]",MISC
679,for,"[368, 584, 405, 597]",MISC
680,Short,"[405, 584, 465, 597]",MISC
681,Ha,"[465, 584, 512, 597]",MISC
682,##ul,"[465, 584, 512, 597]",MISC
683,destinations,"[514, 584, 659, 597]",MISC
684,like,"[659, 584, 706, 597]",MISC
685,Singapore,"[708, 584, 936, 597]",MISC
686,",","[708, 584, 936, 597]",MISC
687,Thailand,"[708, 584, 936, 597]",MISC
688,",","[708, 584, 936, 597]",MISC
689,-,"[938, 584, 940, 597]",MISC
690,NL,"[938, 584, 940, 597]",MISC
691,-,"[938, 584, 940, 597]",MISC
692,UAE,"[94, 597, 194, 615]",MISC
693,",","[94, 597, 194, 615]",MISC
694,Hong,"[94, 597, 194, 615]",MISC
695,Kong,"[195, 597, 244, 615]",MISC
696,Macau,"[245, 597, 320, 615]",MISC
697,",","[245, 597, 320, 615]",MISC
698,Mal,"[321, 597, 421, 615]",MISC
699,##dives,"[321, 597, 421, 615]",MISC
700,",","[422, 597, 560, 615]",MISC
701,Se,"[422, 597, 560, 615]",MISC
702,##ych,"[422, 597, 560, 615]",MISC
703,##elles,"[422, 597, 560, 615]",MISC
704,",","[561, 597, 686, 615]",MISC
705,Mauritius,"[561, 597, 686, 615]",MISC
706,",","[687, 597, 812, 615]",MISC
707,Indonesia,"[687, 597, 812, 615]",MISC
708,etc,"[813, 597, 862, 615]",MISC
709,.,"[813, 597, 862, 615]",MISC
710,-,"[863, 597, 865, 615]",MISC
711,NL,"[863, 597, 865, 615]",MISC
712,-,"[863, 597, 865, 615]",MISC
713,C,"[89, 634, 184, 648]",MISC
714,##rea,"[89, 634, 184, 648]",MISC
715,##ting,"[89, 634, 184, 648]",MISC
716,quotes,"[184, 634, 266, 648]",MISC
717,/,"[184, 634, 266, 648]",MISC
718,it,"[267, 634, 372, 648]",MISC
719,##iner,"[267, 634, 372, 648]",MISC
720,##ary,"[267, 634, 372, 648]",MISC
721,for,"[374, 634, 408, 648]",MISC
722,the,"[409, 634, 444, 648]",MISC
723,international,"[445, 634, 597, 648]",MISC
724,destinations,"[599, 634, 751, 648]",MISC
725,.,"[599, 634, 751, 648]",MISC
726,-,"[753, 634, 754, 648]",MISC
727,NL,"[753, 634, 754, 648]",MISC
728,-,"[753, 634, 754, 648]",MISC
729,Em,"[90, 667, 192, 681]",MISC
730,##ailing,"[90, 667, 192, 681]",MISC
731,clients,"[193, 667, 281, 681]",MISC
732,quotes,"[282, 667, 358, 681]",MISC
733,along,"[359, 667, 422, 681]",MISC
734,with,"[423, 667, 473, 681]",MISC
735,day,"[474, 667, 512, 681]",MISC
736,wise,"[512, 667, 563, 681]",MISC
737,it,"[563, 667, 678, 681]",MISC
738,##iner,"[563, 667, 678, 681]",MISC
739,##ary,"[563, 667, 678, 681]",MISC
740,and,"[678, 667, 716, 681]",MISC
741,trying,"[717, 667, 793, 681]",MISC
742,to,"[793, 667, 819, 681]",MISC
743,get,"[819, 667, 857, 681]",MISC
744,conversion,"[857, 667, 984, 681]",MISC
745,-,"[985, 667, 987, 681]",MISC
746,NL,"[985, 667, 987, 681]",MISC
747,-,"[985, 667, 987, 681]",MISC
748,(,"[94, 681, 181, 699]",MISC
749,sales,"[94, 681, 181, 699]",MISC
750,),"[94, 681, 181, 699]",MISC
751,out,"[182, 681, 218, 699]",MISC
752,of,"[220, 681, 243, 699]",MISC
753,them,"[245, 681, 307, 699]",MISC
754,.,"[245, 681, 307, 699]",MISC
755,-,"[308, 681, 310, 699]",MISC
756,NL,"[308, 681, 310, 699]",MISC
757,-,"[308, 681, 310, 699]",MISC
758,Keeping,"[90, 718, 179, 731]",MISC
759,follow,"[181, 718, 257, 731]",MISC
760,up,"[259, 718, 284, 731]",MISC
761,with,"[285, 718, 336, 731]",MISC
762,the,"[337, 718, 375, 731]",MISC
763,clients,"[375, 718, 479, 731]",MISC
764,",","[375, 718, 479, 731]",MISC
765,for,"[479, 718, 517, 731]",MISC
766,the,"[518, 718, 556, 731]",MISC
767,quota,"[557, 718, 686, 731]",MISC
768,##tions,"[557, 718, 686, 731]",MISC
769,worked,"[686, 718, 762, 731]",MISC
770,out,"[764, 718, 802, 731]",MISC
771,on,"[803, 718, 841, 731]",MISC
772,.,"[803, 718, 841, 731]",MISC
773,-,"[842, 718, 843, 731]",MISC
774,NL,"[842, 718, 843, 731]",MISC
775,-,"[842, 718, 843, 731]",MISC
776,To,"[90, 750, 116, 764]",MISC
777,co,"[116, 750, 141, 764]",MISC
778,–,"[142, 750, 269, 764]",MISC
779,or,"[142, 750, 269, 764]",MISC
780,##dian,"[142, 750, 269, 764]",MISC
781,##ate,"[142, 750, 269, 764]",MISC
782,with,"[270, 750, 320, 764]",MISC
783,ticket,"[321, 750, 435, 764]",MISC
784,##ing,"[321, 750, 435, 764]",MISC
785,team,"[436, 750, 487, 764]",MISC
786,to,"[487, 750, 513, 764]",MISC
787,provide,"[513, 750, 602, 764]",MISC
788,best,"[603, 750, 653, 764]",MISC
789,Air,"[654, 750, 743, 764]",MISC
790,##line,"[654, 750, 743, 764]",MISC
791,and,"[744, 750, 782, 764]",MISC
792,R,"[782, 750, 871, 764]",MISC
793,##out,"[782, 750, 871, 764]",MISC
794,##ing,"[782, 750, 871, 764]",MISC
795,options,"[872, 750, 973, 764]",MISC
796,.,"[872, 750, 973, 764]",MISC
797,-,"[974, 750, 976, 764]",MISC
798,NL,"[974, 750, 976, 764]",MISC
799,-,"[974, 750, 976, 764]",MISC
800,Design,"[91, 783, 209, 797]",MISC
801,##ing,"[91, 783, 209, 797]",MISC
802,quotes,"[209, 783, 287, 797]",MISC
803,as,"[288, 783, 314, 797]",MISC
804,per,"[315, 783, 353, 797]",MISC
805,the,"[354, 783, 392, 797]",MISC
806,requirement,"[394, 783, 537, 797]",MISC
807,given,"[538, 783, 604, 797]",MISC
808,by,"[604, 783, 630, 797]",MISC
809,the,"[630, 783, 669, 797]",MISC
810,sales,"[670, 783, 735, 797]",MISC
811,team,"[736, 783, 894, 797]",MISC
812,/,"[736, 783, 894, 797]",MISC
813,C,"[736, 783, 894, 797]",MISC
814,##lient,"[736, 783, 894, 797]",MISC
815,##s,"[736, 783, 894, 797]",MISC
816,.,"[894, 783, 906, 797]",MISC
817,-,"[907, 783, 909, 797]",MISC
818,NL,"[907, 783, 909, 797]",MISC
819,-,"[907, 783, 909, 797]",MISC
820,Taking,"[90, 816, 167, 830]",MISC
821,the,"[167, 816, 205, 830]",MISC
822,best,"[206, 816, 256, 830]",MISC
823,price,"[257, 816, 320, 830]",MISC
824,from,"[321, 816, 372, 830]",MISC
825,different,"[372, 816, 486, 830]",MISC
826,websites,"[487, 816, 589, 830]",MISC
827,of,"[590, 816, 615, 830]",MISC
828,suppliers,"[615, 816, 730, 830]",MISC
829,to,"[731, 816, 756, 830]",MISC
830,make,"[756, 816, 807, 830]",MISC
831,the,"[808, 816, 846, 830]",MISC
832,it,"[846, 816, 960, 830]",MISC
833,##iner,"[846, 816, 960, 830]",MISC
834,##ary,"[846, 816, 960, 830]",MISC
835,as,"[961, 816, 987, 830]",MISC
836,-,"[987, 816, 989, 830]",MISC
837,NL,"[987, 816, 989, 830]",MISC
838,-,"[987, 816, 989, 830]",MISC
839,cost,"[94, 830, 143, 848]",MISC
840,effective,"[143, 830, 252, 848]",MISC
841,as,"[253, 830, 277, 848]",MISC
842,possible,"[278, 830, 376, 848]",MISC
843,(,"[376, 830, 670, 848]",MISC
844,Via,"[376, 830, 670, 848]",MISC
845,##tor,"[376, 830, 670, 848]",MISC
846,",","[376, 830, 670, 848]",MISC
847,O,"[376, 830, 670, 848]",MISC
848,##tti,"[376, 830, 670, 848]",MISC
849,##la,"[376, 830, 670, 848]",MISC
850,",","[376, 830, 670, 848]",MISC
851,T,"[376, 830, 670, 848]",MISC
852,##BO,"[376, 830, 670, 848]",MISC
853,",","[376, 830, 670, 848]",MISC
854,Room,"[376, 830, 670, 848]",MISC
855,##s,"[376, 830, 670, 848]",MISC
856,XML,"[671, 830, 707, 848]",MISC
857,etc,"[707, 830, 914, 848]",MISC
858,",","[707, 830, 914, 848]",MISC
859,G,"[707, 830, 914, 848]",MISC
860,##R,"[707, 830, 914, 848]",MISC
861,##N,"[707, 830, 914, 848]",MISC
862,",","[707, 830, 914, 848]",MISC
863,Ch,"[707, 830, 914, 848]",MISC
864,##eh,"[707, 830, 914, 848]",MISC
865,##ob,"[707, 830, 914, 848]",MISC
866,##o,"[707, 830, 914, 848]",MISC
867,),"[707, 830, 914, 848]",MISC
868,.,"[707, 830, 914, 848]",MISC
869,-,"[916, 830, 918, 848]",MISC
870,NL,"[916, 830, 918, 848]",MISC
871,-,"[916, 830, 918, 848]",MISC
872,Getting,"[90, 867, 175, 881]",MISC
873,best,"[176, 867, 225, 881]",MISC
874,rates,"[226, 867, 285, 881]",MISC
875,from,"[287, 867, 336, 881]",MISC
876,suppliers,"[336, 867, 447, 881]",MISC
877,for,"[447, 867, 484, 881]",MISC
878,specific,"[484, 867, 582, 881]",MISC
879,it,"[583, 867, 717, 881]",MISC
880,##iner,"[583, 867, 717, 881]",MISC
881,##aries,"[583, 867, 717, 881]",MISC
882,in,"[719, 867, 742, 881]",MISC
883,order,"[743, 867, 803, 881]",MISC
884,to,"[805, 867, 829, 881]",MISC
885,close,"[830, 867, 890, 881]",MISC
886,the,"[891, 867, 928, 881]",MISC
887,deal,"[928, 867, 977, 881]",MISC
888,-,"[978, 867, 980, 881]",MISC
889,NL,"[978, 867, 980, 881]",MISC
890,-,"[978, 867, 980, 881]",MISC
891,for,"[94, 881, 127, 898]",MISC
892,potential,"[127, 881, 225, 898]",MISC
893,clients,"[225, 881, 312, 898]",MISC
894,.,"[225, 881, 312, 898]",MISC
895,-,"[312, 881, 313, 898]",MISC
896,NL,"[312, 881, 313, 898]",MISC
897,-,"[312, 881, 313, 898]",MISC
898,E,"[78, 949, 183, 967]",B-employer_company_name
899,##zee,"[78, 949, 183, 967]",I-employer_company_name
900,##go,"[78, 949, 183, 967]",I-employer_company_name
901,##1,"[78, 949, 183, 967]",I-employer_company_name
902,Travel,"[184, 949, 289, 967]",I-employer_company_name
903,##s,"[184, 949, 289, 967]",I-employer_company_name
904,&,"[290, 949, 304, 967]",I-employer_company_name
905,Tours,"[305, 949, 379, 967]",I-employer_company_name
906,-,"[381, 949, 382, 967]",MISC
907,NL,"[381, 949, 382, 967]",MISC
908,-,"[381, 949, 382, 967]",MISC
909,August,"[78, 967, 328, 984]",MISC
910,’,"[78, 967, 328, 984]",MISC
911,2015,"[78, 967, 328, 984]",MISC
912,–,"[78, 967, 328, 984]",MISC
913,March,"[78, 967, 328, 984]",MISC
914,2016,"[329, 967, 387, 984]",MISC
915,-,"[388, 967, 390, 984]",MISC
916,NL,"[388, 967, 390, 984]",MISC
917,-,"[388, 967, 390, 984]",MISC
918,Design,"[78, 54, 230, 72]",MISC
919,##ation,"[78, 54, 230, 72]",MISC
920,:,"[231, 54, 258, 72]",MISC
921,-,"[231, 54, 258, 72]",MISC
922,Travel,"[259, 54, 342, 72]",B-employer_role
923,Advisor,"[343, 54, 439, 72]",I-employer_role
924,-,"[440, 54, 453, 72]",I-employer_role
925,Sales,"[454, 54, 523, 72]",I-employer_role
926,-,"[524, 54, 526, 72]",MISC
927,NL,"[524, 54, 526, 72]",MISC
928,-,"[524, 54, 526, 72]",MISC
929,Inter,"[90, 91, 226, 104]",MISC
930,##act,"[90, 91, 226, 104]",MISC
931,##ing,"[90, 91, 226, 104]",MISC
932,/,"[228, 91, 402, 104]",MISC
933,Co,"[228, 91, 402, 104]",MISC
934,##mm,"[228, 91, 402, 104]",MISC
935,##uni,"[228, 91, 402, 104]",MISC
936,##cating,"[228, 91, 402, 104]",MISC
937,with,"[403, 91, 452, 104]",MISC
938,clients,"[453, 91, 540, 104]",MISC
939,and,"[540, 91, 577, 104]",MISC
940,understanding,"[578, 91, 739, 104]",MISC
941,their,"[740, 91, 802, 104]",MISC
942,requirements,"[803, 91, 952, 104]",MISC
943,for,"[953, 91, 989, 104]",MISC
944,-,"[990, 91, 992, 104]",MISC
945,NL,"[990, 91, 992, 104]",MISC
946,-,"[990, 91, 992, 104]",MISC
947,their,"[94, 104, 159, 122]",MISC
948,travel,"[160, 104, 240, 122]",MISC
949,to,"[240, 104, 266, 122]",MISC
950,Short,"[267, 104, 332, 122]",MISC
951,haul,"[333, 104, 386, 122]",MISC
952,destinations,"[387, 104, 546, 122]",MISC
953,(,"[546, 104, 811, 122]",MISC
954,Singapore,"[546, 104, 811, 122]",MISC
955,",","[546, 104, 811, 122]",MISC
956,Thailand,"[546, 104, 811, 122]",MISC
957,",","[546, 104, 811, 122]",MISC
958,UAE,"[813, 104, 918, 122]",MISC
959,",","[813, 104, 918, 122]",MISC
960,Hong,"[813, 104, 918, 122]",MISC
961,Kong,"[919, 104, 972, 122]",MISC
962,-,"[972, 104, 974, 122]",MISC
963,NL,"[972, 104, 974, 122]",MISC
964,-,"[972, 104, 974, 122]",MISC
965,Macau,"[94, 122, 176, 140]",MISC
966,",","[94, 122, 176, 140]",MISC
967,Mal,"[176, 122, 285, 140]",MISC
968,##dives,"[176, 122, 285, 140]",MISC
969,",","[286, 122, 437, 140]",MISC
970,Se,"[286, 122, 437, 140]",MISC
971,##ych,"[286, 122, 437, 140]",MISC
972,##elles,"[286, 122, 437, 140]",MISC
973,",","[438, 122, 574, 140]",MISC
974,Mauritius,"[438, 122, 574, 140]",MISC
975,",","[575, 122, 726, 140]",MISC
976,Indonesia,"[575, 122, 726, 140]",MISC
977,",","[575, 122, 726, 140]",MISC
978,),"[727, 122, 739, 140]",MISC
979,and,"[740, 122, 780, 140]",MISC
980,got,"[782, 122, 822, 140]",MISC
981,trained,"[823, 122, 919, 140]",MISC
982,on,"[919, 122, 947, 140]",MISC
983,-,"[947, 122, 949, 140]",MISC
984,NL,"[947, 122, 949, 140]",MISC
985,-,"[947, 122, 949, 140]",MISC
986,long,"[94, 140, 147, 158]",MISC
987,haul,"[148, 140, 201, 158]",MISC
988,destinations,"[202, 140, 364, 158]",MISC
989,like,"[365, 140, 417, 158]",MISC
990,Europe,"[419, 140, 513, 158]",MISC
991,",","[419, 140, 513, 158]",MISC
992,New,"[514, 140, 554, 158]",MISC
993,Zealand,"[554, 140, 661, 158]",MISC
994,",","[554, 140, 661, 158]",MISC
995,Australia,"[663, 140, 784, 158]",MISC
996,.,"[785, 140, 797, 158]",MISC
997,-,"[798, 140, 800, 158]",MISC
998,NL,"[798, 140, 800, 158]",MISC
999,-,"[798, 140, 800, 158]",MISC
1000,Hand,"[91, 161, 194, 175]",MISC
1001,##ling,"[91, 161, 194, 175]",MISC
1002,request,"[195, 161, 286, 175]",MISC
1003,from,"[287, 161, 338, 175]",MISC
1004,clients,"[339, 161, 430, 175]",MISC
1005,",","[430, 161, 443, 175]",MISC
1006,up,"[444, 161, 547, 175]",MISC
1007,##dating,"[444, 161, 547, 175]",MISC
1008,CR,"[548, 161, 586, 175]",MISC
1009,##M,"[548, 161, 586, 175]",MISC
1010,on,"[587, 161, 613, 175]",MISC
1011,time,"[614, 161, 692, 175]",MISC
1012,##ly,"[614, 161, 692, 175]",MISC
1013,basis,"[692, 161, 757, 175]",MISC
1014,and,"[757, 161, 795, 175]",MISC
1015,maintaining,"[797, 161, 940, 175]",MISC
1016,its,"[940, 161, 978, 175]",MISC
1017,-,"[980, 161, 981, 175]",MISC
1018,NL,"[980, 161, 981, 175]",MISC
1019,-,"[980, 161, 981, 175]",MISC
1020,h,"[94, 175, 188, 193]",MISC
1021,##ygiene,"[94, 175, 188, 193]",MISC
1022,.,"[94, 175, 188, 193]",MISC
1023,-,"[188, 175, 190, 193]",MISC
1024,NL,"[188, 175, 190, 193]",MISC
1025,-,"[188, 175, 190, 193]",MISC
1026,Send,"[90, 197, 179, 211]",MISC
1027,##ing,"[90, 197, 179, 211]",MISC
1028,clients,"[181, 197, 270, 211]",MISC
1029,quotes,"[271, 197, 348, 211]",MISC
1030,along,"[349, 197, 412, 211]",MISC
1031,with,"[413, 197, 464, 211]",MISC
1032,day,"[465, 197, 503, 211]",MISC
1033,wise,"[504, 197, 555, 211]",MISC
1034,it,"[555, 197, 672, 211]",MISC
1035,##iner,"[555, 197, 672, 211]",MISC
1036,##ary,"[555, 197, 672, 211]",MISC
1037,and,"[672, 197, 710, 211]",MISC
1038,trying,"[710, 197, 787, 211]",MISC
1039,to,"[788, 197, 813, 211]",MISC
1040,get,"[814, 197, 852, 211]",MISC
1041,-,"[852, 197, 854, 211]",MISC
1042,NL,"[852, 197, 854, 211]",MISC
1043,-,"[852, 197, 854, 211]",MISC
1044,conversion,"[94, 211, 303, 228]",MISC
1045,(,"[94, 211, 303, 228]",MISC
1046,sales,"[94, 211, 303, 228]",MISC
1047,),"[94, 211, 303, 228]",MISC
1048,out,"[303, 211, 339, 228]",MISC
1049,of,"[340, 211, 363, 228]",MISC
1050,them,"[364, 211, 424, 228]",MISC
1051,.,"[364, 211, 424, 228]",MISC
1052,-,"[426, 211, 428, 228]",MISC
1053,NL,"[426, 211, 428, 228]",MISC
1054,-,"[426, 211, 428, 228]",MISC
1055,Following,"[91, 232, 215, 246]",MISC
1056,up,"[216, 232, 243, 246]",MISC
1057,with,"[244, 232, 298, 246]",MISC
1058,the,"[299, 232, 339, 246]",MISC
1059,clients,"[340, 232, 437, 246]",MISC
1060,on,"[437, 232, 464, 246]",MISC
1061,the,"[465, 232, 505, 246]",MISC
1062,phone,"[506, 232, 575, 246]",MISC
1063,to,"[575, 232, 603, 246]",MISC
1064,make,"[603, 232, 658, 246]",MISC
1065,necessary,"[658, 232, 782, 246]",MISC
1066,amendments,"[783, 232, 921, 246]",MISC
1067,in,"[921, 232, 948, 246]",MISC
1068,the,"[949, 232, 989, 246]",MISC
1069,-,"[990, 232, 992, 246]",MISC
1070,NL,"[990, 232, 992, 246]",MISC
1071,-,"[990, 232, 992, 246]",MISC
1072,package,"[94, 246, 192, 264]",MISC
1073,.,"[94, 246, 192, 264]",MISC
1074,-,"[192, 246, 194, 264]",MISC
1075,NL,"[192, 246, 194, 264]",MISC
1076,-,"[192, 246, 194, 264]",MISC
1077,Hand,"[90, 268, 188, 281]",MISC
1078,##ling,"[90, 268, 188, 281]",MISC
1079,calls,"[189, 268, 251, 281]",MISC
1080,from,"[251, 268, 300, 281]",MISC
1081,clients,"[301, 268, 386, 281]",MISC
1082,and,"[387, 268, 424, 281]",MISC
1083,re,"[425, 268, 535, 281]",MISC
1084,##sol,"[425, 268, 535, 281]",MISC
1085,##ving,"[425, 268, 535, 281]",MISC
1086,their,"[536, 268, 598, 281]",MISC
1087,travel,"[598, 268, 671, 281]",MISC
1088,related,"[672, 268, 758, 281]",MISC
1089,que,"[759, 268, 844, 281]",MISC
1090,##ries,"[759, 268, 844, 281]",MISC
1091,on,"[846, 268, 869, 281]",MISC
1092,-,"[871, 268, 872, 281]",MISC
1093,NL,"[871, 268, 872, 281]",MISC
1094,-,"[871, 268, 872, 281]",MISC
1095,international,"[94, 281, 235, 299]",MISC
1096,tours,"[237, 281, 302, 299]",MISC
1097,.,"[237, 281, 302, 299]",MISC
1098,-,"[303, 281, 304, 299]",MISC
1099,NL,"[303, 281, 304, 299]",MISC
1100,-,"[303, 281, 304, 299]",MISC
1101,Pre,"[90, 318, 203, 332]",MISC
1102,##par,"[90, 318, 203, 332]",MISC
1103,##ing,"[90, 318, 203, 332]",MISC
1104,quota,"[204, 318, 329, 332]",MISC
1105,##tions,"[204, 318, 329, 332]",MISC
1106,and,"[331, 318, 367, 332]",MISC
1107,cost,"[369, 318, 418, 332]",MISC
1108,sheets,"[420, 318, 494, 332]",MISC
1109,as,"[496, 318, 519, 332]",MISC
1110,per,"[521, 318, 557, 332]",MISC
1111,destination,"[559, 318, 710, 332]",MISC
1112,.,"[559, 318, 710, 332]",MISC
1113,-,"[711, 318, 713, 332]",MISC
1114,NL,"[711, 318, 713, 332]",MISC
1115,-,"[711, 318, 713, 332]",MISC
1116,Co,"[90, 351, 279, 365]",MISC
1117,-,"[90, 351, 279, 365]",MISC
1118,coordinating,"[90, 351, 279, 365]",MISC
1119,with,"[279, 351, 328, 365]",MISC
1120,clients,"[330, 351, 417, 365]",MISC
1121,on,"[418, 351, 441, 365]",MISC
1122,daily,"[443, 351, 505, 365]",MISC
1123,basis,"[506, 351, 568, 365]",MISC
1124,in,"[569, 351, 593, 365]",MISC
1125,order,"[594, 351, 656, 365]",MISC
1126,to,"[657, 351, 681, 365]",MISC
1127,close,"[683, 351, 744, 365]",MISC
1128,booking,"[746, 351, 845, 365]",MISC
1129,##s,"[746, 351, 845, 365]",MISC
1130,by,"[846, 351, 870, 365]",MISC
1131,providing,"[872, 351, 984, 365]",MISC
1132,-,"[985, 351, 987, 365]",MISC
1133,NL,"[985, 351, 987, 365]",MISC
1134,-,"[985, 351, 987, 365]",MISC
1135,required,"[94, 365, 186, 383]",MISC
1136,Information,"[187, 365, 325, 383]",MISC
1137,.,"[187, 365, 325, 383]",MISC
1138,-,"[326, 365, 328, 383]",MISC
1139,NL,"[326, 365, 328, 383]",MISC
1140,-,"[326, 365, 328, 383]",MISC
1141,Keeping,"[90, 402, 179, 415]",MISC
1142,follow,"[181, 402, 257, 415]",MISC
1143,up,"[259, 402, 284, 415]",MISC
1144,with,"[285, 402, 336, 415]",MISC
1145,the,"[337, 402, 375, 415]",MISC
1146,clients,"[375, 402, 479, 415]",MISC
1147,",","[375, 402, 479, 415]",MISC
1148,for,"[479, 402, 517, 415]",MISC
1149,the,"[518, 402, 556, 415]",MISC
1150,quota,"[557, 402, 686, 415]",MISC
1151,##tions,"[557, 402, 686, 415]",MISC
1152,worked,"[686, 402, 762, 415]",MISC
1153,out,"[764, 402, 802, 415]",MISC
1154,on,"[803, 402, 841, 415]",MISC
1155,.,"[803, 402, 841, 415]",MISC
1156,-,"[842, 402, 843, 415]",MISC
1157,NL,"[842, 402, 843, 415]",MISC
1158,-,"[842, 402, 843, 415]",MISC
1159,Find,"[90, 434, 141, 448]",MISC
1160,out,"[141, 434, 180, 448]",MISC
1161,the,"[180, 434, 218, 448]",MISC
1162,best,"[218, 434, 269, 448]",MISC
1163,Air,"[269, 434, 358, 448]",MISC
1164,##line,"[269, 434, 358, 448]",MISC
1165,and,"[359, 434, 397, 448]",MISC
1166,R,"[397, 434, 486, 448]",MISC
1167,##out,"[397, 434, 486, 448]",MISC
1168,##ing,"[397, 434, 486, 448]",MISC
1169,options,"[486, 434, 575, 448]",MISC
1170,on,"[576, 434, 601, 448]",MISC
1171,Kay,"[601, 434, 754, 448]",MISC
1172,##ak,"[601, 434, 754, 448]",MISC
1173,.,"[601, 434, 754, 448]",MISC
1174,co,"[601, 434, 754, 448]",MISC
1175,.,"[601, 434, 754, 448]",MISC
1176,in,"[601, 434, 754, 448]",MISC
1177,.,"[601, 434, 754, 448]",MISC
1178,-,"[754, 434, 756, 448]",MISC
1179,NL,"[754, 434, 756, 448]",MISC
1180,-,"[754, 434, 756, 448]",MISC
1181,Computer,"[78, 466, 188, 484]",B-skills_heading
1182,Prof,"[188, 466, 339, 484]",I-skills_heading
1183,##iciency,"[188, 466, 339, 484]",I-skills_heading
1184,-,"[341, 466, 343, 484]",MISC
1185,NL,"[341, 466, 343, 484]",MISC
1186,-,"[341, 466, 343, 484]",MISC
1187,Microsoft,"[90, 505, 201, 519]",MISC
1188,office,"[203, 505, 277, 519]",MISC
1189,(,"[278, 505, 388, 519]",MISC
1190,MS,"[278, 505, 388, 519]",MISC
1191,-,"[278, 505, 388, 519]",MISC
1192,Word,"[278, 505, 388, 519]",MISC
1193,",","[278, 505, 388, 519]",MISC
1194,MS,"[390, 505, 490, 519]",MISC
1195,-,"[390, 505, 490, 519]",MISC
1196,Power,"[390, 505, 490, 519]",MISC
1197,Point,"[490, 505, 564, 519]",MISC
1198,",","[490, 505, 564, 519]",MISC
1199,Ba,"[565, 505, 627, 519]",MISC
1200,##sis,"[565, 505, 627, 519]",MISC
1201,MS,"[627, 505, 738, 519]",MISC
1202,-,"[627, 505, 738, 519]",MISC
1203,Ex,"[627, 505, 738, 519]",MISC
1204,##cel,"[627, 505, 738, 519]",MISC
1205,),"[627, 505, 738, 519]",MISC
1206,-,"[740, 505, 742, 519]",MISC
1207,NL,"[740, 505, 742, 519]",MISC
1208,-,"[740, 505, 742, 519]",MISC
1209,AC,"[78, 537, 205, 554]",B-education_heading
1210,##AD,"[78, 537, 205, 554]",I-education_heading
1211,##EM,"[78, 537, 205, 554]",I-education_heading
1212,##IC,"[78, 537, 205, 554]",I-education_heading
1213,CR,"[205, 537, 379, 554]",I-education_heading
1214,##ED,"[205, 537, 379, 554]",I-education_heading
1215,##EN,"[205, 537, 379, 554]",I-education_heading
1216,##TI,"[205, 537, 379, 554]",I-education_heading
1217,##AL,"[205, 537, 379, 554]",I-education_heading
1218,##S,"[205, 537, 379, 554]",I-education_heading
1219,-,"[381, 537, 382, 554]",MISC
1220,NL,"[381, 537, 382, 554]",MISC
1221,-,"[381, 537, 382, 554]",MISC
1222,MBA,"[110, 572, 152, 590]",B-education_degree
1223,Finance,"[153, 572, 251, 590]",B-education_course
1224,–,"[251, 572, 264, 590]",MISC
1225,I,"[265, 572, 307, 590]",B-education_institute
1226,##ES,"[265, 572, 307, 590]",I-education_institute
1227,Management,"[308, 572, 447, 590]",I-education_institute
1228,College,"[449, 572, 547, 590]",I-education_institute
1229,-,"[548, 572, 549, 590]",MISC
1230,NL,"[548, 572, 549, 590]",MISC
1231,-,"[548, 572, 549, 590]",MISC
1232,2009,"[637, 572, 695, 590]",MISC
1233,-,"[695, 572, 710, 590]",MISC
1234,2011,"[710, 572, 768, 590]",MISC
1235,-,"[769, 572, 771, 590]",MISC
1236,NL,"[769, 572, 771, 590]",MISC
1237,-,"[769, 572, 771, 590]",MISC
1238,M,"[110, 591, 123, 609]",B-education_degree
1239,Co,"[125, 591, 166, 609]",I-education_degree
1240,##m,"[125, 591, 166, 609]",I-education_degree
1241,–,"[168, 591, 180, 609]",MISC
1242,University,"[182, 591, 325, 609]",B-education_institute
1243,of,"[326, 591, 353, 609]",I-education_institute
1244,Mumbai,"[354, 591, 440, 609]",I-education_institute
1245,-,"[441, 591, 442, 609]",MISC
1246,NL,"[441, 591, 442, 609]",MISC
1247,-,"[441, 591, 442, 609]",MISC
1248,2008,"[638, 591, 696, 609]",MISC
1249,-,"[697, 591, 712, 609]",MISC
1250,2010,"[712, 591, 770, 609]",MISC
1251,-,"[771, 591, 773, 609]",MISC
1252,NL,"[771, 591, 773, 609]",MISC
1253,-,"[771, 591, 773, 609]",MISC
1254,B,"[110, 609, 123, 627]",B-education_degree
1255,Co,"[125, 609, 166, 627]",I-education_degree
1256,##m,"[125, 609, 166, 627]",I-education_degree
1257,–,"[168, 609, 181, 627]",MISC
1258,Na,"[182, 609, 268, 627]",B-education_institute
1259,##rse,"[182, 609, 268, 627]",I-education_institute
1260,##e,"[182, 609, 268, 627]",I-education_institute
1261,Mon,"[269, 609, 354, 627]",I-education_institute
1262,##jee,"[269, 609, 354, 627]",I-education_institute
1263,College,"[356, 609, 456, 627]",I-education_institute
1264,-,"[457, 609, 459, 627]",MISC
1265,NL,"[457, 609, 459, 627]",MISC
1266,-,"[457, 609, 459, 627]",MISC
1267,2005,"[638, 609, 698, 627]",MISC
1268,–,"[699, 609, 713, 627]",MISC
1269,2008,"[714, 609, 774, 627]",MISC
1270,-,"[774, 609, 776, 627]",MISC
1271,NL,"[774, 609, 776, 627]",MISC
1272,-,"[774, 609, 776, 627]",MISC
1273,AD,"[78, 663, 226, 681]",MISC
1274,##DI,"[78, 663, 226, 681]",MISC
1275,##TI,"[78, 663, 226, 681]",MISC
1276,##ON,"[78, 663, 226, 681]",MISC
1277,##AL,"[78, 663, 226, 681]",MISC
1278,Q,"[227, 663, 601, 681]",MISC
1279,##U,"[227, 663, 601, 681]",MISC
1280,##AL,"[227, 663, 601, 681]",MISC
1281,##IF,"[227, 663, 601, 681]",MISC
1282,##IC,"[227, 663, 601, 681]",MISC
1283,##AT,"[227, 663, 601, 681]",MISC
1284,##ION,"[227, 663, 601, 681]",MISC
1285,##S,"[227, 663, 601, 681]",MISC
1286,/,"[227, 663, 601, 681]",MISC
1287,E,"[227, 663, 601, 681]",MISC
1288,##X,"[227, 663, 601, 681]",MISC
1289,##P,"[227, 663, 601, 681]",MISC
1290,##ER,"[227, 663, 601, 681]",MISC
1291,##IE,"[227, 663, 601, 681]",MISC
1292,##NC,"[227, 663, 601, 681]",MISC
1293,##E,"[227, 663, 601, 681]",MISC
1294,-,"[602, 663, 604, 681]",MISC
1295,NL,"[602, 663, 604, 681]",MISC
1296,-,"[602, 663, 604, 681]",MISC
1297,Travel,"[78, 699, 157, 716]",MISC
1298,and,"[159, 699, 199, 716]",MISC
1299,Tourism,"[200, 699, 294, 716]",MISC
1300,V,"[295, 699, 429, 716]",MISC
1301,##oc,"[295, 699, 429, 716]",MISC
1302,##ational,"[295, 699, 429, 716]",MISC
1303,Course,"[431, 699, 511, 716]",MISC
1304,–,"[513, 699, 525, 716]",MISC
1305,Na,"[526, 699, 606, 716]",B-education_institute
1306,##rse,"[526, 699, 606, 716]",I-education_institute
1307,##e,"[526, 699, 606, 716]",I-education_institute
1308,Mon,"[608, 699, 688, 716]",I-education_institute
1309,##jee,"[608, 699, 688, 716]",I-education_institute
1310,College,"[689, 699, 784, 716]",I-education_institute
1311,2003,"[785, 699, 906, 716]",MISC
1312,-,"[785, 699, 906, 716]",MISC
1313,2005,"[785, 699, 906, 716]",MISC
1314,-,"[907, 699, 909, 716]",MISC
1315,NL,"[907, 699, 909, 716]",MISC
1316,-,"[907, 699, 909, 716]",MISC
1317,S,"[78, 876, 176, 893]",B-work_experience_heading
1318,##UM,"[78, 876, 176, 893]",I-work_experience_heading
1319,##ME,"[78, 876, 176, 893]",I-work_experience_heading
1320,##R,"[78, 876, 176, 893]",I-work_experience_heading
1321,IN,"[177, 876, 342, 893]",I-work_experience_heading
1322,##TE,"[177, 876, 342, 893]",I-work_experience_heading
1323,##R,"[177, 876, 342, 893]",I-work_experience_heading
1324,##NS,"[177, 876, 342, 893]",I-work_experience_heading
1325,##H,"[177, 876, 342, 893]",I-work_experience_heading
1326,##IP,"[177, 876, 342, 893]",I-work_experience_heading
1327,-,"[343, 876, 344, 893]",MISC
1328,NL,"[343, 876, 344, 893]",MISC
1329,-,"[343, 876, 344, 893]",MISC
1330,Indian,"[78, 911, 165, 929]",MISC
1331,Overseas,"[166, 911, 282, 929]",MISC
1332,Travel,"[284, 911, 371, 929]",MISC
1333,and,"[372, 911, 415, 929]",MISC
1334,Tours,"[416, 911, 489, 929]",MISC
1335,-,"[490, 911, 491, 929]",MISC
1336,NL,"[490, 911, 491, 929]",MISC
1337,-,"[490, 911, 491, 929]",MISC
1338,May,"[838, 911, 947, 929]",MISC
1339,-,"[838, 911, 947, 929]",MISC
1340,July,"[838, 911, 947, 929]",MISC
1341,‘,"[948, 911, 987, 929]",MISC
1342,04,"[948, 911, 987, 929]",MISC
1343,-,"[989, 911, 990, 929]",MISC
1344,NL,"[989, 911, 990, 929]",MISC
1345,-,"[989, 911, 990, 929]",MISC
1346,Taking,"[90, 950, 162, 964]",MISC
1347,Air,"[164, 950, 200, 964]",MISC
1348,booking,"[200, 950, 298, 964]",MISC
1349,##s,"[200, 950, 298, 964]",MISC
1350,and,"[299, 950, 335, 964]",MISC
1351,training,"[335, 950, 433, 964]",MISC
1352,on,"[434, 950, 457, 964]",MISC
1353,It,"[458, 950, 605, 964]",MISC
1354,##iner,"[458, 950, 605, 964]",MISC
1355,##aries,"[458, 950, 605, 964]",MISC
1356,.,"[458, 950, 605, 964]",MISC
1357,-,"[606, 950, 607, 964]",MISC
1358,NL,"[606, 950, 607, 964]",MISC
1359,-,"[606, 950, 607, 964]",MISC
1360,C,"[90, 968, 190, 982]",MISC
1361,##rea,"[90, 968, 190, 982]",MISC
1362,##ting,"[90, 968, 190, 982]",MISC
1363,Air,"[192, 968, 228, 982]",MISC
1364,T,"[230, 968, 317, 982]",MISC
1365,##ick,"[230, 968, 317, 982]",MISC
1366,##ets,"[230, 968, 317, 982]",MISC
1367,on,"[318, 968, 342, 982]",MISC
1368,software,"[344, 968, 443, 982]",MISC
1369,i,"[445, 968, 481, 982]",MISC
1370,.,"[445, 968, 481, 982]",MISC
1371,e,"[445, 968, 481, 982]",MISC
1372,A,"[483, 968, 557, 982]",MISC
1373,##ba,"[483, 968, 557, 982]",MISC
1374,##cus,"[483, 968, 557, 982]",MISC
1375,and,"[559, 968, 595, 982]",MISC
1376,Galileo,"[597, 968, 697, 982]",MISC
1377,.,"[597, 968, 697, 982]",MISC
1378,-,"[698, 968, 700, 982]",MISC
1379,NL,"[698, 968, 700, 982]",MISC
1380,-,"[698, 968, 700, 982]",MISC
1381,Main,"[90, 986, 224, 1000]",MISC
1382,##taining,"[90, 986, 224, 1000]",MISC
1383,Daily,"[225, 986, 285, 1000]",MISC
1384,Sales,"[287, 986, 347, 1000]",MISC
1385,Report,"[349, 986, 434, 1000]",MISC
1386,.,"[349, 986, 434, 1000]",MISC
1387,-,"[435, 986, 437, 1000]",MISC
1388,NL,"[435, 986, 437, 1000]",MISC
1389,-,"[435, 986, 437, 1000]",MISC
1390,Em,"[91, 54, 194, 72]",MISC
1391,##ailing,"[91, 54, 194, 72]",MISC
1392,and,"[195, 54, 233, 72]",MISC
1393,coordinating,"[234, 54, 390, 72]",MISC
1394,with,"[391, 54, 442, 72]",MISC
1395,the,"[443, 54, 481, 72]",MISC
1396,clients,"[482, 54, 573, 72]",MISC
1397,on,"[574, 54, 599, 72]",MISC
1398,their,"[600, 54, 663, 72]",MISC
1399,booking,"[665, 54, 756, 72]",MISC
1400,status,"[756, 54, 835, 72]",MISC
1401,and,"[835, 54, 873, 72]",MISC
1402,P,"[874, 54, 912, 72]",MISC
1403,##NR,"[874, 54, 912, 72]",MISC
1404,no,"[913, 54, 951, 72]",MISC
1405,.,"[913, 54, 951, 72]",MISC
1406,-,"[952, 54, 954, 72]",MISC
1407,NL,"[952, 54, 954, 72]",MISC
1408,-,"[952, 54, 954, 72]",MISC
1409,CO,"[78, 89, 270, 107]",B-others_heading
1410,-,"[78, 89, 270, 107]",I-others_heading
1411,C,"[78, 89, 270, 107]",I-others_heading
1412,##UR,"[78, 89, 270, 107]",I-others_heading
1413,##RI,"[78, 89, 270, 107]",I-others_heading
1414,##CU,"[78, 89, 270, 107]",I-others_heading
1415,##LA,"[78, 89, 270, 107]",I-others_heading
1416,##R,"[78, 89, 270, 107]",I-others_heading
1417,ACT,"[270, 89, 417, 107]",I-others_heading
1418,##I,"[270, 89, 417, 107]",I-others_heading
1419,##VI,"[270, 89, 417, 107]",I-others_heading
1420,##TI,"[270, 89, 417, 107]",I-others_heading
1421,##ES,"[270, 89, 417, 107]",I-others_heading
1422,-,"[419, 89, 421, 107]",MISC
1423,NL,"[419, 89, 421, 107]",MISC
1424,-,"[419, 89, 421, 107]",MISC
1425,Old,"[91, 128, 131, 142]",MISC
1426,Age,"[131, 128, 171, 142]",MISC
1427,home,"[171, 128, 224, 142]",MISC
1428,visits,"[225, 128, 318, 142]",MISC
1429,.,"[225, 128, 318, 142]",MISC
1430,-,"[319, 128, 321, 142]",MISC
1431,NL,"[319, 128, 321, 142]",MISC
1432,-,"[319, 128, 321, 142]",MISC
1433,Part,"[90, 146, 241, 160]",MISC
1434,##ici,"[90, 146, 241, 160]",MISC
1435,##pate,"[90, 146, 241, 160]",MISC
1436,##d,"[90, 146, 241, 160]",MISC
1437,in,"[242, 146, 266, 160]",MISC
1438,annual,"[267, 146, 342, 160]",MISC
1439,day,"[343, 146, 379, 160]",MISC
1440,Competition,"[381, 146, 519, 160]",MISC
1441,“,"[520, 146, 747, 160]",MISC
1442,P,"[520, 146, 747, 160]",MISC
1443,##rat,"[520, 146, 747, 160]",MISC
1444,##i,"[520, 146, 747, 160]",MISC
1445,##yu,"[520, 146, 747, 160]",MISC
1446,##sh,"[520, 146, 747, 160]",MISC
1447,”,"[520, 146, 747, 160]",MISC
1448,(,"[520, 146, 747, 160]",MISC
1449,Dance,"[520, 146, 747, 160]",MISC
1450,",","[520, 146, 747, 160]",MISC
1451,Fashion,"[748, 146, 835, 160]",MISC
1452,Show,"[836, 146, 898, 160]",MISC
1453,),"[836, 146, 898, 160]",MISC
1454,-,"[900, 146, 901, 160]",MISC
1455,NL,"[900, 146, 901, 160]",MISC
1456,-,"[900, 146, 901, 160]",MISC
1457,Effect,"[91, 164, 209, 178]",MISC
1458,##ive,"[91, 164, 209, 178]",MISC
1459,participation,"[210, 164, 380, 178]",MISC
1460,in,"[382, 164, 407, 178]",MISC
1461,Annual,"[408, 164, 486, 178]",MISC
1462,Corporate,"[487, 164, 605, 178]",MISC
1463,event,"[606, 164, 672, 178]",MISC
1464,–,"[672, 164, 685, 178]",MISC
1465,U,"[686, 164, 751, 178]",MISC
1466,##DA,"[686, 164, 751, 178]",MISC
1467,##AN,"[686, 164, 751, 178]",MISC
1468,at,"[752, 164, 777, 178]",MISC
1469,I,"[778, 164, 816, 178]",MISC
1470,##ES,"[778, 164, 816, 178]",MISC
1471,MC,"[818, 164, 870, 178]",MISC
1472,##RC,"[818, 164, 870, 178]",MISC
1473,-,"[871, 164, 872, 178]",MISC
1474,NL,"[871, 164, 872, 178]",MISC
1475,-,"[871, 164, 872, 178]",MISC
1476,Active,"[91, 182, 169, 195]",MISC
1477,member,"[170, 182, 248, 195]",MISC
1478,Industry,"[249, 182, 354, 195]",MISC
1479,Inter,"[355, 182, 498, 195]",MISC
1480,##action,"[355, 182, 498, 195]",MISC
1481,Committee,"[500, 182, 618, 195]",MISC
1482,of,"[618, 182, 644, 195]",MISC
1483,‘,"[645, 182, 697, 195]",MISC
1484,I,"[645, 182, 697, 195]",MISC
1485,##ES,"[645, 182, 697, 195]",MISC
1486,MC,"[698, 182, 763, 195]",MISC
1487,##RC,"[698, 182, 763, 195]",MISC
1488,’,"[698, 182, 763, 195]",MISC
1489,-,"[764, 182, 765, 195]",MISC
1490,NL,"[764, 182, 765, 195]",MISC
1491,-,"[764, 182, 765, 195]",MISC
1492,AC,"[78, 213, 286, 231]",B-others_heading
1493,##H,"[78, 213, 286, 231]",I-others_heading
1494,##IE,"[78, 213, 286, 231]",I-others_heading
1495,##VE,"[78, 213, 286, 231]",I-others_heading
1496,##ME,"[78, 213, 286, 231]",I-others_heading
1497,##NT,"[78, 213, 286, 231]",I-others_heading
1498,##S,"[78, 213, 286, 231]",I-others_heading
1499,&,"[287, 213, 304, 231]",I-others_heading
1500,A,"[305, 213, 408, 231]",I-others_heading
1501,##WA,"[305, 213, 408, 231]",I-others_heading
1502,##RD,"[305, 213, 408, 231]",I-others_heading
1503,##S,"[305, 213, 408, 231]",I-others_heading
1504,-,"[410, 213, 411, 231]",MISC
1505,NL,"[410, 213, 411, 231]",MISC
1506,-,"[410, 213, 411, 231]",MISC
1507,Award,"[93, 252, 410, 266]",MISC
1508,##ed,"[93, 252, 410, 266]",MISC
1509,‘,"[93, 252, 410, 266]",MISC
1510,Ms,"[93, 252, 410, 266]",MISC
1511,.,"[93, 252, 410, 266]",MISC
1512,Fresh,"[93, 252, 410, 266]",MISC
1513,##er,"[93, 252, 410, 266]",MISC
1514,’,"[93, 252, 410, 266]",MISC
1515,of,"[93, 252, 410, 266]",MISC
1516,the,"[412, 252, 457, 266]",MISC
1517,year,"[457, 252, 517, 266]",MISC
1518,2009,"[518, 252, 578, 266]",MISC
1519,at,"[579, 252, 608, 266]",MISC
1520,I,"[609, 252, 655, 266]",MISC
1521,##ES,"[609, 252, 655, 266]",MISC
1522,MC,"[655, 252, 729, 266]",MISC
1523,##RC,"[655, 252, 729, 266]",MISC
1524,.,"[655, 252, 729, 266]",MISC
1525,-,"[731, 252, 733, 266]",MISC
1526,NL,"[731, 252, 733, 266]",MISC
1527,-,"[731, 252, 733, 266]",MISC
1528,Ce,"[91, 270, 272, 284]",MISC
1529,##rt,"[91, 270, 272, 284]",MISC
1530,##ifications,"[91, 270, 272, 284]",MISC
1531,from,"[272, 270, 323, 284]",MISC
1532,S,"[324, 270, 415, 284]",MISC
1533,##hai,"[324, 270, 415, 284]",MISC
1534,##ma,"[324, 270, 415, 284]",MISC
1535,##k,"[324, 270, 415, 284]",MISC
1536,Da,"[415, 270, 478, 284]",MISC
1537,##var,"[415, 270, 478, 284]",MISC
1538,Dance,"[480, 270, 543, 284]",MISC
1539,Academy,"[545, 270, 635, 284]",MISC
1540,(,"[636, 270, 739, 284]",MISC
1541,cleared,"[636, 270, 739, 284]",MISC
1542,4,"[739, 270, 752, 284]",MISC
1543,levels,"[752, 270, 856, 284]",MISC
1544,),"[752, 270, 856, 284]",MISC
1545,.,"[752, 270, 856, 284]",MISC
1546,-,"[856, 270, 858, 284]",MISC
1547,NL,"[856, 270, 858, 284]",MISC
1548,-,"[856, 270, 858, 284]",MISC
1549,Silver,"[90, 288, 162, 302]",MISC
1550,medal,"[162, 288, 222, 302]",MISC
1551,&,"[223, 288, 234, 302]",MISC
1552,certificate,"[235, 288, 367, 302]",MISC
1553,for,"[368, 288, 404, 302]",MISC
1554,collecting,"[405, 288, 524, 302]",MISC
1555,funds,"[526, 288, 585, 302]",MISC
1556,for,"[586, 288, 622, 302]",MISC
1557,poor,"[622, 288, 670, 302]",MISC
1558,children,"[671, 288, 780, 302]",MISC
1559,.,"[671, 288, 780, 302]",MISC
1560,-,"[780, 288, 782, 302]",MISC
1561,NL,"[780, 288, 782, 302]",MISC
1562,-,"[780, 288, 782, 302]",MISC
1563,P,"[78, 337, 208, 355]",B-personal_details_heading
1564,##ER,"[78, 337, 208, 355]",I-personal_details_heading
1565,##SO,"[78, 337, 208, 355]",I-personal_details_heading
1566,##NA,"[78, 337, 208, 355]",I-personal_details_heading
1567,##L,"[78, 337, 208, 355]",I-personal_details_heading
1568,DOS,"[208, 337, 323, 355]",I-personal_details_heading
1569,##SI,"[208, 337, 323, 355]",I-personal_details_heading
1570,##ER,"[208, 337, 323, 355]",I-personal_details_heading
1571,-,"[323, 337, 324, 355]",MISC
1572,NL,"[323, 337, 324, 355]",MISC
1573,-,"[323, 337, 324, 355]",MISC
1574,Date,"[78, 372, 125, 390]",MISC
1575,of,"[126, 372, 150, 390]",MISC
1576,Birth,"[150, 372, 223, 390]",MISC
1577,:,"[150, 372, 223, 390]",MISC
1578,-,"[223, 372, 225, 390]",MISC
1579,NL,"[223, 372, 225, 390]",MISC
1580,-,"[223, 372, 225, 390]",MISC
1581,27th,"[274, 372, 324, 390]",MISC
1582,February,"[325, 372, 429, 390]",MISC
1583,1988,"[429, 372, 480, 390]",MISC
1584,-,"[480, 372, 482, 390]",MISC
1585,NL,"[480, 372, 482, 390]",MISC
1586,-,"[480, 372, 482, 390]",MISC
1587,Location,"[78, 390, 194, 408]",MISC
1588,:,"[78, 390, 194, 408]",MISC
1589,Mumbai,"[194, 390, 270, 408]",MISC
1590,-,"[272, 390, 274, 408]",MISC
1591,NL,"[272, 390, 274, 408]",MISC
1592,-,"[272, 390, 274, 408]",MISC
1593,R,"[78, 426, 221, 443]",MISC
1594,##EF,"[78, 426, 221, 443]",MISC
1595,##ER,"[78, 426, 221, 443]",MISC
1596,##EN,"[78, 426, 221, 443]",MISC
1597,##CE,"[78, 426, 221, 443]",MISC
1598,–,"[221, 426, 236, 443]",MISC
1599,On,"[237, 426, 268, 443]",MISC
1600,request,"[269, 426, 380, 443]",MISC
1601,-,"[381, 426, 382, 443]",MISC
1602,NL,"[381, 426, 382, 443]",MISC
1603,-,"[381, 426, 382, 443]",MISC
