,token,box,label
0,R,"[513, 89, 663, 125]",MISC
1,##ES,"[513, 89, 663, 125]",MISC
2,##UM,"[513, 89, 663, 125]",MISC
3,##E,"[513, 89, 663, 125]",MISC
4,-,"[663, 89, 665, 125]",MISC
5,NL,"[663, 89, 665, 125]",MISC
6,-,"[663, 89, 665, 125]",MISC
7,Name,"[148, 157, 226, 181]",MISC
8,:,"[227, 157, 265, 181]",MISC
9,-,"[227, 157, 265, 181]",MISC
10,M,"[267, 157, 305, 181]",B-name
11,##O,"[267, 157, 305, 181]",I-name
12,FA,"[306, 157, 404, 181]",I-name
13,##R,"[306, 157, 404, 181]",I-name
14,##U,"[306, 157, 404, 181]",I-name
15,##K,"[306, 157, 404, 181]",I-name
16,GO,"[406, 157, 503, 181]",I-name
17,##UR,"[406, 157, 503, 181]",I-name
18,##I,"[406, 157, 503, 181]",I-name
19,-,"[505, 157, 506, 181]",MISC
20,NL,"[505, 157, 506, 181]",MISC
21,-,"[505, 157, 506, 181]",MISC
22,Ad,"[148, 178, 212, 200]",MISC
23,##d,"[148, 178, 212, 200]",MISC
24,.,"[148, 178, 212, 200]",MISC
25,:,"[214, 178, 245, 200]",MISC
26,-,"[214, 178, 245, 200]",MISC
27,WA,"[247, 178, 311, 200]",MISC
28,##RD,"[247, 178, 311, 200]",MISC
29,NO,"[313, 178, 362, 200]",MISC
30,.,"[313, 178, 362, 200]",MISC
31,25,"[362, 178, 394, 200]",MISC
32,B,"[396, 178, 493, 200]",MISC
33,##I,"[396, 178, 493, 200]",MISC
34,##HA,"[396, 178, 493, 200]",MISC
35,##RI,"[396, 178, 493, 200]",MISC
36,P,"[495, 178, 559, 200]",MISC
37,##UR,"[495, 178, 559, 200]",MISC
38,##A,"[495, 178, 559, 200]",MISC
39,BA,"[561, 178, 625, 200]",MISC
40,##SS,"[561, 178, 625, 200]",MISC
41,B,"[627, 178, 725, 200]",MISC
42,##HA,"[627, 178, 725, 200]",MISC
43,##DR,"[627, 178, 725, 200]",MISC
44,##A,"[627, 178, 725, 200]",MISC
45,T,"[726, 178, 824, 200]",MISC
46,##E,"[726, 178, 824, 200]",MISC
47,##HS,"[726, 178, 824, 200]",MISC
48,##IL,"[726, 178, 824, 200]",MISC
49,B,"[825, 178, 923, 200]",MISC
50,##HA,"[825, 178, 923, 200]",MISC
51,##DR,"[825, 178, 923, 200]",MISC
52,##A,"[825, 178, 923, 200]",MISC
53,-,"[925, 178, 926, 200]",MISC
54,NL,"[925, 178, 926, 200]",MISC
55,-,"[925, 178, 926, 200]",MISC
56,D,"[313, 199, 425, 219]",MISC
57,##IS,"[313, 199, 425, 219]",MISC
58,##TR,"[313, 199, 425, 219]",MISC
59,##IC,"[313, 199, 425, 219]",MISC
60,##T,"[313, 199, 425, 219]",MISC
61,H,"[426, 199, 581, 219]",MISC
62,##AN,"[426, 199, 581, 219]",MISC
63,##UM,"[426, 199, 581, 219]",MISC
64,##AN,"[426, 199, 581, 219]",MISC
65,##GA,"[426, 199, 581, 219]",MISC
66,##R,"[426, 199, 581, 219]",MISC
67,##H,"[426, 199, 581, 219]",MISC
68,RA,"[581, 199, 707, 219]",MISC
69,##J,"[581, 199, 707, 219]",MISC
70,##AS,"[581, 199, 707, 219]",MISC
71,##TH,"[581, 199, 707, 219]",MISC
72,##AN,"[581, 199, 707, 219]",MISC
73,P,"[708, 199, 750, 219]",MISC
74,##IN,"[708, 199, 750, 219]",MISC
75,NO,"[751, 199, 792, 219]",MISC
76,.,"[751, 199, 792, 219]",MISC
77,335,"[793, 199, 877, 219]",MISC
78,##50,"[793, 199, 877, 219]",MISC
79,##1,"[793, 199, 877, 219]",MISC
80,-,"[878, 199, 879, 219]",MISC
81,NL,"[878, 199, 879, 219]",MISC
82,-,"[878, 199, 879, 219]",MISC
83,Mo,"[148, 219, 196, 240]",MISC
84,##b,"[148, 219, 196, 240]",MISC
85,.,"[148, 219, 196, 240]",MISC
86,No,"[197, 219, 233, 240]",MISC
87,.,"[197, 219, 233, 240]",MISC
88,:,"[233, 219, 258, 240]",MISC
89,-,"[233, 219, 258, 240]",MISC
90,+,"[258, 219, 441, 240]",B-phones_phone
91,91,"[258, 219, 441, 240]",I-phones_phone
92,-,"[258, 219, 441, 240]",I-phones_phone
93,94,"[258, 219, 441, 240]",I-phones_phone
94,##13,"[258, 219, 441, 240]",I-phones_phone
95,##7,"[258, 219, 441, 240]",I-phones_phone
96,##14,"[258, 219, 441, 240]",I-phones_phone
97,##42,"[258, 219, 441, 240]",I-phones_phone
98,##4,"[258, 219, 441, 240]",I-phones_phone
99,",","[258, 219, 441, 240]",MISC
100,+,"[441, 219, 612, 240]",B-phones_phone
101,91,"[441, 219, 612, 240]",I-phones_phone
102,-,"[441, 219, 612, 240]",I-phones_phone
103,96,"[441, 219, 612, 240]",I-phones_phone
104,##64,"[441, 219, 612, 240]",I-phones_phone
105,##16,"[441, 219, 612, 240]",I-phones_phone
106,##01,"[441, 219, 612, 240]",I-phones_phone
107,##16,"[441, 219, 612, 240]",I-phones_phone
108,-,"[613, 219, 614, 240]",MISC
109,NL,"[613, 219, 614, 240]",MISC
110,-,"[613, 219, 614, 240]",MISC
111,Em,"[148, 240, 210, 261]",MISC
112,##ail,"[148, 240, 210, 261]",MISC
113,I,"[211, 240, 235, 261]",MISC
114,##d,"[211, 240, 235, 261]",MISC
115,:,"[236, 240, 260, 261]",MISC
116,-,"[236, 240, 260, 261]",MISC
117,far,"[261, 240, 563, 261]",B-emails_email
118,##uk,"[261, 240, 563, 261]",I-emails_email
119,##go,"[261, 240, 563, 261]",I-emails_email
120,##uri,"[261, 240, 563, 261]",I-emails_email
121,##60,"[261, 240, 563, 261]",I-emails_email
122,##8,"[261, 240, 563, 261]",I-emails_email
123,##5,"[261, 240, 563, 261]",I-emails_email
124,@,"[261, 240, 563, 261]",I-emails_email
125,g,"[261, 240, 563, 261]",I-emails_email
126,##mail,"[261, 240, 563, 261]",I-emails_email
127,.,"[261, 240, 563, 261]",I-emails_email
128,com,"[261, 240, 563, 261]",I-emails_email
129,-,"[564, 240, 566, 261]",MISC
130,NL,"[564, 240, 566, 261]",MISC
131,-,"[564, 240, 566, 261]",MISC
132,O,"[148, 283, 222, 304]",MISC
133,##bject,"[148, 283, 222, 304]",MISC
134,:,"[148, 283, 222, 304]",MISC
135,-,"[148, 283, 222, 304]",MISC
136,-,"[222, 283, 224, 304]",MISC
137,NL,"[222, 283, 224, 304]",MISC
138,-,"[222, 283, 224, 304]",MISC
139,Looking,"[148, 302, 209, 322]",MISC
140,for,"[209, 302, 235, 322]",MISC
141,a,"[235, 302, 244, 322]",MISC
142,position,"[244, 302, 313, 322]",MISC
143,in,"[313, 302, 331, 322]",MISC
144,a,"[331, 302, 340, 322]",MISC
145,result,"[340, 302, 470, 322]",MISC
146,-,"[340, 302, 470, 322]",MISC
147,oriented,"[340, 302, 470, 322]",MISC
148,organization,"[471, 302, 575, 322]",MISC
149,where,"[575, 302, 619, 322]",MISC
150,acquired,"[619, 302, 689, 322]",MISC
151,skills,"[689, 302, 741, 322]",MISC
152,and,"[741, 302, 767, 322]",MISC
153,education,"[767, 302, 846, 322]",MISC
154,will,"[846, 302, 881, 322]",MISC
155,be,"[881, 302, 898, 322]",MISC
156,utilized,"[898, 302, 968, 322]",MISC
157,-,"[968, 302, 970, 322]",MISC
158,NL,"[968, 302, 970, 322]",MISC
159,-,"[968, 302, 970, 322]",MISC
160,towards,"[148, 319, 210, 337]",MISC
161,continuous,"[212, 319, 302, 337]",MISC
162,growth,"[303, 319, 357, 337]",MISC
163,and,"[358, 319, 384, 337]",MISC
164,advancement,"[385, 319, 485, 337]",MISC
165,and,"[486, 319, 512, 337]",MISC
166,also,"[513, 319, 548, 337]",MISC
167,provide,"[550, 319, 613, 337]",MISC
168,opportunity,"[614, 319, 713, 337]",MISC
169,to,"[714, 319, 732, 337]",MISC
170,learn,"[733, 319, 778, 337]",MISC
171,new,"[778, 319, 804, 337]",MISC
172,technologies,"[806, 319, 924, 337]",MISC
173,.,"[806, 319, 924, 337]",MISC
174,-,"[925, 319, 926, 337]",MISC
175,NL,"[925, 319, 926, 337]",MISC
176,-,"[925, 319, 926, 337]",MISC
177,Work,"[141, 366, 182, 388]",MISC
178,Experience,"[182, 366, 308, 388]",MISC
179,:,"[182, 366, 308, 388]",MISC
180,-,"[182, 366, 308, 388]",MISC
181,4,"[308, 366, 329, 388]",MISC
182,+,"[308, 366, 329, 388]",MISC
183,years,"[329, 366, 381, 388]",MISC
184,of,"[381, 366, 402, 388]",MISC
185,experience,"[402, 366, 506, 388]",MISC
186,-,"[506, 366, 508, 388]",MISC
187,NL,"[506, 366, 508, 388]",MISC
188,-,"[506, 366, 508, 388]",MISC
189,Current,"[141, 399, 210, 419]",MISC
190,Em,"[212, 399, 302, 419]",MISC
191,##p,"[212, 399, 302, 419]",MISC
192,##loy,"[212, 399, 302, 419]",MISC
193,##er,"[212, 399, 302, 419]",MISC
194,:,"[212, 399, 302, 419]",MISC
195,P,"[303, 399, 362, 419]",B-employer_company_name
196,##rata,"[303, 399, 362, 419]",I-employer_company_name
197,##p,"[303, 399, 362, 419]",I-employer_company_name
198,Tech,"[364, 399, 476, 419]",I-employer_company_name
199,##no,"[364, 399, 476, 419]",I-employer_company_name
200,##crats,"[364, 399, 476, 419]",I-employer_company_name
201,P,"[476, 399, 516, 419]",I-employer_company_name
202,##v,"[476, 399, 516, 419]",I-employer_company_name
203,##t,"[476, 399, 516, 419]",I-employer_company_name
204,.,"[476, 399, 516, 419]",I-employer_company_name
205,Ltd,"[516, 399, 556, 419]",I-employer_company_name
206,.,"[516, 399, 556, 419]",MISC
207,-,"[557, 399, 559, 419]",MISC
208,NL,"[557, 399, 559, 419]",MISC
209,-,"[557, 399, 559, 419]",MISC
210,01,"[761, 399, 782, 417]",MISC
211,March,"[783, 399, 839, 417]",MISC
212,2019,"[839, 399, 883, 417]",MISC
213,–,"[884, 399, 894, 417]",MISC
214,Current,"[895, 399, 972, 417]",MISC
215,-,"[973, 399, 975, 417]",MISC
216,NL,"[973, 399, 975, 417]",MISC
217,-,"[973, 399, 975, 417]",MISC
218,Currently,"[141, 428, 243, 450]",MISC
219,working,"[243, 428, 322, 450]",MISC
220,as,"[323, 428, 346, 450]",MISC
221,a,"[346, 428, 357, 450]",MISC
222,Fi,"[358, 428, 413, 450]",B-employer_role
223,##ber,"[358, 428, 413, 450]",I-employer_role
224,Super,"[415, 428, 528, 450]",I-employer_role
225,##visor,"[415, 428, 528, 450]",I-employer_role
226,in,"[529, 428, 552, 450]",MISC
227,P,"[552, 428, 620, 450]",B-employer_company_name
228,##rata,"[552, 428, 620, 450]",I-employer_company_name
229,##p,"[552, 428, 620, 450]",I-employer_company_name
230,Tech,"[620, 428, 746, 450]",I-employer_company_name
231,##no,"[620, 428, 746, 450]",I-employer_company_name
232,##crats,"[620, 428, 746, 450]",I-employer_company_name
233,P,"[746, 428, 791, 450]",I-employer_company_name
234,##v,"[746, 428, 791, 450]",I-employer_company_name
235,##t,"[746, 428, 791, 450]",I-employer_company_name
236,.,"[746, 428, 791, 450]",I-employer_company_name
237,Ltd,"[792, 428, 837, 450]",I-employer_company_name
238,.,"[792, 428, 837, 450]",MISC
239,For,"[837, 428, 870, 450]",MISC
240,BS,"[872, 428, 917, 450]",MISC
241,##NL,"[872, 428, 917, 450]",MISC
242,(,"[917, 428, 950, 450]",MISC
243,M,"[917, 428, 950, 450]",MISC
244,##H,"[917, 428, 950, 450]",MISC
245,&,"[951, 428, 962, 450]",MISC
246,-,"[963, 428, 965, 450]",MISC
247,NL,"[963, 428, 965, 450]",MISC
248,-,"[963, 428, 965, 450]",MISC
249,GO,"[141, 446, 195, 468]",MISC
250,##A,"[141, 446, 195, 468]",MISC
251,),"[141, 446, 195, 468]",MISC
252,-,"[195, 446, 196, 468]",MISC
253,NL,"[195, 446, 196, 468]",MISC
254,-,"[195, 446, 196, 468]",MISC
255,Key,"[141, 477, 167, 498]",MISC
256,skills,"[168, 477, 239, 498]",MISC
257,:,"[168, 477, 239, 498]",MISC
258,-,"[168, 477, 239, 498]",MISC
259,-,"[240, 477, 242, 498]",MISC
260,NL,"[240, 477, 242, 498]",MISC
261,-,"[240, 477, 242, 498]",MISC
262,Route,"[141, 508, 191, 529]",MISC
263,including,"[192, 508, 282, 529]",MISC
264,routes,"[284, 508, 345, 529]",MISC
265,Sur,"[345, 508, 478, 529]",MISC
266,##ve,"[345, 508, 478, 529]",MISC
267,##illa,"[345, 508, 478, 529]",MISC
268,##nce,"[345, 508, 478, 529]",MISC
269,",","[345, 508, 478, 529]",MISC
270,prevent,"[478, 508, 579, 529]",MISC
271,##ive,"[478, 508, 579, 529]",MISC
272,&,"[580, 508, 589, 529]",MISC
273,correct,"[591, 508, 692, 529]",MISC
274,##ive,"[591, 508, 692, 529]",MISC
275,Maintenance,"[693, 508, 815, 529]",MISC
276,",","[693, 508, 815, 529]",MISC
277,Restoration,"[815, 508, 927, 529]",MISC
278,of,"[928, 508, 947, 529]",MISC
279,day,"[948, 508, 978, 529]",MISC
280,to,"[979, 508, 998, 529]",MISC
281,-,"[999, 508, 1001, 529]",MISC
282,NL,"[999, 508, 1001, 529]",MISC
283,-,"[999, 508, 1001, 529]",MISC
284,day,"[141, 525, 172, 547]",MISC
285,fiber,"[173, 525, 227, 547]",MISC
286,faults,"[228, 525, 292, 547]",MISC
287,by,"[293, 525, 314, 547]",MISC
288,tracing,"[315, 525, 390, 547]",MISC
289,faults,"[391, 525, 456, 547]",MISC
290,with,"[456, 525, 500, 547]",MISC
291,help,"[500, 525, 543, 547]",MISC
292,of,"[543, 525, 564, 547]",MISC
293,O,"[565, 525, 663, 547]",MISC
294,##T,"[565, 525, 663, 547]",MISC
295,##DR,"[565, 525, 663, 547]",MISC
296,/,"[565, 525, 663, 547]",MISC
297,L,"[565, 525, 663, 547]",MISC
298,##SP,"[565, 525, 663, 547]",MISC
299,##M,"[565, 525, 663, 547]",MISC
300,&,"[663, 525, 674, 547]",MISC
301,S,"[674, 525, 761, 547]",MISC
302,##p,"[674, 525, 761, 547]",MISC
303,##licing,"[674, 525, 761, 547]",MISC
304,the,"[761, 525, 793, 547]",MISC
305,of,"[794, 525, 837, 547]",MISC
306,##c,"[794, 525, 837, 547]",MISC
307,.,"[794, 525, 837, 547]",MISC
308,-,"[837, 525, 839, 547]",MISC
309,NL,"[837, 525, 839, 547]",MISC
310,-,"[837, 525, 839, 547]",MISC
311,Co,"[141, 556, 252, 578]",MISC
312,##rre,"[141, 556, 252, 578]",MISC
313,##ctive,"[141, 556, 252, 578]",MISC
314,&,"[252, 556, 263, 578]",MISC
315,Pre,"[263, 556, 375, 578]",MISC
316,##vent,"[263, 556, 375, 578]",MISC
317,##ive,"[263, 556, 375, 578]",MISC
318,maintenance,"[375, 556, 497, 578]",MISC
319,of,"[498, 556, 519, 578]",MISC
320,all,"[520, 556, 553, 578]",MISC
321,fiber,"[554, 556, 609, 578]",MISC
322,route,"[609, 556, 665, 578]",MISC
323,to,"[665, 556, 686, 578]",MISC
324,keep,"[687, 556, 731, 578]",MISC
325,higher,"[732, 556, 798, 578]",MISC
326,up,"[799, 556, 820, 578]",MISC
327,time,"[821, 556, 865, 578]",MISC
328,&,"[866, 556, 876, 578]",MISC
329,low,"[877, 556, 910, 578]",MISC
330,M,"[911, 556, 966, 578]",MISC
331,##TT,"[911, 556, 966, 578]",MISC
332,##R,"[911, 556, 966, 578]",MISC
333,.,"[911, 556, 966, 578]",MISC
334,-,"[966, 556, 968, 578]",MISC
335,NL,"[966, 556, 968, 578]",MISC
336,-,"[966, 556, 968, 578]",MISC
337,Less,"[141, 587, 236, 609]",MISC
338,##oning,"[141, 587, 236, 609]",MISC
339,with,"[237, 587, 279, 609]",MISC
340,other,"[280, 587, 332, 609]",MISC
341,agencies,"[334, 587, 419, 609]",MISC
342,for,"[420, 587, 451, 609]",MISC
343,t,"[452, 587, 504, 609]",MISC
344,##im,"[452, 587, 504, 609]",MISC
345,##ly,"[452, 587, 504, 609]",MISC
346,work,"[506, 587, 547, 609]",MISC
347,information,"[549, 587, 665, 609]",MISC
348,in,"[667, 587, 688, 609]",MISC
349,routes,"[688, 587, 751, 609]",MISC
350,to,"[753, 587, 773, 609]",MISC
351,avoid,"[774, 587, 826, 609]",MISC
352,und,"[828, 587, 880, 609]",MISC
353,##ue,"[828, 587, 880, 609]",MISC
354,cuts,"[881, 587, 923, 609]",MISC
355,&,"[924, 587, 935, 609]",MISC
356,saving,"[935, 587, 998, 609]",MISC
357,-,"[999, 587, 1001, 609]",MISC
358,NL,"[999, 587, 1001, 609]",MISC
359,-,"[999, 587, 1001, 609]",MISC
360,fiber,"[141, 605, 182, 627]",MISC
361,faults,"[183, 605, 243, 627]",MISC
362,.,"[183, 605, 243, 627]",MISC
363,-,"[243, 605, 245, 627]",MISC
364,NL,"[243, 605, 245, 627]",MISC
365,-,"[243, 605, 245, 627]",MISC
366,Previous,"[142, 642, 224, 659]",MISC
367,Em,"[225, 642, 317, 659]",MISC
368,##p,"[225, 642, 317, 659]",MISC
369,##loy,"[225, 642, 317, 659]",MISC
370,##er,"[225, 642, 317, 659]",MISC
371,:,"[225, 642, 317, 659]",MISC
372,VA,"[317, 642, 357, 659]",B-employer_company_name
373,##L,"[317, 642, 357, 659]",I-employer_company_name
374,##U,"[317, 642, 357, 659]",I-employer_company_name
375,CO,"[358, 642, 419, 659]",I-employer_company_name
376,##N,"[358, 642, 419, 659]",I-employer_company_name
377,##NE,"[358, 642, 419, 659]",I-employer_company_name
378,##X,"[358, 642, 419, 659]",I-employer_company_name
379,T,"[420, 642, 491, 659]",I-employer_company_name
380,##EL,"[420, 642, 491, 659]",I-employer_company_name
381,##EC,"[420, 642, 491, 659]",I-employer_company_name
382,##OM,"[420, 642, 491, 659]",I-employer_company_name
383,SE,"[492, 642, 574, 659]",I-employer_company_name
384,##R,"[492, 642, 574, 659]",I-employer_company_name
385,##VI,"[492, 642, 574, 659]",I-employer_company_name
386,##CE,"[492, 642, 574, 659]",I-employer_company_name
387,##S,"[492, 642, 574, 659]",I-employer_company_name
388,P,"[574, 642, 604, 659]",I-employer_company_name
389,##V,"[574, 642, 604, 659]",I-employer_company_name
390,##T,"[574, 642, 604, 659]",I-employer_company_name
391,L,"[605, 642, 645, 659]",I-employer_company_name
392,##T,"[605, 642, 645, 659]",I-employer_company_name
393,##D,"[605, 642, 645, 659]",I-employer_company_name
394,.,"[605, 642, 645, 659]",MISC
395,-,"[646, 642, 648, 659]",MISC
396,NL,"[646, 642, 648, 659]",MISC
397,-,"[646, 642, 648, 659]",MISC
398,10,"[783, 642, 804, 659]",MISC
399,May,"[805, 642, 837, 659]",MISC
400,2018,"[838, 642, 882, 659]",MISC
401,-,"[882, 642, 913, 659]",MISC
402,25,"[882, 642, 913, 659]",MISC
403,Feb,"[914, 642, 946, 659]",MISC
404,2019,"[947, 642, 991, 659]",MISC
405,-,"[991, 642, 993, 659]",MISC
406,NL,"[991, 642, 993, 659]",MISC
407,-,"[991, 642, 993, 659]",MISC
408,Design,"[141, 661, 264, 677]",MISC
409,##ation,"[141, 661, 264, 677]",MISC
410,:,"[141, 661, 264, 677]",MISC
411,Engineer,"[264, 661, 346, 677]",B-employer_role
412,+,"[347, 661, 355, 677]",MISC
413,T,"[357, 661, 387, 677]",MISC
414,##RT,"[357, 661, 387, 677]",MISC
415,-,"[388, 661, 390, 677]",MISC
416,NL,"[388, 661, 390, 677]",MISC
417,-,"[388, 661, 390, 677]",MISC
418,Re,"[141, 693, 280, 711]",MISC
419,##sp,"[141, 693, 280, 711]",MISC
420,##ons,"[141, 693, 280, 711]",MISC
421,##ibi,"[141, 693, 280, 711]",MISC
422,##lities,"[141, 693, 280, 711]",MISC
423,:,"[141, 693, 280, 711]",MISC
424,-,"[280, 693, 282, 711]",MISC
425,NL,"[280, 693, 282, 711]",MISC
426,-,"[280, 693, 282, 711]",MISC
427,J,"[233, 729, 264, 746]",MISC
428,##IO,"[233, 729, 264, 746]",MISC
429,NO,"[264, 729, 421, 746]",MISC
430,##C,"[264, 729, 421, 746]",MISC
431,-,"[264, 729, 421, 746]",MISC
432,Operations,"[264, 729, 421, 746]",MISC
433,.,"[264, 729, 421, 746]",MISC
434,-,"[421, 729, 423, 746]",MISC
435,NL,"[421, 729, 423, 746]",MISC
436,-,"[421, 729, 423, 746]",MISC
437,Working,"[233, 749, 302, 765]",MISC
438,on,"[303, 749, 322, 765]",MISC
439,saving,"[323, 749, 383, 765]",MISC
440,energy,"[384, 749, 443, 765]",MISC
441,system,"[444, 749, 504, 765]",MISC
442,(,"[505, 749, 585, 765]",MISC
443,Everest,"[505, 749, 585, 765]",MISC
444,Infrastructure,"[586, 749, 727, 765]",MISC
445,Management,"[727, 749, 826, 765]",MISC
446,Framework,"[828, 749, 948, 765]",MISC
447,##s,"[828, 749, 948, 765]",MISC
448,),"[828, 749, 948, 765]",MISC
449,.,"[828, 749, 948, 765]",MISC
450,-,"[949, 749, 951, 765]",MISC
451,NL,"[949, 749, 951, 765]",MISC
452,-,"[949, 749, 951, 765]",MISC
453,K,"[232, 768, 262, 786]",MISC
454,##PI,"[232, 768, 262, 786]",MISC
455,monitoring,"[262, 768, 362, 786]",MISC
456,&,"[362, 768, 371, 786]",MISC
457,troubles,"[372, 768, 520, 786]",MISC
458,##hoot,"[372, 768, 520, 786]",MISC
459,##ing,"[372, 768, 520, 786]",MISC
460,to,"[521, 768, 541, 786]",MISC
461,maintain,"[541, 768, 620, 786]",MISC
462,proper,"[621, 768, 680, 786]",MISC
463,K,"[681, 768, 719, 786]",MISC
464,##PI,"[681, 768, 719, 786]",MISC
465,.,"[681, 768, 719, 786]",MISC
466,-,"[721, 768, 722, 786]",MISC
467,NL,"[721, 768, 722, 786]",MISC
468,-,"[721, 768, 722, 786]",MISC
469,Monitor,"[233, 789, 336, 805]",MISC
470,##ing,"[233, 789, 336, 805]",MISC
471,Network,"[337, 789, 408, 805]",MISC
472,Al,"[410, 789, 471, 805]",MISC
473,##arm,"[410, 789, 471, 805]",MISC
474,##s,"[410, 789, 471, 805]",MISC
475,&,"[472, 789, 481, 805]",MISC
476,Clear,"[483, 789, 565, 805]",MISC
477,##ing,"[483, 789, 565, 805]",MISC
478,Al,"[566, 789, 637, 805]",MISC
479,##arm,"[566, 789, 637, 805]",MISC
480,##s,"[566, 789, 637, 805]",MISC
481,.,"[566, 789, 637, 805]",MISC
482,-,"[639, 789, 641, 805]",MISC
483,NL,"[639, 789, 641, 805]",MISC
484,-,"[639, 789, 641, 805]",MISC
485,Network,"[233, 808, 302, 825]",MISC
486,evolution,"[303, 808, 392, 825]",MISC
487,&,"[393, 808, 402, 825]",MISC
488,Network,"[403, 808, 473, 825]",MISC
489,optimization,"[474, 808, 602, 825]",MISC
490,.,"[474, 808, 602, 825]",MISC
491,-,"[604, 808, 606, 825]",MISC
492,NL,"[604, 808, 606, 825]",MISC
493,-,"[604, 808, 606, 825]",MISC
494,En,"[232, 827, 290, 846]",MISC
495,##sure,"[232, 827, 290, 846]",MISC
496,highest,"[290, 827, 356, 846]",MISC
497,availability,"[358, 827, 473, 846]",MISC
498,of,"[474, 827, 493, 846]",MISC
499,Network,"[494, 827, 560, 846]",MISC
500,&,"[561, 827, 570, 846]",MISC
501,Services,"[571, 827, 648, 846]",MISC
502,by,"[648, 827, 668, 846]",MISC
503,re,"[668, 827, 755, 846]",MISC
504,##sol,"[668, 827, 755, 846]",MISC
505,##ving,"[668, 827, 755, 846]",MISC
506,faults,"[755, 827, 821, 846]",MISC
507,/,"[755, 827, 821, 846]",MISC
508,handling,"[823, 827, 899, 846]",MISC
509,incidents,"[900, 827, 987, 846]",MISC
510,-,"[987, 827, 989, 846]",MISC
511,NL,"[987, 827, 989, 846]",MISC
512,-,"[987, 827, 989, 846]",MISC
513,effectively,"[254, 843, 344, 862]",MISC
514,.,"[254, 843, 344, 862]",MISC
515,-,"[344, 843, 346, 862]",MISC
516,NL,"[344, 843, 346, 862]",MISC
517,-,"[344, 843, 346, 862]",MISC
518,Re,"[233, 865, 352, 883]",MISC
519,##sponsible,"[233, 865, 352, 883]",MISC
520,for,"[352, 865, 383, 883]",MISC
521,end,"[385, 865, 416, 883]",MISC
522,to,"[417, 865, 438, 883]",MISC
523,end,"[439, 865, 470, 883]",MISC
524,T,"[471, 865, 513, 883]",MISC
525,##T,"[471, 865, 513, 883]",MISC
526,##01,"[471, 865, 513, 883]",MISC
527,&,"[514, 865, 525, 883]",MISC
528,T,"[525, 865, 567, 883]",MISC
529,##T,"[525, 865, 567, 883]",MISC
530,##0,"[525, 865, 567, 883]",MISC
531,##2,"[525, 865, 567, 883]",MISC
532,closing,"[568, 865, 654, 883]",MISC
533,.,"[568, 865, 654, 883]",MISC
534,-,"[655, 865, 656, 883]",MISC
535,NL,"[655, 865, 656, 883]",MISC
536,-,"[655, 865, 656, 883]",MISC
537,Material,"[234, 886, 323, 902]",MISC
538,book,"[324, 886, 368, 902]",MISC
539,on,"[369, 886, 435, 902]",MISC
540,##SA,"[369, 886, 435, 902]",MISC
541,##P,"[369, 886, 435, 902]",MISC
542,.,"[369, 886, 435, 902]",MISC
543,-,"[437, 886, 439, 902]",MISC
544,NL,"[437, 886, 439, 902]",MISC
545,-,"[437, 886, 439, 902]",MISC
546,Man,"[233, 905, 313, 922]",MISC
547,##power,"[233, 905, 313, 922]",MISC
548,management,"[313, 905, 412, 922]",MISC
549,for,"[413, 905, 443, 922]",MISC
550,the,"[443, 905, 473, 922]",MISC
551,execution,"[473, 905, 562, 922]",MISC
552,of,"[564, 905, 583, 922]",MISC
553,the,"[584, 905, 613, 922]",MISC
554,site,"[614, 905, 654, 922]",MISC
555,activities,"[654, 905, 764, 922]",MISC
556,.,"[654, 905, 764, 922]",MISC
557,-,"[764, 905, 766, 922]",MISC
558,NL,"[764, 905, 766, 922]",MISC
559,-,"[764, 905, 766, 922]",MISC
560,W,"[233, 926, 294, 943]",MISC
561,##i,"[233, 926, 294, 943]",MISC
562,-,"[233, 926, 294, 943]",MISC
563,Fi,"[233, 926, 294, 943]",MISC
564,",","[233, 926, 294, 943]",MISC
565,Small,"[294, 926, 395, 943]",MISC
566,-,"[294, 926, 395, 943]",MISC
567,Cell,"[294, 926, 395, 943]",MISC
568,&,"[396, 926, 405, 943]",MISC
569,U,"[406, 926, 436, 943]",MISC
570,##BR,"[406, 926, 436, 943]",MISC
571,clearing,"[437, 926, 517, 943]",MISC
572,alarm,"[519, 926, 590, 943]",MISC
573,##s,"[519, 926, 590, 943]",MISC
574,.,"[519, 926, 590, 943]",MISC
575,-,"[590, 926, 592, 943]",MISC
576,NL,"[590, 926, 592, 943]",MISC
577,-,"[590, 926, 592, 943]",MISC
578,Integration,"[231, 945, 338, 962]",MISC
579,",","[231, 945, 338, 962]",MISC
580,commissioning,"[339, 945, 456, 962]",MISC
581,and,"[456, 945, 483, 962]",MISC
582,testing,"[483, 945, 546, 962]",MISC
583,of,"[546, 945, 564, 962]",MISC
584,W,"[564, 945, 617, 962]",MISC
585,##i,"[564, 945, 617, 962]",MISC
586,-,"[564, 945, 617, 962]",MISC
587,Fi,"[564, 945, 617, 962]",MISC
588,",","[564, 945, 617, 962]",MISC
589,Small,"[618, 945, 744, 962]",MISC
590,-,"[618, 945, 744, 962]",MISC
591,Cell,"[618, 945, 744, 962]",MISC
592,&,"[618, 945, 744, 962]",MISC
593,U,"[618, 945, 744, 962]",MISC
594,##BR,"[618, 945, 744, 962]",MISC
595,links,"[744, 945, 788, 962]",MISC
596,(,"[789, 945, 852, 962]",MISC
597,C,"[789, 945, 852, 962]",MISC
598,##isco,"[789, 945, 852, 962]",MISC
599,",","[789, 945, 852, 962]",MISC
600,Air,"[852, 945, 924, 962]",MISC
601,##span,"[852, 945, 924, 962]",MISC
602,",","[852, 945, 924, 962]",MISC
603,J,"[924, 945, 987, 962]",MISC
604,##IO,"[924, 945, 987, 962]",MISC
605,",","[924, 945, 987, 962]",MISC
606,Ra,"[924, 945, 987, 962]",MISC
607,##d,"[924, 945, 987, 962]",MISC
608,-,"[987, 945, 989, 962]",MISC
609,NL,"[987, 945, 989, 962]",MISC
610,-,"[987, 945, 989, 962]",MISC
611,&,"[254, 959, 261, 980]",MISC
612,Air,"[262, 959, 337, 980]",MISC
613,##ti,"[262, 959, 337, 980]",MISC
614,##ght,"[262, 959, 337, 980]",MISC
615,),"[262, 959, 337, 980]",MISC
616,-,"[337, 959, 339, 980]",MISC
617,NL,"[337, 959, 339, 980]",MISC
618,-,"[337, 959, 339, 980]",MISC
619,Support,"[233, 983, 302, 999]",MISC
620,to,"[304, 983, 323, 999]",MISC
621,the,"[324, 983, 354, 999]",MISC
622,team,"[355, 983, 395, 999]",MISC
623,to,"[395, 983, 414, 999]",MISC
624,fix,"[415, 983, 445, 999]",MISC
625,all,"[446, 983, 476, 999]",MISC
626,issues,"[476, 983, 536, 999]",MISC
627,related,"[537, 983, 607, 999]",MISC
628,to,"[608, 983, 628, 999]",MISC
629,network,"[629, 983, 698, 999]",MISC
630,and,"[700, 983, 729, 999]",MISC
631,RF,"[730, 983, 760, 999]",MISC
632,.,"[730, 983, 760, 999]",MISC
633,-,"[761, 983, 763, 999]",MISC
634,NL,"[761, 983, 763, 999]",MISC
635,-,"[761, 983, 763, 999]",MISC
636,Previous,"[141, 107, 221, 124]",MISC
637,Em,"[222, 107, 313, 124]",MISC
638,##p,"[222, 107, 313, 124]",MISC
639,##loy,"[222, 107, 313, 124]",MISC
640,##er,"[222, 107, 313, 124]",MISC
641,:,"[222, 107, 313, 124]",MISC
642,Me,"[314, 107, 375, 124]",MISC
643,##dha,"[314, 107, 375, 124]",MISC
644,##j,"[314, 107, 375, 124]",MISC
645,Tech,"[376, 107, 447, 124]",MISC
646,##nco,"[376, 107, 447, 124]",MISC
647,Concept,"[447, 107, 519, 124]",MISC
648,P,"[519, 107, 548, 124]",MISC
649,##v,"[519, 107, 548, 124]",MISC
650,##t,"[519, 107, 548, 124]",MISC
651,Ltd,"[549, 107, 589, 124]",MISC
652,.,"[549, 107, 589, 124]",MISC
653,-,"[590, 107, 592, 124]",MISC
654,NL,"[590, 107, 592, 124]",MISC
655,-,"[590, 107, 592, 124]",MISC
656,28,"[729, 107, 752, 124]",MISC
657,May,"[752, 107, 785, 124]",MISC
658,2015,"[786, 107, 832, 124]",MISC
659,–,"[832, 107, 842, 124]",MISC
660,30,"[843, 107, 866, 124]",MISC
661,April,"[866, 107, 922, 124]",MISC
662,2018,"[923, 107, 968, 124]",MISC
663,-,"[968, 107, 970, 124]",MISC
664,NL,"[968, 107, 970, 124]",MISC
665,-,"[968, 107, 970, 124]",MISC
666,Design,"[141, 124, 254, 142]",MISC
667,##ation,"[141, 124, 254, 142]",MISC
668,:,"[141, 124, 254, 142]",MISC
669,Engineer,"[255, 124, 329, 142]",B-employer_role
670,-,"[331, 124, 332, 142]",MISC
671,NL,"[331, 124, 332, 142]",MISC
672,-,"[331, 124, 332, 142]",MISC
673,Re,"[141, 157, 280, 175]",MISC
674,##sp,"[141, 157, 280, 175]",MISC
675,##ons,"[141, 157, 280, 175]",MISC
676,##ibi,"[141, 157, 280, 175]",MISC
677,##lities,"[141, 157, 280, 175]",MISC
678,:,"[141, 157, 280, 175]",MISC
679,-,"[280, 157, 282, 175]",MISC
680,NL,"[280, 157, 282, 175]",MISC
681,-,"[280, 157, 282, 175]",MISC
682,Report,"[232, 192, 316, 209]",MISC
683,##ing,"[232, 192, 316, 209]",MISC
684,to,"[317, 192, 335, 209]",MISC
685,the,"[336, 192, 364, 209]",MISC
686,Rajasthan,"[364, 192, 448, 209]",MISC
687,Electricity,"[450, 192, 552, 209]",MISC
688,Board,"[554, 192, 601, 209]",MISC
689,officials,"[601, 192, 685, 209]",MISC
690,about,"[686, 192, 733, 209]",MISC
691,the,"[734, 192, 761, 209]",MISC
692,various,"[762, 192, 828, 209]",MISC
693,problems,"[828, 192, 903, 209]",MISC
694,in,"[904, 192, 921, 209]",MISC
695,the,"[923, 192, 951, 209]",MISC
696,grid,"[951, 192, 988, 209]",MISC
697,-,"[989, 192, 991, 209]",MISC
698,NL,"[989, 192, 991, 209]",MISC
699,-,"[989, 192, 991, 209]",MISC
700,and,"[254, 208, 282, 227]",MISC
701,providing,"[282, 208, 366, 227]",MISC
702,the,"[368, 208, 395, 227]",MISC
703,solutions,"[396, 208, 480, 227]",MISC
704,for,"[481, 208, 509, 227]",MISC
705,them,"[510, 208, 557, 227]",MISC
706,.,"[510, 208, 557, 227]",MISC
707,-,"[557, 208, 559, 227]",MISC
708,NL,"[557, 208, 559, 227]",MISC
709,-,"[557, 208, 559, 227]",MISC
710,>,"[228, 245, 236, 265]",MISC
711,Pro,"[237, 245, 321, 265]",MISC
712,##vid,"[237, 245, 321, 265]",MISC
713,##ing,"[237, 245, 321, 265]",MISC
714,details,"[322, 245, 386, 265]",MISC
715,about,"[388, 245, 433, 265]",MISC
716,the,"[435, 245, 462, 265]",MISC
717,site,"[463, 245, 499, 265]",MISC
718,conditions,"[500, 245, 593, 265]",MISC
719,to,"[594, 245, 612, 265]",MISC
720,the,"[613, 245, 641, 265]",MISC
721,Rajasthan,"[641, 245, 725, 265]",MISC
722,Electricity,"[726, 245, 829, 265]",MISC
723,Board,"[829, 245, 875, 265]",MISC
724,officials,"[876, 245, 960, 265]",MISC
725,and,"[961, 245, 989, 265]",MISC
726,-,"[989, 245, 991, 265]",MISC
727,NL,"[989, 245, 991, 265]",MISC
728,-,"[989, 245, 991, 265]",MISC
729,Company,"[121, 263, 196, 283]",MISC
730,higher,"[197, 263, 262, 283]",MISC
731,management,"[262, 263, 381, 283]",MISC
732,.,"[262, 263, 381, 283]",MISC
733,-,"[381, 263, 383, 283]",MISC
734,NL,"[381, 263, 383, 283]",MISC
735,-,"[381, 263, 383, 283]",MISC
736,Academic,"[141, 323, 217, 345]",B-education_heading
737,Qualification,"[218, 323, 363, 345]",I-education_heading
738,:,"[218, 323, 363, 345]",I-education_heading
739,-,"[218, 323, 363, 345]",I-education_heading
740,-,"[364, 323, 365, 345]",MISC
741,NL,"[364, 323, 365, 345]",MISC
742,-,"[364, 323, 365, 345]",MISC
743,Qualification,"[175, 362, 346, 386]",MISC
744,-,"[347, 362, 359, 386]",MISC
745,University,"[360, 362, 491, 386]",MISC
746,/,"[492, 362, 504, 386]",MISC
747,Board,"[505, 362, 569, 386]",MISC
748,-,"[571, 362, 583, 386]",MISC
749,Year,"[584, 362, 636, 386]",MISC
750,of,"[637, 362, 663, 386]",MISC
751,Pass,"[663, 362, 754, 386]",MISC
752,##ing,"[663, 362, 754, 386]",MISC
753,-,"[755, 362, 767, 386]",MISC
754,Per,"[768, 362, 899, 386]",MISC
755,##cent,"[768, 362, 899, 386]",MISC
756,##age,"[768, 362, 899, 386]",MISC
757,-,"[900, 362, 902, 386]",MISC
758,NL,"[900, 362, 902, 386]",MISC
759,-,"[900, 362, 902, 386]",MISC
760,B,"[174, 395, 247, 415]",MISC
761,.,"[174, 395, 247, 415]",MISC
762,Tech,"[174, 395, 247, 415]",MISC
763,Electronics,"[247, 395, 381, 415]",B-education_course
764,and,"[382, 395, 419, 415]",I-education_course
765,Communication,"[419, 395, 577, 415]",I-education_course
766,Engineering,"[578, 395, 712, 415]",I-education_course
767,-,"[713, 395, 725, 415]",MISC
768,R,"[725, 395, 762, 415]",B-education_institute
769,##TU,"[725, 395, 762, 415]",I-education_institute
770,-,"[762, 395, 774, 415]",MISC
771,2015,"[774, 395, 823, 415]",MISC
772,-,"[823, 395, 836, 415]",MISC
773,62,"[836, 395, 860, 415]",MISC
774,-,"[860, 395, 862, 415]",MISC
775,NL,"[860, 395, 862, 415]",MISC
776,-,"[860, 395, 862, 415]",MISC
777,Senior,"[158, 465, 296, 485]",B-education_degree
778,Secondary,"[297, 465, 504, 485]",I-education_degree
779,-,"[505, 465, 527, 485]",MISC
780,RB,"[528, 465, 620, 485]",MISC
781,##SE,"[528, 465, 620, 485]",MISC
782,-,"[620, 465, 643, 485]",MISC
783,2011,"[643, 465, 735, 485]",MISC
784,-,"[735, 465, 758, 485]",MISC
785,59,"[759, 465, 874, 485]",MISC
786,.,"[759, 465, 874, 485]",MISC
787,38,"[759, 465, 874, 485]",MISC
788,-,"[874, 465, 876, 485]",MISC
789,NL,"[874, 465, 876, 485]",MISC
790,-,"[874, 465, 876, 485]",MISC
791,Higher,"[156, 483, 294, 503]",B-education_degree
792,Secondary,"[295, 483, 503, 503]",I-education_degree
793,-,"[504, 483, 526, 503]",MISC
794,RB,"[527, 483, 619, 503]",MISC
795,##SE,"[527, 483, 619, 503]",MISC
796,-,"[619, 483, 642, 503]",MISC
797,2008,"[643, 483, 735, 503]",MISC
798,-,"[735, 483, 758, 503]",MISC
799,71,"[758, 483, 873, 503]",MISC
800,.,"[758, 483, 873, 503]",MISC
801,33,"[758, 483, 873, 503]",MISC
802,-,"[874, 483, 876, 503]",MISC
803,NL,"[874, 483, 876, 503]",MISC
804,-,"[874, 483, 876, 503]",MISC
805,Training,"[141, 560, 233, 582]",MISC
806,:,"[141, 560, 233, 582]",MISC
807,-,"[141, 560, 233, 582]",MISC
808,-,"[233, 560, 235, 582]",MISC
809,NL,"[233, 560, 235, 582]",MISC
810,-,"[233, 560, 235, 582]",MISC
811,I,"[197, 583, 206, 598]",MISC
812,did,"[207, 583, 235, 598]",MISC
813,my,"[237, 583, 256, 598]",MISC
814,training,"[256, 583, 333, 598]",MISC
815,from,"[335, 583, 373, 598]",MISC
816,“,"[374, 583, 480, 598]",MISC
817,Divisional,"[374, 583, 480, 598]",MISC
818,Signal,"[481, 583, 539, 598]",MISC
819,And,"[540, 583, 568, 598]",MISC
820,Telecom,"[570, 583, 637, 598]",MISC
821,Engineers,"[638, 583, 744, 598]",MISC
822,”,"[638, 583, 744, 598]",MISC
823,-,"[638, 583, 744, 598]",MISC
824,Indian,"[746, 583, 803, 598]",MISC
825,Railway,"[805, 583, 881, 598]",MISC
826,",","[805, 583, 881, 598]",MISC
827,Division,"[883, 583, 959, 598]",MISC
828,-,"[961, 583, 963, 598]",MISC
829,NL,"[961, 583, 963, 598]",MISC
830,-,"[961, 583, 963, 598]",MISC
831,A,"[235, 596, 285, 615]",MISC
832,##j,"[235, 596, 285, 615]",MISC
833,##mer,"[235, 596, 285, 615]",MISC
834,for,"[286, 596, 315, 615]",MISC
835,45,"[317, 596, 336, 615]",MISC
836,days,"[337, 596, 398, 615]",MISC
837,.,"[337, 596, 398, 615]",MISC
838,-,"[398, 596, 400, 615]",MISC
839,NL,"[398, 596, 400, 615]",MISC
840,-,"[398, 596, 400, 615]",MISC
841,Technical,"[141, 630, 224, 652]",MISC
842,Qualification,"[224, 630, 364, 652]",MISC
843,:,"[224, 630, 364, 652]",MISC
844,-,"[224, 630, 364, 652]",MISC
845,-,"[364, 630, 365, 652]",MISC
846,NL,"[364, 630, 365, 652]",MISC
847,-,"[364, 630, 365, 652]",MISC
848,I,"[198, 667, 206, 684]",MISC
849,have,"[208, 667, 248, 684]",MISC
850,certified,"[248, 667, 339, 684]",MISC
851,by,"[339, 667, 358, 684]",MISC
852,PC,"[359, 667, 389, 684]",MISC
853,##B,"[359, 667, 389, 684]",MISC
854,designing,"[389, 667, 480, 684]",MISC
855,workshop,"[480, 667, 560, 684]",MISC
856,for,"[561, 667, 590, 684]",MISC
857,2,"[591, 667, 600, 684]",MISC
858,days,"[601, 667, 641, 684]",MISC
859,from,"[641, 667, 681, 684]",MISC
860,“,"[682, 667, 711, 684]",MISC
861,i,"[682, 667, 711, 684]",MISC
862,##3,"[682, 667, 711, 684]",MISC
863,India,"[712, 667, 761, 684]",MISC
864,Technology,"[762, 667, 872, 684]",MISC
865,”,"[762, 667, 872, 684]",MISC
866,which,"[873, 667, 922, 684]",MISC
867,is,"[924, 667, 943, 684]",MISC
868,-,"[944, 667, 945, 684]",MISC
869,NL,"[944, 667, 945, 684]",MISC
870,-,"[944, 667, 945, 684]",MISC
871,arranged,"[235, 681, 308, 701]",MISC
872,by,"[308, 681, 326, 701]",MISC
873,the,"[327, 681, 353, 701]",MISC
874,college,"[354, 681, 436, 701]",MISC
875,.,"[354, 681, 436, 701]",MISC
876,-,"[437, 681, 439, 701]",MISC
877,NL,"[437, 681, 439, 701]",MISC
878,-,"[437, 681, 439, 701]",MISC
879,Projects,"[148, 698, 235, 720]",B-others_heading
880,:,"[148, 698, 235, 720]",I-others_heading
881,-,"[148, 698, 235, 720]",I-others_heading
882,-,"[235, 698, 236, 720]",MISC
883,NL,"[235, 698, 236, 720]",MISC
884,-,"[235, 698, 236, 720]",MISC
885,My,"[198, 736, 217, 751]",MISC
886,Minor,"[218, 736, 267, 751]",MISC
887,project,"[268, 736, 338, 751]",MISC
888,is,"[338, 736, 358, 751]",MISC
889,“,"[359, 736, 418, 751]",MISC
890,Metro,"[359, 736, 418, 751]",MISC
891,Train,"[419, 736, 468, 751]",MISC
892,Proto,"[469, 736, 569, 751]",MISC
893,##type,"[469, 736, 569, 751]",MISC
894,”,"[469, 736, 569, 751]",MISC
895,Under,"[570, 736, 619, 751]",MISC
896,the,"[620, 736, 650, 751]",MISC
897,guidance,"[650, 736, 730, 751]",MISC
898,of,"[731, 736, 750, 751]",MISC
899,Mr,"[751, 736, 780, 751]",MISC
900,.,"[751, 736, 780, 751]",MISC
901,V,"[781, 736, 861, 751]",MISC
902,##ire,"[781, 736, 861, 751]",MISC
903,##ndra,"[781, 736, 861, 751]",MISC
904,swam,"[861, 736, 910, 751]",MISC
905,##i,"[861, 736, 910, 751]",MISC
906,sir,"[912, 736, 941, 751]",MISC
907,with,"[942, 736, 982, 751]",MISC
908,-,"[982, 736, 984, 751]",MISC
909,NL,"[982, 736, 984, 751]",MISC
910,-,"[982, 736, 984, 751]",MISC
911,the,"[235, 750, 261, 769]",MISC
912,group,"[262, 750, 308, 769]",MISC
913,of,"[308, 750, 326, 769]",MISC
914,3,"[326, 750, 335, 769]",MISC
915,students,"[336, 750, 454, 769]",MISC
916,.,"[336, 750, 454, 769]",MISC
917,This,"[336, 750, 454, 769]",MISC
918,project,"[455, 750, 518, 769]",MISC
919,is,"[519, 750, 536, 769]",MISC
920,based,"[537, 750, 583, 769]",MISC
921,on,"[583, 750, 601, 769]",MISC
922,the,"[602, 750, 628, 769]",MISC
923,80,"[629, 750, 666, 769]",MISC
924,##51,"[629, 750, 666, 769]",MISC
925,Micro,"[666, 750, 802, 769]",MISC
926,##con,"[666, 750, 802, 769]",MISC
927,##tro,"[666, 750, 802, 769]",MISC
928,##ller,"[666, 750, 802, 769]",MISC
929,.,"[803, 750, 821, 769]",MISC
930,-,"[822, 750, 824, 769]",MISC
931,NL,"[822, 750, 824, 769]",MISC
932,-,"[822, 750, 824, 769]",MISC
933,My,"[205, 769, 224, 785]",MISC
934,Major,"[225, 769, 275, 785]",MISC
935,project,"[275, 769, 345, 785]",MISC
936,is,"[346, 769, 365, 785]",MISC
937,“,"[366, 769, 468, 785]",MISC
938,Automatic,"[366, 769, 468, 785]",MISC
939,Moving,"[468, 769, 527, 785]",MISC
940,Robot,"[528, 769, 587, 785]",MISC
941,"""","[528, 769, 587, 785]",MISC
942,with,"[589, 769, 629, 785]",MISC
943,the,"[629, 769, 659, 785]",MISC
944,group,"[660, 769, 710, 785]",MISC
945,of,"[710, 769, 729, 785]",MISC
946,3,"[730, 769, 739, 785]",MISC
947,students,"[741, 769, 831, 785]",MISC
948,.,"[741, 769, 831, 785]",MISC
949,This,"[831, 769, 872, 785]",MISC
950,is,"[872, 769, 891, 785]",MISC
951,Based,"[892, 769, 943, 785]",MISC
952,on,"[943, 769, 962, 785]",MISC
953,-,"[963, 769, 965, 785]",MISC
954,NL,"[963, 769, 965, 785]",MISC
955,-,"[963, 769, 965, 785]",MISC
956,embedded,"[235, 783, 306, 803]",MISC
957,system,"[308, 783, 362, 803]",MISC
958,using,"[362, 783, 408, 803]",MISC
959,80,"[408, 783, 443, 803]",MISC
960,##51,"[408, 783, 443, 803]",MISC
961,Micro,"[444, 783, 589, 803]",MISC
962,##con,"[444, 783, 589, 803]",MISC
963,##tro,"[444, 783, 589, 803]",MISC
964,##ller,"[444, 783, 589, 803]",MISC
965,.,"[444, 783, 589, 803]",MISC
966,-,"[590, 783, 592, 803]",MISC
967,NL,"[590, 783, 592, 803]",MISC
968,-,"[590, 783, 592, 803]",MISC
969,Semi,"[148, 834, 236, 856]",MISC
970,##nar,"[148, 834, 236, 856]",MISC
971,:,"[148, 834, 236, 856]",MISC
972,-,"[148, 834, 236, 856]",MISC
973,-,"[236, 834, 238, 856]",MISC
974,NL,"[236, 834, 238, 856]",MISC
975,-,"[236, 834, 238, 856]",MISC
976,I,"[198, 870, 207, 886]",MISC
977,gave,"[208, 870, 248, 886]",MISC
978,the,"[250, 870, 279, 886]",MISC
979,seminar,"[281, 870, 352, 886]",MISC
980,on,"[353, 870, 372, 886]",MISC
981,my,"[374, 870, 393, 886]",MISC
982,training,"[394, 870, 476, 886]",MISC
983,and,"[477, 870, 507, 886]",MISC
984,the,"[508, 870, 538, 886]",MISC
985,topic,"[539, 870, 590, 886]",MISC
986,is,"[591, 870, 610, 886]",MISC
987,“,"[612, 870, 683, 886]",MISC
988,Signal,"[612, 870, 683, 886]",MISC
989,And,"[684, 870, 714, 886]",MISC
990,Telecom,"[715, 870, 818, 886]",MISC
991,”,"[715, 870, 818, 886]",MISC
992,.,"[715, 870, 818, 886]",MISC
993,-,"[818, 870, 820, 886]",MISC
994,NL,"[818, 870, 820, 886]",MISC
995,-,"[818, 870, 820, 886]",MISC
996,I,"[198, 886, 209, 902]",MISC
997,gave,"[209, 886, 251, 902]",MISC
998,the,"[253, 886, 284, 902]",MISC
999,seminar,"[285, 886, 360, 902]",MISC
1000,on,"[361, 886, 382, 902]",MISC
1001,the,"[382, 886, 414, 902]",MISC
1002,“,"[415, 886, 469, 902]",MISC
1003,Edge,"[415, 886, 469, 902]",MISC
1004,Technology,"[469, 886, 608, 902]",MISC
1005,”,"[469, 886, 608, 902]",MISC
1006,.,"[469, 886, 608, 902]",MISC
1007,-,"[609, 886, 611, 902]",MISC
1008,NL,"[609, 886, 611, 902]",MISC
1009,-,"[609, 886, 611, 902]",MISC
1010,I,"[199, 918, 209, 935]",MISC
1011,have,"[210, 918, 253, 935]",MISC
1012,At,"[254, 918, 318, 935]",MISC
1013,##tend,"[254, 918, 318, 935]",MISC
1014,the,"[320, 918, 351, 935]",MISC
1015,personal,"[353, 918, 440, 935]",MISC
1016,development,"[441, 918, 561, 935]",MISC
1017,seminar,"[562, 918, 639, 935]",MISC
1018,from,"[639, 918, 682, 935]",MISC
1019,“,"[683, 918, 737, 935]",MISC
1020,H,"[683, 918, 737, 935]",MISC
1021,##OP,"[683, 918, 737, 935]",MISC
1022,##E,"[683, 918, 737, 935]",MISC
1023,AC,"[738, 918, 815, 935]",MISC
1024,##AD,"[738, 918, 815, 935]",MISC
1025,##AM,"[738, 918, 815, 935]",MISC
1026,##Y,"[738, 918, 815, 935]",MISC
1027,IN,"[815, 918, 879, 935]",MISC
1028,##DI,"[815, 918, 879, 935]",MISC
1029,##A,"[815, 918, 879, 935]",MISC
1030,”,"[815, 918, 879, 935]",MISC
1031,-,"[881, 918, 883, 935]",MISC
1032,NL,"[881, 918, 883, 935]",MISC
1033,-,"[881, 918, 883, 935]",MISC
1034,p,"[235, 932, 289, 952]",MISC
1035,##ah,"[235, 932, 289, 952]",MISC
1036,##eli,"[235, 932, 289, 952]",MISC
1037,job,"[289, 932, 332, 952]",MISC
1038,.,"[289, 932, 332, 952]",MISC
1039,-,"[334, 932, 336, 952]",MISC
1040,NL,"[334, 932, 336, 952]",MISC
1041,-,"[334, 932, 336, 952]",MISC
1042,Industrial,"[141, 86, 228, 108]",MISC
1043,V,"[229, 86, 290, 108]",MISC
1044,##isi,"[229, 86, 290, 108]",MISC
1045,##t,"[229, 86, 290, 108]",MISC
1046,:,"[229, 86, 290, 108]",MISC
1047,-,"[229, 86, 290, 108]",MISC
1048,-,"[290, 86, 292, 108]",MISC
1049,NL,"[290, 86, 292, 108]",MISC
1050,-,"[290, 86, 292, 108]",MISC
1051,O,"[199, 108, 253, 125]",MISC
1052,##ME,"[199, 108, 253, 125]",MISC
1053,##GA,"[199, 108, 253, 125]",MISC
1054,Electronic,"[254, 108, 363, 125]",MISC
1055,P,"[364, 108, 407, 125]",MISC
1056,##v,"[364, 108, 407, 125]",MISC
1057,##t,"[364, 108, 407, 125]",MISC
1058,.,"[364, 108, 407, 125]",MISC
1059,Ltd,"[408, 108, 452, 125]",MISC
1060,.,"[408, 108, 452, 125]",MISC
1061,Jai,"[452, 108, 529, 125]",MISC
1062,##pur,"[452, 108, 529, 125]",MISC
1063,-,"[529, 108, 531, 125]",MISC
1064,NL,"[529, 108, 531, 125]",MISC
1065,-,"[529, 108, 531, 125]",MISC
1066,“,"[200, 126, 378, 142]",MISC
1067,D,"[200, 126, 378, 142]",MISC
1068,##O,"[200, 126, 378, 142]",MISC
1069,##OR,"[200, 126, 378, 142]",MISC
1070,##DA,"[200, 126, 378, 142]",MISC
1071,##RS,"[200, 126, 378, 142]",MISC
1072,##HA,"[200, 126, 378, 142]",MISC
1073,##N,"[200, 126, 378, 142]",MISC
1074,”,"[200, 126, 378, 142]",MISC
1075,",","[200, 126, 378, 142]",MISC
1076,Jai,"[379, 126, 480, 142]",MISC
1077,##pur,"[379, 126, 480, 142]",MISC
1078,.,"[379, 126, 480, 142]",MISC
1079,-,"[480, 126, 482, 142]",MISC
1080,NL,"[480, 126, 482, 142]",MISC
1081,-,"[480, 126, 482, 142]",MISC
1082,Extra,"[141, 161, 285, 183]",B-others_heading
1083,-,"[141, 161, 285, 183]",I-others_heading
1084,cu,"[141, 161, 285, 183]",I-others_heading
1085,##rricular,"[141, 161, 285, 183]",I-others_heading
1086,activity,"[285, 161, 374, 183]",I-others_heading
1087,:,"[285, 161, 374, 183]",I-others_heading
1088,-,"[285, 161, 374, 183]",I-others_heading
1089,-,"[376, 161, 378, 183]",MISC
1090,NL,"[376, 161, 378, 183]",MISC
1091,-,"[376, 161, 378, 183]",MISC
1092,Co,"[198, 183, 324, 200]",MISC
1093,-,"[198, 183, 324, 200]",MISC
1094,or,"[198, 183, 324, 200]",MISC
1095,##dina,"[198, 183, 324, 200]",MISC
1096,##tor,"[198, 183, 324, 200]",MISC
1097,of,"[325, 183, 346, 200]",MISC
1098,college,"[346, 183, 419, 200]",MISC
1099,annual,"[420, 183, 483, 200]",MISC
1100,f,"[484, 183, 536, 200]",MISC
1101,##est,"[484, 183, 536, 200]",MISC
1102,-,"[484, 183, 536, 200]",MISC
1103,“,"[536, 183, 662, 200]",MISC
1104,AU,"[536, 183, 662, 200]",MISC
1105,##RA,"[536, 183, 662, 200]",MISC
1106,-,"[536, 183, 662, 200]",MISC
1107,2014,"[536, 183, 662, 200]",MISC
1108,”,"[536, 183, 662, 200]",MISC
1109,-,"[663, 183, 665, 200]",MISC
1110,NL,"[663, 183, 665, 200]",MISC
1111,-,"[663, 183, 665, 200]",MISC
1112,I,"[197, 200, 206, 217]",MISC
1113,Have,"[207, 200, 245, 217]",MISC
1114,participate,"[246, 200, 352, 217]",MISC
1115,various,"[352, 200, 418, 217]",MISC
1116,Cultural,"[420, 200, 497, 217]",MISC
1117,and,"[498, 200, 525, 217]",MISC
1118,non,"[527, 200, 642, 217]",MISC
1119,-,"[527, 200, 642, 217]",MISC
1120,cultural,"[527, 200, 642, 217]",MISC
1121,function,"[643, 200, 719, 217]",MISC
1122,in,"[720, 200, 739, 217]",MISC
1123,my,"[740, 200, 759, 217]",MISC
1124,college,"[759, 200, 846, 217]",MISC
1125,.,"[759, 200, 846, 217]",MISC
1126,-,"[846, 200, 848, 217]",MISC
1127,NL,"[846, 200, 848, 217]",MISC
1128,-,"[846, 200, 848, 217]",MISC
1129,Points,"[141, 274, 203, 294]",MISC
1130,Leading,"[204, 274, 277, 294]",MISC
1131,me,"[277, 274, 298, 294]",MISC
1132,towards,"[298, 274, 371, 294]",MISC
1133,success,"[372, 274, 466, 294]",MISC
1134,:,"[372, 274, 466, 294]",MISC
1135,-,"[372, 274, 466, 294]",MISC
1136,-,"[466, 274, 468, 294]",MISC
1137,NL,"[466, 274, 468, 294]",MISC
1138,-,"[466, 274, 468, 294]",MISC
1139,Con,"[201, 296, 349, 313]",MISC
1140,##fi,"[201, 296, 349, 313]",MISC
1141,##dent,"[201, 296, 349, 313]",MISC
1142,.,"[201, 296, 349, 313]",MISC
1143,-,"[350, 296, 351, 313]",MISC
1144,NL,"[350, 296, 351, 313]",MISC
1145,-,"[350, 296, 351, 313]",MISC
1146,Good,"[199, 313, 242, 329]",MISC
1147,Communication,"[243, 313, 386, 329]",MISC
1148,&,"[387, 313, 397, 329]",MISC
1149,Present,"[398, 313, 530, 329]",MISC
1150,##ation,"[398, 313, 530, 329]",MISC
1151,Skills,"[530, 313, 607, 329]",MISC
1152,-,"[608, 313, 609, 329]",MISC
1153,NL,"[608, 313, 609, 329]",MISC
1154,-,"[608, 313, 609, 329]",MISC
1155,En,"[198, 328, 280, 345]",MISC
1156,##rich,"[198, 328, 280, 345]",MISC
1157,##ed,"[198, 328, 280, 345]",MISC
1158,with,"[281, 328, 321, 345]",MISC
1159,experience,"[323, 328, 426, 345]",MISC
1160,of,"[427, 328, 446, 345]",MISC
1161,working,"[448, 328, 519, 345]",MISC
1162,in,"[521, 328, 634, 345]",MISC
1163,-,"[521, 328, 634, 345]",MISC
1164,groups,"[521, 328, 634, 345]",MISC
1165,.,"[521, 328, 634, 345]",MISC
1166,-,"[635, 328, 637, 345]",MISC
1167,NL,"[635, 328, 637, 345]",MISC
1168,-,"[635, 328, 637, 345]",MISC
1169,Quick,"[198, 345, 250, 362]",MISC
1170,to,"[251, 345, 272, 362]",MISC
1171,learn,"[272, 345, 335, 362]",MISC
1172,",","[272, 345, 335, 362]",MISC
1173,hard,"[335, 345, 450, 362]",MISC
1174,##working,"[335, 345, 450, 362]",MISC
1175,and,"[451, 345, 483, 362]",MISC
1176,sincerity,"[483, 345, 587, 362]",MISC
1177,-,"[588, 345, 590, 362]",MISC
1178,NL,"[588, 345, 590, 362]",MISC
1179,-,"[588, 345, 590, 362]",MISC
1180,P,"[200, 362, 297, 379]",MISC
1181,##un,"[200, 362, 297, 379]",MISC
1182,##ct,"[200, 362, 297, 379]",MISC
1183,##ual,"[200, 362, 297, 379]",MISC
1184,and,"[297, 362, 334, 379]",MISC
1185,Hon,"[334, 362, 432, 379]",MISC
1186,##est,"[334, 362, 432, 379]",MISC
1187,.,"[334, 362, 432, 379]",MISC
1188,-,"[432, 362, 433, 379]",MISC
1189,NL,"[432, 362, 433, 379]",MISC
1190,-,"[432, 362, 433, 379]",MISC
1191,Personal,"[141, 394, 217, 415]",B-personal_details_heading
1192,Information,"[219, 394, 346, 415]",I-personal_details_heading
1193,:,"[219, 394, 346, 415]",I-personal_details_heading
1194,-,"[219, 394, 346, 415]",I-personal_details_heading
1195,-,"[346, 394, 348, 415]",MISC
1196,NL,"[346, 394, 348, 415]",MISC
1197,-,"[346, 394, 348, 415]",MISC
1198,Father,"[141, 412, 245, 429]",MISC
1199,’,"[141, 412, 245, 429]",MISC
1200,s,"[141, 412, 245, 429]",MISC
1201,Name,"[246, 412, 299, 429]",MISC
1202,:,"[299, 412, 325, 429]",MISC
1203,-,"[299, 412, 325, 429]",MISC
1204,Mo,"[326, 412, 352, 429]",MISC
1205,Si,"[352, 412, 457, 429]",MISC
1206,##kan,"[352, 412, 457, 429]",MISC
1207,##dar,"[352, 412, 457, 429]",MISC
1208,Go,"[458, 412, 522, 429]",MISC
1209,##uri,"[458, 412, 522, 429]",MISC
1210,-,"[524, 412, 526, 429]",MISC
1211,NL,"[524, 412, 526, 429]",MISC
1212,-,"[524, 412, 526, 429]",MISC
1213,D,"[141, 426, 252, 446]",MISC
1214,.,"[141, 426, 252, 446]",MISC
1215,O,"[141, 426, 252, 446]",MISC
1216,.,"[141, 426, 252, 446]",MISC
1217,B,"[141, 426, 252, 446]",MISC
1218,.,"[141, 426, 252, 446]",MISC
1219,:,"[252, 426, 289, 446]",MISC
1220,-,"[252, 426, 289, 446]",MISC
1221,10,"[289, 426, 326, 446]",MISC
1222,July,"[326, 426, 400, 446]",MISC
1223,1992,"[401, 426, 474, 446]",MISC
1224,-,"[475, 426, 477, 446]",MISC
1225,NL,"[475, 426, 477, 446]",MISC
1226,-,"[475, 426, 477, 446]",MISC
1227,Mari,"[141, 443, 233, 463]",MISC
1228,##tal,"[141, 443, 233, 463]",MISC
1229,status,"[235, 443, 315, 463]",MISC
1230,:,"[315, 443, 341, 463]",MISC
1231,-,"[315, 443, 341, 463]",MISC
1232,Un,"[342, 443, 462, 463]",MISC
1233,##mar,"[342, 443, 462, 463]",MISC
1234,##ried,"[342, 443, 462, 463]",MISC
1235,-,"[463, 443, 465, 463]",MISC
1236,NL,"[463, 443, 465, 463]",MISC
1237,-,"[463, 443, 465, 463]",MISC
1238,National,"[141, 460, 308, 478]",MISC
1239,##ity,"[141, 460, 308, 478]",MISC
1240,:,"[308, 460, 338, 478]",MISC
1241,-,"[308, 460, 338, 478]",MISC
1242,Indian,"[338, 460, 429, 478]",MISC
1243,-,"[430, 460, 432, 478]",MISC
1244,NL,"[430, 460, 432, 478]",MISC
1245,-,"[430, 460, 432, 478]",MISC
1246,Languages,"[141, 476, 270, 495]",MISC
1247,:,"[271, 476, 298, 495]",MISC
1248,-,"[271, 476, 298, 495]",MISC
1249,English,"[300, 476, 414, 495]",MISC
1250,",","[300, 476, 414, 495]",MISC
1251,Hindi,"[415, 476, 487, 495]",MISC
1252,-,"[487, 476, 489, 495]",MISC
1253,NL,"[487, 476, 489, 495]",MISC
1254,-,"[487, 476, 489, 495]",MISC
1255,Ho,"[141, 492, 233, 510]",MISC
1256,##bb,"[141, 492, 233, 510]",MISC
1257,##ies,"[141, 492, 233, 510]",MISC
1258,:,"[233, 492, 259, 510]",MISC
1259,-,"[233, 492, 259, 510]",MISC
1260,Reading,"[260, 492, 352, 510]",MISC
1261,News,"[352, 492, 404, 510]",MISC
1262,Paper,"[405, 492, 602, 510]",MISC
1263,",","[405, 492, 602, 510]",MISC
1264,Watching,"[405, 492, 602, 510]",MISC
1265,.,"[405, 492, 602, 510]",MISC
1266,T,"[603, 492, 656, 510]",MISC
1267,.,"[603, 492, 656, 510]",MISC
1268,v,"[603, 492, 656, 510]",MISC
1269,.,"[603, 492, 656, 510]",MISC
1270,-,"[656, 492, 658, 510]",MISC
1271,NL,"[656, 492, 658, 510]",MISC
1272,-,"[656, 492, 658, 510]",MISC
1273,Declaration,"[141, 529, 259, 549]",B-others_heading
1274,:,"[141, 529, 259, 549]",I-others_heading
1275,-,"[141, 529, 259, 549]",I-others_heading
1276,-,"[259, 529, 261, 549]",MISC
1277,NL,"[259, 529, 261, 549]",MISC
1278,-,"[259, 529, 261, 549]",MISC
1279,I,"[200, 549, 209, 567]",MISC
1280,here,"[209, 549, 265, 567]",MISC
1281,##by,"[209, 549, 265, 567]",MISC
1282,declare,"[266, 549, 330, 567]",MISC
1283,that,"[332, 549, 369, 567]",MISC
1284,the,"[370, 549, 398, 567]",MISC
1285,above,"[398, 549, 445, 567]",MISC
1286,information,"[445, 549, 548, 567]",MISC
1287,mentioned,"[549, 549, 633, 567]",MISC
1288,by,"[634, 549, 652, 567]",MISC
1289,me,"[653, 549, 670, 567]",MISC
1290,is,"[672, 549, 689, 567]",MISC
1291,correct,"[691, 549, 755, 567]",MISC
1292,to,"[757, 549, 774, 567]",MISC
1293,the,"[776, 549, 804, 567]",MISC
1294,best,"[804, 549, 841, 567]",MISC
1295,of,"[842, 549, 859, 567]",MISC
1296,my,"[861, 549, 878, 567]",MISC
1297,knowledge,"[880, 549, 963, 567]",MISC
1298,-,"[965, 549, 966, 567]",MISC
1299,NL,"[965, 549, 966, 567]",MISC
1300,-,"[965, 549, 966, 567]",MISC
1301,and,"[188, 567, 210, 587]",MISC
1302,belief,"[212, 567, 267, 587]",MISC
1303,.,"[212, 567, 267, 587]",MISC
1304,-,"[268, 567, 270, 587]",MISC
1305,NL,"[268, 567, 270, 587]",MISC
1306,-,"[268, 567, 270, 587]",MISC
1307,Palace,"[188, 604, 252, 623]",MISC
1308,:,"[188, 604, 252, 623]",MISC
1309,-,"[188, 604, 252, 623]",MISC
1310,-,"[252, 604, 254, 623]",MISC
1311,NL,"[252, 604, 254, 623]",MISC
1312,-,"[252, 604, 254, 623]",MISC
1313,Yours,"[818, 604, 864, 623]",MISC
1314,sincere,"[864, 604, 944, 623]",MISC
1315,##ly,"[864, 604, 944, 623]",MISC
1316,-,"[945, 604, 947, 623]",MISC
1317,NL,"[945, 604, 947, 623]",MISC
1318,-,"[945, 604, 947, 623]",MISC
1319,Date,"[188, 628, 238, 648]",MISC
1320,:,"[188, 628, 238, 648]",MISC
1321,-,"[188, 628, 238, 648]",MISC
1322,-,"[238, 628, 240, 648]",MISC
1323,NL,"[238, 628, 240, 648]",MISC
1324,-,"[238, 628, 240, 648]",MISC
1325,(,"[815, 628, 846, 648]",MISC
1326,Mo,"[815, 628, 846, 648]",MISC
1327,Far,"[847, 628, 899, 648]",MISC
1328,##uk,"[847, 628, 899, 648]",MISC
1329,Go,"[900, 628, 963, 648]",MISC
1330,##uri,"[900, 628, 963, 648]",MISC
1331,),"[900, 628, 963, 648]",MISC
1332,-,"[965, 628, 966, 648]",MISC
1333,NL,"[965, 628, 966, 648]",MISC
1334,-,"[965, 628, 966, 648]",MISC
