,token,box,label
0,A,"[49, 109, 392, 170]",B-name
1,##b,"[49, 109, 392, 170]",I-name
2,##his,"[49, 109, 392, 170]",I-name
3,##he,"[49, 109, 392, 170]",I-name
4,##k,"[49, 109, 392, 170]",I-name
5,B,"[393, 109, 563, 170]",I-name
6,##han,"[393, 109, 563, 170]",I-name
7,-,"[564, 109, 566, 170]",MISC
8,NL,"[564, 109, 566, 170]",MISC
9,-,"[564, 109, 566, 170]",MISC
10,B,"[49, 178, 64, 195]",MISC
11,.,"[65, 178, 81, 195]",MISC
12,E,"[82, 178, 97, 195]",MISC
13,M,"[98, 178, 114, 195]",MISC
14,E,"[115, 178, 130, 195]",MISC
15,C,"[131, 178, 146, 195]",MISC
16,H,"[147, 178, 163, 195]",MISC
17,A,"[164, 178, 179, 195]",MISC
18,N,"[180, 178, 196, 195]",MISC
19,I,"[197, 178, 212, 195]",MISC
20,C,"[213, 178, 228, 195]",MISC
21,A,"[229, 178, 245, 195]",MISC
22,L,"[246, 178, 261, 195]",MISC
23,-,"[262, 178, 264, 195]",MISC
24,NL,"[262, 178, 264, 195]",MISC
25,-,"[262, 178, 264, 195]",MISC
26,Work,"[49, 306, 102, 324]",B-work_experience_heading
27,History,"[103, 306, 197, 324]",I-work_experience_heading
28,-,"[197, 306, 199, 324]",MISC
29,NL,"[197, 306, 199, 324]",MISC
30,-,"[197, 306, 199, 324]",MISC
31,IN,"[49, 338, 116, 353]",B-employer_role
32,##TE,"[49, 338, 116, 353]",I-employer_role
33,##R,"[49, 338, 116, 353]",I-employer_role
34,##N,"[49, 338, 116, 353]",I-employer_role
35,-,"[116, 338, 117, 353]",MISC
36,NL,"[116, 338, 117, 353]",MISC
37,-,"[116, 338, 117, 353]",MISC
38,T,"[49, 359, 92, 373]",B-employer_company_name
39,##AT,"[49, 359, 92, 373]",I-employer_company_name
40,##A,"[49, 359, 92, 373]",I-employer_company_name
41,Motors,"[92, 359, 155, 373]",I-employer_company_name
42,Limited,"[156, 359, 232, 373]",I-employer_company_name
43,|,"[232, 359, 242, 373]",MISC
44,27,"[242, 359, 263, 373]",MISC
45,Dec,"[264, 359, 295, 373]",MISC
46,2018,"[296, 359, 339, 373]",MISC
47,-,"[339, 359, 349, 373]",MISC
48,27,"[350, 359, 370, 373]",MISC
49,Jan,"[371, 359, 402, 373]",MISC
50,2019,"[404, 359, 446, 373]",MISC
51,-,"[447, 359, 448, 373]",MISC
52,NL,"[447, 359, 448, 373]",MISC
53,-,"[447, 359, 448, 373]",MISC
54,Work,"[49, 381, 97, 393]",MISC
55,##ed,"[49, 381, 97, 393]",MISC
56,closely,"[97, 381, 154, 393]",MISC
57,in,"[154, 381, 169, 393]",MISC
58,repair,"[170, 381, 218, 393]",MISC
59,and,"[219, 381, 243, 393]",MISC
60,maintenance,"[243, 381, 332, 393]",MISC
61,of,"[332, 381, 347, 393]",MISC
62,various,"[348, 381, 404, 393]",MISC
63,T,"[405, 381, 435, 393]",MISC
64,##AT,"[405, 381, 435, 393]",MISC
65,##A,"[405, 381, 435, 393]",MISC
66,vehicles,"[437, 381, 509, 393]",MISC
67,.,"[437, 381, 509, 393]",MISC
68,-,"[510, 381, 511, 393]",MISC
69,NL,"[510, 381, 511, 393]",MISC
70,-,"[510, 381, 511, 393]",MISC
71,Project,"[49, 395, 105, 407]",MISC
72,objective,"[105, 395, 177, 407]",MISC
73,was,"[178, 395, 202, 407]",MISC
74,to,"[202, 395, 218, 407]",MISC
75,find,"[219, 395, 249, 407]",MISC
76,out,"[251, 395, 275, 407]",MISC
77,various,"[275, 395, 331, 407]",MISC
78,reasons,"[332, 395, 388, 407]",MISC
79,due,"[388, 395, 412, 407]",MISC
80,to,"[412, 395, 428, 407]",MISC
81,which,"[428, 395, 468, 407]",MISC
82,-,"[469, 395, 470, 407]",MISC
83,NL,"[469, 395, 470, 407]",MISC
84,-,"[469, 395, 470, 407]",MISC
85,Ty,"[49, 409, 81, 421]",MISC
86,##re,"[49, 409, 81, 421]",MISC
87,wear,"[82, 409, 114, 421]",MISC
88,occur,"[115, 409, 156, 421]",MISC
89,and,"[156, 409, 180, 421]",MISC
90,to,"[181, 409, 197, 421]",MISC
91,give,"[198, 409, 230, 421]",MISC
92,the,"[231, 409, 255, 421]",MISC
93,necessary,"[256, 409, 329, 421]",MISC
94,pre,"[330, 409, 421, 421]",MISC
95,##ca,"[330, 409, 421, 421]",MISC
96,##ution,"[330, 409, 421, 421]",MISC
97,##s,"[330, 409, 421, 421]",MISC
98,to,"[421, 409, 436, 421]",MISC
99,reduce,"[438, 409, 487, 421]",MISC
100,them,"[487, 409, 528, 421]",MISC
101,.,"[487, 409, 528, 421]",MISC
102,-,"[529, 409, 530, 421]",MISC
103,NL,"[529, 409, 530, 421]",MISC
104,-,"[529, 409, 530, 421]",MISC
105,IN,"[49, 459, 116, 474]",B-employer_role
106,##TE,"[49, 459, 116, 474]",I-employer_role
107,##R,"[49, 459, 116, 474]",I-employer_role
108,##N,"[49, 459, 116, 474]",I-employer_role
109,-,"[116, 459, 117, 474]",MISC
110,NL,"[116, 459, 117, 474]",MISC
111,-,"[116, 459, 117, 474]",MISC
112,SK,"[49, 473, 80, 496]",B-employer_company_name
113,##F,"[49, 473, 80, 496]",I-employer_company_name
114,India,"[81, 473, 132, 496]",I-employer_company_name
115,Limited,"[133, 473, 207, 496]",I-employer_company_name
116,|,"[207, 473, 217, 496]",MISC
117,27,"[217, 473, 238, 496]",MISC
118,May,"[238, 473, 269, 496]",MISC
119,2018,"[270, 473, 311, 496]",MISC
120,-,"[312, 473, 322, 496]",MISC
121,27,"[323, 473, 343, 496]",MISC
122,June,"[344, 473, 385, 496]",MISC
123,2018,"[386, 473, 427, 496]",MISC
124,-,"[428, 473, 430, 496]",MISC
125,NL,"[428, 473, 430, 496]",MISC
126,-,"[428, 473, 430, 496]",MISC
127,Done,"[49, 501, 80, 515]",MISC
128,work,"[81, 501, 112, 515]",MISC
129,in,"[114, 501, 129, 515]",MISC
130,bearing,"[130, 501, 186, 515]",MISC
131,basic,"[187, 501, 234, 515]",MISC
132,##s,"[187, 501, 234, 515]",MISC
133,and,"[235, 501, 259, 515]",MISC
134,applications,"[260, 501, 355, 515]",MISC
135,for,"[357, 501, 381, 515]",MISC
136,the,"[381, 501, 405, 515]",MISC
137,company,"[405, 501, 468, 515]",MISC
138,.,"[405, 501, 468, 515]",MISC
139,St,"[470, 501, 526, 515]",MISC
140,##udi,"[470, 501, 526, 515]",MISC
141,##ed,"[470, 501, 526, 515]",MISC
142,-,"[527, 501, 529, 515]",MISC
143,NL,"[527, 501, 529, 515]",MISC
144,-,"[527, 501, 529, 515]",MISC
145,about,"[49, 516, 88, 529]",MISC
146,ball,"[89, 516, 119, 529]",MISC
147,bearings,"[120, 516, 184, 529]",MISC
148,and,"[184, 516, 206, 529]",MISC
149,industrial,"[208, 516, 286, 529]",MISC
150,seals,"[287, 516, 326, 529]",MISC
151,manufactured,"[327, 516, 421, 529]",MISC
152,by,"[422, 516, 437, 529]",MISC
153,the,"[438, 516, 460, 529]",MISC
154,company,"[462, 516, 525, 529]",MISC
155,.,"[462, 516, 525, 529]",MISC
156,-,"[525, 516, 527, 529]",MISC
157,NL,"[525, 516, 527, 529]",MISC
158,-,"[525, 516, 527, 529]",MISC
159,IN,"[49, 560, 116, 577]",B-employer_role
160,##TE,"[49, 560, 116, 577]",I-employer_role
161,##R,"[49, 560, 116, 577]",I-employer_role
162,##N,"[49, 560, 116, 577]",I-employer_role
163,-,"[116, 560, 117, 577]",MISC
164,NL,"[116, 560, 117, 577]",MISC
165,-,"[116, 560, 117, 577]",MISC
166,Ki,"[49, 583, 138, 597]",B-employer_company_name
167,##rl,"[49, 583, 138, 597]",I-employer_company_name
168,##os,"[49, 583, 138, 597]",I-employer_company_name
169,##kar,"[49, 583, 138, 597]",I-employer_company_name
170,Oil,"[139, 583, 168, 597]",I-employer_company_name
171,Engine,"[169, 583, 228, 597]",I-employer_company_name
172,Limited,"[229, 583, 297, 597]",I-employer_company_name
173,|,"[298, 583, 307, 597]",MISC
174,11,"[308, 583, 327, 597]",MISC
175,Dec,"[328, 583, 357, 597]",MISC
176,2017,"[358, 583, 397, 597]",MISC
177,-,"[398, 583, 407, 597]",MISC
178,10,"[408, 583, 427, 597]",B-education_degree
179,Jan,"[428, 583, 457, 597]",MISC
180,2018,"[458, 583, 497, 597]",MISC
181,-,"[498, 583, 500, 597]",MISC
182,NL,"[498, 583, 500, 597]",MISC
183,-,"[498, 583, 500, 597]",MISC
184,Project,"[49, 604, 107, 617]",MISC
185,objective,"[107, 604, 181, 617]",MISC
186,was,"[182, 604, 206, 617]",MISC
187,to,"[207, 604, 223, 617]",MISC
188,design,"[224, 604, 274, 617]",MISC
189,a,"[274, 604, 281, 617]",MISC
190,water,"[282, 604, 323, 617]",MISC
191,pump,"[324, 604, 356, 617]",MISC
192,for,"[357, 604, 381, 617]",MISC
193,a,"[382, 604, 389, 617]",MISC
194,B,"[391, 604, 415, 617]",MISC
195,##MP,"[391, 604, 415, 617]",MISC
196,vehicle,"[416, 604, 482, 617]",MISC
197,.,"[416, 604, 482, 617]",MISC
198,-,"[482, 604, 484, 617]",MISC
199,NL,"[482, 604, 484, 617]",MISC
200,-,"[482, 604, 484, 617]",MISC
201,As,"[49, 618, 112, 631]",MISC
202,##sist,"[49, 618, 112, 631]",MISC
203,##ed,"[49, 618, 112, 631]",MISC
204,in,"[114, 618, 129, 631]",MISC
205,di,"[130, 618, 219, 631]",MISC
206,##sman,"[130, 618, 219, 631]",MISC
207,##tling,"[130, 618, 219, 631]",MISC
208,and,"[219, 618, 243, 631]",MISC
209,ass,"[243, 618, 324, 631]",MISC
210,##em,"[243, 618, 324, 631]",MISC
211,##bling,"[243, 618, 324, 631]",MISC
212,of,"[324, 618, 340, 631]",MISC
213,a,"[340, 618, 347, 631]",MISC
214,B,"[349, 618, 372, 631]",MISC
215,##MP,"[349, 618, 372, 631]",MISC
216,engine,"[373, 618, 429, 631]",MISC
217,.,"[373, 618, 429, 631]",MISC
218,-,"[430, 618, 431, 631]",MISC
219,NL,"[430, 618, 431, 631]",MISC
220,-,"[430, 618, 431, 631]",MISC
221,.,"[49, 712, 59, 728]",B-education_heading
222,Education,"[61, 712, 165, 728]",I-education_heading
223,History,"[165, 712, 246, 728]",I-education_heading
224,-,"[247, 712, 249, 728]",MISC
225,NL,"[247, 712, 249, 728]",MISC
226,-,"[247, 712, 249, 728]",MISC
227,SA,"[49, 733, 162, 756]",B-education_institute
228,##VI,"[49, 733, 162, 756]",I-education_institute
229,##TR,"[49, 733, 162, 756]",I-education_institute
230,##IB,"[49, 733, 162, 756]",I-education_institute
231,##A,"[49, 733, 162, 756]",I-education_institute
232,##I,"[49, 733, 162, 756]",I-education_institute
233,P,"[163, 733, 219, 756]",I-education_institute
234,##H,"[163, 733, 219, 756]",I-education_institute
235,##U,"[163, 733, 219, 756]",I-education_institute
236,##LE,"[163, 733, 219, 756]",I-education_institute
237,P,"[220, 733, 265, 756]",I-education_institute
238,##UN,"[220, 733, 265, 756]",I-education_institute
239,##E,"[220, 733, 265, 756]",I-education_institute
240,UN,"[266, 733, 379, 756]",I-education_institute
241,##IVE,"[266, 733, 379, 756]",I-education_institute
242,##RS,"[266, 733, 379, 756]",I-education_institute
243,##IT,"[266, 733, 379, 756]",I-education_institute
244,##Y,"[266, 733, 379, 756]",I-education_institute
245,-,"[380, 733, 382, 756]",MISC
246,NL,"[380, 733, 382, 756]",MISC
247,-,"[380, 733, 382, 756]",MISC
248,Bachelor,"[49, 761, 129, 777]",B-education_degree
249,of,"[129, 761, 148, 777]",I-education_degree
250,Engineering,"[149, 761, 259, 777]",I-education_degree
251,(,"[260, 761, 379, 777]",MISC
252,ME,"[260, 761, 379, 777]",B-education_course
253,##CH,"[260, 761, 379, 777]",I-education_course
254,##AN,"[260, 761, 379, 777]",I-education_course
255,##IC,"[260, 761, 379, 777]",I-education_course
256,##AL,"[260, 761, 379, 777]",I-education_course
257,),"[260, 761, 379, 777]",MISC
258,|,"[380, 761, 389, 777]",MISC
259,2015,"[390, 761, 430, 777]",MISC
260,-,"[431, 761, 439, 777]",MISC
261,2019,"[441, 761, 480, 777]",MISC
262,-,"[481, 761, 482, 777]",MISC
263,NL,"[481, 761, 482, 777]",MISC
264,-,"[481, 761, 482, 777]",MISC
265,-,"[49, 784, 56, 796]",MISC
266,P,"[57, 784, 114, 796]",MISC
267,##urs,"[57, 784, 114, 796]",MISC
268,##ued,"[57, 784, 114, 796]",MISC
269,Mechanical,"[115, 784, 197, 796]",MISC
270,Engineering,"[197, 784, 286, 796]",MISC
271,from,"[287, 784, 320, 796]",MISC
272,K,"[320, 784, 327, 796]",MISC
273,W,"[328, 784, 361, 796]",MISC
274,##agh,"[328, 784, 361, 796]",MISC
275,College,"[361, 784, 417, 796]",MISC
276,of,"[419, 784, 434, 796]",MISC
277,Engineering,"[435, 784, 532, 796]",MISC
278,.,"[435, 784, 532, 796]",MISC
279,-,"[534, 784, 535, 796]",MISC
280,NL,"[534, 784, 535, 796]",MISC
281,-,"[534, 784, 535, 796]",MISC
282,-,"[49, 797, 56, 810]",MISC
283,Final,"[57, 797, 94, 810]",MISC
284,result,"[95, 797, 141, 810]",MISC
285,obtained,"[142, 797, 203, 810]",MISC
286,55,"[203, 797, 226, 810]",MISC
287,%,"[203, 797, 226, 810]",MISC
288,(,"[227, 797, 279, 810]",MISC
289,Higher,"[227, 797, 279, 810]",MISC
290,Second,"[281, 797, 327, 810]",MISC
291,Class,"[327, 797, 373, 810]",MISC
292,),"[327, 797, 373, 810]",MISC
293,-,"[373, 797, 375, 810]",MISC
294,NL,"[373, 797, 375, 810]",MISC
295,-,"[373, 797, 375, 810]",MISC
296,AR,"[49, 845, 100, 861]",B-education_institute
297,##M,"[49, 845, 100, 861]",I-education_institute
298,##Y,"[49, 845, 100, 861]",I-education_institute
299,P,"[101, 845, 180, 861]",I-education_institute
300,##U,"[101, 845, 180, 861]",I-education_institute
301,##BL,"[101, 845, 180, 861]",I-education_institute
302,##IC,"[101, 845, 180, 861]",I-education_institute
303,SC,"[180, 845, 259, 861]",I-education_institute
304,##H,"[180, 845, 259, 861]",I-education_institute
305,##O,"[180, 845, 259, 861]",I-education_institute
306,##OL,"[180, 845, 259, 861]",I-education_institute
307,D,"[259, 845, 337, 861]",I-education_institute
308,##AM,"[259, 845, 337, 861]",I-education_institute
309,##AN,"[259, 845, 337, 861]",I-education_institute
310,##A,"[259, 845, 337, 861]",I-education_institute
311,-,"[337, 845, 339, 861]",MISC
312,NL,"[337, 845, 339, 861]",MISC
313,-,"[337, 845, 339, 861]",MISC
314,ST,"[49, 867, 122, 882]",MISC
315,##U,"[49, 867, 122, 882]",MISC
316,##DE,"[49, 867, 122, 882]",MISC
317,##NT,"[49, 867, 122, 882]",MISC
318,(,"[124, 867, 187, 882]",MISC
319,C,"[124, 867, 187, 882]",MISC
320,##LA,"[124, 867, 187, 882]",MISC
321,##SS,"[124, 867, 187, 882]",MISC
322,12,"[188, 867, 231, 882]",B-education_degree
323,),"[188, 867, 231, 882]",MISC
324,|,"[188, 867, 231, 882]",MISC
325,2014,"[231, 867, 274, 882]",MISC
326,-,"[274, 867, 284, 882]",MISC
327,2015,"[284, 867, 327, 882]",MISC
328,-,"[327, 867, 329, 882]",MISC
329,NL,"[327, 867, 329, 882]",MISC
330,-,"[327, 867, 329, 882]",MISC
331,-,"[49, 888, 56, 901]",MISC
332,Final,"[57, 888, 94, 901]",MISC
333,result,"[95, 888, 141, 901]",MISC
334,obtained,"[142, 888, 203, 901]",MISC
335,80,"[203, 888, 225, 901]",MISC
336,%,"[203, 888, 225, 901]",MISC
337,-,"[226, 888, 228, 901]",MISC
338,NL,"[226, 888, 228, 901]",MISC
339,-,"[226, 888, 228, 901]",MISC
340,AR,"[49, 945, 100, 960]",B-education_institute
341,##M,"[49, 945, 100, 960]",I-education_institute
342,##Y,"[49, 945, 100, 960]",I-education_institute
343,P,"[101, 945, 178, 960]",I-education_institute
344,##U,"[101, 945, 178, 960]",I-education_institute
345,##BL,"[101, 945, 178, 960]",I-education_institute
346,##IC,"[101, 945, 178, 960]",I-education_institute
347,SC,"[179, 945, 256, 960]",I-education_institute
348,##H,"[179, 945, 256, 960]",I-education_institute
349,##O,"[179, 945, 256, 960]",I-education_institute
350,##OL,"[179, 945, 256, 960]",I-education_institute
351,U,"[257, 945, 361, 960]",I-education_institute
352,##D,"[257, 945, 361, 960]",I-education_institute
353,##HA,"[257, 945, 361, 960]",I-education_institute
354,##MP,"[257, 945, 361, 960]",I-education_institute
355,##UR,"[257, 945, 361, 960]",I-education_institute
356,-,"[361, 945, 363, 960]",MISC
357,NL,"[361, 945, 363, 960]",MISC
358,-,"[361, 945, 363, 960]",MISC
359,ST,"[49, 967, 122, 981]",MISC
360,##U,"[49, 967, 122, 981]",MISC
361,##DE,"[49, 967, 122, 981]",MISC
362,##NT,"[49, 967, 122, 981]",MISC
363,(,"[124, 967, 187, 981]",MISC
364,C,"[124, 967, 187, 981]",MISC
365,##LA,"[124, 967, 187, 981]",MISC
366,##SS,"[124, 967, 187, 981]",MISC
367,10,"[188, 967, 231, 981]",B-education_degree
368,),"[188, 967, 231, 981]",MISC
369,|,"[188, 967, 231, 981]",MISC
370,2012,"[231, 967, 274, 981]",MISC
371,-,"[274, 967, 284, 981]",MISC
372,2013,"[284, 967, 327, 981]",MISC
373,-,"[327, 967, 329, 981]",MISC
374,NL,"[327, 967, 329, 981]",MISC
375,-,"[327, 967, 329, 981]",MISC
376,-,"[49, 988, 56, 999]",MISC
377,Final,"[57, 988, 94, 999]",MISC
378,result,"[95, 988, 141, 999]",MISC
379,obtained,"[142, 988, 203, 999]",MISC
380,94,"[203, 988, 225, 999]",MISC
381,%,"[203, 988, 225, 999]",MISC
382,-,"[226, 988, 228, 999]",MISC
383,NL,"[226, 988, 228, 999]",MISC
384,-,"[226, 988, 228, 999]",MISC
385,Carr,"[626, 329, 706, 349]",B-summary_heading
386,##er,"[626, 329, 706, 349]",I-summary_heading
387,O,"[706, 329, 826, 349]",I-summary_heading
388,##bject,"[706, 329, 826, 349]",I-summary_heading
389,##ive,"[706, 329, 826, 349]",I-summary_heading
390,-,"[827, 329, 829, 349]",MISC
391,NL,"[827, 329, 829, 349]",MISC
392,-,"[827, 329, 829, 349]",MISC
393,I,"[626, 357, 634, 369]",MISC
394,am,"[635, 357, 652, 369]",MISC
395,an,"[652, 357, 669, 369]",MISC
396,engineering,"[670, 357, 765, 369]",MISC
397,graduate,"[766, 357, 836, 369]",MISC
398,with,"[837, 357, 871, 369]",MISC
399,a,"[872, 357, 880, 369]",MISC
400,great,"[880, 357, 923, 369]",MISC
401,passion,"[924, 357, 986, 369]",MISC
402,-,"[986, 357, 988, 369]",MISC
403,NL,"[986, 357, 988, 369]",MISC
404,-,"[986, 357, 988, 369]",MISC
405,for,"[626, 371, 651, 385]",MISC
406,learning,"[652, 371, 722, 385]",MISC
407,and,"[723, 371, 749, 385]",MISC
408,look,"[750, 371, 784, 385]",MISC
409,forward,"[785, 371, 847, 385]",MISC
410,to,"[847, 371, 864, 385]",MISC
411,work,"[865, 371, 899, 385]",MISC
412,for,"[901, 371, 926, 385]",MISC
413,an,"[927, 371, 944, 385]",MISC
414,-,"[945, 371, 947, 385]",MISC
415,NL,"[945, 371, 947, 385]",MISC
416,-,"[945, 371, 947, 385]",MISC
417,organization,"[626, 386, 728, 400]",MISC
418,which,"[729, 386, 771, 400]",MISC
419,provides,"[772, 386, 840, 400]",MISC
420,me,"[840, 386, 857, 400]",MISC
421,the,"[857, 386, 883, 400]",MISC
422,opportunity,"[883, 386, 977, 400]",MISC
423,to,"[977, 386, 994, 400]",MISC
424,-,"[994, 386, 996, 400]",MISC
425,NL,"[994, 386, 996, 400]",MISC
426,-,"[994, 386, 996, 400]",MISC
427,improve,"[626, 401, 686, 414]",MISC
428,my,"[686, 401, 703, 414]",MISC
429,skills,"[704, 401, 755, 414]",MISC
430,and,"[756, 401, 781, 414]",MISC
431,knowledge,"[782, 401, 867, 414]",MISC
432,.,"[782, 401, 867, 414]",MISC
433,-,"[868, 401, 870, 414]",MISC
434,NL,"[868, 401, 870, 414]",MISC
435,-,"[868, 401, 870, 414]",MISC
436,Contact,"[626, 473, 716, 493]",B-personal_details_heading
437,Det,"[716, 473, 807, 493]",I-personal_details_heading
438,##ails,"[716, 473, 807, 493]",I-personal_details_heading
439,-,"[807, 473, 808, 493]",MISC
440,NL,"[807, 473, 808, 493]",MISC
441,-,"[807, 473, 808, 493]",MISC
442,Date,"[626, 501, 660, 513]",MISC
443,of,"[661, 501, 678, 513]",MISC
444,Birth,"[679, 501, 732, 513]",MISC
445,:,"[679, 501, 732, 513]",MISC
446,27,"[732, 501, 749, 513]",MISC
447,Jan,"[750, 501, 775, 513]",MISC
448,1998,"[776, 501, 810, 513]",MISC
449,-,"[812, 501, 813, 513]",MISC
450,NL,"[812, 501, 813, 513]",MISC
451,-,"[812, 501, 813, 513]",MISC
452,Ad,"[626, 516, 694, 529]",MISC
453,##dress,"[626, 516, 694, 529]",MISC
454,:,"[626, 516, 694, 529]",MISC
455,1,"[694, 516, 737, 529]",MISC
456,/,"[694, 516, 737, 529]",MISC
457,73,"[694, 516, 737, 529]",MISC
458,",","[694, 516, 737, 529]",MISC
459,Block,"[737, 516, 780, 529]",MISC
460,1,"[780, 516, 797, 529]",MISC
461,",","[780, 516, 797, 529]",MISC
462,Nehru,"[797, 516, 840, 529]",MISC
463,Nagar,"[840, 516, 891, 529]",MISC
464,",","[840, 516, 891, 529]",MISC
465,New,"[892, 516, 917, 529]",MISC
466,Delhi,"[917, 516, 969, 529]",MISC
467,",","[917, 516, 969, 529]",MISC
468,-,"[969, 516, 970, 529]",MISC
469,NL,"[969, 516, 970, 529]",MISC
470,-,"[969, 516, 970, 529]",MISC
471,1100,"[626, 530, 680, 544]",MISC
472,##65,"[626, 530, 680, 544]",MISC
473,-,"[680, 530, 682, 544]",MISC
474,NL,"[680, 530, 682, 544]",MISC
475,-,"[680, 530, 682, 544]",MISC
476,Em,"[626, 545, 675, 558]",MISC
477,##ail,"[626, 545, 675, 558]",MISC
478,:,"[626, 545, 675, 558]",MISC
479,a,"[675, 545, 873, 558]",B-emails_email
480,##b,"[675, 545, 873, 558]",I-emails_email
481,##his,"[675, 545, 873, 558]",I-emails_email
482,##he,"[675, 545, 873, 558]",I-emails_email
483,##k,"[675, 545, 873, 558]",I-emails_email
484,##bha,"[675, 545, 873, 558]",I-emails_email
485,##n,"[675, 545, 873, 558]",I-emails_email
486,##9,"[675, 545, 873, 558]",I-emails_email
487,##7,"[675, 545, 873, 558]",I-emails_email
488,@,"[675, 545, 873, 558]",I-emails_email
489,g,"[675, 545, 873, 558]",I-emails_email
490,##mail,"[675, 545, 873, 558]",I-emails_email
491,.,"[675, 545, 873, 558]",I-emails_email
492,com,"[675, 545, 873, 558]",I-emails_email
493,-,"[873, 545, 875, 558]",MISC
494,NL,"[873, 545, 875, 558]",MISC
495,-,"[873, 545, 875, 558]",MISC
496,Mobile,"[626, 560, 677, 573]",MISC
497,No,"[678, 560, 712, 573]",MISC
498,.,"[678, 560, 712, 573]",MISC
499,:,"[678, 560, 712, 573]",MISC
500,91,"[713, 560, 826, 573]",B-phones_phone
501,-,"[713, 560, 826, 573]",I-phones_phone
502,91,"[713, 560, 826, 573]",I-phones_phone
503,##4,"[713, 560, 826, 573]",I-phones_phone
504,##9,"[713, 560, 826, 573]",I-phones_phone
505,##8,"[713, 560, 826, 573]",I-phones_phone
506,##9,"[713, 560, 826, 573]",I-phones_phone
507,##65,"[713, 560, 826, 573]",I-phones_phone
508,##6,"[713, 560, 826, 573]",I-phones_phone
509,##2,"[713, 560, 826, 573]",I-phones_phone
510,-,"[827, 560, 829, 573]",MISC
511,NL,"[827, 560, 829, 573]",MISC
512,-,"[827, 560, 829, 573]",MISC
513,Achievement,"[626, 614, 779, 633]",B-others_heading
514,##s,"[626, 614, 779, 633]",I-others_heading
515,-,"[779, 614, 781, 633]",MISC
516,NL,"[779, 614, 781, 633]",MISC
517,-,"[779, 614, 781, 633]",MISC
518,-,"[626, 641, 633, 655]",MISC
519,Runner,"[634, 641, 684, 655]",MISC
520,up,"[684, 641, 699, 655]",MISC
521,in,"[701, 641, 716, 655]",MISC
522,department,"[717, 641, 799, 655]",MISC
523,presentation,"[800, 641, 899, 655]",MISC
524,competition,"[900, 641, 999, 655]",MISC
525,.,"[900, 641, 999, 655]",MISC
526,-,"[1000, 641, 1001, 655]",MISC
527,NL,"[1000, 641, 1001, 655]",MISC
528,-,"[1000, 641, 1001, 655]",MISC
529,-,"[626, 656, 633, 669]",MISC
530,School,"[634, 656, 682, 669]",MISC
531,top,"[682, 656, 730, 669]",MISC
532,##per,"[682, 656, 730, 669]",MISC
533,in,"[731, 656, 746, 669]",MISC
534,class,"[747, 656, 786, 669]",MISC
535,12,"[787, 656, 803, 669]",B-education_degree
536,English,"[803, 656, 860, 669]",MISC
537,Sub,"[860, 656, 923, 669]",MISC
538,##ject,"[860, 656, 923, 669]",MISC
539,.,"[860, 656, 923, 669]",MISC
540,-,"[924, 656, 926, 669]",MISC
541,NL,"[924, 656, 926, 669]",MISC
542,-,"[924, 656, 926, 669]",MISC
543,-,"[626, 670, 634, 684]",MISC
544,Won,"[634, 670, 660, 684]",MISC
545,school,"[660, 670, 711, 684]",MISC
546,level,"[712, 670, 754, 684]",MISC
547,debate,"[755, 670, 806, 684]",MISC
548,competition,"[806, 670, 908, 684]",MISC
549,.,"[806, 670, 908, 684]",MISC
550,-,"[909, 670, 911, 684]",MISC
551,NL,"[909, 670, 911, 684]",MISC
552,-,"[909, 670, 911, 684]",MISC
553,Notable,"[626, 733, 715, 753]",B-skills_heading
554,Skills,"[715, 733, 790, 753]",I-skills_heading
555,-,"[791, 733, 793, 753]",MISC
556,NL,"[791, 733, 793, 753]",MISC
557,-,"[791, 733, 793, 753]",MISC
558,-,"[626, 761, 634, 773]",MISC
559,Working,"[635, 761, 698, 773]",MISC
560,knowledge,"[698, 761, 779, 773]",MISC
561,of,"[780, 761, 797, 773]",MISC
562,Auto,"[798, 761, 870, 773]",MISC
563,##CA,"[798, 761, 870, 773]",MISC
564,##D,"[798, 761, 870, 773]",MISC
565,",","[798, 761, 870, 773]",MISC
566,An,"[871, 761, 924, 773]",MISC
567,##sy,"[871, 761, 924, 773]",MISC
568,##s,"[871, 761, 924, 773]",MISC
569,",","[871, 761, 924, 773]",MISC
570,MA,"[926, 761, 989, 773]",MISC
571,##TL,"[926, 761, 989, 773]",MISC
572,##AB,"[926, 761, 989, 773]",MISC
573,",","[926, 761, 989, 773]",MISC
574,-,"[989, 761, 991, 773]",MISC
575,NL,"[989, 761, 991, 773]",MISC
576,-,"[989, 761, 991, 773]",MISC
577,MS,"[626, 776, 641, 789]",MISC
578,Ex,"[642, 776, 692, 789]",MISC
579,##cel,"[642, 776, 692, 789]",MISC
580,.,"[642, 776, 692, 789]",MISC
581,-,"[692, 776, 694, 789]",MISC
582,NL,"[692, 776, 694, 789]",MISC
583,-,"[692, 776, 694, 789]",MISC
584,-,"[626, 791, 633, 804]",MISC
585,Strong,"[633, 791, 678, 804]",MISC
586,team,"[679, 791, 708, 804]",MISC
587,collaboration,"[710, 791, 809, 804]",MISC
588,skills,"[809, 791, 862, 804]",MISC
589,.,"[809, 791, 862, 804]",MISC
590,-,"[863, 791, 865, 804]",MISC
591,NL,"[863, 791, 865, 804]",MISC
592,-,"[863, 791, 865, 804]",MISC
593,-,"[626, 805, 633, 819]",MISC
594,Problem,"[634, 805, 690, 819]",MISC
595,Sol,"[691, 805, 747, 819]",MISC
596,##ving,"[691, 805, 747, 819]",MISC
597,and,"[748, 805, 771, 819]",MISC
598,attention,"[772, 805, 844, 819]",MISC
599,to,"[845, 805, 860, 819]",MISC
600,details,"[861, 805, 926, 819]",MISC
601,.,"[861, 805, 926, 819]",MISC
602,-,"[926, 805, 928, 819]",MISC
603,NL,"[926, 805, 928, 819]",MISC
604,-,"[926, 805, 928, 819]",MISC
605,-,"[626, 820, 633, 833]",MISC
606,Fitness,"[634, 820, 690, 833]",MISC
607,and,"[691, 820, 715, 833]",MISC
608,health,"[715, 820, 763, 833]",MISC
609,training,"[764, 820, 829, 833]",MISC
610,-,"[829, 820, 831, 833]",MISC
611,NL,"[829, 820, 831, 833]",MISC
612,-,"[829, 820, 831, 833]",MISC
613,Ho,"[626, 867, 721, 886]",B-others_heading
614,##bb,"[626, 867, 721, 886]",I-others_heading
615,##ies,"[626, 867, 721, 886]",I-others_heading
616,-,"[721, 867, 723, 886]",MISC
617,NL,"[721, 867, 723, 886]",MISC
618,-,"[721, 867, 723, 886]",MISC
619,-,"[626, 893, 633, 907]",MISC
620,Playing,"[633, 893, 684, 907]",MISC
621,football,"[684, 893, 749, 907]",MISC
622,",","[684, 893, 749, 907]",MISC
623,basketball,"[750, 893, 830, 907]",MISC
624,.,"[750, 893, 830, 907]",MISC
625,-,"[831, 893, 832, 907]",MISC
626,NL,"[831, 893, 832, 907]",MISC
627,-,"[831, 893, 832, 907]",MISC
628,-,"[626, 909, 633, 921]",MISC
629,Trek,"[633, 909, 700, 921]",MISC
630,##king,"[633, 909, 700, 921]",MISC
631,.,"[633, 909, 700, 921]",MISC
632,-,"[701, 909, 703, 921]",MISC
633,NL,"[701, 909, 703, 921]",MISC
634,-,"[701, 909, 703, 921]",MISC
635,-,"[626, 924, 633, 936]",MISC
636,Reading,"[634, 924, 688, 936]",MISC
637,self,"[690, 924, 720, 936]",MISC
638,helping,"[722, 924, 776, 936]",MISC
639,books,"[778, 924, 825, 936]",MISC
640,.,"[778, 924, 825, 936]",MISC
641,-,"[825, 924, 827, 936]",MISC
642,NL,"[825, 924, 827, 936]",MISC
643,-,"[825, 924, 827, 936]",MISC
644,-,"[626, 938, 633, 952]",MISC
645,S,"[634, 938, 707, 952]",MISC
646,##ket,"[634, 938, 707, 952]",MISC
647,##ching,"[634, 938, 707, 952]",MISC
648,and,"[707, 938, 731, 952]",MISC
649,designing,"[732, 938, 812, 952]",MISC
650,.,"[732, 938, 812, 952]",MISC
651,-,"[813, 938, 815, 952]",MISC
652,NL,"[813, 938, 815, 952]",MISC
653,-,"[813, 938, 815, 952]",MISC
