,token,box,label
0,CA,"[98, 39, 188, 63]",MISC
1,##RE,"[98, 39, 188, 63]",MISC
2,##ER,"[98, 39, 188, 63]",MISC
3,PR,"[189, 39, 294, 63]",MISC
4,##O,"[189, 39, 294, 63]",MISC
5,##FI,"[189, 39, 294, 63]",MISC
6,##LE,"[189, 39, 294, 63]",MISC
7,-,"[295, 39, 297, 63]",MISC
8,NL,"[295, 39, 297, 63]",MISC
9,-,"[295, 39, 297, 63]",MISC
10,A,"[69, 74, 76, 87]",MISC
11,software,"[77, 74, 138, 87]",MISC
12,engineer,"[138, 74, 199, 87]",MISC
13,doing,"[199, 74, 236, 87]",MISC
14,a,"[237, 74, 244, 87]",MISC
15,graduation,"[245, 74, 320, 87]",MISC
16,internship,"[321, 74, 396, 87]",MISC
17,in,"[398, 74, 413, 87]",MISC
18,Ex,"[413, 74, 474, 87]",B-employer_company_name
19,##pen,"[413, 74, 474, 87]",I-employer_company_name
20,##sy,"[413, 74, 474, 87]",I-employer_company_name
21,##a,"[413, 74, 474, 87]",I-employer_company_name
22,and,"[474, 74, 496, 87]",MISC
23,looking,"[497, 74, 550, 87]",MISC
24,for,"[550, 74, 573, 87]",MISC
25,full,"[573, 74, 641, 87]",MISC
26,-,"[573, 74, 641, 87]",MISC
27,time,"[573, 74, 641, 87]",MISC
28,job,"[642, 74, 664, 87]",MISC
29,-,"[665, 74, 667, 87]",MISC
30,NL,"[665, 74, 667, 87]",MISC
31,-,"[665, 74, 667, 87]",MISC
32,opportunities,"[69, 87, 164, 98]",MISC
33,using,"[166, 87, 201, 98]",MISC
34,the,"[203, 87, 225, 98]",MISC
35,technical,"[225, 87, 291, 98]",MISC
36,and,"[292, 87, 314, 98]",MISC
37,theoretical,"[314, 87, 396, 98]",MISC
38,skills,"[396, 87, 440, 98]",MISC
39,acquired,"[440, 87, 498, 98]",MISC
40,through,"[500, 87, 551, 98]",MISC
41,the,"[552, 87, 574, 98]",MISC
42,academic,"[574, 87, 632, 98]",MISC
43,studies,"[633, 87, 684, 98]",MISC
44,-,"[685, 87, 687, 98]",MISC
45,NL,"[685, 87, 687, 98]",MISC
46,-,"[685, 87, 687, 98]",MISC
47,and,"[69, 98, 91, 111]",MISC
48,the,"[91, 98, 113, 111]",MISC
49,professional,"[114, 98, 202, 111]",MISC
50,experiences,"[203, 98, 291, 111]",MISC
51,.,"[203, 98, 291, 111]",MISC
52,-,"[292, 98, 293, 111]",MISC
53,NL,"[292, 98, 293, 111]",MISC
54,-,"[292, 98, 293, 111]",MISC
55,PR,"[98, 145, 276, 166]",B-work_experience_heading
56,##O,"[98, 145, 276, 166]",I-work_experience_heading
57,##F,"[98, 145, 276, 166]",I-work_experience_heading
58,##ES,"[98, 145, 276, 166]",I-work_experience_heading
59,##SI,"[98, 145, 276, 166]",I-work_experience_heading
60,##ON,"[98, 145, 276, 166]",I-work_experience_heading
61,##AL,"[98, 145, 276, 166]",I-work_experience_heading
62,E,"[278, 145, 442, 166]",I-work_experience_heading
63,##X,"[278, 145, 442, 166]",I-work_experience_heading
64,##P,"[278, 145, 442, 166]",I-work_experience_heading
65,##ER,"[278, 145, 442, 166]",I-work_experience_heading
66,##IE,"[278, 145, 442, 166]",I-work_experience_heading
67,##NC,"[278, 145, 442, 166]",I-work_experience_heading
68,##ES,"[278, 145, 442, 166]",I-work_experience_heading
69,-,"[443, 145, 444, 166]",MISC
70,NL,"[443, 145, 444, 166]",MISC
71,-,"[443, 145, 444, 166]",MISC
72,Software,"[67, 193, 134, 207]",B-employer_role
73,en,"[134, 193, 226, 207]",I-employer_role
74,##gin,"[134, 193, 226, 207]",I-employer_role
75,##ner,"[134, 193, 226, 207]",I-employer_role
76,##ing,"[134, 193, 226, 207]",I-employer_role
77,graduation,"[226, 193, 310, 207]",I-employer_role
78,internship,"[310, 193, 393, 207]",I-employer_role
79,-,"[394, 193, 401, 207]",I-employer_role
80,creation,"[402, 193, 469, 207]",I-employer_role
81,of,"[469, 193, 485, 207]",I-employer_role
82,a,"[486, 193, 493, 207]",I-employer_role
83,virtual,"[494, 193, 552, 207]",I-employer_role
84,payment,"[553, 193, 611, 207]",I-employer_role
85,solution,"[612, 193, 678, 207]",I-employer_role
86,-,"[679, 193, 680, 207]",MISC
87,NL,"[679, 193, 680, 207]",MISC
88,-,"[679, 193, 680, 207]",MISC
89,Ex,"[67, 210, 139, 224]",B-employer_company_name
90,##pen,"[67, 210, 139, 224]",I-employer_company_name
91,##sy,"[67, 210, 139, 224]",I-employer_company_name
92,##a,"[67, 210, 139, 224]",I-employer_company_name
93,-,"[139, 210, 147, 224]",MISC
94,G,"[148, 210, 209, 224]",MISC
95,##est,"[148, 210, 209, 224]",MISC
96,##ion,"[148, 210, 209, 224]",MISC
97,des,"[210, 210, 236, 224]",MISC
98,notes,"[237, 210, 281, 224]",MISC
99,de,"[282, 210, 299, 224]",MISC
100,f,"[300, 210, 344, 224]",MISC
101,##rai,"[300, 210, 344, 224]",MISC
102,##s,"[300, 210, 344, 224]",MISC
103,-,"[344, 210, 346, 224]",MISC
104,NL,"[344, 210, 346, 224]",MISC
105,-,"[344, 210, 346, 224]",MISC
106,February,"[463, 210, 536, 224]",MISC
107,2018,"[536, 210, 572, 224]",MISC
108,-,"[573, 210, 581, 224]",MISC
109,September,"[582, 210, 663, 224]",MISC
110,2018,"[664, 210, 700, 224]",MISC
111,-,"[701, 210, 702, 224]",MISC
112,NL,"[701, 210, 702, 224]",MISC
113,-,"[701, 210, 702, 224]",MISC
114,Creation,"[67, 229, 129, 242]",MISC
115,of,"[129, 229, 144, 242]",MISC
116,the,"[145, 229, 167, 242]",MISC
117,web,"[168, 229, 190, 242]",MISC
118,services,"[191, 229, 252, 242]",MISC
119,using,"[252, 229, 290, 242]",MISC
120,.,"[291, 229, 322, 242]",MISC
121,NE,"[291, 229, 322, 242]",MISC
122,##T,"[291, 229, 322, 242]",MISC
123,environment,"[322, 229, 405, 242]",MISC
124,(,"[407, 229, 437, 242]",MISC
125,S,"[407, 229, 437, 242]",MISC
126,##QL,"[407, 229, 437, 242]",MISC
127,server,"[437, 229, 490, 242]",MISC
128,",","[437, 229, 490, 242]",MISC
129,C,"[491, 229, 513, 242]",MISC
130,#,"[491, 229, 513, 242]",MISC
131,),"[491, 229, 513, 242]",MISC
132,using,"[515, 229, 552, 242]",MISC
133,the,"[553, 229, 575, 242]",MISC
134,external,"[576, 229, 637, 242]",MISC
135,-,"[638, 229, 640, 242]",MISC
136,NL,"[638, 229, 640, 242]",MISC
137,-,"[638, 229, 640, 242]",MISC
138,API,"[67, 242, 98, 254]",MISC
139,##s,"[67, 242, 98, 254]",MISC
140,of,"[99, 242, 115, 254]",MISC
141,American,"[116, 242, 178, 254]",MISC
142,Express,"[180, 242, 236, 254]",MISC
143,and,"[236, 242, 260, 254]",MISC
144,B,"[260, 242, 299, 254]",MISC
145,##NP,"[260, 242, 299, 254]",MISC
146,##P,"[260, 242, 299, 254]",MISC
147,.,"[260, 242, 299, 254]",MISC
148,-,"[300, 242, 302, 254]",MISC
149,NL,"[300, 242, 302, 254]",MISC
150,-,"[300, 242, 302, 254]",MISC
151,Creation,"[67, 254, 127, 266]",MISC
152,of,"[127, 254, 141, 266]",MISC
153,the,"[142, 254, 164, 266]",MISC
154,front,"[164, 254, 231, 266]",MISC
155,-,"[164, 254, 231, 266]",MISC
156,end,"[164, 254, 231, 266]",MISC
157,solution,"[232, 254, 291, 266]",MISC
158,in,"[291, 254, 305, 266]",MISC
159,Ex,"[306, 254, 366, 266]",B-employer_company_name
160,##pen,"[306, 254, 366, 266]",I-employer_company_name
161,##sy,"[306, 254, 366, 266]",I-employer_company_name
162,##a,"[306, 254, 366, 266]",I-employer_company_name
163,website,"[366, 254, 417, 266]",MISC
164,(,"[418, 254, 507, 266]",MISC
165,Type,"[418, 254, 507, 266]",MISC
166,##s,"[418, 254, 507, 266]",MISC
167,##cript,"[418, 254, 507, 266]",MISC
168,",","[418, 254, 507, 266]",MISC
169,Ang,"[508, 254, 574, 266]",MISC
170,##ular,"[508, 254, 574, 266]",MISC
171,##2,"[508, 254, 574, 266]",MISC
172,),"[508, 254, 574, 266]",MISC
173,and,"[575, 254, 597, 266]",MISC
174,in,"[597, 254, 611, 266]",MISC
175,-,"[612, 254, 614, 266]",MISC
176,NL,"[612, 254, 614, 266]",MISC
177,-,"[612, 254, 614, 266]",MISC
178,the,"[67, 266, 89, 278]",MISC
179,hybrid,"[91, 266, 136, 278]",MISC
180,mobile,"[137, 266, 183, 278]",MISC
181,application,"[183, 266, 266, 278]",MISC
182,(,"[268, 266, 336, 278]",MISC
183,X,"[268, 266, 336, 278]",MISC
184,##AM,"[268, 266, 336, 278]",MISC
185,##AR,"[268, 266, 336, 278]",MISC
186,##IN,"[268, 266, 336, 278]",MISC
187,),"[268, 266, 336, 278]",MISC
188,-,"[337, 266, 339, 278]",MISC
189,NL,"[337, 266, 339, 278]",MISC
190,-,"[337, 266, 339, 278]",MISC
191,Co,"[67, 288, 159, 302]",B-employer_role
192,-,"[67, 288, 159, 302]",I-employer_role
193,Founder,"[67, 288, 159, 302]",I-employer_role
194,/,"[159, 288, 168, 302]",I-employer_role
195,Technical,"[168, 288, 250, 302]",I-employer_role
196,manager,"[251, 288, 314, 302]",I-employer_role
197,-,"[315, 288, 317, 302]",MISC
198,NL,"[315, 288, 317, 302]",MISC
199,-,"[315, 288, 317, 302]",MISC
200,V,"[67, 305, 123, 319]",B-employer_company_name
201,##eron,"[67, 305, 123, 319]",I-employer_company_name
202,##ia,"[67, 305, 123, 319]",I-employer_company_name
203,-,"[124, 305, 131, 319]",MISC
204,IT,"[132, 305, 147, 319]",MISC
205,start,"[148, 305, 204, 319]",MISC
206,##up,"[148, 305, 204, 319]",MISC
207,-,"[205, 305, 207, 319]",MISC
208,NL,"[205, 305, 207, 319]",MISC
209,-,"[205, 305, 207, 319]",MISC
210,July,"[517, 305, 553, 319]",MISC
211,2017,"[553, 305, 589, 319]",MISC
212,-,"[589, 305, 598, 319]",MISC
213,January,"[598, 305, 661, 319]",MISC
214,2018,"[661, 305, 697, 319]",MISC
215,-,"[697, 305, 699, 319]",MISC
216,NL,"[697, 305, 699, 319]",MISC
217,-,"[697, 305, 699, 319]",MISC
218,V,"[66, 324, 120, 337]",B-employer_company_name
219,##eron,"[66, 324, 120, 337]",I-employer_company_name
220,##ia,"[66, 324, 120, 337]",I-employer_company_name
221,is,"[121, 324, 137, 337]",MISC
222,a,"[137, 324, 144, 337]",MISC
223,Tunisian,"[145, 324, 208, 337]",MISC
224,start,"[209, 324, 263, 337]",MISC
225,##up,"[209, 324, 263, 337]",MISC
226,founded,"[265, 324, 319, 337]",MISC
227,by,"[321, 324, 336, 337]",MISC
228,He,"[337, 324, 367, 337]",MISC
229,##ni,"[337, 324, 367, 337]",MISC
230,G,"[369, 324, 431, 337]",MISC
231,##HA,"[369, 324, 431, 337]",MISC
232,##RI,"[369, 324, 431, 337]",MISC
233,##AN,"[369, 324, 431, 337]",MISC
234,##I,"[369, 324, 431, 337]",MISC
235,(,"[432, 324, 527, 337]",MISC
236,prospect,"[432, 324, 527, 337]",MISC
237,##ing,"[432, 324, 527, 337]",MISC
238,manager,"[528, 324, 591, 337]",MISC
239,),"[528, 324, 591, 337]",MISC
240,and,"[592, 324, 615, 337]",MISC
241,myself,"[616, 324, 663, 337]",MISC
242,-,"[663, 324, 665, 337]",MISC
243,NL,"[663, 324, 665, 337]",MISC
244,-,"[663, 324, 665, 337]",MISC
245,(,"[66, 337, 144, 348]",MISC
246,technical,"[66, 337, 144, 348]",MISC
247,manager,"[144, 337, 207, 348]",MISC
248,),"[144, 337, 207, 348]",MISC
249,in,"[207, 337, 223, 348]",MISC
250,order,"[223, 337, 262, 348]",MISC
251,to,"[263, 337, 278, 348]",MISC
252,create,"[278, 337, 324, 348]",MISC
253,M,"[325, 337, 380, 348]",MISC
254,##O,"[325, 337, 380, 348]",MISC
255,##BI,"[325, 337, 380, 348]",MISC
256,##LE,"[325, 337, 380, 348]",MISC
257,",","[325, 337, 380, 348]",MISC
258,W,"[381, 337, 403, 348]",MISC
259,##E,"[381, 337, 403, 348]",MISC
260,##B,"[381, 337, 403, 348]",MISC
261,and,"[404, 337, 426, 348]",MISC
262,ER,"[428, 337, 450, 348]",MISC
263,##P,"[428, 337, 450, 348]",MISC
264,applications,"[451, 337, 545, 348]",MISC
265,for,"[546, 337, 568, 348]",MISC
266,clients,"[569, 337, 624, 348]",MISC
267,around,"[625, 337, 670, 348]",MISC
268,-,"[672, 337, 674, 348]",MISC
269,NL,"[672, 337, 674, 348]",MISC
270,-,"[672, 337, 674, 348]",MISC
271,the,"[66, 348, 86, 361]",MISC
272,globe,"[88, 348, 130, 361]",MISC
273,.,"[88, 348, 130, 361]",MISC
274,V,"[131, 348, 167, 361]",MISC
275,##isi,"[131, 348, 167, 361]",MISC
276,##t,"[131, 348, 167, 361]",MISC
277,http,"[167, 348, 318, 361]",MISC
278,:,"[167, 348, 318, 361]",MISC
279,/,"[167, 348, 318, 361]",MISC
280,/,"[167, 348, 318, 361]",MISC
281,www,"[167, 348, 318, 361]",MISC
282,.,"[167, 348, 318, 361]",MISC
283,ve,"[167, 348, 318, 361]",MISC
284,##ron,"[167, 348, 318, 361]",MISC
285,##ia,"[167, 348, 318, 361]",MISC
286,.,"[167, 348, 318, 361]",MISC
287,t,"[167, 348, 318, 361]",MISC
288,##n,"[167, 348, 318, 361]",MISC
289,for,"[320, 348, 340, 361]",MISC
290,more,"[342, 348, 371, 361]",MISC
291,information,"[371, 348, 457, 361]",MISC
292,.,"[371, 348, 457, 361]",MISC
293,-,"[458, 348, 460, 361]",MISC
294,NL,"[458, 348, 460, 361]",MISC
295,-,"[458, 348, 460, 361]",MISC
296,2,"[66, 361, 73, 373]",MISC
297,products,"[74, 361, 135, 373]",MISC
298,were,"[136, 361, 166, 373]",MISC
299,created,"[167, 361, 221, 373]",MISC
300,within,"[222, 361, 267, 373]",MISC
301,V,"[268, 361, 329, 373]",B-employer_company_name
302,##eron,"[268, 361, 329, 373]",I-employer_company_name
303,##ia,"[268, 361, 329, 373]",I-employer_company_name
304,:,"[268, 361, 329, 373]",MISC
305,-,"[331, 361, 332, 373]",MISC
306,NL,"[331, 361, 332, 373]",MISC
307,-,"[331, 361, 332, 373]",MISC
308,-,"[127, 372, 134, 385]",MISC
309,One,"[134, 372, 323, 385]",MISC
310,##M,"[134, 372, 323, 385]",MISC
311,##ill,"[134, 372, 323, 385]",MISC
312,##ion,"[134, 372, 323, 385]",MISC
313,##T,"[134, 372, 323, 385]",MISC
314,##ree,"[134, 372, 323, 385]",MISC
315,##s,"[134, 372, 323, 385]",MISC
316,##F,"[134, 372, 323, 385]",MISC
317,##or,"[134, 372, 323, 385]",MISC
318,##T,"[134, 372, 323, 385]",MISC
319,##uni,"[134, 372, 323, 385]",MISC
320,##sia,"[134, 372, 323, 385]",MISC
321,(,"[324, 372, 383, 385]",MISC
322,AC,"[324, 372, 383, 385]",MISC
323,##AC,"[324, 372, 383, 385]",MISC
324,##IA,"[324, 372, 383, 385]",MISC
325,##S,"[324, 372, 383, 385]",MISC
326,F,"[385, 372, 407, 385]",MISC
327,##OR,"[385, 372, 407, 385]",MISC
328,AL,"[407, 372, 445, 385]",MISC
329,##L,"[407, 372, 445, 385]",MISC
330,),"[407, 372, 445, 385]",MISC
331,:,"[407, 372, 445, 385]",MISC
332,Hybrid,"[445, 372, 489, 385]",MISC
333,mobile,"[491, 372, 535, 385]",MISC
334,app,"[536, 372, 558, 385]",MISC
335,(,"[559, 372, 664, 385]",MISC
336,ion,"[559, 372, 664, 385]",MISC
337,##ic,"[559, 372, 664, 385]",MISC
338,+,"[559, 372, 664, 385]",MISC
339,node,"[559, 372, 664, 385]",MISC
340,##J,"[559, 372, 664, 385]",MISC
341,##S,"[559, 372, 664, 385]",MISC
342,),"[559, 372, 664, 385]",MISC
343,-,"[665, 372, 667, 385]",MISC
344,NL,"[665, 372, 667, 385]",MISC
345,-,"[665, 372, 667, 385]",MISC
346,-,"[127, 385, 134, 397]",MISC
347,A,"[135, 385, 159, 397]",MISC
348,##X,"[135, 385, 159, 397]",MISC
349,##A,"[135, 385, 159, 397]",MISC
350,TO,"[159, 385, 198, 397]",MISC
351,##UR,"[159, 385, 198, 397]",MISC
352,##S,"[159, 385, 198, 397]",MISC
353,:,"[199, 385, 206, 397]",MISC
354,website,"[207, 385, 263, 397]",MISC
355,of,"[263, 385, 279, 397]",MISC
356,the,"[279, 385, 303, 397]",MISC
357,travel,"[304, 385, 351, 397]",MISC
358,agency,"[352, 385, 399, 397]",MISC
359,(,"[400, 385, 544, 397]",MISC
360,angular,"[400, 385, 544, 397]",MISC
361,##J,"[400, 385, 544, 397]",MISC
362,##S,"[400, 385, 544, 397]",MISC
363,+,"[400, 385, 544, 397]",MISC
364,node,"[400, 385, 544, 397]",MISC
365,##J,"[400, 385, 544, 397]",MISC
366,##S,"[400, 385, 544, 397]",MISC
367,),"[400, 385, 544, 397]",MISC
368,-,"[544, 385, 546, 397]",MISC
369,NL,"[544, 385, 546, 397]",MISC
370,-,"[544, 385, 546, 397]",MISC
371,Software,"[67, 409, 135, 423]",B-employer_role
372,engineering,"[136, 409, 230, 423]",I-employer_role
373,part,"[231, 409, 307, 423]",I-employer_role
374,-,"[231, 409, 307, 423]",I-employer_role
375,time,"[231, 409, 307, 423]",I-employer_role
376,job,"[308, 409, 334, 423]",I-employer_role
377,-,"[334, 409, 342, 423]",I-employer_role
378,Mobile,"[343, 409, 393, 423]",I-employer_role
379,developer,"[394, 409, 471, 423]",I-employer_role
380,-,"[471, 409, 473, 423]",MISC
381,NL,"[471, 409, 473, 423]",MISC
382,-,"[471, 409, 473, 423]",MISC
383,Tu,"[69, 425, 146, 439]",B-employer_company_name
384,##non,"[69, 425, 146, 439]",I-employer_company_name
385,##line,"[69, 425, 146, 439]",I-employer_company_name
386,-,"[146, 425, 155, 439]",MISC
387,French,"[155, 425, 282, 439]",MISC
388,/,"[155, 425, 282, 439]",MISC
389,Tunisian,"[155, 425, 282, 439]",MISC
390,company,"[284, 425, 343, 439]",MISC
391,-,"[344, 425, 346, 439]",MISC
392,NL,"[344, 425, 346, 439]",MISC
393,-,"[344, 425, 346, 439]",MISC
394,July,"[517, 425, 555, 439]",MISC
395,2016,"[555, 425, 592, 439]",MISC
396,-,"[592, 425, 601, 439]",MISC
397,October,"[601, 425, 666, 439]",MISC
398,2017,"[667, 425, 704, 439]",MISC
399,-,"[704, 425, 706, 439]",MISC
400,NL,"[704, 425, 706, 439]",MISC
401,-,"[704, 425, 706, 439]",MISC
402,Re,"[67, 444, 152, 457]",MISC
403,##sponsible,"[67, 444, 152, 457]",MISC
404,of,"[153, 444, 169, 457]",MISC
405,the,"[169, 444, 191, 457]",MISC
406,development,"[193, 444, 277, 457]",MISC
407,and,"[279, 444, 301, 457]",MISC
408,the,"[302, 444, 324, 457]",MISC
409,publishing,"[325, 444, 404, 457]",MISC
410,of,"[404, 444, 419, 457]",MISC
411,the,"[419, 444, 441, 457]",MISC
412,hybrid,"[443, 444, 489, 457]",MISC
413,mobile,"[490, 444, 536, 457]",MISC
414,application,"[537, 444, 621, 457]",MISC
415,-,"[623, 444, 624, 457]",MISC
416,NL,"[623, 444, 624, 457]",MISC
417,-,"[623, 444, 624, 457]",MISC
418,M,"[67, 457, 144, 468]",MISC
419,##U,"[67, 457, 144, 468]",MISC
420,##LT,"[67, 457, 144, 468]",MISC
421,##IR,"[67, 457, 144, 468]",MISC
422,##ES,"[67, 457, 144, 468]",MISC
423,##TO,"[67, 457, 144, 468]",MISC
424,in,"[144, 457, 159, 468]",MISC
425,both,"[160, 457, 190, 468]",MISC
426,and,"[190, 457, 243, 468]",MISC
427,##roid,"[190, 457, 243, 468]",MISC
428,and,"[244, 457, 266, 468]",MISC
429,iOS,"[267, 457, 289, 468]",MISC
430,platforms,"[290, 457, 366, 468]",MISC
431,.,"[290, 457, 366, 468]",MISC
432,(,"[367, 457, 450, 468]",MISC
433,ion,"[367, 457, 450, 468]",MISC
434,##ic,"[367, 457, 450, 468]",MISC
435,+,"[367, 457, 450, 468]",MISC
436,P,"[367, 457, 450, 468]",MISC
437,##HP,"[367, 457, 450, 468]",MISC
438,),"[367, 457, 450, 468]",MISC
439,-,"[451, 457, 453, 468]",MISC
440,NL,"[451, 457, 453, 468]",MISC
441,-,"[451, 457, 453, 468]",MISC
442,Summer,"[67, 485, 118, 499]",B-employer_role
443,Inter,"[120, 485, 207, 499]",I-employer_role
444,##ns,"[120, 485, 207, 499]",I-employer_role
445,##hip,"[120, 485, 207, 499]",I-employer_role
446,-,"[208, 485, 216, 499]",I-employer_role
447,ER,"[216, 485, 242, 499]",I-employer_role
448,##P,"[216, 485, 242, 499]",I-employer_role
449,software,"[243, 485, 312, 499]",I-employer_role
450,developer,"[313, 485, 391, 499]",I-employer_role
451,-,"[392, 485, 393, 499]",MISC
452,NL,"[392, 485, 393, 499]",MISC
453,-,"[392, 485, 393, 499]",MISC
454,Logic,"[69, 501, 135, 515]",MISC
455,##om,"[69, 501, 135, 515]",MISC
456,-,"[69, 501, 135, 515]",MISC
457,ER,"[136, 501, 159, 515]",MISC
458,##P,"[136, 501, 159, 515]",MISC
459,solutions,"[161, 501, 235, 515]",MISC
460,-,"[235, 501, 237, 515]",MISC
461,NL,"[235, 501, 237, 515]",MISC
462,-,"[235, 501, 237, 515]",MISC
463,July,"[517, 501, 555, 515]",MISC
464,2016,"[555, 501, 592, 515]",MISC
465,-,"[592, 501, 601, 515]",MISC
466,October,"[601, 501, 666, 515]",MISC
467,2017,"[667, 501, 704, 515]",MISC
468,-,"[704, 501, 706, 515]",MISC
469,NL,"[704, 501, 706, 515]",MISC
470,-,"[704, 501, 706, 515]",MISC
471,Creation,"[67, 520, 132, 533]",MISC
472,of,"[133, 520, 148, 533]",MISC
473,an,"[149, 520, 164, 533]",MISC
474,ER,"[166, 520, 189, 533]",MISC
475,##P,"[166, 520, 189, 533]",MISC
476,Software,"[190, 520, 255, 533]",MISC
477,in,"[256, 520, 271, 533]",MISC
478,order,"[272, 520, 313, 533]",MISC
479,to,"[313, 520, 328, 533]",MISC
480,manage,"[329, 520, 377, 533]",MISC
481,employees,"[378, 520, 460, 533]",MISC
482,’,"[378, 520, 460, 533]",MISC
483,payments,"[460, 520, 525, 533]",MISC
484,using,"[526, 520, 566, 533]",MISC
485,.,"[566, 520, 599, 533]",MISC
486,NE,"[566, 520, 599, 533]",MISC
487,##T,"[566, 520, 599, 533]",MISC
488,environment,"[599, 520, 696, 533]",MISC
489,.,"[599, 520, 696, 533]",MISC
490,-,"[697, 520, 699, 533]",MISC
491,NL,"[697, 520, 699, 533]",MISC
492,-,"[697, 520, 699, 533]",MISC
493,(,"[67, 533, 186, 544]",MISC
494,W,"[67, 533, 186, 544]",MISC
495,##P,"[67, 533, 186, 544]",MISC
496,##F,"[67, 533, 186, 544]",MISC
497,+,"[67, 533, 186, 544]",MISC
498,C,"[67, 533, 186, 544]",MISC
499,#,"[67, 533, 186, 544]",MISC
500,+,"[67, 533, 186, 544]",MISC
501,XML,"[67, 533, 186, 544]",MISC
502,+,"[67, 533, 186, 544]",MISC
503,S,"[67, 533, 186, 544]",MISC
504,##QL,"[67, 533, 186, 544]",MISC
505,Server,"[188, 533, 244, 544]",MISC
506,),"[188, 533, 244, 544]",MISC
507,-,"[244, 533, 246, 544]",MISC
508,NL,"[244, 533, 246, 544]",MISC
509,-,"[244, 533, 246, 544]",MISC
510,AC,"[96, 581, 232, 604]",MISC
511,##AD,"[96, 581, 232, 604]",MISC
512,##AM,"[96, 581, 232, 604]",MISC
513,##IC,"[96, 581, 232, 604]",MISC
514,PR,"[232, 581, 368, 604]",MISC
515,##O,"[232, 581, 368, 604]",MISC
516,##J,"[232, 581, 368, 604]",MISC
517,##EC,"[232, 581, 368, 604]",MISC
518,##TS,"[232, 581, 368, 604]",MISC
519,-,"[368, 581, 370, 604]",MISC
520,NL,"[368, 581, 370, 604]",MISC
521,-,"[368, 581, 370, 604]",MISC
522,Web,"[69, 634, 95, 648]",B-project_title
523,search,"[95, 634, 146, 648]",I-project_title
524,engine,"[146, 634, 197, 648]",I-project_title
525,project,"[198, 634, 257, 648]",I-project_title
526,(,"[258, 634, 326, 648]",I-project_title
527,El,"[258, 634, 326, 648]",I-project_title
528,##astic,"[258, 634, 326, 648]",I-project_title
529,search,"[327, 634, 386, 648]",I-project_title
530,),"[327, 634, 386, 648]",I-project_title
531,-,"[387, 634, 388, 648]",MISC
532,NL,"[387, 634, 388, 648]",MISC
533,-,"[387, 634, 388, 648]",MISC
534,Su,"[69, 648, 137, 665]",B-project_company_name
535,##p,"[69, 648, 137, 665]",I-project_company_name
536,’,"[69, 648, 137, 665]",I-project_company_name
537,Co,"[69, 648, 137, 665]",I-project_company_name
538,##m,"[69, 648, 137, 665]",I-project_company_name
539,-,"[137, 648, 139, 665]",MISC
540,NL,"[137, 648, 139, 665]",MISC
541,-,"[137, 648, 139, 665]",MISC
542,September,"[451, 648, 538, 665]",MISC
543,2017,"[539, 648, 576, 665]",MISC
544,-,"[578, 648, 586, 665]",MISC
545,December,"[587, 648, 664, 665]",MISC
546,2017,"[665, 648, 703, 665]",MISC
547,-,"[704, 648, 706, 665]",MISC
548,NL,"[704, 648, 706, 665]",MISC
549,-,"[704, 648, 706, 665]",MISC
550,Search,"[69, 670, 144, 683]",MISC
551,##ing,"[69, 670, 144, 683]",MISC
552,and,"[145, 670, 169, 683]",MISC
553,index,"[170, 670, 237, 683]",MISC
554,##ing,"[170, 670, 237, 683]",MISC
555,images,"[238, 670, 287, 683]",MISC
556,by,"[289, 670, 304, 683]",MISC
557,content,"[305, 670, 363, 683]",MISC
558,from,"[365, 670, 397, 683]",MISC
559,a,"[398, 670, 405, 683]",MISC
560,massive,"[407, 670, 464, 683]",MISC
561,Mon,"[466, 670, 524, 683]",MISC
562,##go,"[466, 670, 524, 683]",MISC
563,##D,"[466, 670, 524, 683]",MISC
564,##B,"[466, 670, 524, 683]",MISC
565,database,"[525, 670, 591, 683]",MISC
566,from,"[592, 670, 625, 683]",MISC
567,a,"[626, 670, 633, 683]",MISC
568,text,"[635, 670, 667, 683]",MISC
569,-,"[668, 670, 670, 683]",MISC
570,NL,"[668, 670, 670, 683]",MISC
571,-,"[668, 670, 670, 683]",MISC
572,or,"[69, 683, 84, 695]",MISC
573,an,"[85, 683, 100, 695]",MISC
574,image,"[100, 683, 138, 695]",MISC
575,as,"[139, 683, 155, 695]",MISC
576,an,"[155, 683, 170, 695]",MISC
577,input,"[171, 683, 208, 695]",MISC
578,using,"[210, 683, 247, 695]",MISC
579,El,"[249, 683, 303, 695]",MISC
580,##astic,"[249, 683, 303, 695]",MISC
581,search,"[303, 683, 358, 695]",MISC
582,.,"[303, 683, 358, 695]",MISC
583,(,"[358, 683, 419, 695]",MISC
584,El,"[358, 683, 419, 695]",MISC
585,##astic,"[358, 683, 419, 695]",MISC
586,search,"[420, 683, 592, 695]",MISC
587,+,"[420, 683, 592, 695]",MISC
588,node,"[420, 683, 592, 695]",MISC
589,##J,"[420, 683, 592, 695]",MISC
590,##S,"[420, 683, 592, 695]",MISC
591,+,"[420, 683, 592, 695]",MISC
592,Mon,"[420, 683, 592, 695]",MISC
593,##go,"[420, 683, 592, 695]",MISC
594,##D,"[420, 683, 592, 695]",MISC
595,##B,"[420, 683, 592, 695]",MISC
596,),"[420, 683, 592, 695]",MISC
597,-,"[592, 683, 594, 695]",MISC
598,NL,"[592, 683, 594, 695]",MISC
599,-,"[592, 683, 594, 695]",MISC
600,Native,"[69, 712, 120, 726]",B-project_title
601,mobile,"[121, 712, 172, 726]",I-project_title
602,application,"[174, 712, 269, 726]",I-project_title
603,development,"[269, 712, 373, 726]",I-project_title
604,-,"[269, 712, 373, 726]",I-project_title
605,I,"[374, 712, 399, 726]",I-project_title
606,##OT,"[374, 712, 399, 726]",I-project_title
607,Sol,"[400, 712, 478, 726]",I-project_title
608,##ution,"[400, 712, 478, 726]",I-project_title
609,:,"[400, 712, 478, 726]",I-project_title
610,easy,"[478, 712, 556, 726]",I-project_title
611,##Q,"[478, 712, 556, 726]",I-project_title
612,##ue,"[478, 712, 556, 726]",I-project_title
613,##ue,"[478, 712, 556, 726]",I-project_title
614,-,"[556, 712, 558, 726]",MISC
615,NL,"[556, 712, 558, 726]",MISC
616,-,"[556, 712, 558, 726]",MISC
617,Su,"[71, 728, 137, 742]",B-project_company_name
618,##p,"[71, 728, 137, 742]",I-project_company_name
619,’,"[71, 728, 137, 742]",I-project_company_name
620,Co,"[71, 728, 137, 742]",I-project_company_name
621,##m,"[71, 728, 137, 742]",I-project_company_name
622,-,"[137, 728, 139, 742]",MISC
623,NL,"[137, 728, 139, 742]",MISC
624,-,"[137, 728, 139, 742]",MISC
625,September,"[453, 728, 539, 742]",MISC
626,2016,"[540, 728, 577, 742]",MISC
627,-,"[578, 728, 587, 742]",MISC
628,December,"[588, 728, 665, 742]",MISC
629,2016,"[665, 728, 703, 742]",MISC
630,-,"[704, 728, 706, 742]",MISC
631,NL,"[704, 728, 706, 742]",MISC
632,-,"[704, 728, 706, 742]",MISC
633,Creation,"[69, 747, 132, 760]",MISC
634,of,"[133, 747, 148, 760]",MISC
635,an,"[149, 747, 164, 760]",MISC
636,and,"[165, 747, 219, 760]",MISC
637,##roid,"[165, 747, 219, 760]",MISC
638,app,"[221, 747, 245, 760]",MISC
639,that,"[245, 747, 275, 760]",MISC
640,manages,"[277, 747, 331, 760]",MISC
641,waiting,"[333, 747, 387, 760]",MISC
642,que,"[388, 747, 436, 760]",MISC
643,##ues,"[388, 747, 436, 760]",MISC
644,in,"[436, 747, 452, 760]",MISC
645,the,"[452, 747, 476, 760]",MISC
646,service,"[476, 747, 531, 760]",MISC
647,offices,"[532, 747, 586, 760]",MISC
648,using,"[588, 747, 627, 760]",MISC
649,and,"[628, 747, 682, 760]",MISC
650,##roid,"[628, 747, 682, 760]",MISC
651,-,"[684, 747, 685, 760]",MISC
652,NL,"[684, 747, 685, 760]",MISC
653,-,"[684, 747, 685, 760]",MISC
654,studio,"[69, 760, 115, 773]",MISC
655,(,"[116, 760, 194, 773]",MISC
656,J,"[116, 760, 194, 773]",MISC
657,##AV,"[116, 760, 194, 773]",MISC
658,##A,"[116, 760, 194, 773]",MISC
659,+,"[116, 760, 194, 773]",MISC
660,XML,"[116, 760, 194, 773]",MISC
661,),"[116, 760, 194, 773]",MISC
662,-,"[195, 760, 196, 773]",MISC
663,NL,"[195, 760, 196, 773]",MISC
664,-,"[195, 760, 196, 773]",MISC
665,SK,"[96, 806, 169, 830]",B-skills_heading
666,##IL,"[96, 806, 169, 830]",I-skills_heading
667,##LS,"[96, 806, 169, 830]",I-skills_heading
668,-,"[169, 806, 171, 830]",MISC
669,NL,"[169, 806, 171, 830]",MISC
670,-,"[169, 806, 171, 830]",MISC
671,Java,"[66, 858, 135, 869]",MISC
672,##Script,"[66, 858, 135, 869]",MISC
673,-,"[135, 858, 137, 869]",MISC
674,NL,"[135, 858, 137, 869]",MISC
675,-,"[135, 858, 137, 869]",MISC
676,H,"[392, 858, 427, 869]",MISC
677,##TM,"[392, 858, 427, 869]",MISC
678,##L,"[392, 858, 427, 869]",MISC
679,5,"[428, 858, 437, 869]",MISC
680,-,"[438, 858, 439, 869]",MISC
681,NL,"[438, 858, 439, 869]",MISC
682,-,"[438, 858, 439, 869]",MISC
683,Type,"[66, 869, 132, 882]",MISC
684,##s,"[66, 869, 132, 882]",MISC
685,##cript,"[66, 869, 132, 882]",MISC
686,-,"[132, 869, 134, 882]",MISC
687,NL,"[132, 869, 134, 882]",MISC
688,-,"[132, 869, 134, 882]",MISC
689,*,"[74, 882, 81, 894]",MISC
690,Ang,"[82, 882, 148, 894]",MISC
691,##ular,"[82, 882, 148, 894]",MISC
692,##J,"[82, 882, 148, 894]",MISC
693,##S,"[82, 882, 148, 894]",MISC
694,-,"[149, 882, 151, 894]",MISC
695,NL,"[149, 882, 151, 894]",MISC
696,-,"[149, 882, 151, 894]",MISC
697,CS,"[392, 882, 419, 894]",MISC
698,##S,"[392, 882, 419, 894]",MISC
699,3,"[420, 882, 428, 894]",MISC
700,-,"[429, 882, 431, 894]",MISC
701,NL,"[429, 882, 431, 894]",MISC
702,-,"[429, 882, 431, 894]",MISC
703,*,"[74, 893, 83, 906]",MISC
704,No,"[83, 893, 134, 906]",MISC
705,##de,"[83, 893, 134, 906]",MISC
706,##J,"[83, 893, 134, 906]",MISC
707,##S,"[83, 893, 134, 906]",MISC
708,-,"[134, 893, 135, 906]",MISC
709,NL,"[134, 893, 135, 906]",MISC
710,-,"[134, 893, 135, 906]",MISC
711,*,"[74, 906, 81, 918]",MISC
712,Express,"[81, 906, 142, 918]",MISC
713,##J,"[81, 906, 142, 918]",MISC
714,##S,"[81, 906, 142, 918]",MISC
715,-,"[144, 906, 146, 918]",MISC
716,NL,"[144, 906, 146, 918]",MISC
717,-,"[144, 906, 146, 918]",MISC
718,C,"[392, 906, 426, 918]",MISC
719,+,"[392, 906, 426, 918]",MISC
720,+,"[392, 906, 426, 918]",MISC
721,",","[392, 906, 426, 918]",MISC
722,C,"[427, 906, 452, 918]",MISC
723,#,"[427, 906, 452, 918]",MISC
724,",","[427, 906, 452, 918]",MISC
725,-,"[453, 906, 455, 918]",MISC
726,NL,"[453, 906, 455, 918]",MISC
727,-,"[453, 906, 455, 918]",MISC
728,Java,"[392, 915, 426, 930]",MISC
729,-,"[426, 915, 427, 930]",MISC
730,NL,"[426, 915, 427, 930]",MISC
731,-,"[426, 915, 427, 930]",MISC
732,Mon,"[66, 930, 132, 942]",MISC
733,##go,"[66, 930, 132, 942]",MISC
734,##D,"[66, 930, 132, 942]",MISC
735,##B,"[66, 930, 132, 942]",MISC
736,-,"[132, 930, 134, 942]",MISC
737,NL,"[132, 930, 134, 942]",MISC
738,-,"[132, 930, 134, 942]",MISC
739,Python,"[392, 942, 438, 955]",MISC
740,-,"[438, 942, 439, 955]",MISC
741,NL,"[438, 942, 439, 955]",MISC
742,-,"[438, 942, 439, 955]",MISC
743,ion,"[66, 954, 100, 967]",MISC
744,##ic,"[66, 954, 100, 967]",MISC
745,1,"[100, 954, 120, 967]",MISC
746,",","[100, 954, 120, 967]",MISC
747,2,"[100, 954, 120, 967]",MISC
748,-,"[120, 954, 122, 967]",MISC
749,NL,"[120, 954, 122, 967]",MISC
750,-,"[120, 954, 122, 967]",MISC
751,Adobe,"[392, 967, 439, 979]",MISC
752,-,"[439, 967, 441, 979]",MISC
753,NL,"[439, 967, 441, 979]",MISC
754,-,"[439, 967, 441, 979]",MISC
755,Co,"[66, 979, 125, 991]",MISC
756,##rdo,"[66, 979, 125, 991]",MISC
757,##va,"[66, 979, 125, 991]",MISC
758,-,"[125, 979, 127, 991]",MISC
759,NL,"[125, 979, 127, 991]",MISC
760,-,"[125, 979, 127, 991]",MISC
761,Il,"[392, 979, 449, 991]",MISC
762,##lus,"[392, 979, 449, 991]",MISC
763,##tra,"[392, 979, 449, 991]",MISC
764,##tor,"[392, 979, 449, 991]",MISC
765,-,"[449, 979, 451, 991]",MISC
766,NL,"[449, 979, 451, 991]",MISC
767,-,"[449, 979, 451, 991]",MISC
768,A,"[762, 111, 870, 139]",B-name
769,##ch,"[762, 111, 870, 139]",I-name
770,##ra,"[762, 111, 870, 139]",I-name
771,##f,"[762, 111, 870, 139]",I-name
772,Ha,"[872, 111, 964, 139]",I-name
773,##kim,"[872, 111, 964, 139]",I-name
774,-,"[964, 111, 966, 139]",MISC
775,NL,"[964, 111, 966, 139]",MISC
776,-,"[964, 111, 966, 139]",MISC
777,Full,"[764, 145, 808, 164]",MISC
778,St,"[808, 145, 862, 164]",MISC
779,##ack,"[808, 145, 862, 164]",MISC
780,Dev,"[864, 145, 964, 164]",MISC
781,##elo,"[864, 145, 964, 164]",MISC
782,##per,"[864, 145, 964, 164]",MISC
783,-,"[964, 145, 966, 164]",MISC
784,NL,"[964, 145, 966, 164]",MISC
785,-,"[964, 145, 966, 164]",MISC
786,CO,"[741, 221, 837, 239]",B-personal_details_heading
787,##NT,"[741, 221, 837, 239]",I-personal_details_heading
788,##AC,"[741, 221, 837, 239]",I-personal_details_heading
789,##T,"[741, 221, 837, 239]",I-personal_details_heading
790,-,"[837, 221, 838, 239]",MISC
791,NL,"[837, 221, 838, 239]",MISC
792,-,"[837, 221, 838, 239]",MISC
793,a,"[774, 256, 962, 269]",B-emails_email
794,##ch,"[774, 256, 962, 269]",I-emails_email
795,##ra,"[774, 256, 962, 269]",I-emails_email
796,##f,"[774, 256, 962, 269]",I-emails_email
797,.,"[774, 256, 962, 269]",I-emails_email
798,ha,"[774, 256, 962, 269]",I-emails_email
799,##kim,"[774, 256, 962, 269]",I-emails_email
800,@,"[774, 256, 962, 269]",I-emails_email
801,su,"[774, 256, 962, 269]",I-emails_email
802,##p,"[774, 256, 962, 269]",I-emails_email
803,##com,"[774, 256, 962, 269]",I-emails_email
804,.,"[774, 256, 962, 269]",I-emails_email
805,t,"[774, 256, 962, 269]",I-emails_email
806,##n,"[774, 256, 962, 269]",I-emails_email
807,-,"[962, 256, 964, 269]",MISC
808,NL,"[962, 256, 964, 269]",MISC
809,-,"[962, 256, 964, 269]",MISC
810,07,"[772, 281, 792, 295]",B-phones_phone
811,51,"[793, 281, 813, 295]",I-phones_phone
812,11,"[813, 281, 834, 295]",I-phones_phone
813,47,"[834, 281, 855, 295]",I-phones_phone
814,73,"[855, 281, 875, 295]",I-phones_phone
815,-,"[876, 281, 877, 295]",MISC
816,NL,"[876, 281, 877, 295]",MISC
817,-,"[876, 281, 877, 295]",MISC
818,E,"[741, 339, 857, 358]",B-education_heading
819,##D,"[741, 339, 857, 358]",I-education_heading
820,##UC,"[741, 339, 857, 358]",I-education_heading
821,##AT,"[741, 339, 857, 358]",I-education_heading
822,##ION,"[741, 339, 857, 358]",I-education_heading
823,-,"[857, 339, 859, 358]",MISC
824,NL,"[857, 339, 859, 358]",MISC
825,-,"[857, 339, 859, 358]",MISC
826,I,"[745, 372, 770, 385]",B-education_degree
827,##CT,"[745, 372, 770, 385]",I-education_degree
828,engineering,"[771, 372, 866, 385]",I-education_degree
829,degree,"[867, 372, 918, 385]",I-education_degree
830,-,"[920, 372, 921, 385]",MISC
831,NL,"[920, 372, 921, 385]",MISC
832,-,"[920, 372, 921, 385]",MISC
833,Higher,"[743, 391, 796, 405]",B-education_institute
834,school,"[797, 391, 849, 405]",I-education_institute
835,of,"[850, 391, 867, 405]",I-education_institute
836,communication,"[868, 391, 984, 405]",I-education_institute
837,-,"[984, 391, 986, 405]",I-education_institute
838,NL,"[984, 391, 986, 405]",I-education_institute
839,-,"[984, 391, 986, 405]",I-education_institute
840,of,"[743, 405, 760, 419]",I-education_institute
841,Tu,"[761, 405, 803, 419]",I-education_institute
842,##nis,"[761, 405, 803, 419]",I-education_institute
843,-,"[804, 405, 882, 419]",I-education_institute
844,S,"[804, 405, 882, 419]",I-education_institute
845,##UP,"[804, 405, 882, 419]",I-education_institute
846,’,"[804, 405, 882, 419]",I-education_institute
847,CO,"[804, 405, 882, 419]",I-education_institute
848,##M,"[804, 405, 882, 419]",I-education_institute
849,-,"[804, 405, 882, 419]",MISC
850,-,"[882, 405, 884, 419]",MISC
851,NL,"[882, 405, 884, 419]",MISC
852,-,"[882, 405, 884, 419]",MISC
853,2014,"[745, 425, 820, 439]",MISC
854,-,"[745, 425, 820, 439]",MISC
855,2018,"[745, 425, 820, 439]",MISC
856,-,"[820, 425, 821, 439]",MISC
857,NL,"[820, 425, 821, 439]",MISC
858,-,"[820, 425, 821, 439]",MISC
859,First,"[745, 457, 784, 470]",B-education_degree
860,cycle,"[785, 457, 824, 470]",I-education_degree
861,of,"[825, 457, 840, 470]",I-education_degree
862,engineering,"[841, 457, 927, 470]",I-education_degree
863,studies,"[928, 457, 983, 470]",I-education_degree
864,-,"[984, 457, 986, 470]",MISC
865,NL,"[984, 457, 986, 470]",MISC
866,-,"[984, 457, 986, 470]",MISC
867,S,"[743, 476, 775, 490]",B-education_institute
868,##fa,"[743, 476, 775, 490]",I-education_institute
869,##x,"[743, 476, 775, 490]",I-education_institute
870,Preparatory,"[776, 476, 864, 490]",I-education_institute
871,Engineering,"[866, 476, 954, 490]",I-education_institute
872,-,"[955, 476, 957, 490]",I-education_institute
873,NL,"[955, 476, 957, 490]",I-education_institute
874,-,"[955, 476, 957, 490]",I-education_institute
875,Institute,"[743, 490, 801, 504]",I-education_institute
876,-,"[802, 490, 848, 504]",I-education_institute
877,IP,"[802, 490, 848, 504]",I-education_institute
878,##EI,"[802, 490, 848, 504]",I-education_institute
879,##S,"[802, 490, 848, 504]",I-education_institute
880,-,"[802, 490, 848, 504]",MISC
881,-,"[848, 490, 850, 504]",MISC
882,NL,"[848, 490, 850, 504]",MISC
883,-,"[848, 490, 850, 504]",MISC
884,2012,"[745, 510, 820, 524]",MISC
885,-,"[745, 510, 820, 524]",MISC
886,2014,"[745, 510, 820, 524]",MISC
887,-,"[820, 510, 821, 524]",MISC
888,NL,"[820, 510, 821, 524]",MISC
889,-,"[820, 510, 821, 524]",MISC
890,First,"[748, 541, 787, 555]",B-education_degree
891,cycle,"[788, 541, 827, 555]",I-education_degree
892,of,"[828, 541, 843, 555]",I-education_degree
893,engineering,"[844, 541, 931, 555]",I-education_degree
894,studies,"[932, 541, 986, 555]",I-education_degree
895,-,"[988, 541, 989, 555]",MISC
896,NL,"[988, 541, 989, 555]",MISC
897,-,"[988, 541, 989, 555]",MISC
898,La,"[747, 561, 765, 575]",B-education_institute
899,Mars,"[765, 561, 811, 575]",I-education_institute
900,##a,"[765, 561, 811, 575]",I-education_institute
901,Science,"[812, 561, 877, 575]",I-education_institute
902,and,"[878, 561, 905, 575]",I-education_institute
903,technology,"[906, 561, 999, 575]",I-education_institute
904,-,"[1000, 561, 1001, 575]",I-education_institute
905,NL,"[1000, 561, 1001, 575]",I-education_institute
906,-,"[1000, 561, 1001, 575]",I-education_institute
907,Preparatory,"[747, 575, 828, 589]",I-education_institute
908,Institute,"[828, 575, 894, 589]",I-education_institute
909,-,"[895, 575, 946, 589]",I-education_institute
910,IP,"[895, 575, 946, 589]",I-education_institute
911,##ES,"[895, 575, 946, 589]",I-education_institute
912,##T,"[895, 575, 946, 589]",I-education_institute
913,-,"[895, 575, 946, 589]",MISC
914,-,"[947, 575, 949, 589]",MISC
915,NL,"[947, 575, 949, 589]",MISC
916,-,"[947, 575, 949, 589]",MISC
917,2011,"[748, 595, 823, 609]",MISC
918,-,"[748, 595, 823, 609]",MISC
919,2012,"[748, 595, 823, 609]",MISC
920,-,"[823, 595, 825, 609]",MISC
921,NL,"[823, 595, 825, 609]",MISC
922,-,"[823, 595, 825, 609]",MISC
923,Ba,"[750, 628, 862, 642]",B-education_degree
924,##cca,"[750, 628, 862, 642]",I-education_degree
925,##lau,"[750, 628, 862, 642]",I-education_degree
926,##reate,"[750, 628, 862, 642]",I-education_degree
927,degree,"[864, 628, 914, 642]",I-education_degree
928,18,"[916, 628, 986, 642]",MISC
929,.,"[916, 628, 986, 642]",MISC
930,33,"[916, 628, 986, 642]",MISC
931,/,"[916, 628, 986, 642]",MISC
932,20,"[916, 628, 986, 642]",MISC
933,-,"[986, 628, 988, 642]",MISC
934,NL,"[986, 628, 988, 642]",MISC
935,-,"[986, 628, 988, 642]",MISC
936,L,"[748, 648, 796, 662]",B-education_institute
937,##y,"[748, 648, 796, 662]",I-education_institute
938,##ce,"[748, 648, 796, 662]",I-education_institute
939,##e,"[748, 648, 796, 662]",I-education_institute
940,Ma,"[796, 648, 862, 662]",I-education_institute
941,##az,"[796, 648, 862, 662]",I-education_institute
942,##ou,"[796, 648, 862, 662]",I-education_institute
943,##n,"[796, 648, 862, 662]",I-education_institute
944,/,"[863, 648, 872, 662]",I-education_institute
945,L,"[873, 648, 921, 662]",I-education_institute
946,##y,"[873, 648, 921, 662]",I-education_institute
947,##ce,"[873, 648, 921, 662]",I-education_institute
948,##e,"[873, 648, 921, 662]",I-education_institute
949,pilot,"[921, 648, 977, 662]",I-education_institute
950,##e,"[921, 648, 977, 662]",I-education_institute
951,de,"[979, 648, 997, 662]",I-education_institute
952,-,"[998, 648, 1000, 662]",I-education_institute
953,NL,"[998, 648, 1000, 662]",I-education_institute
954,-,"[998, 648, 1000, 662]",I-education_institute
955,S,"[748, 662, 779, 676]",I-education_institute
956,##fa,"[748, 662, 779, 676]",I-education_institute
957,##x,"[748, 662, 779, 676]",I-education_institute
958,-,"[779, 662, 780, 676]",MISC
959,NL,"[779, 662, 780, 676]",MISC
960,-,"[779, 662, 780, 676]",MISC
961,2011,"[750, 683, 784, 697]",MISC
962,-,"[784, 683, 786, 697]",MISC
963,NL,"[784, 683, 786, 697]",MISC
964,-,"[784, 683, 786, 697]",MISC
965,LA,"[750, 736, 874, 755]",B-others_heading
966,##NG,"[750, 736, 874, 755]",I-others_heading
967,##U,"[750, 736, 874, 755]",I-others_heading
968,##AG,"[750, 736, 874, 755]",I-others_heading
969,##ES,"[750, 736, 874, 755]",I-others_heading
970,-,"[874, 736, 876, 755]",MISC
971,NL,"[874, 736, 876, 755]",MISC
972,-,"[874, 736, 876, 755]",MISC
973,English,"[752, 762, 820, 776]",MISC
974,Advanced,"[821, 762, 899, 776]",MISC
975,(,"[899, 762, 957, 776]",MISC
976,TO,"[899, 762, 957, 776]",MISC
977,##EI,"[899, 762, 957, 776]",MISC
978,##C,"[899, 762, 957, 776]",MISC
979,93,"[958, 762, 997, 776]",MISC
980,##5,"[958, 762, 997, 776]",MISC
981,),"[958, 762, 997, 776]",MISC
982,-,"[998, 762, 1000, 776]",MISC
983,NL,"[998, 762, 1000, 776]",MISC
984,-,"[998, 762, 1000, 776]",MISC
985,French,"[753, 784, 809, 798]",MISC
986,Upper,"[810, 784, 858, 798]",MISC
987,Intermediate,"[858, 784, 972, 798]",MISC
988,-,"[972, 784, 974, 798]",MISC
989,NL,"[972, 784, 974, 798]",MISC
990,-,"[972, 784, 974, 798]",MISC
991,German,"[752, 806, 811, 820]",MISC
992,Elementary,"[812, 806, 912, 820]",MISC
993,-,"[913, 806, 915, 820]",MISC
994,NL,"[913, 806, 915, 820]",MISC
995,-,"[913, 806, 915, 820]",MISC
996,Arabic,"[752, 826, 814, 840]",MISC
997,Native,"[815, 826, 878, 840]",MISC
998,-,"[879, 826, 881, 840]",MISC
999,NL,"[879, 826, 881, 840]",MISC
1000,-,"[879, 826, 881, 840]",MISC
1001,IN,"[750, 883, 843, 902]",B-skills_heading
1002,##TE,"[750, 883, 843, 902]",I-skills_heading
1003,##RE,"[750, 883, 843, 902]",I-skills_heading
1004,##ST,"[750, 883, 843, 902]",I-skills_heading
1005,##S,"[750, 883, 843, 902]",I-skills_heading
1006,-,"[843, 883, 845, 902]",MISC
1007,NL,"[843, 883, 845, 902]",MISC
1008,-,"[843, 883, 845, 902]",MISC
1009,Playing,"[753, 915, 806, 929]",MISC
1010,guitar,"[807, 915, 853, 929]",MISC
1011,-,"[853, 915, 855, 929]",MISC
1012,NL,"[853, 915, 855, 929]",MISC
1013,-,"[853, 915, 855, 929]",MISC
1014,Singing,"[753, 936, 806, 950]",MISC
1015,-,"[806, 936, 808, 950]",MISC
1016,NL,"[806, 936, 808, 950]",MISC
1017,-,"[806, 936, 808, 950]",MISC
1018,Playing,"[753, 960, 809, 974]",MISC
1019,cards,"[811, 960, 852, 974]",MISC
1020,-,"[852, 960, 853, 974]",MISC
1021,NL,"[852, 960, 853, 974]",MISC
1022,-,"[852, 960, 853, 974]",MISC
1023,S,"[753, 986, 813, 1000]",MISC
1024,##no,"[753, 986, 813, 1000]",MISC
1025,##oker,"[753, 986, 813, 1000]",MISC
1026,-,"[813, 986, 814, 1000]",MISC
1027,NL,"[813, 986, 814, 1000]",MISC
1028,-,"[813, 986, 814, 1000]",MISC
