{ "channels":[

  { "name": "TF1",
    "number": 1,
    "favoris": false,
    "logo": "./ChannelsLogo/tf1.png",
    "security": false,
    "programme": [
      { "description" : "Big Buck Bunny tells the story of a giant rabbit with a heart bigger than himself. When one sunny day three rodents rudely harass him, something snaps... and the rabbit ain't no bunny anymore! In the typical cartoon tradition he prepares the nasty rodents a comical revenge.\n\nLicensed under the Creative Commons Attribution license\nhttp://www.bigbuckbunny.org",
        "sources" : [ "http://commondatastorage.googleapis.com/gtv-videos-bucket/sample/BigBuckBunny.mp4" ],
        "subtitle" : "By Blender Foundation",
        "thumb" : "images/BigBuckBunny.jpg",
        "title" : "Big Buck Bunny",
        "genre": "Animation",
        "creating": "2008"
        }
      ]
    },

  { "name": "France2",
    "number": 2,
    "favoris": false,
    "logo": "./ChannelsLogo/france2.png",
    "security": false,
    "programme" :[
      { "description" : "The first Blender Open Movie from 2006",
        "sources" : [ "http://commondatastorage.googleapis.com/gtv-videos-bucket/sample/ElephantsDream.mp4" ],
        "subtitle" : "By Blender Foundation",
        "thumb" : "images/ElephantsDream.jpg",
        "title" : "Elephant Dream",
        "genre": "Animation",
        "creating": "2006"
      }
    ]
  },
  
  { "name" : "France3",
    "number": 3,
    "favoris": false,
    "logo": "./ChannelsLogo/france3.png",
    "security": false,
    "programme" :[
      { "description" : "Sintel is an independently produced short film, initiated by the Blender Foundation as a means to further improve and validate the free/open source 3D creation suite Blender. With initial funding provided by 1000s of donations via the internet community, it has again proven to be a viable development model for both open 3D technology as for independent animation film.\nThis 15 minute film has been realized in the studio of the Amsterdam Blender Institute, by an international team of artists and developers. In addition to that, several crucial technical and creative targets have been realized online, by developers and artists and teams all over the world.\nwww.sintel.org",
        "sources" : [ "http://commondatastorage.googleapis.com/gtv-videos-bucket/sample/Sintel.mp4" ],
        "subtitle" : "By Blender Foundation",
        "thumb" : "images/Sintel.jpg",
        "title" : "Sintel",
        "genre": "Animation",
        "creating": "2010"
      }
    ]
  },

  { "name" : "Canal+",
    "number": 4,
    "favoris": false,
    "logo": "./ChannelsLogo/canal+.png",
    "security": true,
    "login":"123456",
    "programme" : [
      {"description" : "Smoking Tire takes the all-new Subaru Outback to the highest point we can find in hopes our customer-appreciation Balloon Launch will get some free T-shirts into the hands of our viewers.",
        "sources" : [ "http://commondatastorage.googleapis.com/gtv-videos-bucket/sample/SubaruOutbackOnStreetAndDirt.mp4" ],
        "subtitle" : "By Garage419",
        "thumb" : "images/SubaruOutbackOnStreetAndDirt.jpg",
        "title" : "Subaru Outback On Street And Dirt",
        "genre": "Animation",
        "creating": "2007"
      }
    ]
  },

  { "name": "France5",
    "number": 5,
    "favoris": false,
    "logo": "./ChannelsLogo/france5.png",
    "security": false,
    "programme" : [
      { "description" : "Tears of Steel was realized with crowd-funding by users of the open source 3D creation tool Blender. Target was to improve and test a complete open and free pipeline for visual effects in film - and to make a compelling sci-fi film in Amsterdam, the Netherlands.  The film itself, and all raw material used for making it, have been released under the Creatieve Commons 3.0 Attribution license. Visit the tearsofsteel.org website to find out more about this, or to purchase the 4-DVD box with a lot of extras.  (CC) Blender Foundation - http://www.tearsofsteel.org",
        "sources" : [ "http://commondatastorage.googleapis.com/gtv-videos-bucket/sample/TearsOfSteel.mp4" ],
        "subtitle" : "By Blender Foundation",
        "thumb" : "images/TearsOfSteel.jpg",
        "title" : "Tears of Steel",
        "genre": "Animation",
        "creating": "2008"
      }
    ]
  },

  { "name": "M6",
    "number": 6,
    "favoris": false,
    "logo": "./ChannelsLogo/m6.png",
    "security": false,
    "programe": [
      { "description" : "The Smoking Tire heads out to Adams Motorsports Park in Riverside, CA to test the most requested car of 2010, the Volkswagen GTI. Will it beat the Mazdaspeed3's standard-setting lap time? Watch and see...",
        "sources" : [ "http://commondatastorage.googleapis.com/gtv-videos-bucket/sample/VolkswagenGTIReview.mp4" ],
        "subtitle" : "By Garage419",
        "thumb" : "images/VolkswagenGTIReview.jpg",
        "title" : "Volkswagen GTI Review",
        "genre": "Animation",
        "creating": "20015"
      }
    ]
  },

  {"name": "Arte",
    "number": 7,
    "favoris": false,
    "logo": "./ChannelsLogo/arte.png",
    "security": false,
    "programme": [
      { "description" : "The Smoking Tire meets up with Chris and Jorge from CarsForAGrand.com to see just how far $1,000 can go when looking for a car.The Smoking Tire meets up with Chris and Jorge from CarsForAGrand.com to see just how far $1,000 can go when looking for a car.",
        "sources" : [ "http://commondatastorage.googleapis.com/gtv-videos-bucket/sample/WhatCarCanYouGetForAGrand.mp4" ],
        "subtitle" : "By Garage419",
        "thumb" : "images/WhatCarCanYouGetForAGrand.jpg",
        "title" : "What care can you get for a grand?",
        "genre": "Animation",
        "creating": "2012"
      }
    ]
  },

  { "name": "W9",
    "number": 9,
    "favoris": false,
    "logo": "./ChannelsLogo/w9.png",
    "security": false,
    "programme": [
      { "description" : "Big Buck Bunny tells the story of a giant rabbit with a heart bigger than himself. When one sunny day three rodents rudely harass him, something snaps... and the rabbit ain't no bunny anymore! In the typical cartoon tradition he prepares the nasty rodents a comical revenge.\n\nLicensed under the Creative Commons Attribution license\nhttp://www.bigbuckbunny.org",
        "sources" : [ "http://commondatastorage.googleapis.com/gtv-videos-bucket/sample/BigBuckBunny.mp4" ],
        "subtitle" : "By Blender Foundation",
        "thumb" : "images/BigBuckBunny.jpg",
        "title" : "Big Buck Bunny",
        "genre": "Animation",
        "creating": "2008"
      }
    ]
  },

  { "name": "TMC",
    "number": 10,
    "favoris": false,
    "logo": "./ChannelsLogo/tmc.png",
    "security": false,
    "programme" :[
      { "description" : "The first Blender Open Movie from 2006",
        "sources" : [ "http://commondatastorage.googleapis.com/gtv-videos-bucket/sample/ElephantsDream.mp4" ],
        "subtitle" : "By Blender Foundation",
        "thumb" : "images/ElephantsDream.jpg",
        "title" : "Elephant Dream",
        "genre": "Animation",
        "creating": "2006"
      }
    ]
  },
  
  { "name" : "TFX",
    "number": 11,
    "favoris": false,
    "logo": "./ChannelsLogo/tfx.png",
    "security": false,
    "programme" :[
      { "description" : "Sintel is an independently produced short film, initiated by the Blender Foundation as a means to further improve and validate the free/open source 3D creation suite Blender. With initial funding provided by 1000s of donations via the internet community, it has again proven to be a viable development model for both open 3D technology as for independent animation film.\nThis 15 minute film has been realized in the studio of the Amsterdam Blender Institute, by an international team of artists and developers. In addition to that, several crucial technical and creative targets have been realized online, by developers and artists and teams all over the world.\nwww.sintel.org",
        "sources" : [ "http://commondatastorage.googleapis.com/gtv-videos-bucket/sample/Sintel.mp4" ],
        "subtitle" : "By Blender Foundation",
        "thumb" : "images/Sintel.jpg",
        "title" : "Sintel",
        "genre": "Animation",
        "creating": "2010"
      }
    ]
  },

  { "name" : "NRJ12",
    "number": 12,
    "favoris": false,
    "logo": "./ChannelsLogo/nrj12.png",
    "security": false,
    "programme" : [
      {"description" : "Smoking Tire takes the all-new Subaru Outback to the highest point we can find in hopes our customer-appreciation Balloon Launch will get some free T-shirts into the hands of our viewers.",
        "sources" : [ "http://commondatastorage.googleapis.com/gtv-videos-bucket/sample/SubaruOutbackOnStreetAndDirt.mp4" ],
        "subtitle" : "By Garage419",
        "thumb" : "images/SubaruOutbackOnStreetAndDirt.jpg",
        "title" : "Subaru Outback On Street And Dirt",
        "genre": "Animation",
        "creating": "2007"
      }
    ]
  },

  { "name": "France4",
    "number": 14,
    "favoris": false,
    "logo": "./ChannelsLogo/france4.png",
    "security": false,
    "programme" : [
      { "description" : "Tears of Steel was realized with crowd-funding by users of the open source 3D creation tool Blender. Target was to improve and test a complete open and free pipeline for visual effects in film - and to make a compelling sci-fi film in Amsterdam, the Netherlands.  The film itself, and all raw material used for making it, have been released under the Creatieve Commons 3.0 Attribution license. Visit the tearsofsteel.org website to find out more about this, or to purchase the 4-DVD box with a lot of extras.  (CC) Blender Foundation - http://www.tearsofsteel.org",
        "sources" : [ "http://commondatastorage.googleapis.com/gtv-videos-bucket/sample/TearsOfSteel.mp4" ],
        "subtitle" : "By Blender Foundation",
        "thumb" : "images/TearsOfSteel.jpg",
        "title" : "Tears of Steel",
        "genre": "Animation",
        "creating": "2008"
      }
    ]
  },

  { "name": "BFM TV",
    "number": 15,
    "favoris": false,
    "logo": "./ChannelsLogo/bfm.png",
    "security": false,
    "programe": [
      { "description" : "The Smoking Tire heads out to Adams Motorsports Park in Riverside, CA to test the most requested car of 2010, the Volkswagen GTI. Will it beat the Mazdaspeed3's standard-setting lap time? Watch and see...",
        "sources" : [ "http://commondatastorage.googleapis.com/gtv-videos-bucket/sample/VolkswagenGTIReview.mp4" ],
        "subtitle" : "By Garage419",
        "thumb" : "images/VolkswagenGTIReview.jpg",
        "title" : "Volkswagen GTI Review",
        "genre": "Animation",
        "creating": "20015"
      }
    ]
  },

  {"name": "Cnews",
    "number": 16,
    "favoris": false,
    "logo": "./ChannelsLogo/cnews.png",
    "security": false,
    "programme": [
      { "description" : "The Smoking Tire meets up with Chris and Jorge from CarsForAGrand.com to see just how far $1,000 can go when looking for a car.The Smoking Tire meets up with Chris and Jorge from CarsForAGrand.com to see just how far $1,000 can go when looking for a car.",
        "sources" : [ "http://commondatastorage.googleapis.com/gtv-videos-bucket/sample/WhatCarCanYouGetForAGrand.mp4" ],
        "subtitle" : "By Garage419",
        "thumb" : "images/WhatCarCanYouGetForAGrand.jpg",
        "title" : "What care can you get for a grand?",
        "genre": "Animation",
        "creating": "2012"
      }
    ]
  },

  { "name": "CSTAR",
    "number": 17,
    "favoris": false,
    "logo": "./ChannelsLogo/cstar.png",
    "security": false,
    "programme": [
      { "description" : "Big Buck Bunny tells the story of a giant rabbit with a heart bigger than himself. When one sunny day three rodents rudely harass him, something snaps... and the rabbit ain't no bunny anymore! In the typical cartoon tradition he prepares the nasty rodents a comical revenge.\n\nLicensed under the Creative Commons Attribution license\nhttp://www.bigbuckbunny.org",
        "sources" : [ "http://commondatastorage.googleapis.com/gtv-videos-bucket/sample/BigBuckBunny.mp4" ],
        "subtitle" : "By Blender Foundation",
        "thumb" : "images/BigBuckBunny.jpg",
        "title" : "Big Buck Bunny",
        "genre": "Animation",
        "creating": "2008"
      }
    ]
  },

  { "name": "Gulli",
    "number": 18,
    "favoris": false,
    "logo": "./ChannelsLogo/gulli.png",
    "security": false,
    "programme" :[
      { "description" : "The first Blender Open Movie from 2006",
        "sources" : [ "http://commondatastorage.googleapis.com/gtv-videos-bucket/sample/ElephantsDream.mp4" ],
        "subtitle" : "By Blender Foundation",
        "thumb" : "images/ElephantsDream.jpg",
        "title" : "Elephant Dream",
        "genre": "Animation",
        "creating": "2006"
      }
    ]
  },
  
  { "name" : "TF1 séries films",
    "number": 20,
    "favoris": false,
    "logo": "./ChannelsLogo/tf1seriesfilms.png",
    "security": false,
    "programme" :[
      { "description" : "Sintel is an independently produced short film, initiated by the Blender Foundation as a means to further improve and validate the free/open source 3D creation suite Blender. With initial funding provided by 1000s of donations via the internet community, it has again proven to be a viable development model for both open 3D technology as for independent animation film.\nThis 15 minute film has been realized in the studio of the Amsterdam Blender Institute, by an international team of artists and developers. In addition to that, several crucial technical and creative targets have been realized online, by developers and artists and teams all over the world.\nwww.sintel.org",
        "sources" : [ "http://commondatastorage.googleapis.com/gtv-videos-bucket/sample/Sintel.mp4" ],
        "subtitle" : "By Blender Foundation",
        "thumb" : "images/Sintel.jpg",
        "title" : "Sintel",
        "genre": "Animation",
        "creating": "2010"
      }
    ]
  },

  { "name" : "L'Equipe",
    "number": 21,
    "favoris": false,
    "logo": "./ChannelsLogo/lequipe.png",
    "security": false,
    "programme" : [
      {"description" : "Smoking Tire takes the all-new Subaru Outback to the highest point we can find in hopes our customer-appreciation Balloon Launch will get some free T-shirts into the hands of our viewers.",
        "sources" : [ "http://commondatastorage.googleapis.com/gtv-videos-bucket/sample/SubaruOutbackOnStreetAndDirt.mp4" ],
        "subtitle" : "By Garage419",
        "thumb" : "images/SubaruOutbackOnStreetAndDirt.jpg",
        "title" : "Subaru Outback On Street And Dirt",
        "genre": "Animation",
        "creating": "2007"
      }
    ]
  },

  { "name": "6ter",
    "number": 22,
    "favoris": false,
    "logo": "./ChannelsLogo/6ter.png",
    "security": false,
    "programme" : [
      { "description" : "Tears of Steel was realized with crowd-funding by users of the open source 3D creation tool Blender. Target was to improve and test a complete open and free pipeline for visual effects in film - and to make a compelling sci-fi film in Amsterdam, the Netherlands.  The film itself, and all raw material used for making it, have been released under the Creatieve Commons 3.0 Attribution license. Visit the tearsofsteel.org website to find out more about this, or to purchase the 4-DVD box with a lot of extras.  (CC) Blender Foundation - http://www.tearsofsteel.org",
        "sources" : [ "http://commondatastorage.googleapis.com/gtv-videos-bucket/sample/TearsOfSteel.mp4" ],
        "subtitle" : "By Blender Foundation",
        "thumb" : "images/TearsOfSteel.jpg",
        "title" : "Tears of Steel",
        "genre": "Animation",
        "creating": "2008"
      }
    ]
  },

  { "name": "RMC story",
    "number": 23,
    "favoris": false,
    "logo": "./ChannelsLogo/rmcstory.png",
    "security": false,
    "programe": [
      { "description" : "The Smoking Tire heads out to Adams Motorsports Park in Riverside, CA to test the most requested car of 2010, the Volkswagen GTI. Will it beat the Mazdaspeed3's standard-setting lap time? Watch and see...",
        "sources" : [ "http://commondatastorage.googleapis.com/gtv-videos-bucket/sample/VolkswagenGTIReview.mp4" ],
        "subtitle" : "By Garage419",
        "thumb" : "images/VolkswagenGTIReview.jpg",
        "title" : "Volkswagen GTI Review",
        "genre": "Animation",
        "creating": "20015"
      }
    ]
  },

  { "name": "RMC découverte",
    "number": 24,
    "favoris": false,
    "logo": "./ChannelsLogo/rmcdecouverte.png",
    "security": false,
    "programme": [
      { "description" : "The Smoking Tire meets up with Chris and Jorge from CarsForAGrand.com to see just how far $1,000 can go when looking for a car.The Smoking Tire meets up with Chris and Jorge from CarsForAGrand.com to see just how far $1,000 can go when looking for a car.",
        "sources" : [ "http://commondatastorage.googleapis.com/gtv-videos-bucket/sample/WhatCarCanYouGetForAGrand.mp4" ],
        "subtitle" : "By Garage419",
        "thumb" : "images/WhatCarCanYouGetForAGrand.jpg",
        "title" : "What care can you get for a grand?",
        "genre": "Animation",
        "creating": "2012"
      }
    ]
  },

  { "name": "Chérie 25",
    "number": 25,
    "favoris": false,
    "logo": "./ChannelsLogo/cherie25.png",
    "security": false,
    "programme": [
      { "description" : "Big Buck Bunny tells the story of a giant rabbit with a heart bigger than himself. When one sunny day three rodents rudely harass him, something snaps... and the rabbit ain't no bunny anymore! In the typical cartoon tradition he prepares the nasty rodents a comical revenge.\n\nLicensed under the Creative Commons Attribution license\nhttp://www.bigbuckbunny.org",
        "sources" : [ "http://commondatastorage.googleapis.com/gtv-videos-bucket/sample/BigBuckBunny.mp4" ],
        "subtitle" : "By Blender Foundation",
        "thumb" : "images/BigBuckBunny.jpg",
        "title" : "Big Buck Bunny",
        "genre": "Animation",
        "creating": "2008"
      }
    ]
  },

  { "name": "LCI",
    "number": 26,
    "favoris": false,
    "logo": "./ChannelsLogo/lci.png",
    "security": false,
    "programme" :[
      { "description" : "The first Blender Open Movie from 2006",
        "sources" : [ "http://commondatastorage.googleapis.com/gtv-videos-bucket/sample/ElephantsDream.mp4" ],
        "subtitle" : "By Blender Foundation",
        "thumb" : "images/ElephantsDream.jpg",
        "title" : "Elephant Dream",
        "genre": "Animation",
        "creating": "2006"
      }
    ]
  },
  
  { "name" : "Franceinfo",
    "number": 27,
    "favoris": false,
    "logo": "./ChannelsLogo/franceinfo.png",
    "security": false,
      "programme" :[
      { "description" : "Sintel is an independently produced short film, initiated by the Blender Foundation as a means to further improve and validate the free/open source 3D creation suite Blender. With initial funding provided by 1000s of donations via the internet community, it has again proven to be a viable development model for both open 3D technology as for independent animation film.\nThis 15 minute film has been realized in the studio of the Amsterdam Blender Institute, by an international team of artists and developers. In addition to that, several crucial technical and creative targets have been realized online, by developers and artists and teams all over the world.\nwww.sintel.org",
        "sources" : [ "http://commondatastorage.googleapis.com/gtv-videos-bucket/sample/Sintel.mp4" ],
        "subtitle" : "By Blender Foundation",
        "thumb" : "images/Sintel.jpg",
        "title" : "Sintel",
        "genre": "Animation",
        "creating": "2010"
      }
    ]
  },

  { "name" : "Paris Première",
    "number": 41,
    "favoris": false,
    "logo": "./ChannelsLogo/parispremiere.png",
    "security": false,
    "programme" : [
      {"description" : "Smoking Tire takes the all-new Subaru Outback to the highest point we can find in hopes our customer-appreciation Balloon Launch will get some free T-shirts into the hands of our viewers.",
        "sources" : [ "http://commondatastorage.googleapis.com/gtv-videos-bucket/sample/SubaruOutbackOnStreetAndDirt.mp4" ],
        "subtitle" : "By Garage419",
        "thumb" : "images/SubaruOutbackOnStreetAndDirt.jpg",
        "title" : "Subaru Outback On Street And Dirt",
        "genre": "Animation",
        "creating": "2007"
      }
    ]
  },

  { "name": "Canal+ Sport",
    "number": 46,
    "favoris": false,
    "logo": "./ChannelsLogo/canal+sport.png",
    "security": true,
    "login":"123456",
    "programme" : [
      { "description" : "Tears of Steel was realized with crowd-funding by users of the open source 3D creation tool Blender. Target was to improve and test a complete open and free pipeline for visual effects in film - and to make a compelling sci-fi film in Amsterdam, the Netherlands.  The film itself, and all raw material used for making it, have been released under the Creatieve Commons 3.0 Attribution license. Visit the tearsofsteel.org website to find out more about this, or to purchase the 4-DVD box with a lot of extras.  (CC) Blender Foundation - http://www.tearsofsteel.org",
        "sources" : [ "http://commondatastorage.googleapis.com/gtv-videos-bucket/sample/TearsOfSteel.mp4" ],
        "subtitle" : "By Blender Foundation",
        "thumb" : "images/TearsOfSteel.jpg",
        "title" : "Tears of Steel",
        "genre": "Animation",
        "creating": "2008"
      }
    ]
  },

  { "name": "Planète+",
    "number": 72,
    "favoris": false,
    "logo": "./ChannelsLogo/planete+.png",
    "security": false,
    "programe": [
      { "description" : "The Smoking Tire heads out to Adams Motorsports Park in Riverside, CA to test the most requested car of 2010, the Volkswagen GTI. Will it beat the Mazdaspeed3's standard-setting lap time? Watch and see...",
        "sources" : [ "http://commondatastorage.googleapis.com/gtv-videos-bucket/sample/VolkswagenGTIReview.mp4" ],
        "subtitle" : "By Garage419",
        "thumb" : "images/VolkswagenGTIReview.jpg",
        "title" : "Volkswagen GTI Review",
        "genre": "Animation",
        "creating": "20015"
      }
    ]
  },

  {"name": "13 ème rue",
    "number": 82,
    "favoris": false,
    "logo": "./ChannelsLogo/13emerue.png",
    "security": true,
    "login":"123456",
    "programme": [
      { "description" : "The Smoking Tire meets up with Chris and Jorge from CarsForAGrand.com to see just how far $1,000 can go when looking for a car.The Smoking Tire meets up with Chris and Jorge from CarsForAGrand.com to see just how far $1,000 can go when looking for a car.",
        "sources" : [ "http://commondatastorage.googleapis.com/gtv-videos-bucket/sample/WhatCarCanYouGetForAGrand.mp4" ],
        "subtitle" : "By Garage419",
        "thumb" : "images/WhatCarCanYouGetForAGrand.jpg",
        "title" : "What care can you get for a grand?",
        "genre": "Animation",
        "creating": "2012"
      }
    ]
  },

  {"name": "Action",
    "number": 100,
    "favoris": false,
    "logo": "./ChannelsLogo/action.png",
    "security": true,
    "login":"123456",
    "programme": [
      { "description" : "The Smoking Tire meets up with Chris and Jorge from CarsForAGrand.com to see just how far $1,000 can go when looking for a car.The Smoking Tire meets up with Chris and Jorge from CarsForAGrand.com to see just how far $1,000 can go when looking for a car.",
        "sources" : [ "http://commondatastorage.googleapis.com/gtv-videos-bucket/sample/WhatCarCanYouGetForAGrand.mp4" ],
        "subtitle" : "By Garage419",
        "thumb" : "images/WhatCarCanYouGetForAGrand.jpg",
        "title" : "What care can you get for a grand?",
        "genre": "Animation",
        "creating": "2012"
      }
    ]
  },

  {"name": "Polar +",
    "number": 216,
    "favoris": false,
    "logo": "./ChannelsLogo/polar+.png",
    "security": false,
    "programme": [
      { "description" : "The Smoking Tire meets up with Chris and Jorge from CarsForAGrand.com to see just how far $1,000 can go when looking for a car.The Smoking Tire meets up with Chris and Jorge from CarsForAGrand.com to see just how far $1,000 can go when looking for a car.",
        "sources" : [ "http://commondatastorage.googleapis.com/gtv-videos-bucket/sample/WhatCarCanYouGetForAGrand.mp4" ],
        "subtitle" : "By Garage419",
        "thumb" : "images/WhatCarCanYouGetForAGrand.jpg",
        "title" : "What care can you get for a grand?",
        "genre": "Animation",
        "creating": "2012"
      }
    ]
  }
]
}
    