(module LGA-8_10MMx10MMx4p2MM_MNP (layer F.Cu)
  (fp_text reference REF** (at 0 0) (layer F.SilkS)
    (effects (font (size 1 1) (thickness .15)))
  )
  (fp_text value LGA-8_10MMx10MMx4p2MM_MNP (at 0 0) (layer F.SilkS)
    (effects (font (size 1 1) (thickness .15)))
  )
  (fp_text user "Copyright 2021 Accelerated Designs. All rights reserved." (at 0 0) (layer Cmts.User)
    (effects (font (size .127 .127) (thickness .002)))
  )
  (fp_text user "*" (at 0 0) (layer F.SilkS)
    (effects (font (size 1 1) (thickness .15)))
  )
  (fp_text user "*" (at 0 0) (layer F.Fab)
    (effects (font (size 1 1) (thickness .15)))
  )
  (fp_text user "0.071in/1.803mm" (at -4.05 -8.1026) (layer Dwgs.User)
    (effects (font (size 1 1) (thickness .15)))
  )
  (fp_text user "0.106in/2.7mm" (at -7.097999 -2.7) (layer Dwgs.User)
    (effects (font (size 1 1) (thickness .15)))
  )
  (fp_text user "0.319in/8.1mm" (at 0 7.097999) (layer Dwgs.User)
    (effects (font (size 1 1) (thickness .15)))
  )
  (fp_text user "0.071in/1.803mm" (at 7.097999 -4.05) (layer Dwgs.User)
    (effects (font (size 1 1) (thickness .15)))
  )
  (fp_line (start -5.0546 -5.0546) (end -5.0546 5.0546) (layer F.Fab) (width .1))
  (fp_line (start -5.0546 5.0546) (end 5.0546 5.0546) (layer F.Fab) (width .1))
  (fp_line (start 5.0546 5.0546) (end 5.0546 -5.0546) (layer F.Fab) (width .1))
  (fp_line (start 5.0546 -5.0546) (end -5.0546 -5.0546) (layer F.Fab) (width .1))
  (fp_line (start -5.1816 -2.907755) (end -5.1816 -2.492244) (layer F.SilkS) (width .12))
  (fp_line (start -2.907755 5.1816) (end 2.907755 5.1816) (layer F.SilkS) (width .12))
  (fp_line (start 5.1816 2.907755) (end 5.1816 2.492244) (layer F.SilkS) (width .12))
  (fp_line (start 2.907755 -5.1816) (end -2.907755 -5.1816) (layer F.SilkS) (width .12))
  (fp_line (start -5.1816 -.207755) (end -5.1816 .207755) (layer F.SilkS) (width .12))
  (fp_line (start -5.1816 2.492244) (end -5.1816 2.907755) (layer F.SilkS) (width .12))
  (fp_line (start 5.1816 .207755) (end 5.1816 -.207755) (layer F.SilkS) (width .12))
  (fp_line (start 5.1816 -2.492244) (end 5.1816 -2.907755) (layer F.SilkS) (width .12))
  (fp_line (start -5.3086 5.3086) (end 5.3086 5.3086) (layer F.CrtYd) (width .05))
  (fp_line (start 5.3086 5.3086) (end 5.3086 -5.3086) (layer F.CrtYd) (width .05))
  (fp_line (start 5.3086 -5.3086) (end -5.3086 -5.3086) (layer F.CrtYd) (width .05))
  (fp_line (start -5.3086 -5.3086) (end -5.3086 5.3086) (layer F.CrtYd) (width .05))
  (fp_arc (start 0 -5.0546) (end -.021398 -.128387) (angle -180)(layer Dwgs.User) (width .05))
  (fp_arc (start 0 -5.0546) (end -.021398 -.128387) (angle -180)(layer F.Fab) (width .1))
  (fp_circle (center -6.149299 -4.05) (end -6.149299 -4.05) (layer F.Fab) (width .1))
  (pad 1 smd rect (at -4.05 -4.05) (size 1.8034 1.8034) (layers F.Cu F.Paste F.Mask))
  (pad 2 smd rect (at -4.05 -1.35) (size 1.8034 1.8034) (layers F.Cu F.Paste F.Mask))
  (pad 3 smd rect (at -4.05 1.35) (size 1.8034 1.8034) (layers F.Cu F.Paste F.Mask))
  (pad 4 smd rect (at -4.05 4.05) (size 1.8034 1.8034) (layers F.Cu F.Paste F.Mask))
  (pad 5 smd rect (at 4.05 4.05) (size 1.8034 1.8034) (layers F.Cu F.Paste F.Mask))
  (pad 6 smd rect (at 4.05 1.35) (size 1.8034 1.8034) (layers F.Cu F.Paste F.Mask))
  (pad 7 smd rect (at 4.05 -1.35) (size 1.8034 1.8034) (layers F.Cu F.Paste F.Mask))
  (pad 8 smd rect (at 4.05 -4.05) (size 1.8034 1.8034) (layers F.Cu F.Paste F.Mask))
)
