{
  "changes": [
    {
      "comment": "",
      "packageName": "@fabernovel/heart-cli",
      "type": "none"
    }
  ],
  "packageName": "@fabernovel/heart-cli",
  "email": "bastien.gatellier@fabernovel.com"
}