{
  "name": "@fabernovel/heart-core",
  "entries": [
    {
      "version": "3.0.1",
      "tag": "@fabernovel/heart-core_v3.0.1",
      "date": "Fri, 19 Jul 2019 09:36:21 GMT",
      "comments": {
        "patch": [
          {
            "comment": "Fix an issue where the binary was not packaged when published to NPM"
          }
        ]
      }
    },
    {
      "version": "3.0.0",
      "tag": "@fabernovel/heart-core_v3.0.0",
      "date": "Fri, 19 Jul 2019 08:17:11 GMT",
      "comments": {
        "minor": [
          {
            "comment": "Initial release of environment variables creation from a .env file located under the root folder of the Heart installation"
          },
          {
            "comment": "Improve the module installation: it can now be installed as a devDependency"
          }
        ],
        "patch": [
          {
            "comment": "Remove the contributing guide and the license: they are now available in the Heart repository"
          },
          {
            "comment": "Remove unnecessary dependencies and scripts from package.json"
          }
        ],
        "major": [
          {
            "comment": "Remove module loading, as it is now handled by Heart CLI"
          },
          {
            "comment": "Upgrade the minimum required version of Node.js to the active LTS: from >=8.0.0 to >=10.13.0"
          },
          {
            "comment": "Improve compatibility: starting from this version, every Heart module shares the same major version number"
          }
        ]
      }
    }
  ]
}
