{
  "ok": true,
  "status": 200,
  "details": [
    {
      "id": "001",
      "name": "Societe Generale de Surveillance (SGS)",
      "address": "MENARA BIDAKARA 2 BUILDING 6TH FLOOR JL GATOT SUBROTO KAV 71-73 JAKARTA 12870 - INDONESIA",
      "phone": "(65) 622-29003",
      "fax": "(65) 622-29003",
      "email": "scisi@signet.com.sg"
    },
    {
      "id": "002",
      "name": "China Certification and Inspection Co. Ltd (CCIC)",
      "address": "MENARA BIDAKARA 2 BUILDING 6TH FLOOR JL GATOT SUBROTO KAV 71-73 JAKARTA 12870 - INDONESIA",
      "phone": "(65) 622-29003",
      "fax": "(65) 622-29003",
      "email": "scisi@signet.com.sg"
    },
    {
      "id": "003",
      "name": "Bureau Veritas (BV)",
      "address": "MENARA BIDAKARA 2 BUILDING 6TH FLOOR JL GATOT SUBROTO KAV 71-73 JAKARTA 12870 - INDONESIA",
      "phone": "(65) 622-29003",
      "fax": "(65) 622-29003",
      "email": "scisi@signet.com.sg"
    },
    {
      "id": "004",
      "name": "Societe Generale de Surveillance (SGS)",
      "address": "MENARA BIDAKARA 2 BUILDING 6TH FLOOR JL GATOT SUBROTO KAV 71-73 JAKARTA 12870 - INDONESIA",
      "phone": "(65) 622-29003",
      "fax": "(65) 622-29003",
      "email": "scisi@signet.com.sg"
    },
    {
      "id": "005",
      "name": "Societe Generale de Surveillance (SGS)",
      "address": "MENARA BIDAKARA 2 BUILDING 6TH FLOOR JL GATOT SUBROTO KAV 71-73 JAKARTA 12870 - INDONESIA",
      "phone": "(65) 622-29003",
      "fax": "(65) 622-29003",
      "email": "scisi@signet.com.sg"
    },
    {
      "id": "006",
      "name": "Societe Generale de Surveillance (SGS)",
      "address": "MENARA BIDAKARA 2 BUILDING 6TH FLOOR JL GATOT SUBROTO KAV 71-73 JAKARTA 12870 - INDONESIA",
      "phone": "(65) 622-29003",
      "fax": "(65) 622-29003",
      "email": "scisi@signet.com.sg"
    },
    {
      "id": "007",
      "name": "Societe Generale de Surveillance (SGS)",
      "address": "MENARA BIDAKARA 2 BUILDING 6TH FLOOR JL GATOT SUBROTO KAV 71-73 JAKARTA 12870 - INDONESIA",
      "phone": "(65) 622-29003",
      "fax": "(65) 622-29003",
      "email": "scisi@signet.com.sg"
    }
  ]
}