n_cpus;impl_code;n_sps;assign_time;tot_time;n_obj;seeds
64;2;3;153.484;2554.53;1652131;default
8;2;3;276.738;2289.15;1652131;default
4;2;3;702.505;2745.02;1652131;default
2;2;3;1459.23;3531.81;1652131;default
1;2;3;2508.08;4791.08;1652131;default
64;2;3;103.028;2407.81;1652131;default
8;2;3;306.765;2519.17;1652131;default
4;2;3;618.005;2865.02;1652131;default
2;2;3;1181.21;3571.44;1652131;default
8;0;3;499.905;2934.4;1652131;default
4;0;3;1004.01;3178.58;1652131;default
1;2;3;2067.78;4805.5;1652131;default
64;0;3;136.555;2247.3;1652131;default
8;0;3;459.774;2821.01;1652131;default
64;2;3;81.2543;2015.81;1652131;default
2;0;3;2249.46;4652.5;1652131;default
4;0;3;1023.7;3353.62;1652131;default
8;2;3;265.402;2653.79;1652131;default
64;2;3;90.3742;2466.02;1652131;default
4;2;3;622.486;2914.96;1652131;default
1;0;3;3843.11;6061.43;1652131;default
8;2;3;268.139;2540.6;1652131;default
2;0;3;2187.78;4484.33;1652131;default
64;0;3;120.889;2425.44;1652131;default
4;2;3;591.631;2880.47;1652131;default
64;0;3;133.867;1834.8;1652131;default
8;0;3;454.882;2923.64;1652131;default
2;2;3;1291.62;3347.1;1652131;default
64;2;3;72.3013;2358.22;1652131;default
1;0;3;3672.22;5942.97;1652131;default
4;0;3;1084.17;3540.57;1652131;default
8;0;3;517.497;3024.95;1652131;default
64;2;3;78.136;2608.33;1652131;default
2;2;3;1281.25;3958.32;1652131;default
8;2;3;267.324;2409.97;1652131;default
4;0;3;984.206;3363.82;1652131;default
2;0;3;1020.55;1.64451e+09;1652131;spk31w14_n1-6
2;2;3;225.134;1.64451e+09;1652131;spk31w14_n1-6
64;0;3;110.303;2487.53;1652131;default
1;2;3;2150.06;4704.97;1652131;default
8;2;3;277.4;2686.63;1652131;default
4;2;3;559.465;2853.74;1652131;default
2;0;3;2136.55;4386.98;1652131;default
2;0;3;1018.81;1.64451e+09;1652131;spk31w14_n1-6
64;0;3;140.047;2665.35;1652131;default
2;2;3;227.615;1.64451e+09;1652131;spk31w14_n1-6
8;0;3;478.385;2823.12;1652131;default
1;2;3;2213.46;4592.39;1652131;default
4;2;3;619.896;3156.41;1652131;default
64;2;3;80.5511;2335.61;1652131;default
2;0;3;1031.22;1.64452e+09;1652131;spk31w14_n1-6
2;2;3;230.512;1.64452e+09;1652131;spk31w14_n1-6
2;0;3;2169.7;4527.1;1652131;default
8;0;3;472.397;2898.29;1652131;default
64;2;3;71.4993;2288.25;1652131;default
4;0;3;1009.32;3257.55;1652131;default
2;0;3;1024.97;1.64452e+09;1652131;spk31w14_n1-6
8;2;3;281.793;2617.94;1652131;default
2;2;3;227.26;1.64452e+09;1652131;spk31w14_n1-6
64;0;3;110.983;2499.27;1652131;default
2;2;3;1291.97;3762.56;1652131;default
1;0;3;3739.81;5833.1;1652131;default
4;0;3;1034.71;3378.18;1652131;default
8;2;3;281.832;2406.62;1652131;default
