n_cpus;impl_code;n_sps;assign_time;tot_time;n_obj;seeds
2;0;6;8828.07;13409.1;1652131;spk31w22_n1-6
2;0;6;7153.27;11825;1652131;spk31w22_n1-6
2;2;6;4254.29;9601.16;1652131;spk31w22_n1-6
2;0;6;12267.4;16542.1;1652131;spk31w22_n1-6
2;0;6;7588.21;11883.2;1652131;spk31w22_n1-6
2;2;6;3655.64;7886.67;1652131;spk31w22_n1-6
2;2;6;3862.72;8122.47;1652131;spk31w22_n1-6
2;0;6;6190.7;10421.4;1652131;spk31w22_n1-6
2;0;4;2945.51;6418.44;1652131;spk31w22_n2-5
2;0;4;2949.22;5909.58;1652131;spk31w22_n2-5
2;0;6;6015.82;10248.3;1652131;spk31w22_n1-6
2;2;4;1565.64;5053.75;1652131;spk31w22_n2-5
2;2;6;3885.51;8012.01;1652131;spk31w22_n1-6
2;2;4;1607.44;4862.27;1652131;spk31w22_n2-5
2;2;6;3290.8;7341.78;1652131;spk31w22_n1-6
2;0;4;2928.83;6426.5;1652131;spk31w22_n2-5
2;0;4;2927.88;5992;1652131;spk31w22_n2-5
2;0;6;5480.48;10299.8;1652131;spk31w22_n1-6
2;2;4;1587.98;4707.54;1652131;spk31w22_n2-5
2;2;4;1676.67;4746.81;1652131;spk31w22_n2-5
2;0;6;5311.7;9328.31;1652131;spk31w22_n1-6
2;0;4;2936.35;5705.37;1652131;spk31w22_n2-5
2;2;6;2881.8;6900.9;1652131;spk31w22_n1-6
2;0;4;2931.11;6212.59;1652131;spk31w22_n2-5
2;2;4;1592.05;4779.18;1652131;spk31w22_n2-5
2;2;6;3584.26;7720.86;1652131;spk31w22_n1-6
