seeds,clarksTime,clarksSD,clarksOccurs,misshTime,misshSD,misshOccurs,speedup,clarksTott,misshTott,totspu
Qw14,1065.675,13.2439193594645,8,237.997375,3.52458025616425,8,4.47767543654631,1151.55,324.641125,3.54714763879653
Qw18,2199.8875,44.1236152352521,8,1027.4225,19.9736438838786,8,2.1411712318934,3005.02571428571,1873.9425,1.60358480278115
Qw22,3007.95857142857,271.650222064365,7,1618.23,210.890130840005,8,1.85879545641137,5633.56714285714,4122.79625,1.36644325871237
