\relax 
\providecommand\hyper@newdestlabel[2]{}
\providecommand\babel@aux[2]{}
\@nameuse{bbl@beforestart}
\providecommand\HyperFirstAtBeginDocument{\AtBeginDocument}
\HyperFirstAtBeginDocument{\ifx\hyper@anchor\@undefined
\global\let\oldcontentsline\contentsline
\gdef\contentsline#1#2#3#4{\oldcontentsline{#1}{#2}{#3}}
\global\let\oldnewlabel\newlabel
\gdef\newlabel#1#2{\newlabelxx{#1}#2}
\gdef\newlabelxx#1#2#3#4#5#6{\oldnewlabel{#1}{{#2}{#3}}}
\AtEndDocument{\ifx\hyper@anchor\@undefined
\let\contentsline\oldcontentsline
\let\newlabel\oldnewlabel
\fi}
\fi}
\global\let\hyper@last\relax 
\gdef\HyperFirstAtBeginDocument#1{#1}
\providecommand\HyField@AuxAddToFields[1]{}
\providecommand\HyField@AuxAddToCoFields[2]{}
\@writefile{toc}{\boolfalse {citerequest}\boolfalse {citetracker}\boolfalse {pagetracker}\boolfalse {backtracker}\relax }
\@writefile{lof}{\boolfalse {citerequest}\boolfalse {citetracker}\boolfalse {pagetracker}\boolfalse {backtracker}\relax }
\@writefile{lot}{\boolfalse {citerequest}\boolfalse {citetracker}\boolfalse {pagetracker}\boolfalse {backtracker}\relax }
\abx@aux@refcontext{nty/global//global/global}
\abx@aux@cite{clark:clark}
\abx@aux@segm{0}{0}{clark:clark}
\abx@aux@cite{clark:spaced}
\abx@aux@segm{0}{0}{clark:spaced}
\abx@aux@cite{issh}
\abx@aux@segm{0}{0}{issh}
\babel@aux{english}{}
\@writefile{toc}{\defcounter {refsection}{0}\relax }\@writefile{toc}{\contentsline {section}{\numberline {1}Introduction}{1}{section.1}\protected@file@percent }
\abx@aux@backref{1}{clark:clark}{0}{1}{1}
\abx@aux@backref{2}{clark:spaced}{0}{1}{1}
\abx@aux@backref{3}{issh}{0}{1}{1}
\@writefile{toc}{\defcounter {refsection}{0}\relax }\@writefile{toc}{\contentsline {section}{\numberline {2}Description of the Work}{1}{section.2}\protected@file@percent }
\abx@aux@cite{metaprob}
\abx@aux@segm{0}{0}{metaprob}
\@writefile{toc}{\defcounter {refsection}{0}\relax }\@writefile{toc}{\contentsline {section}{\numberline {3}Experimental Setup}{2}{section.3}\protected@file@percent }
\newlabel{sec:setup}{{3}{2}{Experimental Setup}{section.3}{}}
\newlabel{sec:setup@cref}{{[section][3][]3}{[1][2][]2}}
\abx@aux@backref{4}{metaprob}{0}{2}{2}
\@writefile{toc}{\defcounter {refsection}{0}\relax }\@writefile{toc}{\contentsline {section}{\numberline {4}Debugging}{3}{section.4}\protected@file@percent }
\newlabel{sec:dbg}{{4}{3}{Debugging}{section.4}{}}
\newlabel{sec:dbg@cref}{{[section][4][]4}{[1][3][]3}}
\@writefile{toc}{\defcounter {refsection}{0}\relax }\@writefile{toc}{\contentsline {section}{\numberline {5}Empirical Time Performance}{3}{section.5}\protected@file@percent }
\@writefile{toc}{\defcounter {refsection}{0}\relax }\@writefile{toc}{\contentsline {subsection}{\numberline {5.1}Methods}{4}{subsection.5.1}\protected@file@percent }
\newlabel{sec:method}{{5.1}{4}{Methods}{subsection.5.1}{}}
\newlabel{sec:method@cref}{{[subsection][1][5]5.1}{[1][4][]4}}
\@writefile{toc}{\defcounter {refsection}{0}\relax }\@writefile{toc}{\contentsline {subsection}{\numberline {5.2}Discussion}{4}{subsection.5.2}\protected@file@percent }
\@writefile{lof}{\defcounter {refsection}{0}\relax }\@writefile{lof}{\contentsline {figure}{\numberline {1}{\ignorespaces Speed-up of \textsc  {MISSH}\xspace  with respect to original implementation of \textsc  {CLARK-\emph  {S}}\xspace  . Spaced seeds \textsc  {Qclk}\relax }}{5}{figure.caption.1}\protected@file@percent }
\providecommand*\caption@xref[2]{\@setref\relax\@undefined{#1}}
\newlabel{fig:def}{{1}{5}{Speed-up of \missh with respect to original implementation of \clarks . Spaced seeds \textsc {Qclk}\relax }{figure.caption.1}{}}
\newlabel{fig:def@cref}{{[figure][1][]1}{[1][5][]5}}
\@writefile{toc}{\defcounter {refsection}{0}\relax }\@writefile{toc}{\contentsline {section}{\numberline {6}Spaced Seeds Personalisation}{5}{section.6}\protected@file@percent }
\@writefile{lof}{\defcounter {refsection}{0}\relax }\@writefile{lof}{\contentsline {figure}{\numberline {2}{\ignorespaces Speed-up brought by \textsc  {MISSH}\xspace  to \textsc  {CLARK-\emph  {S}}\xspace  with different spaced seeds of weight $22$.\relax }}{6}{figure.caption.2}\protected@file@percent }
\newlabel{fig:ss22}{{2}{6}{Speed-up brought by \missh to \clarks with different spaced seeds of weight $22$.\relax }{figure.caption.2}{}}
\newlabel{fig:ss22@cref}{{[figure][2][]2}{[1][6][]6}}
\@writefile{toc}{\defcounter {refsection}{0}\relax }\@writefile{toc}{\contentsline {subsection}{\numberline {6.1}Different Spaced Seeds with Equal Length and Weight}{6}{subsection.6.1}\protected@file@percent }
\newlabel{sec:ss22}{{6.1}{6}{Different Spaced Seeds with Equal Length and Weight}{subsection.6.1}{}}
\newlabel{sec:ss22@cref}{{[subsection][1][6]6.1}{[1][6][]6}}
\@writefile{lot}{\defcounter {refsection}{0}\relax }\@writefile{lot}{\contentsline {table}{\numberline {1}{\ignorespaces \textsc  {Time cost of spaced seeds generalisation}. The first row refers to \textsc  {CLARK-\emph  {S}}\xspace  with its original hashing, while the second one with \textsc  {MISSH}\xspace  hashing. In the last row the assignment speed-up of \textsc  {CLARK-\emph  {S}}\xspace  with \textsc  {MISSH}\xspace  exploitation is reported. All the data are obtained from $7$ executions of the programs on $4$ threads on the dataset ERR2270960 as explained in \cref  {sec:method}. The first column reports the average assignment time when the original set of spaced seeds is used; these data are used as reference. The second and fourth columns show average assignment time when \textsc  {Q4-6} and \textsc  {Q1-6} are used, respectively. The third column reports the slow-down of the execution on \textsc  {Q4-6} with respect to the reference; the last column shows the slow-down on \textsc  {Q1-6} with respect to the reference.\relax }}{7}{table.caption.3}\protected@file@percent }
\newlabel{tab:ss22cmp}{{1}{7}{\textsc {Time cost of spaced seeds generalisation}. The first row refers to \clarks with its original hashing, while the second one with \missh hashing. In the last row the assignment speed-up of \clarks with \missh exploitation is reported. All the data are obtained from $7$ executions of the programs on $4$ threads on the dataset ERR2270960 as explained in \cref {sec:method}. The first column reports the average assignment time when the original set of spaced seeds is used; these data are used as reference. The second and fourth columns show average assignment time when \textsc {Q4-6} and \textsc {Q1-6} are used, respectively. The third column reports the slow-down of the execution on \textsc {Q4-6} with respect to the reference; the last column shows the slow-down on \textsc {Q1-6} with respect to the reference.\relax }{table.caption.3}{}}
\newlabel{tab:ss22cmp@cref}{{[table][1][]1}{[1][7][]7}}
\@writefile{toc}{\defcounter {refsection}{0}\relax }\@writefile{toc}{\contentsline {subsection}{\numberline {6.2}Different Spaced Seeds with Variable Weight}{7}{subsection.6.2}\protected@file@percent }
\@writefile{lof}{\defcounter {refsection}{0}\relax }\@writefile{lof}{\contentsline {figure}{\numberline {3}{\ignorespaces Speed-up brought by \textsc  {MISSH}\xspace  to \textsc  {CLARK-\emph  {S}}\xspace  with different spaced seeds of variable weight.\relax }}{8}{figure.caption.4}\protected@file@percent }
\newlabel{fig:ssw}{{3}{8}{Speed-up brought by \missh to \clarks with different spaced seeds of variable weight.\relax }{figure.caption.4}{}}
\newlabel{fig:ssw@cref}{{[figure][3][]3}{[1][7][]8}}
\@writefile{toc}{\defcounter {refsection}{0}\relax }\@writefile{toc}{\contentsline {section}{\numberline {7}Conclusion}{8}{section.7}\protected@file@percent }
\abx@aux@nociteall
\abx@aux@cite{issh}
\abx@aux@segm{0}{0}{issh}
\@writefile{toc}{\defcounter {refsection}{0}\relax }\@writefile{toc}{\contentsline {section}{\numberline {8}Appendices}{9}{section.8}\protected@file@percent }
\@writefile{toc}{\defcounter {refsection}{0}\relax }\@writefile{toc}{\contentsline {subsection}{\numberline {8.1}Spaced Seeds}{9}{subsection.8.1}\protected@file@percent }
\newlabel{sec:ss}{{8.1}{9}{Spaced Seeds}{subsection.8.1}{}}
\newlabel{sec:ss@cref}{{[subsection][1][8]8.1}{[1][9][]9}}
\abx@aux@backref{9}{issh}{0}{9}{9}
\@writefile{toc}{\defcounter {refsection}{0}\relax }\@writefile{toc}{\contentsline {subsection}{\numberline {8.2}Time Measurements Summaries}{9}{subsection.8.2}\protected@file@percent }
\abx@aux@read@bbl@mdfivesum{BED2E2864731AE308F4C4909B8FA08F4}
\abx@aux@refcontextdefaultsdone
\abx@aux@defaultrefcontext{0}{clark:spaced}{nty/global//global/global}
\abx@aux@defaultrefcontext{0}{clark:clark}{nty/global//global/global}
\abx@aux@defaultrefcontext{0}{metaprob}{nty/global//global/global}
\abx@aux@defaultrefcontext{0}{issh}{nty/global//global/global}
\@writefile{lot}{\defcounter {refsection}{0}\relax }\@writefile{lot}{\contentsline {table}{\numberline {2}{\ignorespaces Summary of time performances on dataset SRR1804065.\relax }}{10}{table.caption.6}\protected@file@percent }
\newlabel{tab:srr}{{2}{10}{Summary of time performances on dataset SRR1804065.\relax }{table.caption.6}{}}
\newlabel{tab:srr@cref}{{[table][2][]2}{[1][10][]10}}
\@writefile{lot}{\defcounter {refsection}{0}\relax }\@writefile{lot}{\contentsline {table}{\numberline {3}{\ignorespaces Summary of time performances on dataset ERR2270960. \relax }}{10}{table.caption.7}\protected@file@percent }
\newlabel{tab:err}{{3}{10}{Summary of time performances on dataset ERR2270960. \relax }{table.caption.7}{}}
\newlabel{tab:err@cref}{{[table][3][]3}{[1][10][]10}}
\@writefile{lot}{\defcounter {refsection}{0}\relax }\@writefile{lot}{\contentsline {table}{\numberline {4}{\ignorespaces Summary of time performances on dataset Rlong.\relax }}{11}{table.caption.8}\protected@file@percent }
\newlabel{tab:rlong}{{4}{11}{Summary of time performances on dataset Rlong.\relax }{table.caption.8}{}}
\newlabel{tab:rlong@cref}{{[table][4][]4}{[1][10][]11}}
\@writefile{lot}{\defcounter {refsection}{0}\relax }\@writefile{lot}{\contentsline {table}{\numberline {5}{\ignorespaces Summary of time performances on dataset SRR1804065\xspace  with variable set of spaced seeds.\relax }}{11}{table.caption.9}\protected@file@percent }
\newlabel{tab:wsrr}{{5}{11}{Summary of time performances on dataset \srr with variable set of spaced seeds.\relax }{table.caption.9}{}}
\newlabel{tab:wsrr@cref}{{[table][5][]5}{[1][10][]11}}
\@writefile{lot}{\defcounter {refsection}{0}\relax }\@writefile{lot}{\contentsline {table}{\numberline {6}{\ignorespaces Summary of time performances on dataset Rlong with variable set of spaced seeds.\relax }}{11}{table.caption.10}\protected@file@percent }
\newlabel{tab:wrlong}{{6}{11}{Summary of time performances on dataset Rlong with variable set of spaced seeds.\relax }{table.caption.10}{}}
\newlabel{tab:wrlong@cref}{{[table][6][]6}{[1][10][]11}}
\gdef \@abspage@last{11}
