algo,qclk,qqt,qqc,qqqt,qqqc
clark-s,1690.88833333333,1876.13142857143,1.10955371303137,5002.43571428571,2.95846604158902
missh,1009.85457142857,1006.74671428571,0.996922470590532,2397.55333333333,2.37415703326636
Speed-up,1.67438795760597,1.86355853160399,,2.08647525989789,
