seeds,clarksTime,clarksSD,clarksOccurs,misshTime,misshSD,misshOccurs,speedup,clarksTott,misshTott,totspu
Qw14,1405.2425,27.6774213032935,8,347.321375,3.8151146748352,8,4.04594304050535,1491.12,433.761,3.43765345432162
Qw18,3001.9175,63.6600746712008,8,1360.935,20.6187023285726,8,2.20577580854339,3757.04,2217.14714285714,1.69453796158899
Qw22,4199.34875,442.976857423162,8,2081.25333333333,169.552172226329,6,2.01770187355055,6833.11625,4274.62,1.59853185780256
