n_cpus;impl_code;n_sps;assign_time;tot_time;n_obj;seeds
4;0;3;4472.15;6984.94;5935571;spk31w22_n1-3
4;0;3;1727.09;4712.69;5935571;spk31w22_n4-6
4;0;6;4132.23;8751.67;5935571;spk31w22_n1-6
4;2;3;852.999;2752.44;5935571;spk31w22_n1-3
4;2;3;1066.39;3565.55;5935571;spk31w22_n4-6
4;2;6;2195.46;6566.18;5935571;spk31w22_n1-6
4;0;3;1708.27;4089.84;5935571;spk31w22_n1-3
4;0;3;1862.8;3737.12;5935571;spk31w22_n4-6
4;0;6;5473.55;9947.29;5935571;spk31w22_n1-6
4;2;3;955.548;3084.8;5935571;spk31w22_n1-3
4;2;3;762.065;3094.44;5935571;spk31w22_n4-6
4;2;6;2416.98;6817.68;5935571;spk31w22_n1-6
4;0;3;1267.97;3102;5935571;spk31w22_n1-3
4;0;3;1861.72;3752.29;5935571;spk31w22_n4-6
4;0;6;4009.21;8455.84;5935571;spk31w22_n1-6
4;2;3;1320.31;3865.87;5935571;spk31w22_n1-3
4;2;3;835.832;2899.93;5935571;spk31w22_n4-6
4;2;6;2564.97;7178.77;5935571;spk31w22_n1-6
4;0;3;1441.02;3545.34;5935571;spk31w22_n1-3
4;0;3;1861.5;3845.03;5935571;spk31w22_n4-6
4;0;6;5745.96;10599.5;5935571;spk31w22_n1-6
4;2;3;1002.96;3194.46;5935571;spk31w22_n1-3
4;2;3;1067.81;3381.56;5935571;spk31w22_n4-6
4;2;6;2310.72;7521.18;5935571;spk31w22_n1-6
4;0;3;1977.95;4143.37;5935571;spk31w22_n1-3
4;0;3;1813.73;4790.48;5935571;spk31w22_n4-6
4;0;6;4350.02;9497.51;5935571;spk31w22_n1-6
4;2;3;976.421;2949.78;5935571;spk31w22_n1-3
4;2;3;1047.16;4186.6;5935571;spk31w22_n4-6
4;2;6;4538.02;9470.77;5935571;spk31w22_n1-6
4;0;3;1845.1;3758.46;5935571;spk31w22_n1-3
4;0;3;2036.37;3979.45;5935571;spk31w22_n4-6
4;0;6;6479.69;10818.1;5935571;spk31w22_n1-6
4;2;3;1155.72;3036.03;5935571;spk31w22_n1-3
4;2;3;1092.32;2966.38;5935571;spk31w22_n4-6
4;2;6;2591.46;6832.15;5935571;spk31w22_n1-6
4;0;3;1905.02;4685.73;5935571;spk31w22_n1-3
4;0;3;1969.71;3820.59;5935571;spk31w22_n4-6
4;0;6;4826.39;9078.41;5935571;spk31w22_n1-6
4;2;3;805.024;2589.16;5935571;spk31w22_n1-3
4;2;3;1175.65;3047.62;5935571;spk31w22_n4-6
4;2;6;2305.73;6523.1;5935571;spk31w22_n1-6
