n_cpus;impl_code;n_sps;assign_time;tot_time;n_obj;seeds
64;2;3;138.277;1738.5;21873781;default
64;0;3;207.019;1867.82;21873781;default
16;2;3;206.559;3070.36;21873781;default
4;2;3;888.843;3232.7;21873781;default
2;2;3;1809.09;4152.95;21873781;default
1;2;3;3066.12;5409.96;21873781;default
32;0;3;366.944;4086.19;21873781;default
16;0;3;414.993;4000.51;21873781;default
4;2;3;872.707;3527.9;21873781;default
64;0;3;222.183;1827.99;21873781;default
2;2;3;1736.65;3971.22;21873781;default
32;0;3;302.69;2877.12;21873781;default
64;0;3;213.17;1845.41;21873781;default
4;0;3;1557.19;3828.65;21873781;default
1;2;3;3030.57;5686.19;21873781;default
2;0;3;3247.78;5526.6;21873781;default
4;0;3;1535.1;3804.16;21873781;default
16;2;3;208.781;2849.2;21873781;default
32;0;3;298.457;2595.59;21873781;default
4;2;3;1191.39;3623.63;21873781;default
1;0;3;5536.18;7954.33;21873781;default
2;0;3;3738.32;6298.85;21873781;default
64;0;3;216.472;1816.38;21873781;default
32;2;3;216.866;2426.92;21873781;default
4;2;3;1509.37;4102.59;21873781;default
32;2;3;199.832;2810.46;21873781;default
16;2;3;205.619;2898.76;21873781;default
2;2;3;2004.98;4680.18;21873781;default
4;0;3;1744.89;4148.88;21873781;default
1;0;3;6265.8;8836.47;21873781;default
2;2;3;2028.99;4765.76;21873781;default
32;0;3;309.998;2503.36;21873781;default
16;0;3;353.444;2727.61;21873781;default
4;0;3;1748.62;4267.28;21873781;default
64;2;3;133.553;1742.82;21873781;default
4;2;3;1009.59;3332.03;21873781;default
1;2;3;3732.16;6382.29;21873781;default
32;2;3;230.804;2557.29;21873781;default
16;2;3;246.936;2602.31;21873781;default
2;0;3;4237.44;6922.07;21873781;default
4;2;3;886.449;3305.21;21873781;default
32;0;3;314.526;2709.07;21873781;default
16;0;3;356.577;2758.4;21873781;default
1;2;3;3466.11;5557.74;21873781;default
64;2;3;135.554;1912.04;21873781;default
32;0;3;300.686;2959.53;21873781;default
4;0;3;1653.4;4269.08;21873781;default
2;0;3;3573.84;6361.33;21873781;default
16;2;3;215.681;3052.38;21873781;default
64;0;3;202.661;1810.97;21873781;default
4;0;3;1700.56;4346.35;21873781;default
32;2;3;185.482;2634.69;21873781;default
2;2;3;2013.43;4759.22;21873781;default
1;0;3;6398.66;8982.34;21873781;default
32;0;3;345.002;2804.38;21873781;default
16;0;3;394.038;2908.69;21873781;default
4;2;3;2199.78;4737.44;21873781;default
32;0;3;327.969;2503.78;21873781;default
16;0;3;375.19;2517.71;21873781;default
2;2;3;2079.98;4627.05;21873781;default
4;2;3;1054.48;3578.08;21873781;default
32;2;3;177.794;3128.66;21873781;default
1;0;3;6279.88;8779.33;21873781;default
2;0;3;3582.9;6083.96;21873781;default
4;0;3;1813;4096.65;21873781;default
16;0;3;397.608;2975.23;21873781;default
4;0;3;1880.09;3724.58;21873781;default
16;0;3;368.021;3044.16;21873781;default
2;0;3;3544.5;5470.65;21873781;default
1;2;3;3700.54;6264.69;21873781;default
4;2;3;883.39;3497.93;21873781;default
16;2;3;200.202;3098.84;21873781;default
2;2;3;1912.43;4689;21873781;default
4;2;3;999.881;3699.45;21873781;default
1;2;3;3525.83;6144.5;21873781;default
32;2;3;236.799;3332.56;21873781;default
16;2;3;250.633;3245.12;21873781;default
2;2;3;1907.39;4440.34;21873781;default
32;0;3;297.63;2917.22;21873781;default
16;0;3;347.048;2967.28;21873781;default
4;0;3;1679;4146.82;21873781;default
1;0;3;6506.19;9156.15;21873781;default
4;0;3;3212.15;5750.97;21873781;default
16;2;3;235.494;3350.06;21873781;default
2;0;3;6162.55;8934.82;21873781;default
32;2;3;227.15;2932.44;21873781;default
32;0;3;365.017;3385.92;21873781;default
32;0;3;340.698;3173.97;21873781;default
16;0;3;378.539;3425.04;21873781;default
2;0;3;5008.71;8006.86;21873781;default
2;2;3;2262.76;4508.34;21873781;default
2;2;3;1786.31;3918.95;21873781;default
2;0;6;12717.3;17436.5;21873781;spk31w22_n1-6
2;0;6;8628.96;12844.5;21873781;spk31w22_n1-6
2;2;6;5058.49;9319.74;21873781;spk31w22_n1-6
2;2;6;4577.28;8813.86;21873781;spk31w22_n1-6
2;0;4;6360.49;9573.1;21873781;spk31w22_n2-5
2;0;4;5168.31;8762.3;21873781;spk31w22_n2-5
2;0;6;9006.17;13184.1;21873781;spk31w22_n1-6
2;2;4;2805.87;6093.04;21873781;spk31w22_n2-5
2;2;4;2631.98;6128.1;21873781;spk31w22_n2-5
2;0;6;7586.82;11602.1;21873781;spk31w22_n1-6
2;0;4;5909.58;9204.59;21873781;spk31w22_n2-5
2;2;6;4534.3;8647.53;21873781;spk31w22_n1-6
2;0;4;5107.28;8330.79;21873781;spk31w22_n2-5
2;2;6;4496.3;8592.05;21873781;spk31w22_n1-6
2;2;4;2969.14;6889.34;21873781;spk31w22_n2-5
2;0;6;7875.03;11951.7;21873781;spk31w22_n1-6
2;2;4;2845.01;6071.47;21873781;spk31w22_n2-5
2;0;4;6758.68;10124.8;21873781;spk31w22_n2-5
2;0;6;6917.22;10807.1;21873781;spk31w22_n1-6
4;0;2;1134.36;2793.73;21873781;spk31w22_n2-3
2;2;6;4153.19;8253.04;21873781;spk31w22_n1-6
4;0;2;1229.7;2599.12;21873781;spk31w22_n2-3
2;0;4;5896.45;9894.06;21873781;spk31w22_n2-5
4;2;2;600.238;1748.29;21873781;spk31w22_n2-3
4;2;2;625.447;1766.42;21873781;spk31w22_n2-3
4;0;2;1089.3;2342.93;21873781;spk31w22_n2-3
2;2;4;2707.93;6135.05;21873781;spk31w22_n2-5
4;0;2;1167.06;2314.44;21873781;spk31w22_n2-3
2;2;6;3932.11;8560.19;21873781;spk31w22_n1-6
