\BOOKMARK [1][-]{section.1}{\376\377\000I\000n\000t\000r\000o\000d\000u\000c\000t\000i\000o\000n}{}% 1
\BOOKMARK [1][-]{section.2}{\376\377\000D\000e\000s\000c\000r\000i\000p\000t\000i\000o\000n\000\040\000o\000f\000\040\000t\000h\000e\000\040\000W\000o\000r\000k}{}% 2
\BOOKMARK [1][-]{section.3}{\376\377\000E\000x\000p\000e\000r\000i\000m\000e\000n\000t\000a\000l\000\040\000S\000e\000t\000u\000p}{}% 3
\BOOKMARK [1][-]{section.4}{\376\377\000D\000e\000b\000u\000g\000g\000i\000n\000g}{}% 4
\BOOKMARK [1][-]{section.5}{\376\377\000E\000m\000p\000i\000r\000i\000c\000a\000l\000\040\000T\000i\000m\000e\000\040\000P\000e\000r\000f\000o\000r\000m\000a\000n\000c\000e}{}% 5
\BOOKMARK [2][-]{subsection.5.1}{\376\377\000M\000e\000t\000h\000o\000d\000s}{section.5}% 6
\BOOKMARK [2][-]{subsection.5.2}{\376\377\000D\000i\000s\000c\000u\000s\000s\000i\000o\000n}{section.5}% 7
\BOOKMARK [1][-]{section.6}{\376\377\000S\000p\000a\000c\000e\000d\000\040\000S\000e\000e\000d\000s\000\040\000P\000e\000r\000s\000o\000n\000a\000l\000i\000s\000a\000t\000i\000o\000n}{}% 8
\BOOKMARK [2][-]{subsection.6.1}{\376\377\000D\000i\000f\000f\000e\000r\000e\000n\000t\000\040\000S\000p\000a\000c\000e\000d\000\040\000S\000e\000e\000d\000s\000\040\000w\000i\000t\000h\000\040\000E\000q\000u\000a\000l\000\040\000L\000e\000n\000g\000t\000h\000\040\000a\000n\000d\000\040\000W\000e\000i\000g\000h\000t}{section.6}% 9
\BOOKMARK [2][-]{subsection.6.2}{\376\377\000D\000i\000f\000f\000e\000r\000e\000n\000t\000\040\000S\000p\000a\000c\000e\000d\000\040\000S\000e\000e\000d\000s\000\040\000w\000i\000t\000h\000\040\000V\000a\000r\000i\000a\000b\000l\000e\000\040\000W\000e\000i\000g\000h\000t}{section.6}% 10
\BOOKMARK [1][-]{section.7}{\376\377\000C\000o\000n\000c\000l\000u\000s\000i\000o\000n}{}% 11
\BOOKMARK [1][-]{section.8}{\376\377\000A\000p\000p\000e\000n\000d\000i\000c\000e\000s}{}% 12
\BOOKMARK [2][-]{subsection.8.1}{\376\377\000S\000p\000a\000c\000e\000d\000\040\000S\000e\000e\000d\000s}{section.8}% 13
\BOOKMARK [2][-]{subsection.8.2}{\376\377\000T\000i\000m\000e\000\040\000M\000e\000a\000s\000u\000r\000e\000m\000e\000n\000t\000s\000\040\000S\000u\000m\000m\000a\000r\000i\000e\000s}{section.8}% 14
