cpu,clarksTime,clarksSD,clarksOccurs,misshTime,misshSD,misshOccurs,speedup,clarksTott,misshTott,totspu
1,4230.13333333333,337.55611110846,6,2860.225,143.432756951356,4,1.47895124800788,6763.98333333333,5044.79857142857,1.34078362843691
2,3832.09,361.302534657591,9,2478.05222222222,297.930010311893,9,1.54641212385893,6371.61,5042.986,1.26345978354887
4,1897.77333333333,144.232421574809,3,672.460363636364,151.989280662995,11,2.82213411519309,4435.0025,3139.41125,1.41268605697963
8,NA,NA,0,584.943333333333,24.8471136164076,6,NA,NA,3089.19,NA
16,441.497428571429,13.7928494863237,7,285.1096,27.9641834026631,10,1.54851828409646,2965.9975,2638.248,1.12422998141191
32,213.857714285714,11.3157853124781,7,140.326,20.9906898001403,8,1.52400634441026,2669.87428571429,2594.21555555556,1.02916439614924
