% $ biblatex auxiliary file $
% $ biblatex bbl format version 3.1 $
% Do not modify the above lines!
%
% This is an auxiliary file used by the 'biblatex' package.
% This file may safely be deleted. It will be recreated by
% biber as required.
%
\begingroup
\makeatletter
\@ifundefined{ver@biblatex.sty}
  {\@latex@error
     {Missing 'biblatex' package}
     {The bibliography requires the 'biblatex' package.}
      \aftergroup\endinput}
  {}
\endgroup


\refsection{0}
  \datalist[entry]{nty/global//global/global}
    \entry{clark:spaced}{article}{}
      \name{author}{2}{}{%
        {{hash=703e79c893239f2afce436ce220fe6ec}{%
           family={Ounit},
           familyi={O\bibinitperiod},
           given={Rachid},
           giveni={R\bibinitperiod}}}%
        {{hash=7d2d637c86220863f35efb2ff1308ad5}{%
           family={Lonardi},
           familyi={L\bibinitperiod},
           given={Stefano},
           giveni={S\bibinitperiod}}}%
      }
      \strng{namehash}{e293ba67208861e8de09a0344da13e61}
      \strng{fullhash}{e293ba67208861e8de09a0344da13e61}
      \strng{bibnamehash}{e293ba67208861e8de09a0344da13e61}
      \strng{authorbibnamehash}{e293ba67208861e8de09a0344da13e61}
      \strng{authornamehash}{e293ba67208861e8de09a0344da13e61}
      \strng{authorfullhash}{e293ba67208861e8de09a0344da13e61}
      \field{sortinit}{O}
      \field{sortinithash}{2cd7140a07aea5341f9e2771efe90aae}
      \field{labelnamesource}{author}
      \field{labeltitlesource}{title}
      \field{issn}{1367-4803}
      \field{journaltitle}{Bioinformatics}
      \field{langid}{english}
      \field{month}{08}
      \field{note}{Si veda anche l'allegato}
      \field{number}{24}
      \field{title}{Higher classification sensitivity of short metagenomic reads with CLARK-S}
      \field{volume}{32}
      \field{year}{2016}
      \verb{doi}
      \verb 10.1093/bioinformatics/btw542
      \endverb
      \keyw{accademic}
    \endentry
    \entry{clark:clark}{article}{}
      \name{author}{4}{}{%
        {{hash=703e79c893239f2afce436ce220fe6ec}{%
           family={Ounit},
           familyi={O\bibinitperiod},
           given={Rachid},
           giveni={R\bibinitperiod}}}%
        {{hash=17c44df2dcc4c8222679b4b765f46a68}{%
           family={Wanamaker},
           familyi={W\bibinitperiod},
           given={Steve},
           giveni={S\bibinitperiod}}}%
        {{hash=87d2a8287d5326134801dbb90d05ed18}{%
           family={Close},
           familyi={C\bibinitperiod},
           given={Timothy\bibnamedelima J.},
           giveni={T\bibinitperiod\bibinitdelim J\bibinitperiod}}}%
        {{hash=7d2d637c86220863f35efb2ff1308ad5}{%
           family={Lonardi},
           familyi={L\bibinitperiod},
           given={Stefano},
           giveni={S\bibinitperiod}}}%
      }
      \strng{namehash}{5d45ea8f08c3e3b7161f584684407b13}
      \strng{fullhash}{a86c5909d85c9ac91b88629a4a56c784}
      \strng{bibnamehash}{5d45ea8f08c3e3b7161f584684407b13}
      \strng{authorbibnamehash}{5d45ea8f08c3e3b7161f584684407b13}
      \strng{authornamehash}{5d45ea8f08c3e3b7161f584684407b13}
      \strng{authorfullhash}{a86c5909d85c9ac91b88629a4a56c784}
      \field{sortinit}{O}
      \field{sortinithash}{2cd7140a07aea5341f9e2771efe90aae}
      \field{labelnamesource}{author}
      \field{labeltitlesource}{title}
      \field{journaltitle}{BMC Genomics}
      \field{langid}{english}
      \field{month}{03}
      \field{note}{Si veda anche l'allegato}
      \field{title}{CLARK: fast and accurate classification of metagenomic and genomic sequences using discriminative k-mers}
      \field{volume}{16}
      \field{year}{2015}
      \verb{doi}
      \verb 10.1186/s12864-015-1419-2
      \endverb
      \keyw{accademic}
    \endentry
    \entry{metaprob}{article}{}
      \name{author}{3}{}{%
        {{hash=ba3e0f58bf4f4d158e68fcc7ca23cad1}{%
           family={Girotto},
           familyi={G\bibinitperiod},
           given={Samuele},
           giveni={S\bibinitperiod}}}%
        {{hash=76574c826d106a74754f3ac4e545d1a1}{%
           family={Pizzi},
           familyi={P\bibinitperiod},
           given={Cinzia},
           giveni={C\bibinitperiod}}}%
        {{hash=1ac67787639a4fd081b1c523200ead42}{%
           family={Comin},
           familyi={C\bibinitperiod},
           given={Matteo},
           giveni={M\bibinitperiod}}}%
      }
      \strng{namehash}{141486a881c18055a0e26752456ab39c}
      \strng{fullhash}{141486a881c18055a0e26752456ab39c}
      \strng{bibnamehash}{141486a881c18055a0e26752456ab39c}
      \strng{authorbibnamehash}{141486a881c18055a0e26752456ab39c}
      \strng{authornamehash}{141486a881c18055a0e26752456ab39c}
      \strng{authorfullhash}{141486a881c18055a0e26752456ab39c}
      \field{sortinit}{G}
      \field{sortinithash}{32d67eca0634bf53703493fb1090a2e8}
      \field{labelnamesource}{author}
      \field{labeltitlesource}{title}
      \field{issn}{1367-4803}
      \field{journaltitle}{Bioinformatics}
      \field{month}{08}
      \field{number}{17}
      \field{title}{{MetaProb: accurate metagenomic reads binning based on probabilistic sequence signatures}}
      \field{volume}{32}
      \field{year}{2016}
      \field{pages}{i567\bibrangedash i575}
      \range{pages}{-1}
      \verb{doi}
      \verb 10.1093/bioinformatics/btw466
      \endverb
    \endentry
    \entry{issh}{article}{}
      \name{author}{4}{}{%
        {{hash=fe4e5fcdb271d4b1c342c8bc2f1e8c43}{%
           family={Petrucci},
           familyi={P\bibinitperiod},
           given={Enrico},
           giveni={E\bibinitperiod}}}%
        {{hash=7b3003bbff11aa16be5882c8471e9516}{%
           family={Noé},
           familyi={N\bibinitperiod},
           given={Laurent},
           giveni={L\bibinitperiod}}}%
        {{hash=76574c826d106a74754f3ac4e545d1a1}{%
           family={Pizzi},
           familyi={P\bibinitperiod},
           given={Cinzia},
           giveni={C\bibinitperiod}}}%
        {{hash=1ac67787639a4fd081b1c523200ead42}{%
           family={Comin},
           familyi={C\bibinitperiod},
           given={Matteo},
           giveni={M\bibinitperiod}}}%
      }
      \strng{namehash}{8e120f4f20748b2a1f2bc2f354d46c33}
      \strng{fullhash}{8da8fa4e826b214aea3e170a4ae531bc}
      \strng{bibnamehash}{8e120f4f20748b2a1f2bc2f354d46c33}
      \strng{authorbibnamehash}{8e120f4f20748b2a1f2bc2f354d46c33}
      \strng{authornamehash}{8e120f4f20748b2a1f2bc2f354d46c33}
      \strng{authorfullhash}{8da8fa4e826b214aea3e170a4ae531bc}
      \field{sortinit}{P}
      \field{sortinithash}{ff3bcf24f47321b42cb156c2cc8a8422}
      \field{labelnamesource}{author}
      \field{labeltitlesource}{title}
      \field{journaltitle}{Journal of Computational Biology}
      \field{month}{12}
      \field{title}{Iterative Spaced Seed Hashing: Closing the Gap Between Spaced Seed Hashing and k -mer Hashing}
      \field{volume}{27}
      \field{year}{2019}
      \verb{doi}
      \verb 10.1089/cmb.2019.0298
      \endverb
    \endentry
  \enddatalist
\endrefsection
\endinput

