cpu,clarksTime,clarksSD,clarksOccurs,misshTime,misshSD,misshOccurs,speedup,clarksTott,misshTott,totspu
1,5554.872,292.422273387875,10,2930.433,89.4809082120005,10,1.89558061897337,7850.348,5258.906,1.49277207084515
2,2922.693,129.491990061162,10,1582.467,53.4964391442189,10,1.84692192633401,5183.589,4244.846,1.22114889444753
4,2934.955,624.394663640981,10,1368.382,61.1912978199424,10,2.14483601801251,5501.763,4026.929,1.3662428614957
8,743.711,34.7805145543689,10,438.208625,39.4736066321988,8,1.69716193970395,3334.422,3197.9825,1.04266424222146
16,360.324666666667,7.62704990587231,6,208.43275,5.16545992627955,4,1.72873344839842,2801.20166666667,2937.065,0.953741802332147
32,357.680555555556,14.9699551528312,9,240.4612,41.9651807061521,5,1.48747721277094,2809.65222222222,2841.48,0.988798873200664
64,212.274,6.75808320951041,4,160.01925,32.4307143859541,4,1.32655289910433,2251.0775,2670.875,0.842823980905134
