Division,WeightClassKg,Place,Name,Team,BodyweightKg,Best3SquatKg,Best3BenchKg,Best3DeadliftKg,TotalKg,Equipment,Event,Sex
Boys,51.71,1,Weston Griswold,Lazbuddie,51.26,154.22,65.77,127.01,347,Single-ply,SBD,M
Boys,51.71,2,Jonathon Luna,Tulia,50.8,104.33,74.84,129.27,308.44,Single-ply,SBD,M
Boys,51.71,3,Carlos Bravo,Olton,48.81,102.06,54.43,106.59,263.08,Single-ply,SBD,M
Boys,51.71,4,Arturo Aguillon,Bovina,48.99,88.45,56.7,117.93,263.08,Single-ply,SBD,M
Boys,51.71,5,Erli Rueda,Bovina,51.71,88.45,45.36,106.59,240.4,Single-ply,SBD,M
Boys,51.71,6,Corey Chavira,Levelland,50.26,83.91,45.36,83.91,213.19,Single-ply,SBD,M
Boys,51.71,7,Fernando Corpus,Amarillo Highland Park,41.55,65.77,22.68,65.77,154.22,Single-ply,SBD,M
Boys,55.79,DQ,Matt Longoria,Tulia,51.8,92.99,,,,Single-ply,SBD,M
Boys,55.79,1,Troy Morales,Floydada,54.25,156.49,83.91,147.42,387.82,Single-ply,SBD,M
Boys,59.87,2,Jaime Longoria,Levelland,55.88,136.08,79.38,158.76,374.21,Single-ply,SBD,M
Boys,55.79,3,Oscar Trejo,Sunray,54.98,136.08,56.7,142.88,335.66,Single-ply,SBD,M
Boys,55.79,4,Frankie Mendoza,Abernathy,55.07,102.06,74.84,136.08,312.98,Single-ply,SBD,M
Boys,55.79,5,Angel III Hernandez,Levelland,54.34,111.13,74.84,124.74,310.71,Single-ply,SBD,M
Boys,59.87,6,Omero Bonilla,Sunray,55.97,122.47,70.31,115.67,308.44,Single-ply,SBD,M
Boys,55.79,7,Carson DeFever,Shallowater,52.89,92.99,81.65,115.67,290.3,Single-ply,SBD,M
Boys,55.79,8,Juan Pinela,Bovina,52.98,95.25,54.43,117.93,267.62,Single-ply,SBD,M
Boys,55.79,9,Eddie Fierro,Sunray,52.8,97.52,52.16,95.25,244.94,Single-ply,SBD,M
Boys,55.79,10,Jason David,Amarillo Highland Park,55.34,68.04,61.23,97.52,226.8,Single-ply,SBD,M
Boys,55.79,DQ,Gabriel Hancock,Bovina,52.71,,,,,Single-ply,SBD,M
Boys,59.87,1,Angel Guerrero,Levelland,59.69,172.37,92.99,183.7,449.06,Single-ply,SBD,M
Boys,59.87,2,Jonathan Valderas,Levelland,57.97,151.95,81.65,136.08,369.68,Single-ply,SBD,M
Boys,59.87,3,Pablo Hinojosa,Lamesa,58.33,136.08,70.31,133.81,340.19,Single-ply,SBD,M
Boys,59.87,4,Julian Gaspar,Sunray,58.24,122.47,68.04,133.81,324.32,Single-ply,SBD,M
Boys,59.87,5,Marcus Renteria,Lamesa,58.24,113.4,79.38,131.54,324.32,Single-ply,SBD,M
Boys,59.87,6,Gerardo Ortiz,Bovina,58.42,120.2,68.04,136.08,324.32,Single-ply,SBD,M
Boys,59.87,7,Ramiro Nicolas,Bovina,59.33,108.86,68.04,142.88,319.78,Single-ply,SBD,M
Boys,59.87,8,Levi Wright,Slaton,58.33,115.67,68.04,129.27,312.98,Single-ply,SBD,M
Boys,59.87,9,Eric Rivas,Seagraves,58.97,120.2,68.04,124.74,312.98,Single-ply,SBD,M
Boys,59.87,10,Tyler Munoz,Vega,57.79,102.06,81.65,113.4,297.1,Single-ply,SBD,M
Boys,59.87,11,Cesar Medrano,Sudan,59.42,102.06,70.31,124.74,297.1,Single-ply,SBD,M
Boys,59.87,12,Anthony Pondo,Tulia,57.61,86.18,58.97,113.4,258.55,Single-ply,SBD,M
Boys,59.87,13,Luke Ford,Hale Center,57.52,65.77,43.09,86.18,195.04,Single-ply,SBD,M
Boys,59.87,DQ,Braedon Gibson,Lamesa,57.33,,,,,Single-ply,SBD,M
Boys,67.13,1,Dusty Ortiz,Lamesa,66.86,163.29,102.06,181.44,446.79,Single-ply,SBD,M
Boys,67.13,2,Kyle Stroud,Stinnett West Texas,66.04,142.88,83.91,174.63,401.43,Single-ply,SBD,M
Boys,67.13,3,Chris Muniz,Levelland,63.78,142.88,77.11,156.49,376.48,Single-ply,SBD,M
Boys,67.13,4,Alberto Flores,Olton,64.86,149.69,83.91,142.88,376.48,Single-ply,SBD,M
Boys,67.13,5,Michael Pardo,Hale Center,64.95,133.81,92.99,142.88,369.68,Single-ply,SBD,M
Boys,67.13,6,Cullen Holt,Plainview,64.05,138.35,68.04,142.88,349.27,Single-ply,SBD,M
Boys,67.13,7,Bobby Clift,Canyon Randall,62.69,142.88,77.11,124.74,344.73,Single-ply,SBD,M
Boys,67.13,8,Miguel Herrera,Sunray,65.32,133.81,79.38,129.27,342.46,Single-ply,SBD,M
Boys,67.13,9,Marco Terrones,Friona,63.05,115.67,77.11,147.42,340.19,Single-ply,SBD,M
Boys,67.13,10,Jorge Luna,Bovina,60.69,120.2,81.65,136.08,337.93,Single-ply,SBD,M
Boys,67.13,11,Levi Mills,Levelland,63.32,108.86,81.65,136.08,326.59,Single-ply,SBD,M
Boys,67.13,12,Caelon Gibson,Lamesa,62.32,113.4,70.31,127.01,310.71,Single-ply,SBD,M
Boys,74.84,13,Zach Strickland,Shallowater,67.22,99.79,77.11,131.54,308.44,Single-ply,SBD,M
Boys,67.13,14,Steven Smallwood,Levelland,63.5,117.93,77.11,108.86,303.91,Single-ply,SBD,M
Boys,67.13,15,Zachary Galloway,Hale Center,62.41,102.06,70.31,115.67,288.03,Single-ply,SBD,M
Boys,67.13,16,Nolan Willingham,Canyon Randall,60.24,83.91,68.04,124.74,276.69,Single-ply,SBD,M
Boys,67.13,17,Koby Perez,Shallowater,66.77,115.67,65.77,90.72,272.16,Single-ply,SBD,M
Boys,67.13,18,Josh Brown #10,Panhandle,65.86,90.72,68.04,102.06,260.82,Single-ply,SBD,M
Boys,67.13,19,Marq Burns,Amarillo Highland Park,67.04,102.06,52.16,106.59,260.82,Single-ply,SBD,M
Boys,67.13,20,Jacob Buxton,Hale Center,66.77,83.91,56.7,92.99,233.6,Single-ply,SBD,M
Boys,67.13,DQ,JR Sullivan,Olton,61.23,124.74,,,,Single-ply,SBD,M
Boys,67.13,DQ,Dex Baker,Sudan,66.04,102.06,,,,Single-ply,SBD,M
Boys,67.13,DQ,Miguel Dominguez,Bovina,64.59,83.91,,,,Single-ply,SBD,M
Boys,74.84,DQ,Brady Boyd,Bushland,67.31,108.86,,,,Single-ply,SBD,M
Boys,67.13,DQ,Rigo Galaviz,Sunray,61.87,,,,,Single-ply,SBD,M
Boys,74.84,1,Chandler Green,Levelland,73.21,172.37,111.13,167.83,451.32,Single-ply,SBD,M
Boys,74.84,2,Brandon Guerrero,Memphis,70.58,158.76,88.45,165.56,412.77,Single-ply,SBD,M
Boys,74.84,3,Edward Jalomo,Olton,70.03,156.49,83.91,161.03,401.43,Single-ply,SBD,M
Boys,74.84,4,Emilio Sandoval,Olton,72.03,151.95,88.45,158.76,399.16,Single-ply,SBD,M
Boys,74.84,5,Brendan Harris,Amarillo Highland Park,68.22,147.42,83.91,163.29,394.63,Single-ply,SBD,M
Boys,74.84,6,Uriel Delgado,Sudan,74.12,154.22,77.11,147.42,378.75,Single-ply,SBD,M
Boys,82.1,7,Ceaser Aguirre,Amarillo Highland Park,75.07,136.08,86.18,147.42,369.68,Single-ply,SBD,M
Boys,74.84,8,Matthew Race,Levelland,69.49,138.35,79.38,147.42,365.14,Single-ply,SBD,M
Boys,74.84,9,Eric Waters,Abernathy,72.67,136.08,68.04,161.03,365.14,Single-ply,SBD,M
Boys,74.84,10,Christian Axelsen,Sunray,73.84,124.74,86.18,151.95,362.87,Single-ply,SBD,M
Boys,74.84,11,Chris Taylor #11,Amarillo Highland Park,72.39,124.74,79.38,156.49,360.61,Single-ply,SBD,M
Boys,74.84,12,Casey Redden,Hale Center,67.59,122.47,92.99,140.61,356.07,Single-ply,SBD,M
Boys,74.84,13,Abdiel Ramos,Bovina,73.48,122.47,83.91,149.69,356.07,Single-ply,SBD,M
Boys,74.84,14,Michael Garcia #9,Friona,74.84,124.74,95.25,133.81,353.8,Single-ply,SBD,M
Boys,74.84,15,Lance Mullins,Amarillo Highland Park,73.48,129.27,63.5,154.22,347,Single-ply,SBD,M
Boys,74.84,16,Isaiah Carrasco,Plainview,68.13,129.27,77.11,136.08,342.46,Single-ply,SBD,M
Boys,74.84,17,Edgar Martinez #2,Memphis,74.66,131.54,72.57,138.35,342.46,Single-ply,SBD,M
Boys,74.84,18,Dallas Cox,Lazbuddie,71.12,136.08,70.31,131.54,337.93,Single-ply,SBD,M
Boys,74.84,19,Omar Ramos,Friona,69.4,117.93,90.72,124.74,333.39,Single-ply,SBD,M
Boys,74.84,20,Adrian Prieto,Friona,74.39,122.47,79.38,129.27,331.12,Single-ply,SBD,M
Boys,74.84,21,Phong Nguyen,Amarillo Highland Park,68.95,129.27,68.04,129.27,326.59,Single-ply,SBD,M
Boys,74.84,22,Kennedy Prescott,Amarillo Highland Park,70.4,117.93,79.38,127.01,324.32,Single-ply,SBD,M
Boys,82.1,23,Jacoby Atwood,Vega,74.93,102.06,102.06,117.93,322.05,Single-ply,SBD,M
Boys,74.84,24,John Paul Acevedo,Hale Center,73.75,102.06,83.91,133.81,319.78,Single-ply,SBD,M
Boys,74.84,25,Jose Trejo,Sudan,73.66,102.06,61.23,129.27,292.57,Single-ply,SBD,M
Boys,74.84,26,Luis Morales,Vega,67.86,83.91,81.65,97.52,263.08,Single-ply,SBD,M
Boys,74.84,27,Logan Falkenberry,Whiteface,72.57,72.57,47.63,90.72,210.92,Single-ply,SBD,M
Boys,74.84,28,James Hill,Tulia,74.12,61.23,43.09,74.84,179.17,Single-ply,SBD,M
Boys,74.84,DQ,Nathan Leyendecker,Plainview,69.49,108.86,,,,Single-ply,SBD,M
Boys,82.1,1,Lasalle Washington,Levelland,80.38,208.65,120.2,204.12,532.97,Single-ply,SBD,M
Boys,82.1,2,Corey Richardson,Levelland,77.38,204.12,117.93,204.12,526.17,Single-ply,SBD,M
Boys,82.1,3,Kane Isaacks,Levelland,81.28,158.76,95.25,204.12,458.13,Single-ply,SBD,M
Boys,82.1,4,Garrett Rosson,Seagraves,75.21,181.44,97.52,174.63,453.59,Single-ply,SBD,M
Boys,82.1,5,Anthony Ortiz,Bovina,81.28,147.42,104.33,163.29,415.04,Single-ply,SBD,M
Boys,82.1,6,Christian Cantu,Olton,78.83,142.88,86.18,181.44,410.5,Single-ply,SBD,M
Boys,82.1,7,Nick Runkles,Levelland,77.2,138.35,86.18,163.29,387.82,Single-ply,SBD,M
Boys,82.1,8,Quentin Valentine,Plainview,80.1,163.29,83.91,138.35,385.55,Single-ply,SBD,M
Boys,82.1,9,Frank Byers,Bushland,78.2,142.88,86.18,142.88,371.95,Single-ply,SBD,M
Boys,82.1,10,Grant Sherwood,Bushland,81.65,147.42,81.65,142.88,371.95,Single-ply,SBD,M
Boys,82.1,11,Carson Cleavinger,Levelland,82.01,149.69,70.31,136.08,356.07,Single-ply,SBD,M
Boys,82.1,12,Kolton Pirkle,Shallowater,75.75,136.08,77.11,136.08,349.27,Single-ply,SBD,M
Boys,82.1,13,Ricky Martinez,Tulia,78.38,133.81,77.11,136.08,347,Single-ply,SBD,M
Boys,82.1,14,Kit Watson,Bushland,77.56,129.27,79.38,133.81,342.46,Single-ply,SBD,M
Boys,82.1,15,Eddie Sanchez,Lamesa,78.93,129.27,70.31,136.08,335.66,Single-ply,SBD,M
Boys,82.1,16,Jose Arvizu,Plainview,79.83,124.74,70.31,124.74,319.78,Single-ply,SBD,M
Boys,82.1,17,Abel Palacios,Friona,82.1,113.4,68.04,136.08,317.51,Single-ply,SBD,M
Boys,82.1,18,Daniel Soltero,Friona,82.1,106.59,79.38,129.27,315.25,Single-ply,SBD,M
Boys,82.1,19,Uriel Vargas,Hale Center,80.2,102.06,70.31,138.35,310.71,Single-ply,SBD,M
Boys,82.1,20,Jory Flory,Shallowater,80.56,102.06,74.84,102.06,278.96,Single-ply,SBD,M
Boys,82.1,DQ,Nick Stephens,Panhandle,76.38,149.69,,,,Single-ply,SBD,M
Boys,82.1,DQ,Damion Montes,Sudan,78.93,97.52,,,,Single-ply,SBD,M
Boys,82.1,DQ,Edwin Delgado,Sudan,77.11,90.72,,,,Single-ply,SBD,M
Boys,89.81,1,Adrian Merino,Friona,89.81,192.78,113.4,181.44,487.61,Single-ply,SBD,M
Boys,89.81,2,Shawn Lindsey,Sunray,84.91,181.44,106.59,188.24,476.27,Single-ply,SBD,M
Boys,89.81,3,Tedramedramore Mitchell,Levelland,84.28,183.7,95.25,181.44,460.4,Single-ply,SBD,M
Boys,89.81,4,Jhett Wilcox,Whiteface,83.01,142.88,113.4,197.31,453.59,Single-ply,SBD,M
Boys,89.81,5,Corey Carter,Stinnett West Texas,88.72,161.03,102.06,174.63,437.72,Single-ply,SBD,M
Boys,89.81,6,Matthew Samarron,Lazbuddie,87.54,165.56,102.06,165.56,433.18,Single-ply,SBD,M
Boys,89.81,7,Gerardo Urquidiz,Sunray,89.81,181.44,95.25,147.42,424.11,Single-ply,SBD,M
Boys,89.81,8,Ignacio Jimenez,Lamesa,88.27,163.29,106.59,147.42,417.3,Single-ply,SBD,M
Boys,89.81,9,Chris Galvan #2,Plainview,83.91,158.76,99.79,149.69,408.23,Single-ply,SBD,M
Boys,89.81,10,Jeremy Mandrel,Olton,83.01,156.49,95.25,142.88,394.63,Single-ply,SBD,M
Boys,89.81,11,Eduardo Rojas,Friona,86.18,158.76,83.91,149.69,392.36,Single-ply,SBD,M
Boys,99.79,12,Colton Hedrick,Canyon Randall,89.9,138.35,90.72,149.69,378.75,Single-ply,SBD,M
Boys,89.81,13,Anthony Tapia,Friona,85.73,138.35,90.72,145.15,374.21,Single-ply,SBD,M
Boys,89.81,14,Kyler Battin,Canyon Randall,88,142.88,88.45,142.88,374.21,Single-ply,SBD,M
Boys,89.81,15,Max Zapata,Sunray,88.27,154.22,65.77,154.22,374.21,Single-ply,SBD,M
Boys,89.81,16,Juan Garcia #15,Bovina,85.55,106.59,74.84,147.42,328.85,Single-ply,SBD,M
Boys,89.81,DQ,Rolando Perez,Bovina,88.09,145.15,,,,Single-ply,SBD,M
Boys,99.79,1,Juan DeOchoa,Floydada,97.7,204.12,151.95,235.87,591.94,Single-ply,SBD,M
Boys,99.79,2,Brett Cummings,Stinnett West Texas,99.43,201.85,127.01,210.92,539.77,Single-ply,SBD,M
Boys,99.79,3,Paden Cornett,Seagraves,93.44,192.78,136.08,192.78,521.63,Single-ply,SBD,M
Boys,99.79,4,Shane Smith,Levelland,90.81,181.44,104.33,181.44,467.2,Single-ply,SBD,M
Boys,99.79,5,Octavius Ledbetter,Memphis,91.17,199.58,99.79,161.03,460.4,Single-ply,SBD,M
Boys,99.79,6,Zack Sperazza,Canyon Randall,94.53,154.22,113.4,192.78,460.4,Single-ply,SBD,M
Boys,99.79,7,Mason Cook,Vega,91.81,163.29,124.74,163.29,451.32,Single-ply,SBD,M
Boys,99.79,8,Mark Munoz,Memphis,95.25,136.08,88.45,147.42,371.95,Single-ply,SBD,M
Boys,99.79,9,Brennen George,Tulia,99.25,115.67,88.45,151.95,356.07,Single-ply,SBD,M
Boys,99.79,10,Mario Pineda,Amarillo Highland Park,96.89,95.25,61.23,147.42,303.91,Single-ply,SBD,M
Boys,99.79,11,Isiah Hernandez,Abernathy,95.35,92.99,56.7,102.06,251.74,Single-ply,SBD,M
Boys,99.79,12,Michael Lunde,Amarillo Highland Park,92.08,90.72,68.04,90.72,249.48,Single-ply,SBD,M
Boys,99.79,DQ,Ben Estep,Panhandle,91.08,,,,,Single-ply,SBD,M
Boys,99.79,DQ,Chris Thomas #5,Slaton,97.07,165.56,,,,Single-ply,SBD,M
Boys,99.79,DQ,Antonio Ramirez,Sudan,90.54,92.99,,,,Single-ply,SBD,M
Boys,99.79,DQ,Justin Curtis,Bovina,92.26,127.01,68.04,,,Single-ply,SBD,M
Boys,109.77,1,Trae Taylor,Levelland,101.7,235.87,145.15,199.58,580.6,Single-ply,SBD,M
Boys,109.77,2,Levi Salinas,Slaton,101.15,215.46,131.54,215.46,562.45,Single-ply,SBD,M
Boys,109.77,3,Matt Cruz,Abernathy,100.52,208.65,102.06,183.7,494.42,Single-ply,SBD,M
Boys,109.77,4,Shane Atwood,Vega,102.97,172.37,129.27,181.44,483.08,Single-ply,SBD,M
Boys,109.77,5,Colter Peck,Slaton,106.59,165.56,111.13,190.51,467.2,Single-ply,SBD,M
Boys,109.77,6,Caleb Lee,Canyon Randall,107.5,145.15,129.27,181.44,455.86,Single-ply,SBD,M
Boys,109.77,7,Broyon Perez,Seagraves,107.05,163.29,117.93,172.37,453.59,Single-ply,SBD,M
Boys,109.77,8,Santana Vera,Plainview,102.78,195.04,83.91,163.29,442.25,Single-ply,SBD,M
Boys,109.77,9,Celso Guerrero,Memphis,108.05,158.76,99.79,158.76,417.3,Single-ply,SBD,M
Boys,109.77,10,Brandon Cox,Whiteface,101.15,151.95,83.91,158.76,394.63,Single-ply,SBD,M
Boys,109.77,11,Esai Sandoval,Olton,105.78,142.88,77.11,142.88,362.87,Single-ply,SBD,M
Boys,109.77,12,Santana Benitez,Abernathy,100.33,136.08,65.77,154.22,356.07,Single-ply,SBD,M
Boys,109.77,13,Hagen Kelly,Plainview,103.78,120.2,74.84,147.42,342.46,Single-ply,SBD,M
Boys,109.77,14,Many Munoz,Olton,107.05,142.88,61.23,136.08,340.19,Single-ply,SBD,M
Boys,109.77,15,Ivan Gonzales,Hale Center,101.51,133.81,70.31,129.27,333.39,Single-ply,SBD,M
Boys,109.77,16,Victor Perez,Lamesa,107.41,124.74,74.84,131.54,331.12,Single-ply,SBD,M
Boys,109.77,17,Edwin Carrillo,Bovina,107.41,115.67,79.38,111.13,306.17,Single-ply,SBD,M
Boys,109.77,18,Brandon Amaya,Hale Center,101.7,97.52,86.18,120.2,303.91,Single-ply,SBD,M
Boys,109.77,DQ,Aaron Castaneda,Bovina,102.51,149.69,102.06,,,Single-ply,SBD,M
Boys,124.74,1,Eric Martinez,Olton,119.11,226.8,138.35,206.38,571.53,Single-ply,SBD,M
Boys,124.74,2,Sergio Vidales,Levelland,116.85,185.97,140.61,181.44,508.02,Single-ply,SBD,M
Boys,124.74,3,Sergio Mendez,Friona,113.4,208.65,122.47,172.37,503.49,Single-ply,SBD,M
Boys,124.74,4,Emiliano Renteria,Lamesa,119.84,167.83,113.4,185.97,467.2,Single-ply,SBD,M
Boys,124.74,5,Carlos García,Sunray,114.58,172.37,115.67,156.49,444.52,Single-ply,SBD,M
Boys,124.74,6,Jason Olvera,Bovina,111.4,154.22,97.52,174.63,426.38,Single-ply,SBD,M
Boys,124.74,7,Nathan Stinson,Shallowater,114.4,163.29,99.79,163.29,426.38,Single-ply,SBD,M
Boys,124.74,8,Ryan Fred,Sudan,122.56,145.15,77.11,167.83,390.09,Single-ply,SBD,M
Boys,124.74,9,Ty Fisher,Bushland,111.4,124.74,77.11,136.08,337.93,Single-ply,SBD,M
Boys,124.74,10,ZR Smith,Slaton,111.13,92.99,61.23,95.25,249.48,Single-ply,SBD,M
Boys,124.74+,1,Al Valderas,Levelland,127.1,290.3,154.22,208.65,653.17,Single-ply,SBD,M
Boys,124.74+,2,Clayton Smiley,Friona,158.76,272.16,154.22,204.12,630.49,Single-ply,SBD,M
Boys,124.74+,3,Michael Staudenraus,Slaton,129.18,188.24,99.79,183.7,471.74,Single-ply,SBD,M
Boys,124.74+,4,Brandon Turner #7,Memphis,130.82,151.95,122.47,181.44,455.86,Single-ply,SBD,M
Boys,124.74+,5,Steven Manahan,Levelland,129.91,165.56,111.13,176.9,453.59,Single-ply,SBD,M
Boys,124.74+,6,Batai Grisonno,Shallowater,129.27,158.76,81.65,181.44,421.84,Single-ply,SBD,M
Boys,124.74+,7,Jobe Allen,Stinnett West Texas,131.63,154.22,88.45,145.15,387.82,Single-ply,SBD,M
Boys,124.74+,8,Wesley Escamilla,Amarillo Highland Park,151.5,136.08,81.65,136.08,353.8,Single-ply,SBD,M
