EESchema Schematic File Version 4
LIBS:PowerElectronicsII-cache
EELAYER 29 0
EELAYER END
$Descr A4 11693 8268
encoding utf-8
Sheet 1 1
Title "Power Electronics II Project"
Date ""
Rev "V0.1"
Comp "International Hellenic University"
Comment1 "Georgios Amponis"
Comment2 ""
Comment3 ""
Comment4 ""
$EndDescr
$Comp
L SamacSys_Parts:TPS54339EDDA IC1
U 1 1 5E289EC9
P 1950 1525
F 0 "IC1" H 2550 1790 50  0000 C CNN
F 1 "TPS54339EDDA" H 2550 1699 50  0000 C CNN
F 2 "SOIC127P600X170-9N" H 3000 1625 50  0001 L CNN
F 3 "http://www.ti.com/lit/ds/symlink/tps54339e.pdf" H 3000 1525 50  0001 L CNN
F 4 "Switching Voltage Regulators 4.5V-23V Input 3A Sync SD Cnvtr" H 3000 1425 50  0001 L CNN "Description"
F 5 "1.7" H 3000 1325 50  0001 L CNN "Height"
F 6 "Texas Instruments" H 3000 1225 50  0001 L CNN "Manufacturer_Name"
F 7 "TPS54339EDDA" H 3000 1125 50  0001 L CNN "Manufacturer_Part_Number"
F 8 "595-TPS54339EDDA" H 3000 1025 50  0001 L CNN "Mouser Part Number"
F 9 "https://www.mouser.com/Search/Refine.aspx?Keyword=595-TPS54339EDDA" H 3000 925 50  0001 L CNN "Mouser Price/Stock"
F 10 "" H 3000 825 50  0001 L CNN "RS Part Number"
F 11 "" H 3000 725 50  0001 L CNN "RS Price/Stock"
	1    1950 1525
	1    0    0    -1  
$EndComp
$Comp
L Device:R_US R1
U 1 1 5E28ABA8
P 3775 1650
F 0 "R1" H 3843 1696 50  0000 L CNN
F 1 "124k" H 3843 1605 50  0000 L CNN
F 2 "Resistor_SMD:R_0805_2012Metric" V 3815 1640 50  0001 C CNN
F 3 "~" H 3775 1650 50  0001 C CNN
	1    3775 1650
	1    0    0    -1  
$EndComp
$Comp
L Device:R_US R2
U 1 1 5E28C06F
P 3775 2025
F 0 "R2" H 3843 2071 50  0000 L CNN
F 1 "22.1k" H 3843 1980 50  0000 L CNN
F 2 "Resistor_SMD:R_0805_2012Metric" V 3815 2015 50  0001 C CNN
F 3 "~" H 3775 2025 50  0001 C CNN
	1    3775 2025
	1    0    0    -1  
$EndComp
$Comp
L Device:R_US R3
U 1 1 5E28CECB
P 2575 1100
F 0 "R3" V 2780 1100 50  0000 C CNN
F 1 "1k" V 2689 1100 50  0000 C CNN
F 2 "Resistor_SMD:R_0805_2012Metric" V 2615 1090 50  0001 C CNN
F 3 "~" H 2575 1100 50  0001 C CNN
	1    2575 1100
	0    -1   -1   0   
$EndComp
$Comp
L Device:R_US R4
U 1 1 5E2924F6
P 4450 1725
F 0 "R4" H 4300 1775 50  0000 L CNN
F 1 "20k" H 4275 1700 50  0000 L CNN
F 2 "Resistor_SMD:R_0805_2012Metric" V 4490 1715 50  0001 C CNN
F 3 "~" H 4450 1725 50  0001 C CNN
	1    4450 1725
	1    0    0    -1  
$EndComp
$Comp
L Device:R_US R5
U 1 1 5E293265
P 5350 825
F 0 "R5" H 5418 871 50  0000 L CNN
F 1 "0.05" H 5418 780 50  0000 L CNN
F 2 "Resistor_SMD:R_1020_2550Metric" V 5390 815 50  0001 C CNN
F 3 "~" H 5350 825 50  0001 C CNN
	1    5350 825 
	0    1    1    0   
$EndComp
Wire Wire Line
	3775 1800 3775 1825
Connection ~ 3775 1825
Wire Wire Line
	3775 1825 3775 1875
$Comp
L SamacSys_Parts:744777004 L1
U 1 1 5E29840C
P 2150 825
F 0 "L1" H 2550 1050 50  0000 C CNN
F 1 "4.7uH" H 2550 959 50  0000 C CNN
F 2 "WE-PD-SMD_SHIELDED_POWER_INDUCTOR" H 2800 875 50  0001 L CNN
F 3 "https://katalog.we-online.com/pbs/datasheet/744777004.pdf" H 2800 775 50  0001 L CNN
F 4 "Wurth WE-PD Series Shielded Wire-wound SMD Inductor with a Ferrite Core, 4.7 uH +/-20% 4A Idc" H 2800 675 50  0001 L CNN "Description"
F 5 "" H 2800 575 50  0001 L CNN "Height"
F 6 "Wurth Elektronik" H 2800 475 50  0001 L CNN "Manufacturer_Name"
F 7 "744777004" H 2800 375 50  0001 L CNN "Manufacturer_Part_Number"
F 8 "710-744777004" H 2800 275 50  0001 L CNN "Mouser Part Number"
F 9 "https://www.mouser.com/Search/Refine.aspx?Keyword=710-744777004" H 2800 175 50  0001 L CNN "Mouser Price/Stock"
F 10 "7444949P" H 2800 75  50  0001 L CNN "RS Part Number"
F 11 "http://uk.rs-online.com/web/p/products/7444949P" H 2800 -25 50  0001 L CNN "RS Price/Stock"
	1    2150 825 
	1    0    0    -1  
$EndComp
$Comp
L Device:C C1
U 1 1 5E29E446
P 1575 1575
F 0 "C1" H 1325 1625 50  0000 L CNN
F 1 "0.1uF" H 1275 1550 50  0000 L CNN
F 2 "Capacitor_SMD:C_1210_3225Metric" H 1613 1425 50  0001 C CNN
F 3 "~" H 1575 1575 50  0001 C CNN
	1    1575 1575
	1    0    0    -1  
$EndComp
$Comp
L Device:C C2
U 1 1 5E29EA9B
P 3150 1875
F 0 "C2" H 3265 1921 50  0000 L CNN
F 1 "0.47uF" H 3265 1830 50  0000 L CNN
F 2 "Capacitor_SMD:C_1210_3225Metric" H 3188 1725 50  0001 C CNN
F 3 "~" H 3150 1875 50  0001 C CNN
	1    3150 1875
	1    0    0    -1  
$EndComp
$Comp
L Device:C C3
U 1 1 5E29F45F
P 3475 1425
F 0 "C3" H 3500 1525 50  0000 L CNN
F 1 "10nF" H 3500 1300 50  0000 L CNN
F 2 "Capacitor_SMD:C_1210_3225Metric" H 3513 1275 50  0001 C CNN
F 3 "~" H 3475 1425 50  0001 C CNN
	1    3475 1425
	1    0    0    -1  
$EndComp
Wire Wire Line
	3150 1625 3325 1625
$Comp
L power:GND #PWR0101
U 1 1 5E2A3EA3
P 2550 2525
F 0 "#PWR0101" H 2550 2275 50  0001 C CNN
F 1 "GND" H 2555 2352 50  0000 C CNN
F 2 "" H 2550 2525 50  0001 C CNN
F 3 "" H 2550 2525 50  0001 C CNN
	1    2550 2525
	1    0    0    -1  
$EndComp
$Comp
L power:GND #PWR0102
U 1 1 5E2A4679
P 3775 2175
F 0 "#PWR0102" H 3775 1925 50  0001 C CNN
F 1 "GND" H 3780 2002 50  0000 C CNN
F 2 "" H 3775 2175 50  0001 C CNN
F 3 "" H 3775 2175 50  0001 C CNN
	1    3775 2175
	1    0    0    -1  
$EndComp
$Comp
L power:GND #PWR0103
U 1 1 5E2A5BC4
P 3975 1325
F 0 "#PWR0103" H 3975 1075 50  0001 C CNN
F 1 "GND" H 3980 1152 50  0000 C CNN
F 2 "" H 3975 1325 50  0001 C CNN
F 3 "" H 3975 1325 50  0001 C CNN
	1    3975 1325
	1    0    0    -1  
$EndComp
Wire Wire Line
	1800 825  2150 825 
Wire Wire Line
	3975 825  3975 1025
Wire Wire Line
	2725 1100 3325 1100
Wire Wire Line
	3325 1100 3325 1625
Wire Wire Line
	3150 1825 3775 1825
$Comp
L Device:C C4
U 1 1 5E2A9E5F
P 3975 1175
F 0 "C4" H 4090 1221 50  0000 L CNN
F 1 "22uF" H 4090 1130 50  0000 L CNN
F 2 "Capacitor_SMD:C_1210_3225Metric" H 4013 1025 50  0001 C CNN
F 3 "~" H 3975 1175 50  0001 C CNN
	1    3975 1175
	1    0    0    -1  
$EndComp
Wire Wire Line
	3150 1525 3250 1525
$Comp
L power:GND #PWR0104
U 1 1 5E2AB9ED
P 3475 1575
F 0 "#PWR0104" H 3475 1325 50  0001 C CNN
F 1 "GND" H 3480 1402 50  0000 C CNN
F 2 "" H 3475 1575 50  0001 C CNN
F 3 "" H 3475 1575 50  0001 C CNN
	1    3475 1575
	1    0    0    -1  
$EndComp
Wire Wire Line
	3250 1525 3250 1275
Wire Wire Line
	3250 1275 3475 1275
$Comp
L power:GND #PWR0105
U 1 1 5E2ACE08
P 3150 2025
F 0 "#PWR0105" H 3150 1775 50  0001 C CNN
F 1 "GND" H 3155 1852 50  0000 C CNN
F 2 "" H 3150 2025 50  0001 C CNN
F 3 "" H 3150 2025 50  0001 C CNN
	1    3150 2025
	1    0    0    -1  
$EndComp
Wire Wire Line
	2950 825  3975 825 
Text GLabel 4325 825  1    50   Input ~ 0
5V
$Comp
L power:GND #PWR0106
U 1 1 5E2AE9A0
P 1950 1825
F 0 "#PWR0106" H 1950 1575 50  0001 C CNN
F 1 "GND" H 1955 1652 50  0000 C CNN
F 2 "" H 1950 1825 50  0001 C CNN
F 3 "" H 1950 1825 50  0001 C CNN
	1    1950 1825
	1    0    0    -1  
$EndComp
Wire Wire Line
	1950 1725 1800 1725
$Comp
L SamacSys_Parts:TPS54339EDDA IC2
U 1 1 5E2B4BA9
P 1925 3800
F 0 "IC2" H 2525 4065 50  0000 C CNN
F 1 "TPS54339EDDA" H 2525 3974 50  0000 C CNN
F 2 "SOIC127P600X170-9N" H 2975 3900 50  0001 L CNN
F 3 "http://www.ti.com/lit/ds/symlink/tps54339e.pdf" H 2975 3800 50  0001 L CNN
F 4 "Switching Voltage Regulators 4.5V-23V Input 3A Sync SD Cnvtr" H 2975 3700 50  0001 L CNN "Description"
F 5 "1.7" H 2975 3600 50  0001 L CNN "Height"
F 6 "Texas Instruments" H 2975 3500 50  0001 L CNN "Manufacturer_Name"
F 7 "TPS54339EDDA" H 2975 3400 50  0001 L CNN "Manufacturer_Part_Number"
F 8 "595-TPS54339EDDA" H 2975 3300 50  0001 L CNN "Mouser Part Number"
F 9 "https://www.mouser.com/Search/Refine.aspx?Keyword=595-TPS54339EDDA" H 2975 3200 50  0001 L CNN "Mouser Price/Stock"
F 10 "" H 2975 3100 50  0001 L CNN "RS Part Number"
F 11 "" H 2975 3000 50  0001 L CNN "RS Price/Stock"
	1    1925 3800
	1    0    0    -1  
$EndComp
$Comp
L Device:R_US R6
U 1 1 5E2B4BAF
P 3750 3925
F 0 "R6" H 3818 3971 50  0000 L CNN
F 1 "73.2k" H 3818 3880 50  0000 L CNN
F 2 "Resistor_SMD:R_0805_2012Metric" V 3790 3915 50  0001 C CNN
F 3 "~" H 3750 3925 50  0001 C CNN
	1    3750 3925
	1    0    0    -1  
$EndComp
$Comp
L Device:R_US R7
U 1 1 5E2B4BB5
P 3750 4300
F 0 "R7" H 3818 4346 50  0000 L CNN
F 1 "22.1k" H 3818 4255 50  0000 L CNN
F 2 "Resistor_SMD:R_0805_2012Metric" V 3790 4290 50  0001 C CNN
F 3 "~" H 3750 4300 50  0001 C CNN
	1    3750 4300
	1    0    0    -1  
$EndComp
$Comp
L Device:R_US R8
U 1 1 5E2B4BBB
P 2550 3375
F 0 "R8" V 2755 3375 50  0000 C CNN
F 1 "1k" V 2664 3375 50  0000 C CNN
F 2 "Resistor_SMD:R_0805_2012Metric" V 2590 3365 50  0001 C CNN
F 3 "~" H 2550 3375 50  0001 C CNN
	1    2550 3375
	0    -1   -1   0   
$EndComp
Wire Wire Line
	3750 4075 3750 4100
Connection ~ 3750 4100
Wire Wire Line
	3750 4100 3750 4150
$Comp
L SamacSys_Parts:744777004 L2
U 1 1 5E2B4BCC
P 2125 3100
F 0 "L2" H 2525 3325 50  0000 C CNN
F 1 "4.7uH" H 2525 3234 50  0000 C CNN
F 2 "WE-PD-SMD_SHIELDED_POWER_INDUCTOR" H 2775 3150 50  0001 L CNN
F 3 "https://katalog.we-online.com/pbs/datasheet/744777004.pdf" H 2775 3050 50  0001 L CNN
F 4 "Wurth WE-PD Series Shielded Wire-wound SMD Inductor with a Ferrite Core, 4.7 uH +/-20% 4A Idc" H 2775 2950 50  0001 L CNN "Description"
F 5 "" H 2775 2850 50  0001 L CNN "Height"
F 6 "Wurth Elektronik" H 2775 2750 50  0001 L CNN "Manufacturer_Name"
F 7 "744777004" H 2775 2650 50  0001 L CNN "Manufacturer_Part_Number"
F 8 "710-744777004" H 2775 2550 50  0001 L CNN "Mouser Part Number"
F 9 "https://www.mouser.com/Search/Refine.aspx?Keyword=710-744777004" H 2775 2450 50  0001 L CNN "Mouser Price/Stock"
F 10 "7444949P" H 2775 2350 50  0001 L CNN "RS Part Number"
F 11 "http://uk.rs-online.com/web/p/products/7444949P" H 2775 2250 50  0001 L CNN "RS Price/Stock"
	1    2125 3100
	1    0    0    -1  
$EndComp
$Comp
L Device:C C5
U 1 1 5E2B4BD2
P 1550 3850
F 0 "C5" H 1300 3900 50  0000 L CNN
F 1 "0.1uF" H 1250 3825 50  0000 L CNN
F 2 "Capacitor_SMD:C_1210_3225Metric" H 1588 3700 50  0001 C CNN
F 3 "~" H 1550 3850 50  0001 C CNN
	1    1550 3850
	1    0    0    -1  
$EndComp
$Comp
L Device:C C6
U 1 1 5E2B4BD8
P 3125 4150
F 0 "C6" H 3240 4196 50  0000 L CNN
F 1 "0.47uF" H 3240 4105 50  0000 L CNN
F 2 "Capacitor_SMD:C_1210_3225Metric" H 3163 4000 50  0001 C CNN
F 3 "~" H 3125 4150 50  0001 C CNN
	1    3125 4150
	1    0    0    -1  
$EndComp
$Comp
L Device:C C7
U 1 1 5E2B4BDE
P 3450 3700
F 0 "C7" H 3475 3800 50  0000 L CNN
F 1 "10nF" H 3475 3575 50  0000 L CNN
F 2 "Capacitor_SMD:C_1210_3225Metric" H 3488 3550 50  0001 C CNN
F 3 "~" H 3450 3700 50  0001 C CNN
	1    3450 3700
	1    0    0    -1  
$EndComp
Wire Wire Line
	3125 3900 3300 3900
$Comp
L power:GND #PWR0107
U 1 1 5E2B4BE5
P 2525 4800
F 0 "#PWR0107" H 2525 4550 50  0001 C CNN
F 1 "GND" H 2530 4627 50  0000 C CNN
F 2 "" H 2525 4800 50  0001 C CNN
F 3 "" H 2525 4800 50  0001 C CNN
	1    2525 4800
	1    0    0    -1  
$EndComp
$Comp
L power:GND #PWR0108
U 1 1 5E2B4BEB
P 3750 4450
F 0 "#PWR0108" H 3750 4200 50  0001 C CNN
F 1 "GND" H 3755 4277 50  0000 C CNN
F 2 "" H 3750 4450 50  0001 C CNN
F 3 "" H 3750 4450 50  0001 C CNN
	1    3750 4450
	1    0    0    -1  
$EndComp
$Comp
L power:GND #PWR0109
U 1 1 5E2B4BF1
P 3950 3600
F 0 "#PWR0109" H 3950 3350 50  0001 C CNN
F 1 "GND" H 3955 3427 50  0000 C CNN
F 2 "" H 3950 3600 50  0001 C CNN
F 3 "" H 3950 3600 50  0001 C CNN
	1    3950 3600
	1    0    0    -1  
$EndComp
Wire Wire Line
	1775 3100 2125 3100
Wire Wire Line
	3950 3100 3950 3300
Wire Wire Line
	2700 3375 3300 3375
Wire Wire Line
	3300 3375 3300 3900
Wire Wire Line
	3125 4100 3750 4100
$Comp
L Device:C C8
U 1 1 5E2B4BFF
P 3950 3450
F 0 "C8" H 4065 3496 50  0000 L CNN
F 1 "22uF" H 4065 3405 50  0000 L CNN
F 2 "Capacitor_SMD:C_1210_3225Metric" H 3988 3300 50  0001 C CNN
F 3 "~" H 3950 3450 50  0001 C CNN
	1    3950 3450
	1    0    0    -1  
$EndComp
Wire Wire Line
	3125 3800 3225 3800
$Comp
L power:GND #PWR0110
U 1 1 5E2B4C06
P 3450 3850
F 0 "#PWR0110" H 3450 3600 50  0001 C CNN
F 1 "GND" H 3455 3677 50  0000 C CNN
F 2 "" H 3450 3850 50  0001 C CNN
F 3 "" H 3450 3850 50  0001 C CNN
	1    3450 3850
	1    0    0    -1  
$EndComp
Wire Wire Line
	3225 3800 3225 3550
Wire Wire Line
	3225 3550 3450 3550
$Comp
L power:GND #PWR0111
U 1 1 5E2B4C0E
P 3125 4300
F 0 "#PWR0111" H 3125 4050 50  0001 C CNN
F 1 "GND" H 3130 4127 50  0000 C CNN
F 2 "" H 3125 4300 50  0001 C CNN
F 3 "" H 3125 4300 50  0001 C CNN
	1    3125 4300
	1    0    0    -1  
$EndComp
Wire Wire Line
	2925 3100 3950 3100
$Comp
L power:GND #PWR0112
U 1 1 5E2B4C17
P 1925 4100
F 0 "#PWR0112" H 1925 3850 50  0001 C CNN
F 1 "GND" H 1930 3927 50  0000 C CNN
F 2 "" H 1925 4100 50  0001 C CNN
F 3 "" H 1925 4100 50  0001 C CNN
	1    1925 4100
	1    0    0    -1  
$EndComp
Wire Wire Line
	1925 4000 1775 4000
Connection ~ 3975 825 
Wire Wire Line
	3975 825  4125 825 
Wire Wire Line
	4800 1775 4575 1775
Wire Wire Line
	4575 1775 4575 825 
Connection ~ 4575 825 
Wire Wire Line
	4575 825  5200 825 
Wire Wire Line
	5900 1575 5900 825 
Wire Wire Line
	5900 825  5500 825 
$Comp
L power:GND #PWR0113
U 1 1 5E2D26B4
P 4450 1875
F 0 "#PWR0113" H 4450 1625 50  0001 C CNN
F 1 "GND" H 4450 1750 50  0000 C CNN
F 2 "" H 4450 1875 50  0001 C CNN
F 3 "" H 4450 1875 50  0001 C CNN
	1    4450 1875
	1    0    0    -1  
$EndComp
$Comp
L power:GND #PWR0114
U 1 1 5E2D8C50
P 4800 1675
F 0 "#PWR0114" H 4800 1425 50  0001 C CNN
F 1 "GND" H 4800 1550 50  0000 C CNN
F 2 "" H 4800 1675 50  0001 C CNN
F 3 "" H 4800 1675 50  0001 C CNN
	1    4800 1675
	0    1    1    0   
$EndComp
Wire Wire Line
	4450 1575 4800 1575
$Comp
L Device:R_US R10
U 1 1 5E2DEC1D
P 5325 3100
F 0 "R10" H 5393 3146 50  0000 L CNN
F 1 "0.05" H 5393 3055 50  0000 L CNN
F 2 "Resistor_SMD:R_1020_2550Metric" V 5365 3090 50  0001 C CNN
F 3 "~" H 5325 3100 50  0001 C CNN
	1    5325 3100
	0    1    1    0   
$EndComp
Wire Wire Line
	4775 4050 4550 4050
Wire Wire Line
	4550 4050 4550 3100
Connection ~ 4550 3100
Wire Wire Line
	4550 3100 5175 3100
Wire Wire Line
	5875 3850 5875 3100
Wire Wire Line
	5875 3100 5475 3100
$Comp
L power:GND #PWR0116
U 1 1 5E2DEC30
P 4775 3950
F 0 "#PWR0116" H 4775 3700 50  0001 C CNN
F 1 "GND" H 4775 3825 50  0000 C CNN
F 2 "" H 4775 3950 50  0001 C CNN
F 3 "" H 4775 3950 50  0001 C CNN
	1    4775 3950
	0    1    1    0   
$EndComp
Wire Wire Line
	4425 3850 4775 3850
$Comp
L SamacSys_Parts:INA139NA_3K IC4
U 1 1 5E2DEC3F
P 4775 3850
F 0 "IC4" H 5325 4115 50  0000 C CNN
F 1 "INA139NA_3K" H 5325 4024 50  0000 C CNN
F 2 "SOT95P280X145-5N" H 5725 3950 50  0001 L CNN
F 3 "http://www.ti.com/lit/gpn/ina139" H 5725 3850 50  0001 L CNN
F 4 "36V, High-Side, High-Speed, Current Output Current Sense Amplifier" H 5725 3750 50  0001 L CNN "Description"
F 5 "1.45" H 5725 3650 50  0001 L CNN "Height"
F 6 "Texas Instruments" H 5725 3550 50  0001 L CNN "Manufacturer_Name"
F 7 "INA139NA/3K" H 5725 3450 50  0001 L CNN "Manufacturer_Part_Number"
F 8 "595-INA139NA/3K" H 5725 3350 50  0001 L CNN "Mouser Part Number"
F 9 "https://www.mouser.com/Search/Refine.aspx?Keyword=595-INA139NA%2F3K" H 5725 3250 50  0001 L CNN "Mouser Price/Stock"
F 10 "" H 5725 3150 50  0001 L CNN "RS Part Number"
F 11 "" H 5725 3050 50  0001 L CNN "RS Price/Stock"
	1    4775 3850
	1    0    0    -1  
$EndComp
Connection ~ 3950 3100
Wire Wire Line
	1550 4000 1775 4000
Connection ~ 1775 4000
Wire Wire Line
	1550 3700 1925 3700
Wire Wire Line
	1925 3700 1925 3800
Wire Wire Line
	1575 1725 1800 1725
Connection ~ 1800 1725
Wire Wire Line
	1575 1425 1950 1425
Wire Wire Line
	1950 1425 1950 1525
$Comp
L Connector:Conn_01x02_Male J1
U 1 1 5E2F1073
P 800 2600
F 0 "J1" H 908 2781 50  0000 C CNN
F 1 "DC input" H 908 2690 50  0000 C CNN
F 2 "SamacSys_Parts:SHDR2W100P0X500_1X2_1000X760X1040P" H 800 2600 50  0001 C CNN
F 3 "~" H 800 2600 50  0001 C CNN
	1    800  2600
	1    0    0    -1  
$EndComp
$Comp
L power:GND #PWR0117
U 1 1 5E2F2FF7
P 1000 2700
F 0 "#PWR0117" H 1000 2450 50  0001 C CNN
F 1 "GND" H 1005 2527 50  0000 C CNN
F 2 "" H 1000 2700 50  0001 C CNN
F 3 "" H 1000 2700 50  0001 C CNN
	1    1000 2700
	1    0    0    -1  
$EndComp
Text GLabel 1625 2600 2    50   Input ~ 0
Vin
Text GLabel 1950 1625 0    50   Input ~ 0
Vin
Text GLabel 1925 3900 0    50   Input ~ 0
Vin
Text GLabel 5875 3425 2    50   Input ~ 0
ADC0-3.3VCheck
Text GLabel 5900 1200 2    50   Input ~ 0
ADC1-5VCheck
Text GLabel 4725 1575 1    50   Input ~ 0
ADC2-I5Check
Text GLabel 4700 3850 1    50   Input ~ 0
ADC3-I3.3Check
$Comp
L Device:R_US R11
U 1 1 5E322ED9
P 8125 1150
F 0 "R11" H 8193 1196 50  0000 L CNN
F 1 "220" H 8193 1105 50  0000 L CNN
F 2 "Resistor_SMD:R_0805_2012Metric" V 8165 1140 50  0001 C CNN
F 3 "~" H 8125 1150 50  0001 C CNN
	1    8125 1150
	1    0    0    -1  
$EndComp
$Comp
L Device:R_US R12
U 1 1 5E323A9A
P 8500 1150
F 0 "R12" H 8568 1196 50  0000 L CNN
F 1 "220" H 8568 1105 50  0000 L CNN
F 2 "Resistor_SMD:R_0805_2012Metric" V 8540 1140 50  0001 C CNN
F 3 "~" H 8500 1150 50  0001 C CNN
	1    8500 1150
	1    0    0    -1  
$EndComp
$Comp
L Device:R_US R13
U 1 1 5E323F09
P 8875 1150
F 0 "R13" H 8943 1196 50  0000 L CNN
F 1 "220" H 8943 1105 50  0000 L CNN
F 2 "Resistor_SMD:R_0805_2012Metric" V 8915 1140 50  0001 C CNN
F 3 "~" H 8875 1150 50  0001 C CNN
	1    8875 1150
	1    0    0    -1  
$EndComp
Text GLabel 8125 1000 1    50   Input ~ 0
GPIO1
Text GLabel 8500 1000 1    50   Input ~ 0
GPIO2
Text GLabel 8875 1000 1    50   Input ~ 0
GPIO3
$Comp
L Device:LED D1
U 1 1 5E32B67B
P 8125 1450
F 0 "D1" V 8164 1333 50  0000 R CNN
F 1 "LED" V 8073 1333 50  0000 R CNN
F 2 "LED_SMD:LED_1206_3216Metric" H 8125 1450 50  0001 C CNN
F 3 "~" H 8125 1450 50  0001 C CNN
	1    8125 1450
	0    -1   -1   0   
$EndComp
$Comp
L Device:LED D2
U 1 1 5E32C84E
P 8500 1450
F 0 "D2" V 8539 1333 50  0000 R CNN
F 1 "LED" V 8448 1333 50  0000 R CNN
F 2 "LED_SMD:LED_1206_3216Metric" H 8500 1450 50  0001 C CNN
F 3 "~" H 8500 1450 50  0001 C CNN
	1    8500 1450
	0    -1   -1   0   
$EndComp
$Comp
L Device:LED D3
U 1 1 5E32CC7D
P 8875 1450
F 0 "D3" V 8914 1333 50  0000 R CNN
F 1 "LED" V 8823 1333 50  0000 R CNN
F 2 "LED_SMD:LED_1206_3216Metric" H 8875 1450 50  0001 C CNN
F 3 "~" H 8875 1450 50  0001 C CNN
	1    8875 1450
	0    -1   -1   0   
$EndComp
$Comp
L power:GND #PWR0120
U 1 1 5E32DE31
P 8125 1600
F 0 "#PWR0120" H 8125 1350 50  0001 C CNN
F 1 "GND" H 8125 1475 50  0000 C CNN
F 2 "" H 8125 1600 50  0001 C CNN
F 3 "" H 8125 1600 50  0001 C CNN
	1    8125 1600
	1    0    0    -1  
$EndComp
$Comp
L power:GND #PWR0121
U 1 1 5E32E61F
P 8500 1600
F 0 "#PWR0121" H 8500 1350 50  0001 C CNN
F 1 "GND" H 8500 1475 50  0000 C CNN
F 2 "" H 8500 1600 50  0001 C CNN
F 3 "" H 8500 1600 50  0001 C CNN
	1    8500 1600
	1    0    0    -1  
$EndComp
$Comp
L power:GND #PWR0122
U 1 1 5E32EA02
P 8875 1600
F 0 "#PWR0122" H 8875 1350 50  0001 C CNN
F 1 "GND" H 8875 1475 50  0000 C CNN
F 2 "" H 8875 1600 50  0001 C CNN
F 3 "" H 8875 1600 50  0001 C CNN
	1    8875 1600
	1    0    0    -1  
$EndComp
$Comp
L Device:R_US R15
U 1 1 5E344405
P 2375 6725
F 0 "R15" V 2575 6725 50  0000 C CNN
F 1 "2.2k" V 2489 6725 50  0000 C CNN
F 2 "Resistor_SMD:R_0805_2012Metric" V 2415 6715 50  0001 C CNN
F 3 "~" H 2375 6725 50  0001 C CNN
	1    2375 6725
	0    -1   1    0   
$EndComp
$Comp
L Device:LED D4
U 1 1 5E348FD4
P 2075 6625
F 0 "D4" H 2200 6475 50  0000 C CNN
F 1 "LED" H 2200 6550 50  0000 C CNN
F 2 "LED_SMD:LED_1206_3216Metric" H 2075 6625 50  0001 C CNN
F 3 "~" H 2075 6625 50  0001 C CNN
	1    2075 6625
	-1   0    0    1   
$EndComp
$Comp
L Device:LED D5
U 1 1 5E3497EA
P 2075 6725
F 0 "D5" H 2200 6575 50  0000 C CNN
F 1 "LED" H 2200 6650 50  0000 C CNN
F 2 "LED_SMD:LED_1206_3216Metric" H 2075 6725 50  0001 C CNN
F 3 "~" H 2075 6725 50  0001 C CNN
	1    2075 6725
	-1   0    0    -1  
$EndComp
Wire Wire Line
	3025 6025 2525 6025
Connection ~ 2525 6025
Wire Wire Line
	1925 6725 1925 6625
$Comp
L SamacSys_Parts:744777004 L3
U 1 1 5E357A3E
P 3850 6225
F 0 "L3" H 4250 6450 50  0000 C CNN
F 1 "4.7uH" H 4250 6359 50  0000 C CNN
F 2 "WE-PD-SMD_SHIELDED_POWER_INDUCTOR" H 4500 6275 50  0001 L CNN
F 3 "https://katalog.we-online.com/pbs/datasheet/744777004.pdf" H 4500 6175 50  0001 L CNN
F 4 "Wurth WE-PD Series Shielded Wire-wound SMD Inductor with a Ferrite Core, 4.7 uH +/-20% 4A Idc" H 4500 6075 50  0001 L CNN "Description"
F 5 "" H 4500 5975 50  0001 L CNN "Height"
F 6 "Wurth Elektronik" H 4500 5875 50  0001 L CNN "Manufacturer_Name"
F 7 "744777004" H 4500 5775 50  0001 L CNN "Manufacturer_Part_Number"
F 8 "710-744777004" H 4500 5675 50  0001 L CNN "Mouser Part Number"
F 9 "https://www.mouser.com/Search/Refine.aspx?Keyword=710-744777004" H 4500 5575 50  0001 L CNN "Mouser Price/Stock"
F 10 "7444949P" H 4500 5475 50  0001 L CNN "RS Part Number"
F 11 "http://uk.rs-online.com/web/p/products/7444949P" H 4500 5375 50  0001 L CNN "RS Price/Stock"
	1    3850 6225
	1    0    0    -1  
$EndComp
$Comp
L Device:R_US R14
U 1 1 5E343682
P 2375 6625
F 0 "R14" V 2575 6625 50  0000 C CNN
F 1 "2.2k" V 2489 6625 50  0000 C CNN
F 2 "Resistor_SMD:R_0805_2012Metric" V 2415 6615 50  0001 C CNN
F 3 "~" H 2375 6625 50  0001 C CNN
	1    2375 6625
	0    -1   -1   0   
$EndComp
$Comp
L Device:R_US R16
U 1 1 5E361054
P 3975 6825
F 0 "R16" V 4125 6750 50  0000 L CNN
F 1 "30k" V 4050 6750 50  0000 L CNN
F 2 "Resistor_SMD:R_0603_1608Metric" V 4015 6815 50  0001 C CNN
F 3 "~" H 3975 6825 50  0001 C CNN
	1    3975 6825
	0    -1   -1   0   
$EndComp
$Comp
L Device:R_US R18
U 1 1 5E365DDC
P 3675 6825
F 0 "R18" V 3825 6825 50  0000 C CNN
F 1 "223k" V 3750 6825 50  0000 C CNN
F 2 "Resistor_SMD:R_0603_1608Metric" V 3715 6815 50  0001 C CNN
F 3 "~" H 3675 6825 50  0001 C CNN
	1    3675 6825
	0    -1   -1   0   
$EndComp
Wire Wire Line
	3825 6875 3825 6825
Connection ~ 3825 6825
Wire Wire Line
	4125 6825 4125 6625
Wire Wire Line
	4125 6625 3525 6625
NoConn ~ 3525 6725
$Comp
L SamacSys_Parts:CMSH1-40MA D6
U 1 1 5E37F9DF
P 2075 5475
F 0 "D6" H 2475 5210 50  0000 C CNN
F 1 "CMSH1-40MA" H 2475 5301 50  0000 C CNN
F 2 "Diode_SMD:D_SMA" H 2575 5625 50  0001 L CNN
F 3 "https://my.centralsemi.com/get_document.php?cmp=1&mergetype=pd&mergepath=pd&pdf_id=CMSH1-20_40_60_100.PDF" H 2575 5525 50  0001 L CNN
F 4 "SURFACE MOUNT SILICON SCHOTTKY RECTIFIERS 1.0 AMP" H 2575 5425 50  0001 L CNN "Description"
F 5 "2.44" H 2575 5325 50  0001 L CNN "Height"
F 6 "Central Semiconductor" H 2575 5225 50  0001 L CNN "Manufacturer_Name"
F 7 "CMSH1-40MA" H 2575 5125 50  0001 L CNN "Manufacturer_Part_Number"
F 8 "" H 2575 5025 50  0001 L CNN "Mouser Part Number"
F 9 "" H 2575 4925 50  0001 L CNN "Mouser Price/Stock"
F 10 "" H 2575 4825 50  0001 L CNN "RS Part Number"
F 11 "" H 2575 4725 50  0001 L CNN "RS Price/Stock"
	1    2075 5475
	-1   0    0    1   
$EndComp
Wire Wire Line
	2525 5475 2525 6025
$Comp
L Device:C C9
U 1 1 5E382B67
P 2225 5625
F 0 "C9" H 2340 5671 50  0000 L CNN
F 1 "10uF" H 2340 5580 50  0000 L CNN
F 2 "Capacitor_SMD:C_1210_3225Metric" H 2263 5475 50  0001 C CNN
F 3 "~" H 2225 5625 50  0001 C CNN
	1    2225 5625
	1    0    0    -1  
$EndComp
Wire Wire Line
	1975 5475 2225 5475
Connection ~ 2225 5475
Wire Wire Line
	2225 5475 2525 5475
$Comp
L SamacSys_Parts:CMSH3-40MA_TR13 D7
U 1 1 5E392AF2
P 4650 6225
F 0 "D7" V 4996 6097 50  0000 R CNN
F 1 "CMSH3-40MA_TR13" V 4905 6097 50  0000 R CNN
F 2 "Diode_SMD:D_SMA" H 5100 6225 50  0001 L CNN
F 3 "http://www.mouser.com/ds/2/68/cmsh3_20ma-35342.pdf" H 5100 6125 50  0001 L CNN
F 4 "http://www.mouser.com/ds/2/68/cmsh3_20ma-35342.pdf" H 5100 6025 50  0001 L CNN "Description"
F 5 "2.62" H 5100 5925 50  0001 L CNN "Height"
F 6 "Central Semiconductor" H 5100 5825 50  0001 L CNN "Manufacturer_Name"
F 7 "CMSH3-40MA TR13" H 5100 5725 50  0001 L CNN "Manufacturer_Part_Number"
F 8 "610-CMSH3-40MA" H 5100 5625 50  0001 L CNN "Mouser Part Number"
F 9 "https://www.mouser.com/Search/Refine.aspx?Keyword=610-CMSH3-40MA" H 5100 5525 50  0001 L CNN "Mouser Price/Stock"
F 10 "" H 5100 5425 50  0001 L CNN "RS Part Number"
F 11 "" H 5100 5325 50  0001 L CNN "RS Price/Stock"
	1    4650 6225
	0    -1   -1   0   
$EndComp
$Comp
L Device:C C10
U 1 1 5E39926C
P 4250 6775
F 0 "C10" H 4375 6725 50  0000 L CNN
F 1 "10uF" H 4350 6625 50  0000 L CNN
F 2 "Capacitor_SMD:C_1210_3225Metric" H 4288 6625 50  0001 C CNN
F 3 "~" H 4250 6775 50  0001 C CNN
	1    4250 6775
	1    0    0    -1  
$EndComp
Wire Wire Line
	4125 6625 4250 6625
Connection ~ 4125 6625
$Comp
L Diode:1N4148W D8
U 1 1 5E39D797
P 3975 6425
F 0 "D8" H 3975 6600 50  0000 C CNN
F 1 "1N4148W" H 3975 6525 50  0000 C CNN
F 2 "Diode_SMD:D_SOD-123" H 3975 6250 50  0001 C CNN
F 3 "https://www.vishay.com/docs/85748/1n4148w.pdf" H 3975 6425 50  0001 C CNN
	1    3975 6425
	1    0    0    -1  
$EndComp
Wire Wire Line
	4125 6425 4125 6625
Wire Wire Line
	3825 6425 3750 6425
$Comp
L Device:C C11
U 1 1 5E2B397C
P 3750 6275
F 0 "C11" H 3475 6325 50  0000 L CNN
F 1 "1uF" H 3500 6225 50  0000 L CNN
F 2 "Capacitor_SMD:C_1210_3225Metric" H 3788 6125 50  0001 C CNN
F 3 "~" H 3750 6275 50  0001 C CNN
	1    3750 6275
	1    0    0    -1  
$EndComp
$Comp
L Device:R_US R19
U 1 1 5E2BBE02
P 4475 6525
F 0 "R19" H 4625 6525 50  0000 C CNN
F 1 "0.05" V 4550 6525 50  0000 C CNN
F 2 "Resistor_SMD:R_1020_2550Metric" V 4515 6515 50  0001 C CNN
F 3 "~" H 4475 6525 50  0001 C CNN
	1    4475 6525
	0    1    1    0   
$EndComp
Text GLabel 3775 1500 1    50   Input ~ 0
5V_output
$Comp
L SamacSys_Parts:ESP32 IC6
U 1 1 5E310428
P 7575 3650
F 0 "IC6" H 8525 3915 50  0000 C CNN
F 1 "ESP32" H 8525 3824 50  0000 C CNN
F 2 "SamacSys_Parts:ESP32" H 9325 3750 50  0001 L CNN
F 3 "https://docs.pycom.io/chapter/datasheets/downloads/wipy3-specsheet.pdf" H 9575 4250 50  0001 L CNN
F 4 "5" H 9325 3450 50  0001 L CNN "Height"
	1    7575 3650
	1    0    0    -1  
$EndComp
Text GLabel 9475 4250 2    50   Input ~ 0
ADC2-I5Check
Text GLabel 9475 4150 2    50   Input ~ 0
ADC3-I3.3Check
$Comp
L power:GND #PWR0118
U 1 1 5E321589
P 7575 3750
F 0 "#PWR0118" H 7575 3500 50  0001 C CNN
F 1 "GND" H 7575 3625 50  0000 C CNN
F 2 "" H 7575 3750 50  0001 C CNN
F 3 "" H 7575 3750 50  0001 C CNN
	1    7575 3750
	0    1    1    0   
$EndComp
$Comp
L power:GND #PWR0119
U 1 1 5E321DA0
P 9475 3750
F 0 "#PWR0119" H 9475 3500 50  0001 C CNN
F 1 "GND" H 9475 3625 50  0000 C CNN
F 2 "" H 9475 3750 50  0001 C CNN
F 3 "" H 9475 3750 50  0001 C CNN
	1    9475 3750
	0    -1   -1   0   
$EndComp
Text GLabel 9475 3650 2    50   Input ~ 0
5V
Text GLabel 7575 3850 0    50   Input ~ 0
GPIO1
Text GLabel 7575 4050 0    50   Input ~ 0
GPIO2
Text GLabel 7575 4350 0    50   Input ~ 0
GPIO3
Text Notes 8250 4225 0    50   ~ 0
check pinout!
$Comp
L Connector:Conn_01x15_Male J4
U 1 1 5E2D85B7
P 6850 4350
F 0 "J4" H 6958 5231 50  0000 C CNN
F 1 "Conn_01x15_Male" H 6958 5140 50  0000 C CNN
F 2 "Connector_PinHeader_2.54mm:PinHeader_1x15_P2.54mm_Vertical" H 6850 4350 50  0001 C CNN
F 3 "~" H 6850 4350 50  0001 C CNN
	1    6850 4350
	1    0    0    -1  
$EndComp
$Comp
L Connector:Conn_01x15_Male J5
U 1 1 5E2DB0F7
P 10550 4350
F 0 "J5" H 10500 4575 50  0000 R CNN
F 1 "Conn_01x15_Male" H 10525 4775 50  0000 R CNN
F 2 "Connector_PinHeader_2.54mm:PinHeader_1x15_P2.54mm_Vertical" H 10550 4350 50  0001 C CNN
F 3 "~" H 10550 4350 50  0001 C CNN
	1    10550 4350
	-1   0    0    1   
$EndComp
Wire Wire Line
	7575 3650 7350 3650
Wire Wire Line
	7575 3950 7050 3950
Wire Wire Line
	7575 4150 7050 4150
Wire Wire Line
	7050 4250 7575 4250
Wire Wire Line
	7575 4450 7050 4450
Wire Wire Line
	7050 4550 7575 4550
Wire Wire Line
	7575 4650 7050 4650
Wire Wire Line
	7050 4750 7575 4750
Wire Wire Line
	7575 4850 7050 4850
Wire Wire Line
	7050 4950 7575 4950
Wire Wire Line
	7575 5050 7050 5050
Wire Wire Line
	9475 5050 10350 5050
Wire Wire Line
	10350 4950 9475 4950
Wire Wire Line
	9475 4850 10350 4850
Wire Wire Line
	10350 4750 9475 4750
Wire Wire Line
	9475 4650 10350 4650
Wire Wire Line
	10350 4550 9475 4550
Wire Wire Line
	10350 3950 9475 3950
Wire Wire Line
	9475 3850 10350 3850
Text GLabel 10350 3650 0    50   Input ~ 0
5V
$Comp
L power:GND #PWR0130
U 1 1 5E30CD3D
P 10350 3750
F 0 "#PWR0130" H 10350 3500 50  0001 C CNN
F 1 "GND" H 10350 3625 50  0000 C CNN
F 2 "" H 10350 3750 50  0001 C CNN
F 3 "" H 10350 3750 50  0001 C CNN
	1    10350 3750
	0    1    1    0   
$EndComp
Text GLabel 10350 4150 2    50   Input ~ 0
ADC3-I3.3Check
Text GLabel 10350 4250 2    50   Input ~ 0
ADC2-I5Check
$Comp
L power:GND #PWR0131
U 1 1 5E30E429
P 7050 3750
F 0 "#PWR0131" H 7050 3500 50  0001 C CNN
F 1 "GND" H 7050 3625 50  0000 C CNN
F 2 "" H 7050 3750 50  0001 C CNN
F 3 "" H 7050 3750 50  0001 C CNN
	1    7050 3750
	0    -1   -1   0   
$EndComp
Text GLabel 7050 3850 0    50   Input ~ 0
GPIO1
Text GLabel 7050 4050 0    50   Input ~ 0
GPIO2
Text GLabel 7050 4350 0    50   Input ~ 0
GPIO3
Wire Notes Line
	5375 5050 5375 7475
Wire Notes Line
	5375 7475 850  7475
Wire Notes Line
	850  7475 850  5075
Wire Notes Line
	850  5075 5375 5075
Text GLabel 3750 3775 1    50   Input ~ 0
3.3V_output
Text GLabel 10500 1900 0    50   Input ~ 0
3.3V_output
$Comp
L power:GND #PWR0123
U 1 1 5E3224B0
P 10500 2000
F 0 "#PWR0123" H 10500 1750 50  0001 C CNN
F 1 "GND" H 10500 1875 50  0000 C CNN
F 2 "" H 10500 2000 50  0001 C CNN
F 3 "" H 10500 2000 50  0001 C CNN
	1    10500 2000
	0    1    1    0   
$EndComp
$Comp
L Connector:Conn_01x02_Male J6
U 1 1 5E34E686
P 975 5475
F 0 "J6" H 1083 5656 50  0000 C CNN
F 1 "Charger input" H 1083 5565 50  0000 C CNN
F 2 "SamacSys_Parts:SHDR2W100P0X500_1X2_1000X760X1040P" H 975 5475 50  0001 C CNN
F 3 "~" H 975 5475 50  0001 C CNN
	1    975  5475
	1    0    0    -1  
$EndComp
$Comp
L power:Earth #PWR0125
U 1 1 5E354103
P 1175 5575
F 0 "#PWR0125" H 1175 5325 50  0001 C CNN
F 1 "Earth" H 1175 5425 50  0001 C CNN
F 2 "" H 1175 5575 50  0001 C CNN
F 3 "~" H 1175 5575 50  0001 C CNN
	1    1175 5575
	1    0    0    -1  
$EndComp
$Comp
L power:Earth #PWR0126
U 1 1 5E35493D
P 2225 5775
F 0 "#PWR0126" H 2225 5525 50  0001 C CNN
F 1 "Earth" H 2225 5625 50  0001 C CNN
F 2 "" H 2225 5775 50  0001 C CNN
F 3 "~" H 2225 5775 50  0001 C CNN
	1    2225 5775
	1    0    0    -1  
$EndComp
$Comp
L power:Earth #PWR0127
U 1 1 5E354E89
P 4650 5625
F 0 "#PWR0127" H 4650 5375 50  0001 C CNN
F 1 "Earth" H 4650 5475 50  0001 C CNN
F 2 "" H 4650 5625 50  0001 C CNN
F 3 "~" H 4650 5625 50  0001 C CNN
	1    4650 5625
	-1   0    0    1   
$EndComp
$Comp
L power:Earth #PWR0129
U 1 1 5E35654A
P 4250 6925
F 0 "#PWR0129" H 4250 6675 50  0001 C CNN
F 1 "Earth" H 4250 6775 50  0001 C CNN
F 2 "" H 4250 6925 50  0001 C CNN
F 3 "~" H 4250 6925 50  0001 C CNN
	1    4250 6925
	1    0    0    -1  
$EndComp
$Comp
L power:Earth #PWR0132
U 1 1 5E356870
P 3825 7175
F 0 "#PWR0132" H 3825 6925 50  0001 C CNN
F 1 "Earth" H 3825 7025 50  0001 C CNN
F 2 "" H 3825 7175 50  0001 C CNN
F 3 "~" H 3825 7175 50  0001 C CNN
	1    3825 7175
	1    0    0    -1  
$EndComp
$Comp
L power:Earth #PWR0133
U 1 1 5E356CC0
P 3025 7025
F 0 "#PWR0133" H 3025 6775 50  0001 C CNN
F 1 "Earth" H 3025 6875 50  0001 C CNN
F 2 "" H 3025 7025 50  0001 C CNN
F 3 "~" H 3025 7025 50  0001 C CNN
	1    3025 7025
	1    0    0    -1  
$EndComp
$Comp
L power:Earth #PWR0134
U 1 1 5E3570D9
P 2525 6825
F 0 "#PWR0134" H 2525 6575 50  0001 C CNN
F 1 "Earth" H 2525 6675 50  0001 C CNN
F 2 "" H 2525 6825 50  0001 C CNN
F 3 "~" H 2525 6825 50  0001 C CNN
	1    2525 6825
	1    0    0    -1  
$EndComp
Wire Wire Line
	1175 5475 1375 5475
$Comp
L SamacSys_Parts:INA139NA_3K IC3
U 1 1 5E28DC47
P 4800 1575
F 0 "IC3" H 5350 1840 50  0000 C CNN
F 1 "INA139NA_3K" H 5350 1749 50  0000 C CNN
F 2 "SOT95P280X145-5N" H 5750 1675 50  0001 L CNN
F 3 "http://www.ti.com/lit/gpn/ina139" H 5750 1575 50  0001 L CNN
F 4 "36V, High-Side, High-Speed, Current Output Current Sense Amplifier" H 5750 1475 50  0001 L CNN "Description"
F 5 "1.45" H 5750 1375 50  0001 L CNN "Height"
F 6 "Texas Instruments" H 5750 1275 50  0001 L CNN "Manufacturer_Name"
F 7 "INA139NA/3K" H 5750 1175 50  0001 L CNN "Manufacturer_Part_Number"
F 8 "595-INA139NA/3K" H 5750 1075 50  0001 L CNN "Mouser Part Number"
F 9 "https://www.mouser.com/Search/Refine.aspx?Keyword=595-INA139NA%2F3K" H 5750 975 50  0001 L CNN "Mouser Price/Stock"
F 10 "" H 5750 875 50  0001 L CNN "RS Part Number"
F 11 "" H 5750 775 50  0001 L CNN "RS Price/Stock"
	1    4800 1575
	1    0    0    -1  
$EndComp
Text GLabel 10500 2100 0    50   Input ~ 0
5V_output
$Comp
L power:GND #PWR0124
U 1 1 5E322979
P 10500 2200
F 0 "#PWR0124" H 10500 1950 50  0001 C CNN
F 1 "GND" H 10500 2075 50  0000 C CNN
F 2 "" H 10500 2200 50  0001 C CNN
F 3 "" H 10500 2200 50  0001 C CNN
	1    10500 2200
	0    1    1    0   
$EndComp
$Comp
L power:Earth #PWR0128
U 1 1 5E355769
P 4775 6625
F 0 "#PWR0128" H 4775 6375 50  0001 C CNN
F 1 "Earth" H 4775 6475 50  0001 C CNN
F 2 "" H 4775 6625 50  0001 C CNN
F 3 "~" H 4775 6625 50  0001 C CNN
	1    4775 6625
	1    0    0    -1  
$EndComp
Wire Wire Line
	1800 825  1800 1725
Text GLabel 2425 1100 0    50   Input ~ 0
Vin
Text GLabel 2400 3375 0    50   Input ~ 0
Vin
Wire Wire Line
	1775 3100 1775 4000
Text GLabel 4825 6525 1    50   Input ~ 0
Vbat
Wire Wire Line
	4775 6625 4825 6625
Text GLabel 10350 4450 0    50   Input ~ 0
Vbat
$Comp
L Device:R_US R20
U 1 1 5E6731E9
P 6700 5525
F 0 "R20" V 6575 5550 50  0000 L CNN
F 1 "0" V 6775 5500 50  0000 L CNN
F 2 "Resistor_SMD:R_0805_2012Metric" V 6740 5515 50  0001 C CNN
F 3 "~" H 6700 5525 50  0001 C CNN
	1    6700 5525
	0    1    1    0   
$EndComp
$Comp
L power:Earth #PWR0135
U 1 1 5E6738B6
P 6850 5525
F 0 "#PWR0135" H 6850 5275 50  0001 C CNN
F 1 "Earth" H 6850 5375 50  0001 C CNN
F 2 "" H 6850 5525 50  0001 C CNN
F 3 "~" H 6850 5525 50  0001 C CNN
	1    6850 5525
	1    0    0    -1  
$EndComp
$Comp
L power:GND #PWR0136
U 1 1 5E674044
P 6550 5525
F 0 "#PWR0136" H 6550 5275 50  0001 C CNN
F 1 "GND" H 6555 5352 50  0000 C CNN
F 2 "" H 6550 5525 50  0001 C CNN
F 3 "" H 6550 5525 50  0001 C CNN
	1    6550 5525
	1    0    0    -1  
$EndComp
$Comp
L Device:R_US R21
U 1 1 5E686B9F
P 6700 6025
F 0 "R21" V 6550 6075 50  0000 L CNN
F 1 "0" V 6800 6025 50  0000 L CNN
F 2 "Resistor_SMD:R_0805_2012Metric" V 6740 6015 50  0001 C CNN
F 3 "~" H 6700 6025 50  0001 C CNN
	1    6700 6025
	0    1    1    0   
$EndComp
Text GLabel 1175 5475 1    50   Input ~ 0
CHRG
Text GLabel 6850 6025 2    50   Input ~ 0
CHRG
Text GLabel 6550 6025 0    50   Input ~ 0
Vin
Wire Wire Line
	5900 1675 5900 2150
Wire Wire Line
	5900 2150 4225 2150
Wire Wire Line
	4225 2150 4225 825 
Connection ~ 4225 825 
Wire Wire Line
	4225 825  4575 825 
Wire Wire Line
	5875 3950 5875 4500
Text GLabel 5875 3250 2    50   Input ~ 0
3.3V_output
Text GLabel 5900 1025 2    50   Input ~ 0
5V_output
$Comp
L power:GND #PWR0115
U 1 1 5E2DEC2A
P 4425 4150
F 0 "#PWR0115" H 4425 3900 50  0001 C CNN
F 1 "GND" H 4425 4025 50  0000 C CNN
F 2 "" H 4425 4150 50  0001 C CNN
F 3 "" H 4425 4150 50  0001 C CNN
	1    4425 4150
	1    0    0    -1  
$EndComp
$Comp
L Device:R_US R9
U 1 1 5E2DEC17
P 4425 4000
F 0 "R9" H 4275 4050 50  0000 L CNN
F 1 "20k" H 4250 3975 50  0000 L CNN
F 2 "Resistor_SMD:R_0805_2012Metric" V 4465 3990 50  0001 C CNN
F 3 "~" H 4425 4000 50  0001 C CNN
	1    4425 4000
	1    0    0    -1  
$EndComp
Wire Wire Line
	3950 3100 4275 3100
Text GLabel 5875 4500 0    50   Input ~ 0
5V
Wire Wire Line
	1925 6725 1550 6725
Connection ~ 1925 6725
Wire Wire Line
	2525 6025 1375 6025
Wire Wire Line
	1375 6025 1375 6725
$Comp
L Device:C C12
U 1 1 5E7B3734
P 1550 6875
F 0 "C12" H 1675 6825 50  0000 L CNN
F 1 "10uF" H 1650 6725 50  0000 L CNN
F 2 "Capacitor_SMD:C_1210_3225Metric" H 1588 6725 50  0001 C CNN
F 3 "~" H 1550 6875 50  0001 C CNN
	1    1550 6875
	1    0    0    -1  
$EndComp
Connection ~ 1550 6725
Wire Wire Line
	1550 6725 1375 6725
$Comp
L power:Earth #PWR0137
U 1 1 5E7B3D95
P 1550 7025
F 0 "#PWR0137" H 1550 6775 50  0001 C CNN
F 1 "Earth" H 1550 6875 50  0001 C CNN
F 2 "" H 1550 7025 50  0001 C CNN
F 3 "~" H 1550 7025 50  0001 C CNN
	1    1550 7025
	1    0    0    -1  
$EndComp
Wire Wire Line
	4625 6525 4825 6525
Text GLabel 4250 6625 2    50   Input ~ 0
Vbat
Wire Wire Line
	3850 6225 3650 6225
Connection ~ 3750 6425
Wire Wire Line
	3750 6425 3525 6425
Wire Wire Line
	3750 6125 3650 6125
Wire Wire Line
	3650 6125 3650 6225
Connection ~ 3650 6225
Wire Wire Line
	3650 6225 3525 6225
Wire Wire Line
	2525 6425 2525 6225
Wire Wire Line
	2525 6225 2525 6025
Connection ~ 2525 6225
$Comp
L Battery_Management:LT3652EMSE U1
U 1 1 5E341AA2
P 3025 6525
F 0 "U1" H 3025 7206 50  0000 C CNN
F 1 "LT3652EMSE" H 3025 7115 50  0000 C CNN
F 2 "Package_SO:MSOP-12-1EP_3x4mm_P0.65mm_EP1.65x2.85mm" H 3025 5925 50  0001 C CNN
F 3 "https://www.analog.com/media/en/technical-documentation/data-sheets/3652fe.pdf" H 3625 5725 50  0001 C CNN
	1    3025 6525
	1    0    0    -1  
$EndComp
Wire Wire Line
	4650 6225 4650 6425
Wire Wire Line
	4650 6425 4225 6425
Wire Wire Line
	4225 6425 4225 6525
Wire Wire Line
	3525 6525 4225 6525
Wire Wire Line
	4225 6525 4325 6525
Connection ~ 4225 6525
Connection ~ 4650 6225
Wire Notes Line
	7250 5275 7250 6175
Wire Notes Line
	7250 6175 6125 6175
Wire Notes Line
	6125 6175 6125 5275
Wire Notes Line
	6125 5275 7250 5275
Text Notes 7375 5900 0    50   ~ 0
Net Ties
$Comp
L Device:C C14
U 1 1 5E668596
P 1625 2750
F 0 "C14" H 1740 2796 50  0000 L CNN
F 1 "10uF" H 1740 2705 50  0000 L CNN
F 2 "Capacitor_SMD:C_1210_3225Metric" H 1663 2600 50  0001 C CNN
F 3 "~" H 1625 2750 50  0001 C CNN
	1    1625 2750
	1    0    0    -1  
$EndComp
Wire Wire Line
	1000 2600 1400 2600
$Comp
L power:GND #PWR0138
U 1 1 5E670A34
P 1625 2900
F 0 "#PWR0138" H 1625 2650 50  0001 C CNN
F 1 "GND" H 1630 2727 50  0000 C CNN
F 2 "" H 1625 2900 50  0001 C CNN
F 3 "" H 1625 2900 50  0001 C CNN
	1    1625 2900
	1    0    0    -1  
$EndComp
$Comp
L Device:C C13
U 1 1 5E6715D6
P 1400 2750
F 0 "C13" H 1515 2796 50  0000 L CNN
F 1 "10uF" H 1515 2705 50  0000 L CNN
F 2 "Capacitor_SMD:C_1210_3225Metric" H 1438 2600 50  0001 C CNN
F 3 "~" H 1400 2750 50  0001 C CNN
	1    1400 2750
	1    0    0    -1  
$EndComp
Connection ~ 1400 2600
Wire Wire Line
	1400 2600 1625 2600
$Comp
L power:GND #PWR0139
U 1 1 5E671B44
P 1400 2900
F 0 "#PWR0139" H 1400 2650 50  0001 C CNN
F 1 "GND" H 1405 2727 50  0000 C CNN
F 2 "" H 1400 2900 50  0001 C CNN
F 3 "" H 1400 2900 50  0001 C CNN
	1    1400 2900
	1    0    0    -1  
$EndComp
$Comp
L Device:R_US R22
U 1 1 5E67B94C
P 7350 3500
F 0 "R22" V 7225 3525 50  0000 L CNN
F 1 "0" V 7425 3475 50  0000 L CNN
F 2 "Resistor_SMD:R_0805_2012Metric" V 7390 3490 50  0001 C CNN
F 3 "~" H 7350 3500 50  0001 C CNN
	1    7350 3500
	-1   0    0    1   
$EndComp
Connection ~ 7350 3650
Wire Wire Line
	7350 3650 7050 3650
Text GLabel 7350 3350 2    50   Input ~ 0
3.3V_output
$Comp
L Device:C C15
U 1 1 5E6A34AF
P 4125 975
F 0 "C15" H 4240 1021 50  0000 L CNN
F 1 "22uF" H 4240 930 50  0000 L CNN
F 2 "Capacitor_SMD:C_1210_3225Metric" H 4163 825 50  0001 C CNN
F 3 "~" H 4125 975 50  0001 C CNN
	1    4125 975 
	1    0    0    -1  
$EndComp
Connection ~ 4125 825 
Wire Wire Line
	4125 825  4225 825 
$Comp
L power:GND #PWR0140
U 1 1 5E6A3B68
P 4125 1125
F 0 "#PWR0140" H 4125 875 50  0001 C CNN
F 1 "GND" H 4130 952 50  0000 C CNN
F 2 "" H 4125 1125 50  0001 C CNN
F 3 "" H 4125 1125 50  0001 C CNN
	1    4125 1125
	1    0    0    -1  
$EndComp
$Comp
L Device:C C16
U 1 1 5E6A3F15
P 4275 3250
F 0 "C16" H 4390 3296 50  0000 L CNN
F 1 "22uF" H 4390 3205 50  0000 L CNN
F 2 "Capacitor_SMD:C_1210_3225Metric" H 4313 3100 50  0001 C CNN
F 3 "~" H 4275 3250 50  0001 C CNN
	1    4275 3250
	1    0    0    -1  
$EndComp
Connection ~ 4275 3100
Wire Wire Line
	4275 3100 4550 3100
$Comp
L power:GND #PWR0141
U 1 1 5E6A43FB
P 4275 3400
F 0 "#PWR0141" H 4275 3150 50  0001 C CNN
F 1 "GND" H 4280 3227 50  0000 C CNN
F 2 "" H 4275 3400 50  0001 C CNN
F 3 "" H 4275 3400 50  0001 C CNN
	1    4275 3400
	1    0    0    -1  
$EndComp
Text GLabel 9475 4450 2    50   Input ~ 0
Vbat
Wire Wire Line
	9475 4350 10350 4350
Wire Wire Line
	10350 4050 9475 4050
$Comp
L Device:R_US R17
U 1 1 5E362735
P 3825 7025
F 0 "R17" H 3893 7071 50  0000 L CNN
F 1 "330k" H 3893 6980 50  0000 L CNN
F 2 "Resistor_SMD:R_0603_1608Metric" V 3865 7015 50  0001 C CNN
F 3 "~" H 3825 7025 50  0001 C CNN
	1    3825 7025
	1    0    0    -1  
$EndComp
$Comp
L Connector:Conn_01x02_Male J2
U 1 1 5E6C5776
P 10700 2000
F 0 "J2" H 10808 2181 50  0000 C CNN
F 1 "DC input" H 10808 2090 50  0000 C CNN
F 2 "SamacSys_Parts:SHDR2W100P0X500_1X2_1000X760X1040P" H 10700 2000 50  0001 C CNN
F 3 "~" H 10700 2000 50  0001 C CNN
	1    10700 2000
	-1   0    0    1   
$EndComp
$Comp
L Connector:Conn_01x02_Male J7
U 1 1 5E6CEC39
P 10700 2200
F 0 "J7" H 10808 2381 50  0000 C CNN
F 1 "DC input" H 10808 2290 50  0000 C CNN
F 2 "SamacSys_Parts:SHDR2W100P0X500_1X2_1000X760X1040P" H 10700 2200 50  0001 C CNN
F 3 "~" H 10700 2200 50  0001 C CNN
	1    10700 2200
	-1   0    0    1   
$EndComp
$Comp
L Connector:Conn_01x02_Male J3
U 1 1 5E2C12F1
P 5025 6625
F 0 "J3" H 4900 6525 50  0000 C CNN
F 1 "Battery" H 4825 6625 50  0000 C CNN
F 2 "SamacSys_Parts:SHDR2W100P0X500_1X2_1000X760X1040P" H 5025 6625 50  0001 C CNN
F 3 "~" H 5025 6625 50  0001 C CNN
	1    5025 6625
	-1   0    0    1   
$EndComp
$EndSCHEMATC
