(module "SOT95P280X145-5N" (layer F.Cu)
  (descr "DBV (R-PDSO-G5)")
  (tags "Integrated Circuit")
  (attr smd)
  (fp_text reference IC** (at 0 0) (layer F.SilkS)
    (effects (font (size 1.27 1.27) (thickness 0.254)))
  )
  (fp_text user %R (at 0 0) (layer F.Fab)
    (effects (font (size 1.27 1.27) (thickness 0.254)))
  )
  (fp_text value "SOT95P280X145-5N" (at 0 0) (layer F.SilkS) hide
    (effects (font (size 1.27 1.27) (thickness 0.254)))
  )
  (fp_line (start -2.1 -1.775) (end 2.1 -1.775) (layer F.CrtYd) (width 0.05))
  (fp_line (start 2.1 -1.775) (end 2.1 1.775) (layer F.CrtYd) (width 0.05))
  (fp_line (start 2.1 1.775) (end -2.1 1.775) (layer F.CrtYd) (width 0.05))
  (fp_line (start -2.1 1.775) (end -2.1 -1.775) (layer F.CrtYd) (width 0.05))
  (fp_line (start -0.8 -1.45) (end 0.8 -1.45) (layer F.Fab) (width 0.1))
  (fp_line (start 0.8 -1.45) (end 0.8 1.45) (layer F.Fab) (width 0.1))
  (fp_line (start 0.8 1.45) (end -0.8 1.45) (layer F.Fab) (width 0.1))
  (fp_line (start -0.8 1.45) (end -0.8 -1.45) (layer F.Fab) (width 0.1))
  (fp_line (start -0.8 -0.5) (end 0.15 -1.45) (layer F.Fab) (width 0.1))
  (fp_line (start -0.3 -1.45) (end 0.3 -1.45) (layer F.SilkS) (width 0.2))
  (fp_line (start 0.3 -1.45) (end 0.3 1.45) (layer F.SilkS) (width 0.2))
  (fp_line (start 0.3 1.45) (end -0.3 1.45) (layer F.SilkS) (width 0.2))
  (fp_line (start -0.3 1.45) (end -0.3 -1.45) (layer F.SilkS) (width 0.2))
  (fp_line (start -1.85 -1.5) (end -0.65 -1.5) (layer F.SilkS) (width 0.2))
  (pad 1 smd rect (at -1.25 -0.95 90) (size 0.6 1.2) (layers F.Cu F.Paste F.Mask))
  (pad 2 smd rect (at -1.25 0 90) (size 0.6 1.2) (layers F.Cu F.Paste F.Mask))
  (pad 3 smd rect (at -1.25 0.95 90) (size 0.6 1.2) (layers F.Cu F.Paste F.Mask))
  (pad 4 smd rect (at 1.25 0.95 90) (size 0.6 1.2) (layers F.Cu F.Paste F.Mask))
  (pad 5 smd rect (at 1.25 -0.95 90) (size 0.6 1.2) (layers F.Cu F.Paste F.Mask))
  (model "C:\Users\gampo\OneDrive\?p?????st??\Updated_eps_prototype\SamacSys_Parts.3dshapes\\INA139NA_250.stp"
    (at (xyz 0 0 0))
    (scale (xyz 1 1 1))
    (rotate (xyz 0 0 0))
  )
)
