%!PS-Adobe-3.0
%%Creator: PCBNEW
%%CreationDate: Sat Jul 27 02:10:59 2019
%%Title: C:\Users\gampo\OneDrive\Υπολογιστής\Updated_eps_prototype\eps_prototype-PTH-drl_map.ps
%%Pages: 1
%%PageOrder: Ascend
%%BoundingBox: 0 0 596 842
%%DocumentMedia: A4 595 842 0 () ()
%%Orientation: Landscape
%%EndComments
%%BeginProlog
/line { newpath moveto lineto stroke } bind def
/cir0 { newpath 0 360 arc stroke } bind def
/cir1 { newpath 0 360 arc gsave fill grestore stroke } bind def
/cir2 { newpath 0 360 arc gsave fill grestore stroke } bind def
/arc0 { newpath arc stroke } bind def
/arc1 { newpath 4 index 4 index moveto arc closepath gsave fill
    grestore stroke } bind def
/arc2 { newpath 4 index 4 index moveto arc closepath gsave fill
    grestore stroke } bind def
/poly0 { stroke } bind def
/poly1 { closepath gsave fill grestore stroke } bind def
/poly2 { closepath gsave fill grestore stroke } bind def
/rect0 { rectstroke } bind def
/rect1 { rectfill } bind def
/rect2 { rectfill } bind def
/linemode0 { 0 setlinecap 0 setlinejoin 0 setlinewidth } bind def
/linemode1 { 1 setlinecap 1 setlinejoin } bind def
/dashedline { [200] 100 setdash } bind def
/solidline { [] 0 setdash } bind def
/phantomshow { moveto
    /KicadFont findfont 0.000001 scalefont setfont
    show } bind def
/textshow { gsave
    findfont exch scalefont setfont concat 1 scale 0 0 moveto show
    } bind def
/reencodefont {
  findfont dup length dict begin
  { 1 index /FID ne
    { def }
    { pop pop } ifelse
  } forall
  /Encoding ISOLatin1Encoding def
  currentdict
  end } bind def
/KicadFont /Helvetica reencodefont definefont pop
/KicadFont-Bold /Helvetica-Bold reencodefont definefont pop
/KicadFont-Oblique /Helvetica-Oblique reencodefont definefont pop
/KicadFont-BoldOblique /Helvetica-BoldOblique reencodefont definefont pop
%%EndProlog
%%Page: 1 1
%%BeginPageSetup
gsave
0.0072 0.0072 scale
linemode1
82680 0 translate 90 rotate
58.021 setlinewidth
%%EndPageSetup
0 0 0 setrgbcolor
45.6858 setlinewidth
newpath
79309.1 78720.1 moveto
38648.8 78720.1 lineto
stroke
0 0 0 setrgbcolor
newpath
38648.8 78720.1 moveto
37620.9 78720.1 lineto
stroke
0 0 0 setrgbcolor
newpath
37620.9 78720.1 moveto
37620.9 77692.2 lineto
stroke
0 0 0 setrgbcolor
newpath
37620.9 37031.9 moveto
37620.9 77692.2 lineto
stroke
0 0 0 setrgbcolor
newpath
79309.1 78720.1 moveto
79309.1 77692.2 lineto
stroke
0 0 0 setrgbcolor
newpath
38648.8 37031.9 moveto
37620.9 37031.9 lineto
stroke
0 0 0 setrgbcolor
newpath
38648.8 37031.9 moveto
79309.1 37031.9 lineto
stroke
0 0 0 setrgbcolor
newpath
79309.1 77692.2 moveto
79309.1 37031.9 lineto
stroke
78.7399 setlinewidth
newpath
38059.4 53407.5 moveto
38242.2 53224.7 lineto
stroke
newpath
38242.2 53407.5 moveto
38059.4 53224.7 lineto
stroke
newpath
39335.9 70697.7 moveto
39518.6 70515 lineto
stroke
newpath
39518.6 70697.7 moveto
39335.9 70515 lineto
stroke
newpath
40496.3 48508.1 moveto
40679.1 48325.4 lineto
stroke
newpath
40679.1 48508.1 moveto
40496.3 48325.4 lineto
stroke
newpath
40496.3 47480.2 moveto
40679.1 47297.5 lineto
stroke
newpath
40679.1 47480.2 moveto
40496.3 47297.5 lineto
stroke
newpath
40612.4 57817.1 moveto
40795.1 57634.3 lineto
stroke
newpath
40795.1 57817.1 moveto
40612.4 57634.3 lineto
stroke
newpath
40844.4 63967.3 moveto
41027.2 63784.5 lineto
stroke
newpath
41027.2 63967.3 moveto
40844.4 63784.5 lineto
stroke
newpath
40844.4 61994.6 moveto
41027.2 61811.8 lineto
stroke
newpath
41027.2 61994.6 moveto
40844.4 61811.8 lineto
stroke
newpath
41689.6 45623.5 moveto
41872.4 45440.8 lineto
stroke
newpath
41872.4 45623.5 moveto
41689.6 45440.8 lineto
stroke
newpath
42469 70349.6 moveto
42651.8 70166.9 lineto
stroke
newpath
42651.8 70349.6 moveto
42469 70166.9 lineto
stroke
newpath
42469 69421.3 moveto
42651.8 69238.5 lineto
stroke
newpath
42651.8 69421.3 moveto
42469 69238.5 lineto
stroke
newpath
42817.2 50016.7 moveto
42999.9 49833.9 lineto
stroke
newpath
42999.9 50016.7 moveto
42817.2 49833.9 lineto
stroke
newpath
43148.4 49567.1 moveto
43331.1 49384.4 lineto
stroke
newpath
43331.1 49567.1 moveto
43148.4 49384.4 lineto
stroke
newpath
43165.3 67680.6 moveto
43348 67497.9 lineto
stroke
newpath
43348 67680.6 moveto
43165.3 67497.9 lineto
stroke
newpath
43761.9 47402.5 moveto
43944.7 47219.8 lineto
stroke
newpath
43944.7 47402.5 moveto
43761.9 47219.8 lineto
stroke
newpath
44079 41803.3 moveto
44261.7 41620.5 lineto
stroke
newpath
44261.7 41803.3 moveto
44079 41620.5 lineto
stroke
newpath
46298.4 68957.1 moveto
46481.2 68774.3 lineto
stroke
newpath
46481.2 68957.1 moveto
46298.4 68774.3 lineto
stroke
newpath
46653.9 48616.8 moveto
46836.6 48434.1 lineto
stroke
newpath
46836.6 48616.8 moveto
46653.9 48434.1 lineto
stroke
newpath
46994.7 69305.2 moveto
47177.4 69122.5 lineto
stroke
newpath
47177.4 69305.2 moveto
46994.7 69122.5 lineto
stroke
newpath
47226.7 56424.6 moveto
47409.5 56241.8 lineto
stroke
newpath
47409.5 56424.6 moveto
47226.7 56241.8 lineto
stroke
newpath
47226.7 55380.2 moveto
47409.5 55197.4 lineto
stroke
newpath
47409.5 55380.2 moveto
47226.7 55197.4 lineto
stroke
newpath
47458.8 70697.7 moveto
47641.6 70515 lineto
stroke
newpath
47641.6 70697.7 moveto
47458.8 70515 lineto
stroke
newpath
47466.1 46488.8 moveto
47648.9 46306.1 lineto
stroke
newpath
47648.9 46488.8 moveto
47466.1 46306.1 lineto
stroke
newpath
47923 48658.9 moveto
48105.7 48476.1 lineto
stroke
newpath
48105.7 48658.9 moveto
47923 48476.1 lineto
stroke
newpath
47923 47115.6 moveto
48105.7 46932.9 lineto
stroke
newpath
48105.7 47115.6 moveto
47923 46932.9 lineto
stroke
newpath
48229.1 72206.3 moveto
48411.8 72023.5 lineto
stroke
newpath
48411.8 72206.3 moveto
48229.1 72023.5 lineto
stroke
newpath
48387.2 61414.4 moveto
48569.9 61231.6 lineto
stroke
newpath
48569.9 61414.4 moveto
48387.2 61231.6 lineto
stroke
newpath
48836.7 46831.5 moveto
49019.5 46648.7 lineto
stroke
newpath
49019.5 46831.5 moveto
48836.7 46648.7 lineto
stroke
newpath
49199.5 71161.9 moveto
49382.2 70979.1 lineto
stroke
newpath
49382.2 71161.9 moveto
49199.5 70979.1 lineto
stroke
newpath
49199.5 63967.3 moveto
49382.2 63784.5 lineto
stroke
newpath
49382.2 63967.3 moveto
49199.5 63784.5 lineto
stroke
newpath
49199.5 63155 moveto
49382.2 62972.3 lineto
stroke
newpath
49382.2 63155 moveto
49199.5 62972.3 lineto
stroke
newpath
49315.5 54335.8 moveto
49498.2 54153.1 lineto
stroke
newpath
49498.2 54335.8 moveto
49315.5 54153.1 lineto
stroke
newpath
49431.5 59093.5 moveto
49614.3 58910.8 lineto
stroke
newpath
49614.3 59093.5 moveto
49431.5 58910.8 lineto
stroke
newpath
49431.5 58220 moveto
49614.3 58037.3 lineto
stroke
newpath
49614.3 58220 moveto
49431.5 58037.3 lineto
stroke
newpath
49737.6 72090.2 moveto
49920.4 71907.5 lineto
stroke
newpath
49920.4 72090.2 moveto
49737.6 71907.5 lineto
stroke
newpath
49895.7 64315.4 moveto
50078.5 64132.7 lineto
stroke
newpath
50078.5 64315.4 moveto
49895.7 64132.7 lineto
stroke
newpath
50708 70581.7 moveto
50890.8 70398.9 lineto
stroke
newpath
50890.8 70581.7 moveto
50708 70398.9 lineto
stroke
newpath
50715.8 59449.4 moveto
50898.5 59266.7 lineto
stroke
newpath
50898.5 59449.4 moveto
50715.8 59266.7 lineto
stroke
newpath
51121 69445.9 moveto
51303.8 69263.2 lineto
stroke
newpath
51303.8 69445.9 moveto
51121 69263.2 lineto
stroke
newpath
51235.2 66476.4 moveto
51418 66293.6 lineto
stroke
newpath
51418 66476.4 moveto
51235.2 66293.6 lineto
stroke
newpath
51463.7 72758.2 moveto
51646.4 72575.4 lineto
stroke
newpath
51646.4 72758.2 moveto
51463.7 72575.4 lineto
stroke
newpath
51806.3 62478.8 moveto
51989 62296.1 lineto
stroke
newpath
51989 62478.8 moveto
51806.3 62296.1 lineto
stroke
newpath
52377.4 55626 moveto
52560.1 55443.2 lineto
stroke
newpath
52560.1 55626 moveto
52377.4 55443.2 lineto
stroke
newpath
52377.4 54369.6 moveto
52560.1 54186.9 lineto
stroke
newpath
52560.1 54369.6 moveto
52377.4 54186.9 lineto
stroke
newpath
52433.1 60021.9 moveto
52615.8 59839.1 lineto
stroke
newpath
52615.8 60021.9 moveto
52433.1 59839.1 lineto
stroke
newpath
52948.4 61222.5 moveto
53131.2 61039.7 lineto
stroke
newpath
53131.2 61222.5 moveto
52948.4 61039.7 lineto
stroke
newpath
53028.8 53175.4 moveto
53211.6 52992.6 lineto
stroke
newpath
53211.6 53175.4 moveto
53028.8 52992.6 lineto
stroke
newpath
53082.8 42168.8 moveto
53265.5 41986 lineto
stroke
newpath
53265.5 42168.8 moveto
53082.8 41986 lineto
stroke
newpath
53144.9 57933.1 moveto
53327.6 57750.4 lineto
stroke
newpath
53327.6 57933.1 moveto
53144.9 57750.4 lineto
stroke
newpath
53153.7 59102.3 moveto
53336.4 58919.5 lineto
stroke
newpath
53336.4 59102.3 moveto
53153.7 58919.5 lineto
stroke
newpath
53609.1 59065.2 moveto
53791.8 58882.5 lineto
stroke
newpath
53791.8 59065.2 moveto
53609.1 58882.5 lineto
stroke
newpath
53609.1 57933.1 moveto
53791.8 57750.4 lineto
stroke
newpath
53791.8 57933.1 moveto
53609.1 57750.4 lineto
stroke
newpath
53747.9 64306.3 moveto
53930.7 64123.5 lineto
stroke
newpath
53930.7 64306.3 moveto
53747.9 64123.5 lineto
stroke
newpath
53747.9 63278.3 moveto
53930.7 63095.6 lineto
stroke
newpath
53930.7 63278.3 moveto
53747.9 63095.6 lineto
stroke
newpath
53833.8 61878.5 moveto
54016.6 61695.8 lineto
stroke
newpath
54016.6 61878.5 moveto
53833.8 61695.8 lineto
stroke
newpath
53833.8 61066.2 moveto
54016.6 60883.5 lineto
stroke
newpath
54016.6 61066.2 moveto
53833.8 60883.5 lineto
stroke
newpath
54305.3 61066.2 moveto
54488.1 60883.5 lineto
stroke
newpath
54488.1 61066.2 moveto
54305.3 60883.5 lineto
stroke
newpath
54433.2 48316.2 moveto
54616 48133.5 lineto
stroke
newpath
54616 48316.2 moveto
54433.2 48133.5 lineto
stroke
newpath
54459.7 60021.9 moveto
54642.5 59839.1 lineto
stroke
newpath
54642.5 60021.9 moveto
54459.7 59839.1 lineto
stroke
newpath
54537.4 63271 moveto
54720.1 63088.3 lineto
stroke
newpath
54720.1 63271 moveto
54537.4 63088.3 lineto
stroke
newpath
54537.4 51666.8 moveto
54720.1 51484.1 lineto
stroke
newpath
54720.1 51666.8 moveto
54537.4 51484.1 lineto
stroke
newpath
54661.7 65905.3 moveto
54844.4 65722.5 lineto
stroke
newpath
54844.4 65905.3 moveto
54661.7 65722.5 lineto
stroke
newpath
54762.2 61066.2 moveto
54944.9 60883.5 lineto
stroke
newpath
54944.9 61066.2 moveto
54762.2 60883.5 lineto
stroke
newpath
54769.5 64547.5 moveto
54952.2 64364.8 lineto
stroke
newpath
54952.2 64547.5 moveto
54769.5 64364.8 lineto
stroke
newpath
54885.5 61994.6 moveto
55068.3 61811.8 lineto
stroke
newpath
55068.3 61994.6 moveto
54885.5 61811.8 lineto
stroke
newpath
55233.6 57936.8 moveto
55416.4 57754 lineto
stroke
newpath
55416.4 57936.8 moveto
55233.6 57754 lineto
stroke
newpath
55581.8 53175.4 moveto
55764.5 52992.6 lineto
stroke
newpath
55764.5 53175.4 moveto
55581.8 52992.6 lineto
stroke
newpath
56025.3 66254.8 moveto
56208.1 66072.1 lineto
stroke
newpath
56208.1 66254.8 moveto
56025.3 66072.1 lineto
stroke
newpath
56112.2 53705.8 moveto
56294.9 53523 lineto
stroke
newpath
56294.9 53705.8 moveto
56112.2 53523 lineto
stroke
newpath
56162 65243.7 moveto
56344.7 65061 lineto
stroke
newpath
56344.7 65243.7 moveto
56162 65061 lineto
stroke
newpath
56162 54683.9 moveto
56344.7 54501.2 lineto
stroke
newpath
56344.7 54683.9 moveto
56162 54501.2 lineto
stroke
newpath
56169.3 55612.3 moveto
56352 55429.5 lineto
stroke
newpath
56352 55612.3 moveto
56169.3 55429.5 lineto
stroke
newpath
56489.1 65676.9 moveto
56671.8 65494.1 lineto
stroke
newpath
56671.8 65676.9 moveto
56489.1 65494.1 lineto
stroke
newpath
56510.1 63967.3 moveto
56692.8 63784.5 lineto
stroke
newpath
56692.8 63967.3 moveto
56510.1 63784.5 lineto
stroke
newpath
56527 66288.1 moveto
56709.8 66105.4 lineto
stroke
newpath
56709.8 66288.1 moveto
56527 66105.4 lineto
stroke
newpath
56550.3 64547.5 moveto
56733.1 64364.8 lineto
stroke
newpath
56733.1 64547.5 moveto
56550.3 64364.8 lineto
stroke
newpath
56626.1 60834.2 moveto
56808.9 60651.4 lineto
stroke
newpath
56808.9 60834.2 moveto
56626.1 60651.4 lineto
stroke
newpath
56626.1 55612.3 moveto
56808.9 55429.5 lineto
stroke
newpath
56808.9 55612.3 moveto
56626.1 55429.5 lineto
stroke
newpath
56626.1 54683.9 moveto
56808.9 54501.2 lineto
stroke
newpath
56808.9 54683.9 moveto
56626.1 54501.2 lineto
stroke
newpath
56858.2 53059.3 moveto
57041 52876.6 lineto
stroke
newpath
57041 53059.3 moveto
56858.2 52876.6 lineto
stroke
newpath
57090.3 55612.3 moveto
57273.1 55429.5 lineto
stroke
newpath
57273.1 55612.3 moveto
57090.3 55429.5 lineto
stroke
newpath
57090.3 54683.9 moveto
57273.1 54501.2 lineto
stroke
newpath
57273.1 54683.9 moveto
57090.3 54501.2 lineto
stroke
newpath
57457.2 65243.7 moveto
57639.9 65061 lineto
stroke
newpath
57639.9 65243.7 moveto
57457.2 65061 lineto
stroke
newpath
57547.2 55612.3 moveto
57729.9 55429.5 lineto
stroke
newpath
57729.9 55612.3 moveto
57547.2 55429.5 lineto
stroke
newpath
57554.5 54683.9 moveto
57737.2 54501.2 lineto
stroke
newpath
57737.2 54683.9 moveto
57554.5 54501.2 lineto
stroke
newpath
57670.5 63967.3 moveto
57853.3 63784.5 lineto
stroke
newpath
57853.3 63967.3 moveto
57670.5 63784.5 lineto
stroke
newpath
57859.7 57505.5 moveto
58042.4 57322.7 lineto
stroke
newpath
58042.4 57505.5 moveto
57859.7 57322.7 lineto
stroke
newpath
58018.6 53291.4 moveto
58201.4 53108.7 lineto
stroke
newpath
58201.4 53291.4 moveto
58018.6 53108.7 lineto
stroke
newpath
58134.7 66520.2 moveto
58317.4 66337.5 lineto
stroke
newpath
58317.4 66520.2 moveto
58134.7 66337.5 lineto
stroke
newpath
58482.8 61994.6 moveto
58665.6 61811.8 lineto
stroke
newpath
58665.6 61994.6 moveto
58482.8 61811.8 lineto
stroke
newpath
58598.9 63039 moveto
58781.6 62856.2 lineto
stroke
newpath
58781.6 63039 moveto
58598.9 62856.2 lineto
stroke
newpath
58947 55612.3 moveto
59129.7 55429.5 lineto
stroke
newpath
59129.7 55612.3 moveto
58947 55429.5 lineto
stroke
newpath
59179.1 60911.8 moveto
59361.8 60729.1 lineto
stroke
newpath
59361.8 60911.8 moveto
59179.1 60729.1 lineto
stroke
newpath
59179.1 41455.2 moveto
59361.8 41272.4 lineto
stroke
newpath
59361.8 41455.2 moveto
59179.1 41272.4 lineto
stroke
newpath
59179.1 40641 moveto
59361.8 40458.3 lineto
stroke
newpath
59361.8 40641 moveto
59179.1 40458.3 lineto
stroke
newpath
59411.2 53175.4 moveto
59593.9 52992.6 lineto
stroke
newpath
59593.9 53175.4 moveto
59411.2 52992.6 lineto
stroke
newpath
59643.2 63503.1 moveto
59826 63320.4 lineto
stroke
newpath
59826 63503.1 moveto
59643.2 63320.4 lineto
stroke
newpath
59759.3 55032.1 moveto
59942 54849.3 lineto
stroke
newpath
59942 55032.1 moveto
59759.3 54849.3 lineto
stroke
newpath
59991.4 65940 moveto
60174.1 65757.3 lineto
stroke
newpath
60174.1 65940 moveto
59991.4 65757.3 lineto
stroke
newpath
60455.5 59284.5 moveto
60638.3 59101.7 lineto
stroke
newpath
60638.3 59284.5 moveto
60455.5 59101.7 lineto
stroke
newpath
60455.5 55032.1 moveto
60638.3 54849.3 lineto
stroke
newpath
60638.3 55032.1 moveto
60455.5 54849.3 lineto
stroke
newpath
60829.2 57505.5 moveto
61012 57322.7 lineto
stroke
newpath
61012 57505.5 moveto
60829.2 57322.7 lineto
stroke
newpath
61499.9 58977.5 moveto
61682.7 58794.7 lineto
stroke
newpath
61682.7 58977.5 moveto
61499.9 58794.7 lineto
stroke
newpath
61616 53175.4 moveto
61798.7 52992.6 lineto
stroke
newpath
61798.7 53175.4 moveto
61616 52992.6 lineto
stroke
newpath
61628.7 56197 moveto
61811.5 56014.3 lineto
stroke
newpath
61811.5 56197 moveto
61628.7 56014.3 lineto
stroke
newpath
61734.1 65942.1 moveto
61916.9 65759.4 lineto
stroke
newpath
61916.9 65942.1 moveto
61734.1 65759.4 lineto
stroke
newpath
61964.1 62110.6 moveto
62146.8 61927.9 lineto
stroke
newpath
62146.8 62110.6 moveto
61964.1 61927.9 lineto
stroke
newpath
62428.2 54683.9 moveto
62611 54501.2 lineto
stroke
newpath
62611 54683.9 moveto
62428.2 54501.2 lineto
stroke
newpath
62428.2 52827.3 moveto
62611 52644.5 lineto
stroke
newpath
62611 52827.3 moveto
62428.2 52644.5 lineto
stroke
newpath
62892.4 55844.4 moveto
63075.2 55661.6 lineto
stroke
newpath
63075.2 55844.4 moveto
62892.4 55661.6 lineto
stroke
newpath
63588.7 58629.4 moveto
63771.4 58446.6 lineto
stroke
newpath
63771.4 58629.4 moveto
63588.7 58446.6 lineto
stroke
newpath
63936.8 63155 moveto
64119.5 62972.3 lineto
stroke
newpath
64119.5 63155 moveto
63936.8 62972.3 lineto
stroke
newpath
63936.8 60834.2 moveto
64119.5 60651.4 lineto
stroke
newpath
64119.5 60834.2 moveto
63936.8 60651.4 lineto
stroke
newpath
64052.8 57724.8 moveto
64235.6 57542 lineto
stroke
newpath
64235.6 57724.8 moveto
64052.8 57542 lineto
stroke
newpath
64168.9 55844.4 moveto
64351.6 55661.6 lineto
stroke
newpath
64351.6 55844.4 moveto
64168.9 55661.6 lineto
stroke
newpath
64633 61994.6 moveto
64815.8 61811.8 lineto
stroke
newpath
64815.8 61994.6 moveto
64633 61811.8 lineto
stroke
newpath
64633 60834.2 moveto
64815.8 60651.4 lineto
stroke
newpath
64815.8 60834.2 moveto
64633 60651.4 lineto
stroke
newpath
64633 56272 moveto
64815.8 56089.2 lineto
stroke
newpath
64815.8 56272 moveto
64633 56089.2 lineto
stroke
newpath
65097.2 55728.3 moveto
65280 55545.6 lineto
stroke
newpath
65280 55728.3 moveto
65097.2 55545.6 lineto
stroke
newpath
65169.4 58595.6 moveto
65352.1 58412.8 lineto
stroke
newpath
65352.1 58595.6 moveto
65169.4 58412.8 lineto
stroke
newpath
65793.5 61994.6 moveto
65976.2 61811.8 lineto
stroke
newpath
65976.2 61994.6 moveto
65793.5 61811.8 lineto
stroke
newpath
65793.5 60834.2 moveto
65976.2 60651.4 lineto
stroke
newpath
65976.2 60834.2 moveto
65793.5 60651.4 lineto
stroke
newpath
66025.5 70581.7 moveto
66208.3 70398.9 lineto
stroke
newpath
66208.3 70581.7 moveto
66025.5 70398.9 lineto
stroke
newpath
66837.8 45400.6 moveto
67020.6 45217.8 lineto
stroke
newpath
67020.6 45400.6 moveto
66837.8 45217.8 lineto
stroke
newpath
66882.6 65791.1 moveto
67065.4 65608.3 lineto
stroke
newpath
67065.4 65791.1 moveto
66882.6 65608.3 lineto
stroke
newpath
66953.9 70117.5 moveto
67136.6 69934.8 lineto
stroke
newpath
67136.6 70117.5 moveto
66953.9 69934.8 lineto
stroke
newpath
68602.2 72434.7 moveto
68785 72252 lineto
stroke
newpath
68785 72434.7 moveto
68602.2 72252 lineto
stroke
newpath
68824.3 50829 moveto
69007 50646.2 lineto
stroke
newpath
69007 50829 moveto
68824.3 50646.2 lineto
stroke
newpath
69042.6 69189.2 moveto
69225.4 69006.4 lineto
stroke
newpath
69225.4 69189.2 moveto
69042.6 69006.4 lineto
stroke
newpath
69971 60834.2 moveto
70153.7 60651.4 lineto
stroke
newpath
70153.7 60834.2 moveto
69971 60651.4 lineto
stroke
newpath
69971 58049.1 moveto
70153.7 57866.4 lineto
stroke
newpath
70153.7 58049.1 moveto
69971 57866.4 lineto
stroke
newpath
70087 70697.7 moveto
70269.8 70515 lineto
stroke
newpath
70269.8 70697.7 moveto
70087 70515 lineto
stroke
newpath
70087 66636.3 moveto
70269.8 66453.5 lineto
stroke
newpath
70269.8 66636.3 moveto
70087 66453.5 lineto
stroke
newpath
70435.1 46909.1 moveto
70617.9 46726.4 lineto
stroke
newpath
70617.9 46909.1 moveto
70435.1 46726.4 lineto
stroke
newpath
70551.2 68144.8 moveto
70733.9 67962.1 lineto
stroke
newpath
70733.9 68144.8 moveto
70551.2 67962.1 lineto
stroke
newpath
70551.2 67134.7 moveto
70733.9 66951.9 lineto
stroke
newpath
70733.9 67134.7 moveto
70551.2 66951.9 lineto
stroke
newpath
70667.2 63039 moveto
70850 62856.2 lineto
stroke
newpath
70850 63039 moveto
70667.2 62856.2 lineto
stroke
newpath
71015.3 64547.5 moveto
71198.1 64364.8 lineto
stroke
newpath
71198.1 64547.5 moveto
71015.3 64364.8 lineto
stroke
newpath
71363.5 50622.5 moveto
71546.2 50439.7 lineto
stroke
newpath
71546.2 50622.5 moveto
71363.5 50439.7 lineto
stroke
newpath
71363.5 49578.1 moveto
71546.2 49395.3 lineto
stroke
newpath
71546.2 49578.1 moveto
71363.5 49395.3 lineto
stroke
newpath
71363.5 48301.6 moveto
71546.2 48118.9 lineto
stroke
newpath
71546.2 48301.6 moveto
71363.5 48118.9 lineto
stroke
newpath
71479.5 47257.2 moveto
71662.3 47074.5 lineto
stroke
newpath
71662.3 47257.2 moveto
71479.5 47074.5 lineto
stroke
newpath
72523.9 50506.4 moveto
72706.6 50323.7 lineto
stroke
newpath
72706.6 50506.4 moveto
72523.9 50323.7 lineto
stroke
newpath
72639.9 50042.3 moveto
72822.7 49859.5 lineto
stroke
newpath
72822.7 50042.3 moveto
72639.9 49859.5 lineto
stroke
newpath
72639.9 48106.3 moveto
72822.7 47923.6 lineto
stroke
newpath
72822.7 48106.3 moveto
72639.9 47923.6 lineto
stroke
newpath
72639.9 45400.6 moveto
72822.7 45217.8 lineto
stroke
newpath
72822.7 45400.6 moveto
72639.9 45217.8 lineto
stroke
newpath
72756 70465.6 moveto
72938.7 70282.9 lineto
stroke
newpath
72938.7 70465.6 moveto
72756 70282.9 lineto
stroke
newpath
72756 49578.1 moveto
72938.7 49395.3 lineto
stroke
newpath
72938.7 49578.1 moveto
72756 49395.3 lineto
stroke
newpath
73220.1 69073.1 moveto
73402.9 68890.4 lineto
stroke
newpath
73402.9 69073.1 moveto
73220.1 68890.4 lineto
stroke
newpath
73336.2 68376.9 moveto
73518.9 68194.1 lineto
stroke
newpath
73518.9 68376.9 moveto
73336.2 68194.1 lineto
stroke
newpath
73336.2 67448.5 moveto
73518.9 67265.8 lineto
stroke
newpath
73518.9 67448.5 moveto
73336.2 67265.8 lineto
stroke
newpath
73338.3 71048 moveto
73521.1 70865.2 lineto
stroke
newpath
73521.1 71048 moveto
73338.3 70865.2 lineto
stroke
newpath
74148.5 70697.7 moveto
74331.2 70515 lineto
stroke
newpath
74331.2 70697.7 moveto
74148.5 70515 lineto
stroke
newpath
74148.5 49810.2 moveto
74331.2 49627.4 lineto
stroke
newpath
74331.2 49810.2 moveto
74148.5 49627.4 lineto
stroke
newpath
74728.7 50158.3 moveto
74911.4 49975.6 lineto
stroke
newpath
74911.4 50158.3 moveto
74728.7 49975.6 lineto
stroke
newpath
74977.7 47721.4 moveto
75160.4 47538.7 lineto
stroke
newpath
75160.4 47721.4 moveto
74977.7 47538.7 lineto
stroke
newpath
74991.8 43633.4 moveto
75174.6 43450.7 lineto
stroke
newpath
75174.6 43633.4 moveto
74991.8 43450.7 lineto
stroke
newpath
75076.8 50622.5 moveto
75259.6 50439.7 lineto
stroke
newpath
75259.6 50622.5 moveto
75076.8 50439.7 lineto
stroke
newpath
75192.9 46096.8 moveto
75375.6 45914.1 lineto
stroke
newpath
75375.6 46096.8 moveto
75192.9 45914.1 lineto
stroke
newpath
75541 71394 moveto
75723.7 71211.2 lineto
stroke
newpath
75723.7 71394 moveto
75541 71211.2 lineto
stroke
newpath
75773.1 62110.6 moveto
75955.8 61927.9 lineto
stroke
newpath
75955.8 62110.6 moveto
75773.1 61927.9 lineto
stroke
newpath
75773.1 47721.4 moveto
75955.8 47538.7 lineto
stroke
newpath
75955.8 47721.4 moveto
75773.1 47538.7 lineto
stroke
newpath
77161.9 43370.8 moveto
77344.7 43188 lineto
stroke
newpath
77344.7 43370.8 moveto
77161.9 43188 lineto
stroke
newpath
77296.1 44383 moveto
77478.9 44200.2 lineto
stroke
newpath
77478.9 44383 moveto
77296.1 44200.2 lineto
stroke
newpath
78209.9 48649.8 moveto
78392.7 48467 lineto
stroke
newpath
78392.7 48649.8 moveto
78209.9 48467 lineto
stroke
newpath
78304.1 43519.2 moveto
78486.8 43336.5 lineto
stroke
newpath
78486.8 43519.2 moveto
78304.1 43336.5 lineto
stroke
47423.2 59392.3 143.91 cir0
47423.2 57162.8 143.91 cir0
newpath
54296.2 67104.5 moveto
54296.2 66807.6 lineto
stroke
newpath
54147.7 66956.1 moveto
54444.6 66956.1 lineto
stroke
newpath
61948.5 67104.5 moveto
61948.5 66807.6 lineto
stroke
newpath
61800.1 66956.1 moveto
62097 66956.1 lineto
stroke
newpath
54182 77612.3 moveto
54182 77315.3 lineto
stroke
newpath
54033.5 77463.8 moveto
54330.4 77463.8 lineto
stroke
newpath
61948.5 77612.3 moveto
61948.5 77315.3 lineto
stroke
newpath
61800.1 77463.8 moveto
62097 77463.8 lineto
stroke
newpath
60512.9 45031.6 moveto
60512.9 45354.7 lineto
60189.8 45354.7 lineto
60189.8 45031.6 lineto
60512.9 45031.6 lineto
poly0
newpath
61655 42747.3 moveto
61655 43070.4 lineto
61332 43070.4 lineto
61332 42747.3 lineto
61655 42747.3 lineto
poly0
newpath
62797.2 45031.6 moveto
62797.2 45354.7 lineto
62474.1 45354.7 lineto
62474.1 45031.6 lineto
62797.2 45031.6 lineto
poly0
newpath
78462.8 61857.7 moveto
78462.8 62180.8 lineto
78139.8 62180.8 lineto
78139.8 61857.7 lineto
78462.8 61857.7 lineto
poly0
newpath
78462.8 60697.3 moveto
78462.8 61020.4 lineto
78139.8 61020.4 lineto
78139.8 60697.3 lineto
78462.8 60697.3 lineto
poly0
newpath
78462.8 59536.9 moveto
78462.8 59859.9 lineto
78139.8 59859.9 lineto
78139.8 59536.9 lineto
78462.8 59536.9 lineto
poly0
newpath
78462.8 58376.5 moveto
78462.8 58699.5 lineto
78139.8 58699.5 lineto
78139.8 58376.5 lineto
78462.8 58376.5 lineto
poly0
newpath
78462.8 57216 moveto
78462.8 57539.1 lineto
78139.8 57539.1 lineto
78139.8 57216 lineto
78462.8 57216 lineto
poly0
newpath
78462.8 56055.6 moveto
78462.8 56378.7 lineto
78139.8 56378.7 lineto
78139.8 56055.6 lineto
78462.8 56055.6 lineto
poly0
newpath
56627.8 73875.8 moveto
56627.8 74198.9 lineto
56304.7 74198.9 lineto
56304.7 73875.8 lineto
56627.8 73875.8 lineto
poly0
newpath
57788.2 73875.8 moveto
57788.2 74198.9 lineto
57465.1 74198.9 lineto
57465.1 73875.8 lineto
57788.2 73875.8 lineto
poly0
newpath
58948.6 73875.8 moveto
58948.6 74198.9 lineto
58625.6 74198.9 lineto
58625.6 73875.8 lineto
58948.6 73875.8 lineto
poly0
newpath
60109 73875.8 moveto
60109 74198.9 lineto
59786 74198.9 lineto
59786 73875.8 lineto
60109 73875.8 lineto
poly0
newpath
39588.8 57564.2 moveto
39588.8 57887.2 lineto
39265.7 57887.2 lineto
39265.7 57564.2 lineto
39588.8 57564.2 lineto
poly0
newpath
39588.8 56403.7 moveto
39588.8 56726.8 lineto
39265.7 56726.8 lineto
39265.7 56403.7 lineto
39588.8 56403.7 lineto
poly0
newpath
78462.8 52342.3 moveto
78462.8 52665.3 lineto
78139.8 52665.3 lineto
78139.8 52342.3 lineto
78462.8 52342.3 lineto
poly0
newpath
78462.8 51181.9 moveto
78462.8 51504.9 lineto
78139.8 51504.9 lineto
78139.8 51181.9 lineto
78462.8 51181.9 lineto
poly0
118.11 setlinewidth
0 0 0 setrgbcolor
0 0 0 setrgbcolor
newpath
38725.7 35175.5 moveto
38725.7 36356.6 lineto
39006.9 36356.6 lineto
39175.6 36300.3 lineto
39288.1 36187.9 lineto
39344.4 36075.4 lineto
39400.6 35850.4 lineto
39400.6 35681.7 lineto
39344.4 35456.7 lineto
39288.1 35344.2 lineto
39175.6 35231.7 lineto
39006.9 35175.5 lineto
38725.7 35175.5 lineto
stroke
newpath
39906.8 35175.5 moveto
39906.8 35962.9 lineto
stroke
newpath
39906.8 35737.9 moveto
39963 35850.4 lineto
40019.3 35906.6 lineto
40131.8 35962.9 lineto
40244.2 35962.9 lineto
stroke
newpath
40637.9 35175.5 moveto
40637.9 35962.9 lineto
stroke
newpath
40637.9 36356.6 moveto
40581.7 36300.3 lineto
40637.9 36244.1 lineto
40694.2 36300.3 lineto
40637.9 36356.6 lineto
40637.9 36244.1 lineto
stroke
newpath
41369.1 35175.5 moveto
41256.6 35231.7 lineto
41200.4 35344.2 lineto
41200.4 36356.6 lineto
stroke
newpath
41987.8 35175.5 moveto
41875.3 35231.7 lineto
41819 35344.2 lineto
41819 36356.6 lineto
stroke
newpath
43337.6 35175.5 moveto
43337.6 36356.6 lineto
43731.3 35512.9 lineto
44125 36356.6 lineto
44125 35175.5 lineto
stroke
newpath
45193.6 35175.5 moveto
45193.6 35794.2 lineto
45137.4 35906.6 lineto
45024.9 35962.9 lineto
44799.9 35962.9 lineto
44687.4 35906.6 lineto
stroke
newpath
45193.6 35231.7 moveto
45081.1 35175.5 lineto
44799.9 35175.5 lineto
44687.4 35231.7 lineto
44631.2 35344.2 lineto
44631.2 35456.7 lineto
44687.4 35569.2 lineto
44799.9 35625.4 lineto
45081.1 35625.4 lineto
45193.6 35681.7 lineto
stroke
newpath
45756.1 35962.9 moveto
45756.1 34781.8 lineto
stroke
newpath
45756.1 35906.6 moveto
45868.5 35962.9 lineto
46093.5 35962.9 lineto
46206 35906.6 lineto
46262.2 35850.4 lineto
46318.5 35737.9 lineto
46318.5 35400.5 lineto
46262.2 35288 lineto
46206 35231.7 lineto
46093.5 35175.5 lineto
45868.5 35175.5 lineto
45756.1 35231.7 lineto
stroke
newpath
46824.7 35288 moveto
46880.9 35231.7 lineto
46824.7 35175.5 lineto
46768.4 35231.7 lineto
46824.7 35288 lineto
46824.7 35175.5 lineto
stroke
newpath
46824.7 35906.6 moveto
46880.9 35850.4 lineto
46824.7 35794.2 lineto
46768.4 35850.4 lineto
46824.7 35906.6 lineto
46824.7 35794.2 lineto
stroke
newpath
37415.3 33320.9 moveto
37598 33138.1 lineto
stroke
newpath
37598 33320.9 moveto
37415.3 33138.1 lineto
stroke
0 0 0 setrgbcolor
0 0 0 setrgbcolor
newpath
38950.7 33876.3 moveto
39063.1 33876.3 lineto
39175.6 33820 lineto
39231.9 33763.8 lineto
39288.1 33651.3 lineto
39344.4 33426.3 lineto
39344.4 33145.1 lineto
39288.1 32920.1 lineto
39231.9 32807.7 lineto
39175.6 32751.4 lineto
39063.1 32695.2 lineto
38950.7 32695.2 lineto
38838.2 32751.4 lineto
38781.9 32807.7 lineto
38725.7 32920.1 lineto
38669.4 33145.1 lineto
38669.4 33426.3 lineto
38725.7 33651.3 lineto
38781.9 33763.8 lineto
38838.2 33820 lineto
38950.7 33876.3 lineto
stroke
newpath
39850.5 32807.7 moveto
39906.8 32751.4 lineto
39850.5 32695.2 lineto
39794.3 32751.4 lineto
39850.5 32807.7 lineto
39850.5 32695.2 lineto
stroke
newpath
40919.2 33482.6 moveto
40919.2 32695.2 lineto
stroke
newpath
40637.9 33932.5 moveto
40356.7 33088.9 lineto
41087.9 33088.9 lineto
stroke
newpath
41762.8 33876.3 moveto
41875.3 33876.3 lineto
41987.8 33820 lineto
42044 33763.8 lineto
42100.3 33651.3 lineto
42156.5 33426.3 lineto
42156.5 33145.1 lineto
42100.3 32920.1 lineto
42044 32807.7 lineto
41987.8 32751.4 lineto
41875.3 32695.2 lineto
41762.8 32695.2 lineto
41650.3 32751.4 lineto
41594.1 32807.7 lineto
41537.8 32920.1 lineto
41481.6 33145.1 lineto
41481.6 33426.3 lineto
41537.8 33651.3 lineto
41594.1 33763.8 lineto
41650.3 33820 lineto
41762.8 33876.3 lineto
stroke
newpath
42662.7 32695.2 moveto
42662.7 33482.6 lineto
stroke
newpath
42662.7 33370.1 moveto
42718.9 33426.3 lineto
42831.4 33482.6 lineto
43000.1 33482.6 lineto
43112.6 33426.3 lineto
43168.9 33313.8 lineto
43168.9 32695.2 lineto
stroke
newpath
43168.9 33313.8 moveto
43225.1 33426.3 lineto
43337.6 33482.6 lineto
43506.3 33482.6 lineto
43618.8 33426.3 lineto
43675.1 33313.8 lineto
43675.1 32695.2 lineto
stroke
newpath
44237.5 32695.2 moveto
44237.5 33482.6 lineto
stroke
newpath
44237.5 33370.1 moveto
44293.7 33426.3 lineto
44406.2 33482.6 lineto
44574.9 33482.6 lineto
44687.4 33426.3 lineto
44743.7 33313.8 lineto
44743.7 32695.2 lineto
stroke
newpath
44743.7 33313.8 moveto
44799.9 33426.3 lineto
44912.4 33482.6 lineto
45081.1 33482.6 lineto
45193.6 33426.3 lineto
45249.9 33313.8 lineto
45249.9 32695.2 lineto
stroke
newpath
47555.8 33932.5 moveto
46543.5 32414 lineto
stroke
newpath
49074.4 33876.3 moveto
49186.9 33876.3 lineto
49299.4 33820 lineto
49355.6 33763.8 lineto
49411.8 33651.3 lineto
49468.1 33426.3 lineto
49468.1 33145.1 lineto
49411.8 32920.1 lineto
49355.6 32807.7 lineto
49299.4 32751.4 lineto
49186.9 32695.2 lineto
49074.4 32695.2 lineto
48961.9 32751.4 lineto
48905.7 32807.7 lineto
48849.4 32920.1 lineto
48793.2 33145.1 lineto
48793.2 33426.3 lineto
48849.4 33651.3 lineto
48905.7 33763.8 lineto
48961.9 33820 lineto
49074.4 33876.3 lineto
stroke
newpath
49974.3 32807.7 moveto
50030.5 32751.4 lineto
49974.3 32695.2 lineto
49918 32751.4 lineto
49974.3 32807.7 lineto
49974.3 32695.2 lineto
stroke
newpath
50761.7 33876.3 moveto
50874.2 33876.3 lineto
50986.6 33820 lineto
51042.9 33763.8 lineto
51099.1 33651.3 lineto
51155.4 33426.3 lineto
51155.4 33145.1 lineto
51099.1 32920.1 lineto
51042.9 32807.7 lineto
50986.6 32751.4 lineto
50874.2 32695.2 lineto
50761.7 32695.2 lineto
50649.2 32751.4 lineto
50592.9 32807.7 lineto
50536.7 32920.1 lineto
50480.5 33145.1 lineto
50480.5 33426.3 lineto
50536.7 33651.3 lineto
50592.9 33763.8 lineto
50649.2 33820 lineto
50761.7 33876.3 lineto
stroke
newpath
52280.2 32695.2 moveto
51605.3 32695.2 lineto
stroke
newpath
51942.8 32695.2 moveto
51942.8 33876.3 lineto
51830.3 33707.5 lineto
51717.8 33595.1 lineto
51605.3 33538.8 lineto
stroke
newpath
53292.6 33876.3 moveto
53067.6 33876.3 lineto
52955.2 33820 lineto
52898.9 33763.8 lineto
52786.4 33595.1 lineto
52730.2 33370.1 lineto
52730.2 32920.1 lineto
52786.4 32807.7 lineto
52842.7 32751.4 lineto
52955.2 32695.2 lineto
53180.1 32695.2 lineto
53292.6 32751.4 lineto
53348.9 32807.7 lineto
53405.1 32920.1 lineto
53405.1 33201.4 lineto
53348.9 33313.8 lineto
53292.6 33370.1 lineto
53180.1 33426.3 lineto
52955.2 33426.3 lineto
52842.7 33370.1 lineto
52786.4 33313.8 lineto
52730.2 33201.4 lineto
stroke
newpath
53855 33876.3 moveto
53855 33651.3 lineto
stroke
newpath
54305 33876.3 moveto
54305 33651.3 lineto
stroke
newpath
56048.5 32245.2 moveto
55992.3 32301.5 lineto
55879.8 32470.2 lineto
55823.5 32582.7 lineto
55767.3 32751.4 lineto
55711.1 33032.6 lineto
55711.1 33257.6 lineto
55767.3 33538.8 lineto
55823.5 33707.5 lineto
55879.8 33820 lineto
55992.3 33988.8 lineto
56048.5 34045 lineto
stroke
newpath
57117.1 32695.2 moveto
56442.2 32695.2 lineto
stroke
newpath
56779.7 32695.2 moveto
56779.7 33876.3 lineto
56667.2 33707.5 lineto
56554.7 33595.1 lineto
56442.2 33538.8 lineto
stroke
newpath
58129.5 33876.3 moveto
57904.5 33876.3 lineto
57792 33820 lineto
57735.8 33763.8 lineto
57623.3 33595.1 lineto
57567.1 33370.1 lineto
57567.1 32920.1 lineto
57623.3 32807.7 lineto
57679.6 32751.4 lineto
57792 32695.2 lineto
58017 32695.2 lineto
58129.5 32751.4 lineto
58185.7 32807.7 lineto
58242 32920.1 lineto
58242 33201.4 lineto
58185.7 33313.8 lineto
58129.5 33370.1 lineto
58017 33426.3 lineto
57792 33426.3 lineto
57679.6 33370.1 lineto
57623.3 33313.8 lineto
57567.1 33201.4 lineto
stroke
newpath
59310.6 33876.3 moveto
58748.2 33876.3 lineto
58691.9 33313.8 lineto
58748.2 33370.1 lineto
58860.7 33426.3 lineto
59141.9 33426.3 lineto
59254.4 33370.1 lineto
59310.6 33313.8 lineto
59366.8 33201.4 lineto
59366.8 32920.1 lineto
59310.6 32807.7 lineto
59254.4 32751.4 lineto
59141.9 32695.2 lineto
58860.7 32695.2 lineto
58748.2 32751.4 lineto
58691.9 32807.7 lineto
stroke
newpath
60772.9 32695.2 moveto
60772.9 33876.3 lineto
stroke
newpath
61279.1 32695.2 moveto
61279.1 33313.8 lineto
61222.9 33426.3 lineto
61110.4 33482.6 lineto
60941.7 33482.6 lineto
60829.2 33426.3 lineto
60772.9 33370.1 lineto
stroke
newpath
62010.3 32695.2 moveto
61897.8 32751.4 lineto
61841.5 32807.7 lineto
61785.3 32920.1 lineto
61785.3 33257.6 lineto
61841.5 33370.1 lineto
61897.8 33426.3 lineto
62010.3 33482.6 lineto
62179 33482.6 lineto
62291.5 33426.3 lineto
62347.7 33370.1 lineto
62404 33257.6 lineto
62404 32920.1 lineto
62347.7 32807.7 lineto
62291.5 32751.4 lineto
62179 32695.2 lineto
62010.3 32695.2 lineto
stroke
newpath
63078.9 32695.2 moveto
62966.4 32751.4 lineto
62910.2 32863.9 lineto
62910.2 33876.3 lineto
stroke
newpath
63978.8 32751.4 moveto
63866.3 32695.2 lineto
63641.3 32695.2 lineto
63528.8 32751.4 lineto
63472.6 32863.9 lineto
63472.6 33313.8 lineto
63528.8 33426.3 lineto
63641.3 33482.6 lineto
63866.3 33482.6 lineto
63978.8 33426.3 lineto
64035 33313.8 lineto
64035 33201.4 lineto
63472.6 33088.9 lineto
stroke
newpath
64485 32751.4 moveto
64597.4 32695.2 lineto
64822.4 32695.2 lineto
64934.9 32751.4 lineto
64991.1 32863.9 lineto
64991.1 32920.1 lineto
64934.9 33032.6 lineto
64822.4 33088.9 lineto
64653.7 33088.9 lineto
64541.2 33145.1 lineto
64485 33257.6 lineto
64485 33313.8 lineto
64541.2 33426.3 lineto
64653.7 33482.6 lineto
64822.4 33482.6 lineto
64934.9 33426.3 lineto
stroke
newpath
65384.8 32245.2 moveto
65441.1 32301.5 lineto
65553.6 32470.2 lineto
65609.8 32582.7 lineto
65666.1 32751.4 lineto
65722.3 33032.6 lineto
65722.3 33257.6 lineto
65666.1 33538.8 lineto
65609.8 33707.5 lineto
65553.6 33820 lineto
65441.1 33988.8 lineto
65384.8 34045 lineto
stroke
37454.1 31670.4 143.91 cir0
0 0 0 setrgbcolor
0 0 0 setrgbcolor
newpath
38950.7 32317.2 moveto
39063.1 32317.2 lineto
39175.6 32261 lineto
39231.9 32204.7 lineto
39288.1 32092.2 lineto
39344.4 31867.3 lineto
39344.4 31586.1 lineto
39288.1 31361.1 lineto
39231.9 31248.6 lineto
39175.6 31192.4 lineto
39063.1 31136.1 lineto
38950.7 31136.1 lineto
38838.2 31192.4 lineto
38781.9 31248.6 lineto
38725.7 31361.1 lineto
38669.4 31586.1 lineto
38669.4 31867.3 lineto
38725.7 32092.2 lineto
38781.9 32204.7 lineto
38838.2 32261 lineto
38950.7 32317.2 lineto
stroke
newpath
39850.5 31248.6 moveto
39906.8 31192.4 lineto
39850.5 31136.1 lineto
39794.3 31192.4 lineto
39850.5 31248.6 lineto
39850.5 31136.1 lineto
stroke
newpath
40919.2 32317.2 moveto
40694.2 32317.2 lineto
40581.7 32261 lineto
40525.5 32204.7 lineto
40413 32036 lineto
40356.7 31811 lineto
40356.7 31361.1 lineto
40413 31248.6 lineto
40469.2 31192.4 lineto
40581.7 31136.1 lineto
40806.7 31136.1 lineto
40919.2 31192.4 lineto
40975.4 31248.6 lineto
41031.6 31361.1 lineto
41031.6 31642.3 lineto
40975.4 31754.8 lineto
40919.2 31811 lineto
40806.7 31867.3 lineto
40581.7 31867.3 lineto
40469.2 31811 lineto
40413 31754.8 lineto
40356.7 31642.3 lineto
stroke
newpath
41425.3 32317.2 moveto
42156.5 32317.2 lineto
41762.8 31867.3 lineto
41931.5 31867.3 lineto
42044 31811 lineto
42100.3 31754.8 lineto
42156.5 31642.3 lineto
42156.5 31361.1 lineto
42100.3 31248.6 lineto
42044 31192.4 lineto
41931.5 31136.1 lineto
41594.1 31136.1 lineto
41481.6 31192.4 lineto
41425.3 31248.6 lineto
stroke
newpath
42662.7 31136.1 moveto
42662.7 31923.5 lineto
stroke
newpath
42662.7 31811 moveto
42718.9 31867.3 lineto
42831.4 31923.5 lineto
43000.1 31923.5 lineto
43112.6 31867.3 lineto
43168.9 31754.8 lineto
43168.9 31136.1 lineto
stroke
newpath
43168.9 31754.8 moveto
43225.1 31867.3 lineto
43337.6 31923.5 lineto
43506.3 31923.5 lineto
43618.8 31867.3 lineto
43675.1 31754.8 lineto
43675.1 31136.1 lineto
stroke
newpath
44237.5 31136.1 moveto
44237.5 31923.5 lineto
stroke
newpath
44237.5 31811 moveto
44293.7 31867.3 lineto
44406.2 31923.5 lineto
44574.9 31923.5 lineto
44687.4 31867.3 lineto
44743.7 31754.8 lineto
44743.7 31136.1 lineto
stroke
newpath
44743.7 31754.8 moveto
44799.9 31867.3 lineto
44912.4 31923.5 lineto
45081.1 31923.5 lineto
45193.6 31867.3 lineto
45249.9 31754.8 lineto
45249.9 31136.1 lineto
stroke
newpath
47555.8 32373.5 moveto
46543.5 30854.9 lineto
stroke
newpath
49074.4 32317.2 moveto
49186.9 32317.2 lineto
49299.4 32261 lineto
49355.6 32204.7 lineto
49411.8 32092.2 lineto
49468.1 31867.3 lineto
49468.1 31586.1 lineto
49411.8 31361.1 lineto
49355.6 31248.6 lineto
49299.4 31192.4 lineto
49186.9 31136.1 lineto
49074.4 31136.1 lineto
48961.9 31192.4 lineto
48905.7 31248.6 lineto
48849.4 31361.1 lineto
48793.2 31586.1 lineto
48793.2 31867.3 lineto
48849.4 32092.2 lineto
48905.7 32204.7 lineto
48961.9 32261 lineto
49074.4 32317.2 lineto
stroke
newpath
49974.3 31248.6 moveto
50030.5 31192.4 lineto
49974.3 31136.1 lineto
49918 31192.4 lineto
49974.3 31248.6 lineto
49974.3 31136.1 lineto
stroke
newpath
50761.7 32317.2 moveto
50874.2 32317.2 lineto
50986.6 32261 lineto
51042.9 32204.7 lineto
51099.1 32092.2 lineto
51155.4 31867.3 lineto
51155.4 31586.1 lineto
51099.1 31361.1 lineto
51042.9 31248.6 lineto
50986.6 31192.4 lineto
50874.2 31136.1 lineto
50761.7 31136.1 lineto
50649.2 31192.4 lineto
50592.9 31248.6 lineto
50536.7 31361.1 lineto
50480.5 31586.1 lineto
50480.5 31867.3 lineto
50536.7 32092.2 lineto
50592.9 32204.7 lineto
50649.2 32261 lineto
50761.7 32317.2 lineto
stroke
newpath
51605.3 32204.7 moveto
51661.6 32261 lineto
51774 32317.2 lineto
52055.3 32317.2 lineto
52167.7 32261 lineto
52224 32204.7 lineto
52280.2 32092.2 lineto
52280.2 31979.8 lineto
52224 31811 lineto
51549.1 31136.1 lineto
52280.2 31136.1 lineto
stroke
newpath
53348.9 32317.2 moveto
52786.4 32317.2 lineto
52730.2 31754.8 lineto
52786.4 31811 lineto
52898.9 31867.3 lineto
53180.1 31867.3 lineto
53292.6 31811 lineto
53348.9 31754.8 lineto
53405.1 31642.3 lineto
53405.1 31361.1 lineto
53348.9 31248.6 lineto
53292.6 31192.4 lineto
53180.1 31136.1 lineto
52898.9 31136.1 lineto
52786.4 31192.4 lineto
52730.2 31248.6 lineto
stroke
newpath
53855 32317.2 moveto
53855 32092.2 lineto
stroke
newpath
54305 32317.2 moveto
54305 32092.2 lineto
stroke
newpath
56048.5 30686.2 moveto
55992.3 30742.4 lineto
55879.8 30911.1 lineto
55823.5 31023.6 lineto
55767.3 31192.4 lineto
55711.1 31473.6 lineto
55711.1 31698.5 lineto
55767.3 31979.8 lineto
55823.5 32148.5 lineto
55879.8 32261 lineto
55992.3 32429.7 lineto
56048.5 32485.9 lineto
stroke
newpath
56442.2 32204.7 moveto
56498.5 32261 lineto
56610.9 32317.2 lineto
56892.2 32317.2 lineto
57004.6 32261 lineto
57060.9 32204.7 lineto
57117.1 32092.2 lineto
57117.1 31979.8 lineto
57060.9 31811 lineto
56386 31136.1 lineto
57117.1 31136.1 lineto
stroke
newpath
58523.2 31136.1 moveto
58523.2 32317.2 lineto
stroke
newpath
59029.4 31136.1 moveto
59029.4 31754.8 lineto
58973.1 31867.3 lineto
58860.7 31923.5 lineto
58691.9 31923.5 lineto
58579.4 31867.3 lineto
58523.2 31811 lineto
stroke
newpath
59760.5 31136.1 moveto
59648.1 31192.4 lineto
59591.8 31248.6 lineto
59535.6 31361.1 lineto
59535.6 31698.5 lineto
59591.8 31811 lineto
59648.1 31867.3 lineto
59760.5 31923.5 lineto
59929.3 31923.5 lineto
60041.8 31867.3 lineto
60098 31811 lineto
60154.3 31698.5 lineto
60154.3 31361.1 lineto
60098 31248.6 lineto
60041.8 31192.4 lineto
59929.3 31136.1 lineto
59760.5 31136.1 lineto
stroke
newpath
60829.2 31136.1 moveto
60716.7 31192.4 lineto
60660.4 31304.8 lineto
60660.4 32317.2 lineto
stroke
newpath
61729.1 31192.4 moveto
61616.6 31136.1 lineto
61391.6 31136.1 lineto
61279.1 31192.4 lineto
61222.9 31304.8 lineto
61222.9 31754.8 lineto
61279.1 31867.3 lineto
61391.6 31923.5 lineto
61616.6 31923.5 lineto
61729.1 31867.3 lineto
61785.3 31754.8 lineto
61785.3 31642.3 lineto
61222.9 31529.8 lineto
stroke
newpath
62235.2 31192.4 moveto
62347.7 31136.1 lineto
62572.7 31136.1 lineto
62685.2 31192.4 lineto
62741.4 31304.8 lineto
62741.4 31361.1 lineto
62685.2 31473.6 lineto
62572.7 31529.8 lineto
62404 31529.8 lineto
62291.5 31586.1 lineto
62235.2 31698.5 lineto
62235.2 31754.8 lineto
62291.5 31867.3 lineto
62404 31923.5 lineto
62572.7 31923.5 lineto
62685.2 31867.3 lineto
stroke
newpath
63135.1 30686.2 moveto
63191.4 30742.4 lineto
63303.9 30911.1 lineto
63360.1 31023.6 lineto
63416.3 31192.4 lineto
63472.6 31473.6 lineto
63472.6 31698.5 lineto
63416.3 31979.8 lineto
63360.1 32148.5 lineto
63303.9 32261 lineto
63191.4 32429.7 lineto
63135.1 32485.9 lineto
stroke
newpath
37449.5 30259.8 moveto
37449.5 29962.9 lineto
stroke
newpath
37301.1 30111.4 moveto
37598 30111.4 lineto
stroke
0 0 0 setrgbcolor
0 0 0 setrgbcolor
newpath
38950.7 30758.2 moveto
39063.1 30758.2 lineto
39175.6 30701.9 lineto
39231.9 30645.7 lineto
39288.1 30533.2 lineto
39344.4 30308.2 lineto
39344.4 30027 lineto
39288.1 29802 lineto
39231.9 29689.5 lineto
39175.6 29633.3 lineto
39063.1 29577.1 lineto
38950.7 29577.1 lineto
38838.2 29633.3 lineto
38781.9 29689.5 lineto
38725.7 29802 lineto
38669.4 30027 lineto
38669.4 30308.2 lineto
38725.7 30533.2 lineto
38781.9 30645.7 lineto
38838.2 30701.9 lineto
38950.7 30758.2 lineto
stroke
newpath
39850.5 29689.5 moveto
39906.8 29633.3 lineto
39850.5 29577.1 lineto
39794.3 29633.3 lineto
39850.5 29689.5 lineto
39850.5 29577.1 lineto
stroke
newpath
40919.2 30758.2 moveto
40694.2 30758.2 lineto
40581.7 30701.9 lineto
40525.5 30645.7 lineto
40413 30476.9 lineto
40356.7 30252 lineto
40356.7 29802 lineto
40413 29689.5 lineto
40469.2 29633.3 lineto
40581.7 29577.1 lineto
40806.7 29577.1 lineto
40919.2 29633.3 lineto
40975.4 29689.5 lineto
41031.6 29802 lineto
41031.6 30083.2 lineto
40975.4 30195.7 lineto
40919.2 30252 lineto
40806.7 30308.2 lineto
40581.7 30308.2 lineto
40469.2 30252 lineto
40413 30195.7 lineto
40356.7 30083.2 lineto
stroke
newpath
42100.3 30758.2 moveto
41537.8 30758.2 lineto
41481.6 30195.7 lineto
41537.8 30252 lineto
41650.3 30308.2 lineto
41931.5 30308.2 lineto
42044 30252 lineto
42100.3 30195.7 lineto
42156.5 30083.2 lineto
42156.5 29802 lineto
42100.3 29689.5 lineto
42044 29633.3 lineto
41931.5 29577.1 lineto
41650.3 29577.1 lineto
41537.8 29633.3 lineto
41481.6 29689.5 lineto
stroke
newpath
42662.7 29577.1 moveto
42662.7 30364.5 lineto
stroke
newpath
42662.7 30252 moveto
42718.9 30308.2 lineto
42831.4 30364.5 lineto
43000.1 30364.5 lineto
43112.6 30308.2 lineto
43168.9 30195.7 lineto
43168.9 29577.1 lineto
stroke
newpath
43168.9 30195.7 moveto
43225.1 30308.2 lineto
43337.6 30364.5 lineto
43506.3 30364.5 lineto
43618.8 30308.2 lineto
43675.1 30195.7 lineto
43675.1 29577.1 lineto
stroke
newpath
44237.5 29577.1 moveto
44237.5 30364.5 lineto
stroke
newpath
44237.5 30252 moveto
44293.7 30308.2 lineto
44406.2 30364.5 lineto
44574.9 30364.5 lineto
44687.4 30308.2 lineto
44743.7 30195.7 lineto
44743.7 29577.1 lineto
stroke
newpath
44743.7 30195.7 moveto
44799.9 30308.2 lineto
44912.4 30364.5 lineto
45081.1 30364.5 lineto
45193.6 30308.2 lineto
45249.9 30195.7 lineto
45249.9 29577.1 lineto
stroke
newpath
47555.8 30814.4 moveto
46543.5 29295.8 lineto
stroke
newpath
49074.4 30758.2 moveto
49186.9 30758.2 lineto
49299.4 30701.9 lineto
49355.6 30645.7 lineto
49411.8 30533.2 lineto
49468.1 30308.2 lineto
49468.1 30027 lineto
49411.8 29802 lineto
49355.6 29689.5 lineto
49299.4 29633.3 lineto
49186.9 29577.1 lineto
49074.4 29577.1 lineto
48961.9 29633.3 lineto
48905.7 29689.5 lineto
48849.4 29802 lineto
48793.2 30027 lineto
48793.2 30308.2 lineto
48849.4 30533.2 lineto
48905.7 30645.7 lineto
48961.9 30701.9 lineto
49074.4 30758.2 lineto
stroke
newpath
49974.3 29689.5 moveto
50030.5 29633.3 lineto
49974.3 29577.1 lineto
49918 29633.3 lineto
49974.3 29689.5 lineto
49974.3 29577.1 lineto
stroke
newpath
50761.7 30758.2 moveto
50874.2 30758.2 lineto
50986.6 30701.9 lineto
51042.9 30645.7 lineto
51099.1 30533.2 lineto
51155.4 30308.2 lineto
51155.4 30027 lineto
51099.1 29802 lineto
51042.9 29689.5 lineto
50986.6 29633.3 lineto
50874.2 29577.1 lineto
50761.7 29577.1 lineto
50649.2 29633.3 lineto
50592.9 29689.5 lineto
50536.7 29802 lineto
50480.5 30027 lineto
50480.5 30308.2 lineto
50536.7 30533.2 lineto
50592.9 30645.7 lineto
50649.2 30701.9 lineto
50761.7 30758.2 lineto
stroke
newpath
51605.3 30645.7 moveto
51661.6 30701.9 lineto
51774 30758.2 lineto
52055.3 30758.2 lineto
52167.7 30701.9 lineto
52224 30645.7 lineto
52280.2 30533.2 lineto
52280.2 30420.7 lineto
52224 30252 lineto
51549.1 29577.1 lineto
52280.2 29577.1 lineto
stroke
newpath
53292.6 30758.2 moveto
53067.6 30758.2 lineto
52955.2 30701.9 lineto
52898.9 30645.7 lineto
52786.4 30476.9 lineto
52730.2 30252 lineto
52730.2 29802 lineto
52786.4 29689.5 lineto
52842.7 29633.3 lineto
52955.2 29577.1 lineto
53180.1 29577.1 lineto
53292.6 29633.3 lineto
53348.9 29689.5 lineto
53405.1 29802 lineto
53405.1 30083.2 lineto
53348.9 30195.7 lineto
53292.6 30252 lineto
53180.1 30308.2 lineto
52955.2 30308.2 lineto
52842.7 30252 lineto
52786.4 30195.7 lineto
52730.2 30083.2 lineto
stroke
newpath
53855 30758.2 moveto
53855 30533.2 lineto
stroke
newpath
54305 30758.2 moveto
54305 30533.2 lineto
stroke
newpath
56048.5 29127.1 moveto
55992.3 29183.4 lineto
55879.8 29352.1 lineto
55823.5 29464.6 lineto
55767.3 29633.3 lineto
55711.1 29914.5 lineto
55711.1 30139.5 lineto
55767.3 30420.7 lineto
55823.5 30589.4 lineto
55879.8 30701.9 lineto
55992.3 30870.7 lineto
56048.5 30926.9 lineto
stroke
newpath
57004.6 30364.5 moveto
57004.6 29577.1 lineto
stroke
newpath
56723.4 30814.4 moveto
56442.2 29970.8 lineto
57173.4 29970.8 lineto
stroke
newpath
58523.2 29577.1 moveto
58523.2 30758.2 lineto
stroke
newpath
59029.4 29577.1 moveto
59029.4 30195.7 lineto
58973.1 30308.2 lineto
58860.7 30364.5 lineto
58691.9 30364.5 lineto
58579.4 30308.2 lineto
58523.2 30252 lineto
stroke
newpath
59760.5 29577.1 moveto
59648.1 29633.3 lineto
59591.8 29689.5 lineto
59535.6 29802 lineto
59535.6 30139.5 lineto
59591.8 30252 lineto
59648.1 30308.2 lineto
59760.5 30364.5 lineto
59929.3 30364.5 lineto
60041.8 30308.2 lineto
60098 30252 lineto
60154.3 30139.5 lineto
60154.3 29802 lineto
60098 29689.5 lineto
60041.8 29633.3 lineto
59929.3 29577.1 lineto
59760.5 29577.1 lineto
stroke
newpath
60829.2 29577.1 moveto
60716.7 29633.3 lineto
60660.4 29745.8 lineto
60660.4 30758.2 lineto
stroke
newpath
61729.1 29633.3 moveto
61616.6 29577.1 lineto
61391.6 29577.1 lineto
61279.1 29633.3 lineto
61222.9 29745.8 lineto
61222.9 30195.7 lineto
61279.1 30308.2 lineto
61391.6 30364.5 lineto
61616.6 30364.5 lineto
61729.1 30308.2 lineto
61785.3 30195.7 lineto
61785.3 30083.2 lineto
61222.9 29970.8 lineto
stroke
newpath
62235.2 29633.3 moveto
62347.7 29577.1 lineto
62572.7 29577.1 lineto
62685.2 29633.3 lineto
62741.4 29745.8 lineto
62741.4 29802 lineto
62685.2 29914.5 lineto
62572.7 29970.8 lineto
62404 29970.8 lineto
62291.5 30027 lineto
62235.2 30139.5 lineto
62235.2 30195.7 lineto
62291.5 30308.2 lineto
62404 30364.5 lineto
62572.7 30364.5 lineto
62685.2 30308.2 lineto
stroke
newpath
63135.1 29127.1 moveto
63191.4 29183.4 lineto
63303.9 29352.1 lineto
63360.1 29464.6 lineto
63416.3 29633.3 lineto
63472.6 29914.5 lineto
63472.6 30139.5 lineto
63416.3 30420.7 lineto
63360.1 30589.4 lineto
63303.9 30701.9 lineto
63191.4 30870.7 lineto
63135.1 30926.9 lineto
stroke
newpath
37531.1 28390.8 moveto
37531.1 28713.8 lineto
37208.1 28713.8 lineto
37208.1 28390.8 lineto
37531.1 28390.8 lineto
poly0
0 0 0 setrgbcolor
0 0 0 setrgbcolor
newpath
39344.4 28018 moveto
38669.4 28018 lineto
stroke
newpath
39006.9 28018 moveto
39006.9 29199.1 lineto
38894.4 29030.4 lineto
38781.9 28917.9 lineto
38669.4 28861.7 lineto
stroke
newpath
39850.5 28130.5 moveto
39906.8 28074.3 lineto
39850.5 28018 lineto
39794.3 28074.3 lineto
39850.5 28130.5 lineto
39850.5 28018 lineto
stroke
newpath
40637.9 29199.1 moveto
40750.4 29199.1 lineto
40862.9 29142.9 lineto
40919.2 29086.6 lineto
40975.4 28974.1 lineto
41031.6 28749.2 lineto
41031.6 28468 lineto
40975.4 28243 lineto
40919.2 28130.5 lineto
40862.9 28074.3 lineto
40750.4 28018 lineto
40637.9 28018 lineto
40525.5 28074.3 lineto
40469.2 28130.5 lineto
40413 28243 lineto
40356.7 28468 lineto
40356.7 28749.2 lineto
40413 28974.1 lineto
40469.2 29086.6 lineto
40525.5 29142.9 lineto
40637.9 29199.1 lineto
stroke
newpath
41762.8 29199.1 moveto
41875.3 29199.1 lineto
41987.8 29142.9 lineto
42044 29086.6 lineto
42100.3 28974.1 lineto
42156.5 28749.2 lineto
42156.5 28468 lineto
42100.3 28243 lineto
42044 28130.5 lineto
41987.8 28074.3 lineto
41875.3 28018 lineto
41762.8 28018 lineto
41650.3 28074.3 lineto
41594.1 28130.5 lineto
41537.8 28243 lineto
41481.6 28468 lineto
41481.6 28749.2 lineto
41537.8 28974.1 lineto
41594.1 29086.6 lineto
41650.3 29142.9 lineto
41762.8 29199.1 lineto
stroke
newpath
42662.7 28018 moveto
42662.7 28805.4 lineto
stroke
newpath
42662.7 28692.9 moveto
42718.9 28749.2 lineto
42831.4 28805.4 lineto
43000.1 28805.4 lineto
43112.6 28749.2 lineto
43168.9 28636.7 lineto
43168.9 28018 lineto
stroke
newpath
43168.9 28636.7 moveto
43225.1 28749.2 lineto
43337.6 28805.4 lineto
43506.3 28805.4 lineto
43618.8 28749.2 lineto
43675.1 28636.7 lineto
43675.1 28018 lineto
stroke
newpath
44237.5 28018 moveto
44237.5 28805.4 lineto
stroke
newpath
44237.5 28692.9 moveto
44293.7 28749.2 lineto
44406.2 28805.4 lineto
44574.9 28805.4 lineto
44687.4 28749.2 lineto
44743.7 28636.7 lineto
44743.7 28018 lineto
stroke
newpath
44743.7 28636.7 moveto
44799.9 28749.2 lineto
44912.4 28805.4 lineto
45081.1 28805.4 lineto
45193.6 28749.2 lineto
45249.9 28636.7 lineto
45249.9 28018 lineto
stroke
newpath
47555.8 29255.4 moveto
46543.5 27736.8 lineto
stroke
newpath
49074.4 29199.1 moveto
49186.9 29199.1 lineto
49299.4 29142.9 lineto
49355.6 29086.6 lineto
49411.8 28974.1 lineto
49468.1 28749.2 lineto
49468.1 28468 lineto
49411.8 28243 lineto
49355.6 28130.5 lineto
49299.4 28074.3 lineto
49186.9 28018 lineto
49074.4 28018 lineto
48961.9 28074.3 lineto
48905.7 28130.5 lineto
48849.4 28243 lineto
48793.2 28468 lineto
48793.2 28749.2 lineto
48849.4 28974.1 lineto
48905.7 29086.6 lineto
48961.9 29142.9 lineto
49074.4 29199.1 lineto
stroke
newpath
49974.3 28130.5 moveto
50030.5 28074.3 lineto
49974.3 28018 lineto
49918 28074.3 lineto
49974.3 28130.5 lineto
49974.3 28018 lineto
stroke
newpath
50761.7 29199.1 moveto
50874.2 29199.1 lineto
50986.6 29142.9 lineto
51042.9 29086.6 lineto
51099.1 28974.1 lineto
51155.4 28749.2 lineto
51155.4 28468 lineto
51099.1 28243 lineto
51042.9 28130.5 lineto
50986.6 28074.3 lineto
50874.2 28018 lineto
50761.7 28018 lineto
50649.2 28074.3 lineto
50592.9 28130.5 lineto
50536.7 28243 lineto
50480.5 28468 lineto
50480.5 28749.2 lineto
50536.7 28974.1 lineto
50592.9 29086.6 lineto
50649.2 29142.9 lineto
50761.7 29199.1 lineto
stroke
newpath
51549.1 29199.1 moveto
52280.2 29199.1 lineto
51886.5 28749.2 lineto
52055.3 28749.2 lineto
52167.7 28692.9 lineto
52224 28636.7 lineto
52280.2 28524.2 lineto
52280.2 28243 lineto
52224 28130.5 lineto
52167.7 28074.3 lineto
52055.3 28018 lineto
51717.8 28018 lineto
51605.3 28074.3 lineto
51549.1 28130.5 lineto
stroke
newpath
52842.7 28018 moveto
53067.6 28018 lineto
53180.1 28074.3 lineto
53236.4 28130.5 lineto
53348.9 28299.2 lineto
53405.1 28524.2 lineto
53405.1 28974.1 lineto
53348.9 29086.6 lineto
53292.6 29142.9 lineto
53180.1 29199.1 lineto
52955.2 29199.1 lineto
52842.7 29142.9 lineto
52786.4 29086.6 lineto
52730.2 28974.1 lineto
52730.2 28692.9 lineto
52786.4 28580.4 lineto
52842.7 28524.2 lineto
52955.2 28468 lineto
53180.1 28468 lineto
53292.6 28524.2 lineto
53348.9 28580.4 lineto
53405.1 28692.9 lineto
stroke
newpath
53855 29199.1 moveto
53855 28974.1 lineto
stroke
newpath
54305 29199.1 moveto
54305 28974.1 lineto
stroke
newpath
56048.5 27568.1 moveto
55992.3 27624.3 lineto
55879.8 27793 lineto
55823.5 27905.5 lineto
55767.3 28074.3 lineto
55711.1 28355.5 lineto
55711.1 28580.4 lineto
55767.3 28861.7 lineto
55823.5 29030.4 lineto
55879.8 29142.9 lineto
55992.3 29311.6 lineto
56048.5 29367.8 lineto
stroke
newpath
57117.1 28018 moveto
56442.2 28018 lineto
stroke
newpath
56779.7 28018 moveto
56779.7 29199.1 lineto
56667.2 29030.4 lineto
56554.7 28917.9 lineto
56442.2 28861.7 lineto
stroke
newpath
57510.8 29199.1 moveto
58298.2 29199.1 lineto
57792 28018 lineto
stroke
newpath
59648.1 28018 moveto
59648.1 29199.1 lineto
stroke
newpath
60154.3 28018 moveto
60154.3 28636.7 lineto
60098 28749.2 lineto
59985.5 28805.4 lineto
59816.8 28805.4 lineto
59704.3 28749.2 lineto
59648.1 28692.9 lineto
stroke
newpath
60885.4 28018 moveto
60772.9 28074.3 lineto
60716.7 28130.5 lineto
60660.4 28243 lineto
60660.4 28580.4 lineto
60716.7 28692.9 lineto
60772.9 28749.2 lineto
60885.4 28805.4 lineto
61054.1 28805.4 lineto
61166.6 28749.2 lineto
61222.9 28692.9 lineto
61279.1 28580.4 lineto
61279.1 28243 lineto
61222.9 28130.5 lineto
61166.6 28074.3 lineto
61054.1 28018 lineto
60885.4 28018 lineto
stroke
newpath
61954 28018 moveto
61841.5 28074.3 lineto
61785.3 28186.7 lineto
61785.3 29199.1 lineto
stroke
newpath
62853.9 28074.3 moveto
62741.4 28018 lineto
62516.5 28018 lineto
62404 28074.3 lineto
62347.7 28186.7 lineto
62347.7 28636.7 lineto
62404 28749.2 lineto
62516.5 28805.4 lineto
62741.4 28805.4 lineto
62853.9 28749.2 lineto
62910.2 28636.7 lineto
62910.2 28524.2 lineto
62347.7 28411.7 lineto
stroke
newpath
63360.1 28074.3 moveto
63472.6 28018 lineto
63697.6 28018 lineto
63810 28074.3 lineto
63866.3 28186.7 lineto
63866.3 28243 lineto
63810 28355.5 lineto
63697.6 28411.7 lineto
63528.8 28411.7 lineto
63416.3 28468 lineto
63360.1 28580.4 lineto
63360.1 28636.7 lineto
63416.3 28749.2 lineto
63528.8 28805.4 lineto
63697.6 28805.4 lineto
63810 28749.2 lineto
stroke
newpath
64260 27568.1 moveto
64316.2 27624.3 lineto
64428.7 27793 lineto
64485 27905.5 lineto
64541.2 28074.3 lineto
64597.4 28355.5 lineto
64597.4 28580.4 lineto
64541.2 28861.7 lineto
64485 29030.4 lineto
64428.7 29142.9 lineto
64316.2 29311.6 lineto
64260 29367.8 lineto
stroke
showpage
grestore
%%EOF
