G04 #@! TF.GenerationSoftware,KiCad,Pcbnew,(5.1.2)-2*
G04 #@! TF.CreationDate,2019-07-27T02:09:11+03:00*
G04 #@! TF.ProjectId,eps_prototype,6570735f-7072-46f7-946f-747970652e6b,rev?*
G04 #@! TF.SameCoordinates,Original*
G04 #@! TF.FileFunction,Profile,NP*
%FSLAX46Y46*%
G04 Gerber Fmt 4.6, Leading zero omitted, Abs format (unit mm)*
G04 Created by KiCad (PCBNEW (5.1.2)-2) date 2019-07-27 02:09:11*
%MOMM*%
%LPD*%
G04 APERTURE LIST*
%ADD10C,0.100000*%
G04 APERTURE END LIST*
D10*
X132000000Y-92750000D02*
X43000000Y-92750000D01*
X43000000Y-92750000D02*
X40750000Y-92750000D01*
X40750000Y-92750000D02*
X40750000Y-95000000D01*
X40750000Y-184000000D02*
X40750000Y-95000000D01*
X132000000Y-92750000D02*
X132000000Y-95000000D01*
X43000000Y-184000000D02*
X40750000Y-184000000D01*
X43000000Y-184000000D02*
X132000000Y-184000000D01*
X132000000Y-95000000D02*
X132000000Y-184000000D01*
M02*
