EESchema Schematic File Version 4
LIBS:eps_prototype-cache
EELAYER 29 0
EELAYER END
$Descr A4 11693 8268
encoding utf-8
Sheet 1 1
Title "AcubeSAT Electrical Power Subsystem"
Date "2019-07-24"
Rev "3"
Comp "Aristotle Space and Aeronautics Team"
Comment1 "TODO: Check/Redo charging module"
Comment2 "TODO: Enable battery input after complete charge (check. via MCU)"
Comment3 "TODO: Ripple check. (coop. between EPS & OBC), EPS MCU hard reset"
Comment4 "Last edited: 22:39 26/07/2019 by George Amponis"
$EndDescr
$Comp
L Connector:Conn_01x02_Female J1
U 1 1 5D29A15C
P 600 2050
F 0 "J1" H 628 2026 50  0000 L CNN
F 1 "Panels" H 628 1935 50  0000 L CNN
F 2 "Connector_PinHeader_2.54mm:PinHeader_1x02_P2.54mm_Vertical" H 600 2050 50  0001 C CNN
F 3 "~" H 600 2050 50  0001 C CNN
	1    600  2050
	-1   0    0    1   
$EndComp
Wire Wire Line
	7800 3300 7100 3300
$Comp
L power:GND #PWR0104
U 1 1 5D2F2F74
P 800 2050
F 0 "#PWR0104" H 800 1800 50  0001 C CNN
F 1 "GND" H 805 1877 50  0000 C CNN
F 2 "" H 800 2050 50  0001 C CNN
F 3 "" H 800 2050 50  0001 C CNN
	1    800  2050
	1    0    0    -1  
$EndComp
$Comp
L power:GND #PWR0105
U 1 1 5D2F934A
P 7800 3200
F 0 "#PWR0105" H 7800 2950 50  0001 C CNN
F 1 "GND" H 7805 3027 50  0000 C CNN
F 2 "" H 7800 3200 50  0001 C CNN
F 3 "" H 7800 3200 50  0001 C CNN
	1    7800 3200
	1    0    0    -1  
$EndComp
$Comp
L power:GND #PWR0106
U 1 1 5D2FF2A1
P 7800 3400
F 0 "#PWR0106" H 7800 3150 50  0001 C CNN
F 1 "GND" H 7805 3227 50  0000 C CNN
F 2 "" H 7800 3400 50  0001 C CNN
F 3 "" H 7800 3400 50  0001 C CNN
	1    7800 3400
	1    0    0    -1  
$EndComp
Wire Wire Line
	7800 3500 6500 3500
Wire Wire Line
	6500 4450 5800 4450
$Comp
L Device:RTRIM R7
U 1 1 5D1C3360
P 1000 6150
F 0 "R7" H 1128 6196 50  0000 L CNN
F 1 "RTRIM" H 1128 6105 50  0000 L CNN
F 2 "Potentiometer_THT:Potentiometer_Runtron_RM-065_Vertical" V 930 6150 50  0001 C CNN
F 3 "~" H 1000 6150 50  0001 C CNN
	1    1000 6150
	1    0    0    -1  
$EndComp
$Comp
L power:GND #PWR0101
U 1 1 5D1C182C
P 1000 6650
F 0 "#PWR0101" H 1000 6400 50  0001 C CNN
F 1 "GND" H 1005 6477 50  0000 C CNN
F 2 "" H 1000 6650 50  0001 C CNN
F 3 "" H 1000 6650 50  0001 C CNN
	1    1000 6650
	1    0    0    -1  
$EndComp
Connection ~ 1000 6300
Wire Wire Line
	1000 6350 1000 6300
$Comp
L Device:R R8
U 1 1 5D1AB9F0
P 1000 6500
F 0 "R8" H 1070 6546 50  0000 L CNN
F 1 "50k" H 1070 6455 50  0000 L CNN
F 2 "Resistor_SMD:R_0603_1608Metric_Pad1.05x0.95mm_HandSolder" V 930 6500 50  0001 C CNN
F 3 "~" H 1000 6500 50  0001 C CNN
	1    1000 6500
	1    0    0    -1  
$EndComp
$Comp
L Transistor_FET:DMG2301L Q4
U 1 1 5D30BFC4
P 5500 2200
F 0 "Q4" H 5706 2246 50  0000 L CNN
F 1 "DMG2301L" H 5706 2155 50  0000 L CNN
F 2 "Package_TO_SOT_SMD:SOT-23" H 5700 2125 50  0001 L CIN
F 3 "https://www.diodes.com/assets/Datasheets/DMG2301L.pdf" H 5500 2200 50  0001 L CNN
	1    5500 2200
	0    1    1    0   
$EndComp
Wire Wire Line
	5700 2300 6000 2300
$Comp
L Transistor_FET:DMG2301L Q3
U 1 1 5D3BFB10
P 5450 3500
F 0 "Q3" H 5656 3546 50  0000 L CNN
F 1 "DMG2301L" V 5400 3650 50  0000 L CNN
F 2 "Package_TO_SOT_SMD:SOT-23" H 5650 3425 50  0001 L CIN
F 3 "https://www.diodes.com/assets/Datasheets/DMG2301L.pdf" H 5450 3500 50  0001 L CNN
	1    5450 3500
	0    1    1    0   
$EndComp
Wire Wire Line
	6400 3600 5650 3600
$Comp
L Transistor_FET:DMG2301L Q2
U 1 1 5D3D3590
P 4650 4850
F 0 "Q2" H 4856 4896 50  0000 L CNN
F 1 "DMG2301L" H 4856 4805 50  0000 L CNN
F 2 "Package_TO_SOT_SMD:SOT-23" H 4850 4775 50  0001 L CIN
F 3 "https://www.diodes.com/assets/Datasheets/DMG2301L.pdf" H 4650 4850 50  0001 L CNN
	1    4650 4850
	0    1    1    0   
$EndComp
$Comp
L Device:CP C3
U 1 1 5D367B9E
P 550 7250
F 0 "C3" H 668 7296 50  0000 L CNN
F 1 "1uF" H 668 7205 50  0000 L CNN
F 2 "Capacitor_SMD:C_1210_3225Metric" H 588 7100 50  0001 C CNN
F 3 "~" H 550 7250 50  0001 C CNN
	1    550  7250
	1    0    0    -1  
$EndComp
$Comp
L power:GND #PWR0110
U 1 1 5D367BA5
P 750 7450
F 0 "#PWR0110" H 750 7200 50  0001 C CNN
F 1 "GND" H 755 7277 50  0000 C CNN
F 2 "" H 750 7450 50  0001 C CNN
F 3 "" H 750 7450 50  0001 C CNN
	1    750  7450
	1    0    0    -1  
$EndComp
Wire Wire Line
	550  7100 750  7100
Connection ~ 750  7100
Wire Wire Line
	950  7100 750  7100
Wire Wire Line
	550  7400 650  7400
Connection ~ 750  7400
Wire Wire Line
	950  7400 750  7400
Wire Wire Line
	750  7450 750  7400
Wire Wire Line
	650  7450 650  7400
Connection ~ 650  7400
Wire Wire Line
	650  7400 750  7400
$Comp
L Device:CP C4
U 1 1 5D367BB5
P 750 7250
F 0 "C4" H 868 7296 50  0000 L CNN
F 1 "1uF" H 868 7205 50  0000 L CNN
F 2 "Capacitor_SMD:C_1210_3225Metric" H 788 7100 50  0001 C CNN
F 3 "~" H 750 7250 50  0001 C CNN
	1    750  7250
	1    0    0    -1  
$EndComp
$Comp
L Device:CP C5
U 1 1 5D367BBB
P 950 7250
F 0 "C5" H 1068 7296 50  0000 L CNN
F 1 "1uF" H 1068 7205 50  0000 L CNN
F 2 "Capacitor_SMD:C_1210_3225Metric" H 988 7100 50  0001 C CNN
F 3 "~" H 950 7250 50  0001 C CNN
	1    950  7250
	1    0    0    -1  
$EndComp
Wire Wire Line
	2300 2350 2600 2350
Wire Wire Line
	2300 2800 2700 2800
$Comp
L power:GND #PWR0111
U 1 1 5D5CB8A6
P 2400 2200
F 0 "#PWR0111" H 2400 1950 50  0001 C CNN
F 1 "GND" H 2405 2027 50  0000 C CNN
F 2 "" H 2400 2200 50  0001 C CNN
F 3 "" H 2400 2200 50  0001 C CNN
	1    2400 2200
	1    0    0    -1  
$EndComp
Wire Wire Line
	2700 2050 2600 2050
Wire Wire Line
	2600 1750 2700 1750
Wire Wire Line
	2300 2800 2300 2850
Connection ~ 2300 2800
Wire Wire Line
	2300 2750 2300 2800
$Comp
L Device:R R1
U 1 1 5D5CB8BC
P 2300 2600
F 0 "R1" H 2370 2646 50  0000 L CNN
F 1 "124k" H 2370 2555 50  0000 L CNN
F 2 "Resistor_SMD:R_0603_1608Metric_Pad1.05x0.95mm_HandSolder" V 2230 2600 50  0001 C CNN
F 3 "~" H 2300 2600 50  0001 C CNN
	1    2300 2600
	1    0    0    -1  
$EndComp
$Comp
L Device:R R2
U 1 1 5D5CB8C2
P 2300 3000
F 0 "R2" H 2370 3046 50  0000 L CNN
F 1 "22.1k" H 2370 2955 50  0000 L CNN
F 2 "Resistor_SMD:R_0603_1608Metric_Pad1.05x0.95mm_HandSolder" V 2230 3000 50  0001 C CNN
F 3 "~" H 2300 3000 50  0001 C CNN
	1    2300 3000
	1    0    0    -1  
$EndComp
$Comp
L Device:CP C12
U 1 1 5D5CB8C8
P 2550 2200
F 0 "C12" H 2668 2246 50  0000 L CNN
F 1 "1uF" H 2668 2155 50  0000 L CNN
F 2 "Capacitor_SMD:C_1210_3225Metric" H 2588 2050 50  0001 C CNN
F 3 "~" H 2550 2200 50  0001 C CNN
	1    2550 2200
	0    1    1    0   
$EndComp
$Comp
L Device:R R3
U 1 1 5D5CB8CE
P 2600 1900
F 0 "R3" H 2670 1946 50  0000 L CNN
F 1 "1k" H 2670 1855 50  0000 L CNN
F 2 "Resistor_SMD:R_0603_1608Metric_Pad1.05x0.95mm_HandSolder" V 2530 1900 50  0001 C CNN
F 3 "~" H 2600 1900 50  0001 C CNN
	1    2600 1900
	1    0    0    -1  
$EndComp
Wire Wire Line
	2700 1750 2700 1800
Wire Wire Line
	2700 2050 2700 2000
$Comp
L Device:CP C2
U 1 1 5D5CB8D6
P 2700 3150
F 0 "C2" H 2818 3196 50  0000 L CNN
F 1 "1uF" H 2818 3105 50  0000 L CNN
F 2 "Capacitor_SMD:C_1210_3225Metric" H 2738 3000 50  0001 C CNN
F 3 "~" H 2700 3150 50  0001 C CNN
	1    2700 3150
	1    0    0    -1  
$EndComp
$Comp
L Device:CP C1
U 1 1 5D5CB8DC
P 2600 2500
F 0 "C1" H 2718 2546 50  0000 L CNN
F 1 "1uF" H 2718 2455 50  0000 L CNN
F 2 "Capacitor_SMD:C_1210_3225Metric" H 2638 2350 50  0001 C CNN
F 3 "~" H 2600 2500 50  0001 C CNN
	1    2600 2500
	1    0    0    -1  
$EndComp
Connection ~ 2600 2350
Wire Wire Line
	2600 2350 2700 2350
Wire Wire Line
	2700 2350 2700 2400
Wire Wire Line
	2600 2650 2700 2650
Wire Wire Line
	2700 2650 2700 2600
$Comp
L power:GND #PWR0112
U 1 1 5D5CB8E7
P 4100 1800
F 0 "#PWR0112" H 4100 1550 50  0001 C CNN
F 1 "GND" H 4105 1627 50  0000 C CNN
F 2 "" H 4100 1800 50  0001 C CNN
F 3 "" H 4100 1800 50  0001 C CNN
	1    4100 1800
	1    0    0    -1  
$EndComp
$Comp
L power:GND #PWR0113
U 1 1 5D5CB8ED
P 2700 3300
F 0 "#PWR0113" H 2700 3050 50  0001 C CNN
F 1 "GND" H 2705 3127 50  0000 C CNN
F 2 "" H 2700 3300 50  0001 C CNN
F 3 "" H 2700 3300 50  0001 C CNN
	1    2700 3300
	1    0    0    -1  
$EndComp
$Comp
L Device:L L1
U 1 1 5D5CB8F3
P 2300 2200
F 0 "L1" V 2490 2200 50  0000 C CNN
F 1 "4.7uH" V 2399 2200 50  0000 C CNN
F 2 "SamacSys_Parts:WE-PD_1030_105054" H 2300 2200 50  0001 C CNN
F 3 "~" H 2300 2200 50  0001 C CNN
	1    2300 2200
	-1   0    0    1   
$EndComp
$Comp
L Device:CP C16
U 1 1 5D61EE03
P 2800 1150
F 0 "C16" H 2918 1196 50  0000 L CNN
F 1 "1uF" H 2918 1105 50  0000 L CNN
F 2 "Capacitor_SMD:C_1210_3225Metric" H 2838 1000 50  0001 C CNN
F 3 "~" H 2800 1150 50  0001 C CNN
	1    2800 1150
	1    0    0    -1  
$EndComp
Wire Wire Line
	3000 1000 3000 900 
$Comp
L power:GND #PWR0114
U 1 1 5D61EE0A
P 3000 1350
F 0 "#PWR0114" H 3000 1100 50  0001 C CNN
F 1 "GND" H 3005 1177 50  0000 C CNN
F 2 "" H 3000 1350 50  0001 C CNN
F 3 "" H 3000 1350 50  0001 C CNN
	1    3000 1350
	1    0    0    -1  
$EndComp
Wire Wire Line
	2800 1000 3000 1000
Connection ~ 3000 1000
Wire Wire Line
	3200 1000 3000 1000
Wire Wire Line
	2800 1300 2900 1300
Connection ~ 3000 1300
Wire Wire Line
	3200 1300 3000 1300
Wire Wire Line
	3000 1350 3000 1300
Wire Wire Line
	2900 1350 2900 1300
Connection ~ 2900 1300
Wire Wire Line
	2900 1300 3000 1300
$Comp
L Device:CP C17
U 1 1 5D61EE1A
P 3000 1150
F 0 "C17" H 3118 1196 50  0000 L CNN
F 1 "1uF" H 3118 1105 50  0000 L CNN
F 2 "Capacitor_SMD:C_1210_3225Metric" H 3038 1000 50  0001 C CNN
F 3 "~" H 3000 1150 50  0001 C CNN
	1    3000 1150
	1    0    0    -1  
$EndComp
$Comp
L Device:CP C18
U 1 1 5D61EE20
P 3200 1150
F 0 "C18" H 3318 1196 50  0000 L CNN
F 1 "10uF" H 3318 1105 50  0000 L CNN
F 2 "Capacitor_SMD:C_1210_3225Metric" H 3238 1000 50  0001 C CNN
F 3 "~" H 3200 1150 50  0001 C CNN
	1    3200 1150
	1    0    0    -1  
$EndComp
$Comp
L Device:CP C19
U 1 1 5D62527B
P 3400 1150
F 0 "C19" H 3518 1196 50  0000 L CNN
F 1 "10uF" H 3518 1105 50  0000 L CNN
F 2 "Capacitor_SMD:C_1210_3225Metric" H 3438 1000 50  0001 C CNN
F 3 "~" H 3400 1150 50  0001 C CNN
	1    3400 1150
	1    0    0    -1  
$EndComp
Wire Wire Line
	3600 1000 3600 900 
$Comp
L power:GND #PWR0115
U 1 1 5D625282
P 3600 1350
F 0 "#PWR0115" H 3600 1100 50  0001 C CNN
F 1 "GND" H 3605 1177 50  0000 C CNN
F 2 "" H 3600 1350 50  0001 C CNN
F 3 "" H 3600 1350 50  0001 C CNN
	1    3600 1350
	1    0    0    -1  
$EndComp
Wire Wire Line
	3400 1000 3600 1000
Connection ~ 3600 1000
Wire Wire Line
	3800 1000 3600 1000
Wire Wire Line
	3400 1300 3500 1300
Connection ~ 3600 1300
Wire Wire Line
	3800 1300 3600 1300
Wire Wire Line
	3600 1350 3600 1300
Wire Wire Line
	3500 1350 3500 1300
Connection ~ 3500 1300
Wire Wire Line
	3500 1300 3600 1300
$Comp
L Device:CP C20
U 1 1 5D625292
P 3600 1150
F 0 "C20" H 3718 1196 50  0000 L CNN
F 1 "100uF" H 3718 1105 50  0000 L CNN
F 2 "Capacitor_SMD:C_1210_3225Metric" H 3638 1000 50  0001 C CNN
F 3 "~" H 3600 1150 50  0001 C CNN
	1    3600 1150
	1    0    0    -1  
$EndComp
$Comp
L Device:CP C21
U 1 1 5D625298
P 3800 1150
F 0 "C21" H 3918 1196 50  0000 L CNN
F 1 "100uF" H 3918 1105 50  0000 L CNN
F 2 "Capacitor_SMD:C_1210_3225Metric" H 3838 1000 50  0001 C CNN
F 3 "~" H 3800 1150 50  0001 C CNN
	1    3800 1150
	1    0    0    -1  
$EndComp
Wire Wire Line
	3600 900  3300 900 
Wire Wire Line
	3300 900  3300 800 
Wire Wire Line
	3300 800  2300 800 
Wire Wire Line
	2300 800  2300 2050
Connection ~ 3300 900 
Wire Wire Line
	3300 900  3000 900 
$Comp
L power:GND #PWR0116
U 1 1 5D639F24
P 2300 3150
F 0 "#PWR0116" H 2300 2900 50  0001 C CNN
F 1 "GND" H 2305 2977 50  0000 C CNN
F 2 "" H 2300 3150 50  0001 C CNN
F 3 "" H 2300 3150 50  0001 C CNN
	1    2300 3150
	1    0    0    -1  
$EndComp
Wire Wire Line
	3300 800  4300 800 
Wire Wire Line
	4300 800  4300 2300
Connection ~ 3300 800 
Wire Wire Line
	2300 4650 2600 4650
Wire Wire Line
	2300 5100 2700 5100
$Comp
L power:GND #PWR0119
U 1 1 5D700E63
P 2400 4500
F 0 "#PWR0119" H 2400 4250 50  0001 C CNN
F 1 "GND" H 2405 4327 50  0000 C CNN
F 2 "" H 2400 4500 50  0001 C CNN
F 3 "" H 2400 4500 50  0001 C CNN
	1    2400 4500
	1    0    0    -1  
$EndComp
Wire Wire Line
	2700 4350 2600 4350
Wire Wire Line
	2300 5100 2300 5150
Connection ~ 2300 5100
Wire Wire Line
	2300 5050 2300 5100
$Comp
L TPS54339EDDA:TPS54339EDDA U2
U 1 1 5D700E73
P 3400 4800
F 0 "U2" H 3400 5770 50  0000 C CNN
F 1 "TPS54339EDDA" H 3400 5679 50  0000 C CNN
F 2 "SamacSys_Parts:SOIC127P600X170-9N" H 3400 4800 50  0001 L BNN
F 3 "" H 3400 4800 50  0001 L BNN
F 4 "Unavailable" H 3400 4800 50  0001 L BNN "Field4"
F 5 "Conv DC-DC 4.5V to 23V Step Down Single-Out 0.76V to 7V 10A 8-Pin HSOP EP Tube" H 3400 4800 50  0001 L BNN "Field5"
F 6 "Texas Instruments" H 3400 4800 50  0001 L BNN "Field6"
F 7 "SO-8 Texas Instruments" H 3400 4800 50  0001 L BNN "Field7"
F 8 "None" H 3400 4800 50  0001 L BNN "Field8"
	1    3400 4800
	1    0    0    -1  
$EndComp
$Comp
L Device:R R5
U 1 1 5D700E79
P 2300 4900
F 0 "R5" H 2370 4946 50  0000 L CNN
F 1 "124k" H 2370 4855 50  0000 L CNN
F 2 "Resistor_SMD:R_0603_1608Metric_Pad1.05x0.95mm_HandSolder" V 2230 4900 50  0001 C CNN
F 3 "~" H 2300 4900 50  0001 C CNN
	1    2300 4900
	1    0    0    -1  
$EndComp
$Comp
L Device:R R6
U 1 1 5D700E7F
P 2300 5300
F 0 "R6" H 2370 5346 50  0000 L CNN
F 1 "22.1k" H 2370 5255 50  0000 L CNN
F 2 "Resistor_SMD:R_0603_1608Metric_Pad1.05x0.95mm_HandSolder" V 2230 5300 50  0001 C CNN
F 3 "~" H 2300 5300 50  0001 C CNN
	1    2300 5300
	1    0    0    -1  
$EndComp
$Comp
L Device:CP C13
U 1 1 5D700E85
P 2550 4500
F 0 "C13" H 2668 4546 50  0000 L CNN
F 1 "1uF" H 2668 4455 50  0000 L CNN
F 2 "Capacitor_SMD:C_1210_3225Metric" H 2588 4350 50  0001 C CNN
F 3 "~" H 2550 4500 50  0001 C CNN
	1    2550 4500
	0    1    1    0   
$EndComp
$Comp
L Device:R R4
U 1 1 5D700E8B
P 2600 4200
F 0 "R4" H 2670 4246 50  0000 L CNN
F 1 "1k" H 2670 4155 50  0000 L CNN
F 2 "Resistor_SMD:R_0603_1608Metric_Pad1.05x0.95mm_HandSolder" V 2530 4200 50  0001 C CNN
F 3 "~" H 2600 4200 50  0001 C CNN
	1    2600 4200
	1    0    0    -1  
$EndComp
Wire Wire Line
	2700 4050 2700 4100
Wire Wire Line
	2700 4350 2700 4300
$Comp
L Device:CP C15
U 1 1 5D700E93
P 2700 5450
F 0 "C15" H 2818 5496 50  0000 L CNN
F 1 "1uF" H 2818 5405 50  0000 L CNN
F 2 "Capacitor_SMD:C_1210_3225Metric" H 2738 5300 50  0001 C CNN
F 3 "~" H 2700 5450 50  0001 C CNN
	1    2700 5450
	1    0    0    -1  
$EndComp
$Comp
L Device:CP C14
U 1 1 5D700E99
P 2600 4800
F 0 "C14" H 2718 4846 50  0000 L CNN
F 1 "1uF" H 2718 4755 50  0000 L CNN
F 2 "Capacitor_SMD:C_1210_3225Metric" H 2638 4650 50  0001 C CNN
F 3 "~" H 2600 4800 50  0001 C CNN
	1    2600 4800
	1    0    0    -1  
$EndComp
Connection ~ 2600 4650
Wire Wire Line
	2600 4650 2700 4650
Wire Wire Line
	2700 4650 2700 4700
Wire Wire Line
	2600 4950 2700 4950
Wire Wire Line
	2700 4950 2700 4900
$Comp
L power:GND #PWR0120
U 1 1 5D700EA4
P 4100 4100
F 0 "#PWR0120" H 4100 3850 50  0001 C CNN
F 1 "GND" H 4105 3927 50  0000 C CNN
F 2 "" H 4100 4100 50  0001 C CNN
F 3 "" H 4100 4100 50  0001 C CNN
	1    4100 4100
	1    0    0    -1  
$EndComp
$Comp
L power:GND #PWR0121
U 1 1 5D700EAA
P 2700 5600
F 0 "#PWR0121" H 2700 5350 50  0001 C CNN
F 1 "GND" H 2705 5427 50  0000 C CNN
F 2 "" H 2700 5600 50  0001 C CNN
F 3 "" H 2700 5600 50  0001 C CNN
	1    2700 5600
	1    0    0    -1  
$EndComp
$Comp
L Device:L L2
U 1 1 5D700EB0
P 2300 4500
F 0 "L2" V 2490 4500 50  0000 C CNN
F 1 "4.7uH" V 2399 4500 50  0000 C CNN
F 2 "SamacSys_Parts:WE-PD_1030_105054" H 2300 4500 50  0001 C CNN
F 3 "~" H 2300 4500 50  0001 C CNN
	1    2300 4500
	-1   0    0    1   
$EndComp
$Comp
L power:GND #PWR0122
U 1 1 5D700EB6
P 2300 5450
F 0 "#PWR0122" H 2300 5200 50  0001 C CNN
F 1 "GND" H 2305 5277 50  0000 C CNN
F 2 "" H 2300 5450 50  0001 C CNN
F 3 "" H 2300 5450 50  0001 C CNN
	1    2300 5450
	1    0    0    -1  
$EndComp
$Comp
L Device:CP C6
U 1 1 5D70C5BA
P 1200 3900
F 0 "C6" H 1318 3946 50  0000 L CNN
F 1 "1uF" H 1318 3855 50  0000 L CNN
F 2 "Capacitor_SMD:C_1210_3225Metric" H 1238 3750 50  0001 C CNN
F 3 "~" H 1200 3900 50  0001 C CNN
	1    1200 3900
	1    0    0    -1  
$EndComp
Wire Wire Line
	1400 3750 1400 3650
$Comp
L power:GND #PWR0124
U 1 1 5D70C5C1
P 1400 4100
F 0 "#PWR0124" H 1400 3850 50  0001 C CNN
F 1 "GND" H 1405 3927 50  0000 C CNN
F 2 "" H 1400 4100 50  0001 C CNN
F 3 "" H 1400 4100 50  0001 C CNN
	1    1400 4100
	1    0    0    -1  
$EndComp
Wire Wire Line
	1200 3750 1400 3750
Connection ~ 1400 3750
Wire Wire Line
	1600 3750 1400 3750
Wire Wire Line
	1200 4050 1300 4050
Connection ~ 1400 4050
Wire Wire Line
	1600 4050 1400 4050
Wire Wire Line
	1400 4100 1400 4050
Wire Wire Line
	1300 4100 1300 4050
Connection ~ 1300 4050
Wire Wire Line
	1300 4050 1400 4050
$Comp
L Device:CP C7
U 1 1 5D70C5D1
P 1400 3900
F 0 "C7" H 1518 3946 50  0000 L CNN
F 1 "1uF" H 1518 3855 50  0000 L CNN
F 2 "Capacitor_SMD:C_1210_3225Metric" H 1438 3750 50  0001 C CNN
F 3 "~" H 1400 3900 50  0001 C CNN
	1    1400 3900
	1    0    0    -1  
$EndComp
$Comp
L Device:CP C8
U 1 1 5D70C5D7
P 1600 3900
F 0 "C8" H 1718 3946 50  0000 L CNN
F 1 "10uF" H 1718 3855 50  0000 L CNN
F 2 "Capacitor_SMD:C_1210_3225Metric" H 1638 3750 50  0001 C CNN
F 3 "~" H 1600 3900 50  0001 C CNN
	1    1600 3900
	1    0    0    -1  
$EndComp
$Comp
L Device:CP C9
U 1 1 5D70C5DD
P 1800 3900
F 0 "C9" H 1918 3946 50  0000 L CNN
F 1 "10uF" H 1918 3855 50  0000 L CNN
F 2 "Capacitor_SMD:C_1210_3225Metric" H 1838 3750 50  0001 C CNN
F 3 "~" H 1800 3900 50  0001 C CNN
	1    1800 3900
	1    0    0    -1  
$EndComp
Wire Wire Line
	2000 3750 2000 3650
$Comp
L power:GND #PWR0125
U 1 1 5D70C5E4
P 2000 4100
F 0 "#PWR0125" H 2000 3850 50  0001 C CNN
F 1 "GND" H 2005 3927 50  0000 C CNN
F 2 "" H 2000 4100 50  0001 C CNN
F 3 "" H 2000 4100 50  0001 C CNN
	1    2000 4100
	1    0    0    -1  
$EndComp
Wire Wire Line
	1800 3750 2000 3750
Connection ~ 2000 3750
Wire Wire Line
	2200 3750 2000 3750
Wire Wire Line
	1800 4050 1900 4050
Connection ~ 2000 4050
Wire Wire Line
	2200 4050 2000 4050
Wire Wire Line
	2000 4100 2000 4050
Wire Wire Line
	1900 4100 1900 4050
Connection ~ 1900 4050
Wire Wire Line
	1900 4050 2000 4050
$Comp
L Device:CP C10
U 1 1 5D70C5F4
P 2000 3900
F 0 "C10" H 2118 3946 50  0000 L CNN
F 1 "100uF" H 2118 3855 50  0000 L CNN
F 2 "Capacitor_SMD:C_1210_3225Metric" H 2038 3750 50  0001 C CNN
F 3 "~" H 2000 3900 50  0001 C CNN
	1    2000 3900
	1    0    0    -1  
$EndComp
$Comp
L Device:CP C11
U 1 1 5D70C5FA
P 2200 3900
F 0 "C11" H 2318 3946 50  0000 L CNN
F 1 "100uF" H 2318 3855 50  0000 L CNN
F 2 "Capacitor_SMD:C_1210_3225Metric" H 2238 3750 50  0001 C CNN
F 3 "~" H 2200 3900 50  0001 C CNN
	1    2200 3900
	1    0    0    -1  
$EndComp
Wire Wire Line
	2300 4350 1050 4350
Wire Wire Line
	1400 3650 1700 3650
Wire Wire Line
	1700 3600 1700 3650
Connection ~ 1700 3650
Wire Wire Line
	1700 3650 2000 3650
Wire Wire Line
	1700 3600 1050 3600
Connection ~ 1700 3600
Wire Wire Line
	1050 3600 1050 4350
$Comp
L power:GND #PWR0127
U 1 1 5D3C51E5
P 7800 3600
F 0 "#PWR0127" H 7800 3350 50  0001 C CNN
F 1 "GND" H 7805 3427 50  0000 C CNN
F 2 "" H 7800 3600 50  0001 C CNN
F 3 "" H 7800 3600 50  0001 C CNN
	1    7800 3600
	1    0    0    -1  
$EndComp
Text GLabel 7000 3300 1    50   Output ~ 0
3.3V
Text GLabel 6900 3100 1    50   Output ~ 0
5V
Text GLabel 5800 4850 0    50   Output ~ 0
?V
Text GLabel 7100 3500 1    50   Output ~ 0
?V
Wire Wire Line
	800  1750 800  1950
Connection ~ 2600 1750
$Comp
L Device:R R_Shunt5V1
U 1 1 5D42E405
P 4950 2300
F 0 "R_Shunt5V1" V 4750 2100 50  0000 L CNN
F 1 "0.05" H 5020 2255 50  0000 L CNN
F 2 "Resistor_SMD:R_0603_1608Metric_Pad1.05x0.95mm_HandSolder" V 4880 2300 50  0001 C CNN
F 3 "~" H 4950 2300 50  0001 C CNN
	1    4950 2300
	0    1    1    0   
$EndComp
Wire Wire Line
	5100 2300 5300 2300
Wire Wire Line
	4300 2300 4800 2300
Connection ~ 4800 2300
Wire Wire Line
	5100 2450 5100 2300
Connection ~ 5100 2300
$Comp
L Device:R R_Shunt3.3V1
U 1 1 5D464F28
P 5050 3600
F 0 "R_Shunt3.3V1" V 4900 3300 50  0000 L CNN
F 1 "0.05" H 5120 3555 50  0000 L CNN
F 2 "Resistor_SMD:R_0603_1608Metric_Pad1.05x0.95mm_HandSolder" V 4980 3600 50  0001 C CNN
F 3 "~" H 5050 3600 50  0001 C CNN
	1    5050 3600
	0    1    1    0   
$EndComp
Wire Wire Line
	5200 3600 5250 3600
Wire Wire Line
	4950 3700 4900 3700
Wire Wire Line
	4900 3700 4900 3600
Connection ~ 4900 3600
Wire Wire Line
	5150 3700 5200 3700
Wire Wire Line
	5200 3700 5200 3600
Connection ~ 5200 3600
$Comp
L Device:R R_Shunt?V1
U 1 1 5D49E01C
P 3300 6450
F 0 "R_Shunt?V1" H 3370 6496 50  0000 L CNN
F 1 "0.05" H 3370 6405 50  0000 L CNN
F 2 "Resistor_SMD:R_0603_1608Metric_Pad1.05x0.95mm_HandSolder" V 3230 6450 50  0001 C CNN
F 3 "~" H 3300 6450 50  0001 C CNN
	1    3300 6450
	0    1    1    0   
$EndComp
$Comp
L LMC662CMX_NOPB:LMC662CMX_NOPB U3
U 1 1 5D330FE8
P 2000 6500
F 0 "U3" H 2000 7170 50  0000 C CNN
F 1 "LMC662CMX_NOPB" H 2000 7079 50  0000 C CNN
F 2 "SamacSys_Parts:SOIC127P600X175-8N" H 2000 6500 50  0001 L BNN
F 3 "" H 2000 6500 50  0001 L BNN
F 4 "Unavailable" H 2000 6500 50  0001 L BNN "Field4"
F 5 "OPERATIONAL AMPLIFIER, 1.4MHZ, 1.1V/ us, SOIC-8, FULL REEL" H 2000 6500 50  0001 L BNN "Field5"
F 6 "Texas Instruments" H 2000 6500 50  0001 L BNN "Field6"
F 7 "SOIC-8 Texas Instruments" H 2000 6500 50  0001 L BNN "Field7"
F 8 "None" H 2000 6500 50  0001 L BNN "Field8"
	1    2000 6500
	1    0    0    -1  
$EndComp
Wire Wire Line
	750  5950 1000 5950
Wire Wire Line
	750  5950 750  7100
Wire Wire Line
	1000 6000 1000 5950
Connection ~ 1000 5950
Wire Wire Line
	1300 6200 1300 5950
Wire Wire Line
	1000 6300 1150 6300
Wire Wire Line
	1300 6700 1150 6700
Wire Wire Line
	1150 6700 1150 6300
Wire Wire Line
	1300 6400 1200 6400
Wire Wire Line
	1200 6400 1200 7300
Wire Wire Line
	1200 7300 3000 7300
Wire Wire Line
	3000 7300 3000 6450
Connection ~ 3000 6450
Wire Wire Line
	3000 6450 3000 6400
$Comp
L MCP9808T-E_MS:MCP9808T-E_MS U8
U 1 1 5D368FF8
P 10200 6050
F 0 "U8" H 10200 6617 50  0000 C CNN
F 1 "MCP9808T-E_MS" H 10200 6526 50  0000 C CNN
F 2 "SamacSys_Parts:SOP65P490X110-8N" H 10200 6050 50  0001 L BNN
F 3 "" H 10200 6050 50  0001 L BNN
F 4 "None" H 10200 6050 50  0001 L BNN "Field4"
F 5 "Microchip" H 10200 6050 50  0001 L BNN "Field5"
F 6 "MSOP-8 Microchip" H 10200 6050 50  0001 L BNN "Field6"
F 7 "Unavailable" H 10200 6050 50  0001 L BNN "Field7"
F 8 "MCP9808 Series 3.6 V Memory Module Digital Temperature Sensor SMT - MSOP-8" H 10200 6050 50  0001 L BNN "Field8"
	1    10200 6050
	1    0    0    -1  
$EndComp
Text GLabel 4350 2750 1    50   Input ~ 0
5V_current_monitor
Text GLabel 2300 2450 0    50   Input ~ 0
5V_check
$Comp
L power:GND #PWR0103
U 1 1 5D653450
P 7700 6300
F 0 "#PWR0103" H 7700 6050 50  0001 C CNN
F 1 "GND" H 7705 6127 50  0000 C CNN
F 2 "" H 7700 6300 50  0001 C CNN
F 3 "" H 7700 6300 50  0001 C CNN
	1    7700 6300
	1    0    0    -1  
$EndComp
Wire Wire Line
	7700 6300 7700 6250
Connection ~ 7700 6250
$Comp
L Device:CP C23
U 1 1 5D65345B
P 7900 6100
F 0 "C23" H 8018 6146 50  0000 L CNN
F 1 "3pF" H 8018 6055 50  0000 L CNN
F 2 "Capacitor_SMD:C_1210_3225Metric" H 7938 5950 50  0001 C CNN
F 3 "~" H 7900 6100 50  0001 C CNN
	1    7900 6100
	1    0    0    -1  
$EndComp
$Comp
L Device:CP C22
U 1 1 5D653461
P 7500 6100
F 0 "C22" H 7618 6146 50  0000 L CNN
F 1 "3pF" H 7618 6055 50  0000 L CNN
F 2 "Capacitor_SMD:C_1210_3225Metric" H 7538 5950 50  0001 C CNN
F 3 "~" H 7500 6100 50  0001 C CNN
	1    7500 6100
	1    0    0    -1  
$EndComp
$Comp
L power:+3.3V #PWR0107
U 1 1 5D6CA389
P 7100 3300
F 0 "#PWR0107" H 7100 3150 50  0001 C CNN
F 1 "+3.3V" H 7115 3473 50  0000 C CNN
F 2 "" H 7100 3300 50  0001 C CNN
F 3 "" H 7100 3300 50  0001 C CNN
	1    7100 3300
	1    0    0    -1  
$EndComp
Connection ~ 7100 3300
Wire Wire Line
	7100 3300 6400 3300
$Comp
L power:+3.3V #PWR0109
U 1 1 5D6CB9DE
P 11000 5750
F 0 "#PWR0109" H 11000 5600 50  0001 C CNN
F 1 "+3.3V" H 11015 5923 50  0000 C CNN
F 2 "" H 11000 5750 50  0001 C CNN
F 3 "" H 11000 5750 50  0001 C CNN
	1    11000 5750
	1    0    0    -1  
$EndComp
$Comp
L power:+3.3V #PWR0118
U 1 1 5D703F65
P 5500 2850
F 0 "#PWR0118" H 5500 2700 50  0001 C CNN
F 1 "+3.3V" H 5515 3023 50  0000 C CNN
F 2 "" H 5500 2850 50  0001 C CNN
F 3 "" H 5500 2850 50  0001 C CNN
	1    5500 2850
	0    1    1    0   
$EndComp
Wire Wire Line
	1700 3600 4300 3600
$Comp
L power:+5V #PWR0126
U 1 1 5D747BF6
P 7000 3100
F 0 "#PWR0126" H 7000 2950 50  0001 C CNN
F 1 "+5V" H 7015 3273 50  0000 C CNN
F 2 "" H 7000 3100 50  0001 C CNN
F 3 "" H 7000 3100 50  0001 C CNN
	1    7000 3100
	1    0    0    -1  
$EndComp
Wire Wire Line
	1000 5950 1300 5950
$Comp
L power:+5V #PWR0129
U 1 1 5D766014
P 1150 5950
F 0 "#PWR0129" H 1150 5800 50  0001 C CNN
F 1 "+5V" H 1165 6123 50  0000 C CNN
F 2 "" H 1150 5950 50  0001 C CNN
F 3 "" H 1150 5950 50  0001 C CNN
	1    1150 5950
	1    0    0    -1  
$EndComp
$Comp
L power:GND #PWR0130
U 1 1 5D7E1801
P 11000 6350
F 0 "#PWR0130" H 11000 6100 50  0001 C CNN
F 1 "GND" H 11005 6177 50  0000 C CNN
F 2 "" H 11000 6350 50  0001 C CNN
F 3 "" H 11000 6350 50  0001 C CNN
	1    11000 6350
	0    -1   1    0   
$EndComp
$Comp
L power:GND #PWR0131
U 1 1 5D7F06DC
P 11000 6050
F 0 "#PWR0131" H 11000 5800 50  0001 C CNN
F 1 "GND" H 11005 5877 50  0000 C CNN
F 2 "" H 11000 6050 50  0001 C CNN
F 3 "" H 11000 6050 50  0001 C CNN
	1    11000 6050
	0    -1   1    0   
$EndComp
$Comp
L power:GND #PWR0132
U 1 1 5D7FF6F9
P 9400 5850
F 0 "#PWR0132" H 9400 5600 50  0001 C CNN
F 1 "GND" H 9405 5677 50  0000 C CNN
F 2 "" H 9400 5850 50  0001 C CNN
F 3 "" H 9400 5850 50  0001 C CNN
	1    9400 5850
	0    1    -1   0   
$EndComp
$Comp
L power:GND #PWR0133
U 1 1 5D80E80D
P 9400 5950
F 0 "#PWR0133" H 9400 5700 50  0001 C CNN
F 1 "GND" H 9405 5777 50  0000 C CNN
F 2 "" H 9400 5950 50  0001 C CNN
F 3 "" H 9400 5950 50  0001 C CNN
	1    9400 5950
	0    1    -1   0   
$EndComp
$Comp
L power:GND #PWR0134
U 1 1 5D81D807
P 9400 6050
F 0 "#PWR0134" H 9400 5800 50  0001 C CNN
F 1 "GND" H 9405 5877 50  0000 C CNN
F 2 "" H 9400 6050 50  0001 C CNN
F 3 "" H 9400 6050 50  0001 C CNN
	1    9400 6050
	0    1    -1   0   
$EndComp
$Comp
L Device:R R10
U 1 1 5D866816
P 8750 6050
F 0 "R10" H 8820 6096 50  0000 L CNN
F 1 "10k" H 8820 6005 50  0000 L CNN
F 2 "Resistor_SMD:R_0603_1608Metric_Pad1.05x0.95mm_HandSolder" V 8680 6050 50  0001 C CNN
F 3 "~" H 8750 6050 50  0001 C CNN
	1    8750 6050
	1    0    0    -1  
$EndComp
$Comp
L Device:R R9
U 1 1 5D867258
P 8500 6050
F 0 "R9" H 8570 6096 50  0000 L CNN
F 1 "10k" H 8570 6005 50  0000 L CNN
F 2 "Resistor_SMD:R_0603_1608Metric_Pad1.05x0.95mm_HandSolder" V 8430 6050 50  0001 C CNN
F 3 "~" H 8500 6050 50  0001 C CNN
	1    8500 6050
	1    0    0    -1  
$EndComp
$Comp
L power:+3.3V #PWR0135
U 1 1 5D86813F
P 8500 5900
F 0 "#PWR0135" H 8500 5750 50  0001 C CNN
F 1 "+3.3V" H 8515 6073 50  0000 C CNN
F 2 "" H 8500 5900 50  0001 C CNN
F 3 "" H 8500 5900 50  0001 C CNN
	1    8500 5900
	1    0    0    -1  
$EndComp
$Comp
L power:+3.3V #PWR0136
U 1 1 5D868852
P 8750 5900
F 0 "#PWR0136" H 8750 5750 50  0001 C CNN
F 1 "+3.3V" H 8765 6073 50  0000 C CNN
F 2 "" H 8750 5900 50  0001 C CNN
F 3 "" H 8750 5900 50  0001 C CNN
	1    8750 5900
	1    0    0    -1  
$EndComp
Text GLabel 9000 6000 1    50   Input ~ 0
SCL
Text GLabel 9100 6000 1    50   Input ~ 0
SDA
Wire Wire Line
	8750 6250 8750 6200
Wire Wire Line
	9400 6350 9100 6350
Wire Wire Line
	8500 6350 8500 6200
Wire Wire Line
	9400 6250 9000 6250
Wire Wire Line
	9000 6000 9000 6250
Connection ~ 9000 6250
Wire Wire Line
	9000 6250 8750 6250
Wire Wire Line
	9100 6000 9100 6350
Connection ~ 9100 6350
Wire Wire Line
	9100 6350 8500 6350
Text GLabel 4650 4650 2    50   Input ~ 0
?V_switch
Text GLabel 5450 3300 0    50   Input ~ 0
3.3V_switch
Text GLabel 5500 2000 0    50   Input ~ 0
5V_switch
Wire Wire Line
	7700 6250 7900 6250
Wire Wire Line
	7500 6250 7700 6250
$Comp
L power:GND #PWR0137
U 1 1 5D96A823
P 2700 6300
F 0 "#PWR0137" H 2700 6050 50  0001 C CNN
F 1 "GND" H 2705 6127 50  0000 C CNN
F 2 "" H 2700 6300 50  0001 C CNN
F 3 "" H 2700 6300 50  0001 C CNN
	1    2700 6300
	1    0    0    -1  
$EndComp
Text GLabel 2300 4750 0    50   Input ~ 0
3.3V_check
Text GLabel 10100 3450 2    50   Input ~ 0
5V_current_monitor
Text GLabel 10100 3550 2    50   Input ~ 0
3.3V_current_monitor
Text GLabel 10100 3650 2    50   Input ~ 0
?V_current_monitor
Text GLabel 10100 3850 2    50   Input ~ 0
5V_check
Wire Wire Line
	9400 2250 9450 2250
Text GLabel 8900 3150 0    50   Input ~ 0
3.3V_switch
Text GLabel 8900 4650 0    50   Input ~ 0
?V_switch
Text GLabel 8900 3250 0    50   Input ~ 0
5V_switch
Text GLabel 10100 3750 2    50   Input ~ 0
3.3V_check
$Comp
L MCU_ST_STM32L4:STM32L433CCTx U9
U 1 1 5D376BDC
P 9500 3650
F 0 "U9" H 9500 2061 50  0000 C CNN
F 1 "STM32L433CCTx" H 9500 1970 50  0000 C CNN
F 2 "Package_QFP:LQFP-48_7x7mm_P0.5mm" H 9000 2250 50  0001 R CNN
F 3 "http://www.st.com/st-web-ui/static/active/en/resource/technical/document/datasheet/DM00257192.pdf" H 9500 3650 50  0001 C CNN
	1    9500 3650
	1    0    0    -1  
$EndComp
Text GLabel 10100 4450 2    50   Input ~ 0
SDA
Text GLabel 10100 4350 2    50   Input ~ 0
SCL
Text GLabel 10100 4750 2    50   Input ~ 0
SYS_JTMS-SWDIO
Text GLabel 10100 3950 2    50   Input ~ 0
panels_voltage
Text GLabel 10100 4050 2    50   Input ~ 0
panels_current_monitor
Text GLabel 8900 4350 0    50   Input ~ 0
GPIO_Output3
Text GLabel 8900 4250 0    50   Input ~ 0
GPIO_Output2
Text GLabel 8900 2650 0    50   Input ~ 0
Clock_in
Text GLabel 8900 2750 0    50   Input ~ 0
Clock_out
Text GLabel 7500 5900 0    50   Input ~ 0
Clock_in
Text GLabel 7900 5900 2    50   Input ~ 0
Clock_out
Wire Wire Line
	7500 5950 7500 5900
Wire Wire Line
	7900 5950 7900 5900
$Comp
L power:VCC #PWR0138
U 1 1 5D38EFAE
P 4300 3600
F 0 "#PWR0138" H 4300 3450 50  0001 C CNN
F 1 "VCC" H 4317 3773 50  0000 C CNN
F 2 "" H 4300 3600 50  0001 C CNN
F 3 "" H 4300 3600 50  0001 C CNN
	1    4300 3600
	1    0    0    -1  
$EndComp
Connection ~ 4300 3600
Wire Wire Line
	4300 3600 4900 3600
$Comp
L power:VCC #PWR0139
U 1 1 5D39757B
P 9450 2250
F 0 "#PWR0139" H 9450 2100 50  0001 C CNN
F 1 "VCC" H 9467 2423 50  0000 C CNN
F 2 "" H 9450 2250 50  0001 C CNN
F 3 "" H 9450 2250 50  0001 C CNN
	1    9450 2250
	1    0    0    -1  
$EndComp
Text GLabel 800  1750 1    50   Input ~ 0
panels_raw
Connection ~ 9450 2250
Wire Wire Line
	9450 2250 9500 2250
$Comp
L power:GND #PWR0140
U 1 1 5D3A8E7F
P 9450 5150
F 0 "#PWR0140" H 9450 4900 50  0001 C CNN
F 1 "GND" H 9455 4977 50  0000 C CNN
F 2 "" H 9450 5150 50  0001 C CNN
F 3 "" H 9450 5150 50  0001 C CNN
	1    9450 5150
	1    0    0    -1  
$EndComp
Wire Wire Line
	9400 5150 9450 5150
Connection ~ 9450 5150
Wire Wire Line
	9450 5150 9500 5150
$Comp
L LT3652EMSEPBF:LT3652EMSEPBF U10
U 1 1 5D3BA6D4
P 5800 950
F 0 "U10" H 7200 1315 50  0000 C CNN
F 1 "LT3652EMSEPBF" H 7200 1224 50  0000 C CNN
F 2 "SamacSys_Parts:SOP65P490X110-13N" H 5800 950 50  0001 L BNN
F 3 "" H 5800 950 50  0001 L BNN
F 4 "None" H 5800 950 50  0001 L BNN "Field4"
F 5 "Linear Technology/Analog" H 5800 950 50  0001 L BNN "Field5"
F 6 "MSOP-12 Linear Technology" H 5800 950 50  0001 L BNN "Field6"
F 7 "Unavailable" H 5800 950 50  0001 L BNN "Field7"
F 8 "LT3652 - Power Tracking 2A Battery Charger for Solar Power" H 5800 950 50  0001 L BNN "Field8"
	1    5800 950 
	1    0    0    -1  
$EndComp
Wire Wire Line
	5800 950  5800 1050
Wire Wire Line
	5800 1150 5800 1050
Connection ~ 5800 1050
$Comp
L power:GND #PWR0141
U 1 1 5D3D0BC1
P 5800 1450
F 0 "#PWR0141" H 5800 1200 50  0001 C CNN
F 1 "GND" H 5805 1277 50  0000 C CNN
F 2 "" H 5800 1450 50  0001 C CNN
F 3 "" H 5800 1450 50  0001 C CNN
	1    5800 1450
	1    0    0    -1  
$EndComp
Text GLabel 1650 2750 1    50   Input ~ 0
panels_current_monitor
$Comp
L Device:R R_Panels_Shunt4
U 1 1 5D3D14C7
P 1250 1750
F 0 "R_Panels_Shunt4" H 1320 1796 50  0000 L CNN
F 1 "0.05" H 1320 1705 50  0000 L CNN
F 2 "Resistor_SMD:R_0603_1608Metric_Pad1.05x0.95mm_HandSolder" V 1180 1750 50  0001 C CNN
F 3 "~" H 1250 1750 50  0001 C CNN
	1    1250 1750
	0    1    1    0   
$EndComp
$Comp
L power:GND #PWR0142
U 1 1 5D3DDD32
P 1250 3050
F 0 "#PWR0142" H 1250 2800 50  0001 C CNN
F 1 "GND" H 1255 2877 50  0000 C CNN
F 2 "" H 1250 3050 50  0001 C CNN
F 3 "" H 1250 3050 50  0001 C CNN
	1    1250 3050
	1    0    0    -1  
$EndComp
$Comp
L power:+3.3V #PWR0143
U 1 1 5D3DDD46
P 1250 2450
F 0 "#PWR0143" H 1250 2300 50  0001 C CNN
F 1 "+3.3V" H 1265 2623 50  0000 C CNN
F 2 "" H 1250 2450 50  0001 C CNN
F 3 "" H 1250 2450 50  0001 C CNN
	1    1250 2450
	1    0    0    -1  
$EndComp
$Comp
L Amplifier_Current:INA138 U7
U 1 1 5D3DDD39
P 1350 2750
F 0 "U7" H 1694 2796 50  0000 L CNN
F 1 "INA138" H 1694 2705 50  0000 L CNN
F 2 "Package_TO_SOT_SMD:SOT-23-5" H 1350 2750 50  0001 C CNN
F 3 "http://www.ti.com/lit/ds/symlink/ina138.pdf" H 1350 2755 50  0001 C CNN
	1    1350 2750
	1    0    0    -1  
$EndComp
Wire Wire Line
	1050 2650 1050 1750
Wire Wire Line
	800  1750 1050 1750
Connection ~ 1050 1750
Wire Wire Line
	1050 1750 1100 1750
Wire Wire Line
	1050 2850 950  2850
Wire Wire Line
	950  2850 950  2000
Wire Wire Line
	950  2000 1450 2000
Wire Wire Line
	1450 2000 1450 1750
Connection ~ 1450 1750
Wire Wire Line
	1450 1750 1400 1750
$Comp
L Device:CP C_CHRG0
U 1 1 5D415FC5
P 10450 1750
F 0 "C_CHRG0" H 10568 1796 50  0000 L CNN
F 1 "1uF" H 10568 1705 50  0000 L CNN
F 2 "Capacitor_SMD:C_1210_3225Metric" H 10488 1600 50  0001 C CNN
F 3 "~" H 10450 1750 50  0001 C CNN
	1    10450 1750
	1    0    0    -1  
$EndComp
$Comp
L Diode:B340 D2
U 1 1 5D41728D
P 10850 1700
F 0 "D2" V 10804 1779 50  0000 L CNN
F 1 "B340" V 10895 1779 50  0000 L CNN
F 2 "Diode_SMD:D_SMC" H 10850 1525 50  0001 C CNN
F 3 "http://www.jameco.com/Jameco/Products/ProdDS/1538777.pdf" H 10850 1700 50  0001 C CNN
	1    10850 1700
	0    1    1    0   
$EndComp
$Comp
L Diode:B140-E3 D1
U 1 1 5D417CEA
P 9500 900
F 0 "D1" V 9454 979 50  0000 L CNN
F 1 "B140-E3" V 9545 979 50  0000 L CNN
F 2 "Diode_SMD:D_SMA" H 9500 725 50  0001 C CNN
F 3 "http://www.vishay.com/docs/88946/b120.pdf" H 9500 900 50  0001 C CNN
	1    9500 900 
	0    1    1    0   
$EndComp
$Comp
L power:GND #PWR0144
U 1 1 5D4535B3
P 10850 1850
F 0 "#PWR0144" H 10850 1600 50  0001 C CNN
F 1 "GND" H 10855 1677 50  0000 C CNN
F 2 "" H 10850 1850 50  0001 C CNN
F 3 "" H 10850 1850 50  0001 C CNN
	1    10850 1850
	1    0    0    -1  
$EndComp
Text GLabel 8600 1150 2    50   Input ~ 0
BOOST
Text GLabel 8600 1050 2    50   Input ~ 0
SW
Text GLabel 8600 1250 2    50   Input ~ 0
SENSE
Text GLabel 8600 1350 2    50   Input ~ 0
BAT
$Comp
L Device:R R_CHRG0
U 1 1 5D48945A
P 9850 1500
F 0 "R_CHRG0" H 9920 1546 50  0000 L CNN
F 1 "859.1K" H 9920 1455 50  0000 L CNN
F 2 "Resistor_SMD:R_0603_1608Metric_Pad1.05x0.95mm_HandSolder" V 9780 1500 50  0001 C CNN
F 3 "~" H 9850 1500 50  0001 C CNN
	1    9850 1500
	1    0    0    -1  
$EndComp
$Comp
L Device:R R_CHRG1
U 1 1 5D4897D9
P 9850 1200
F 0 "R_CHRG1" H 9920 1246 50  0000 L CNN
F 1 "378k" H 9920 1155 50  0000 L CNN
F 2 "Resistor_SMD:R_0603_1608Metric_Pad1.05x0.95mm_HandSolder" V 9780 1200 50  0001 C CNN
F 3 "~" H 9850 1200 50  0001 C CNN
	1    9850 1200
	1    0    0    -1  
$EndComp
Text GLabel 8600 1450 2    50   Input ~ 0
NTC
Text GLabel 8600 1550 2    50   Input ~ 0
VFB
Text GLabel 9400 1050 0    50   Input ~ 0
BAT
Text GLabel 9850 1350 0    50   Input ~ 0
VFB
$Comp
L power:GND #PWR0145
U 1 1 5D48BF60
P 9850 1650
F 0 "#PWR0145" H 9850 1400 50  0001 C CNN
F 1 "GND" H 9855 1477 50  0000 C CNN
F 2 "" H 9850 1650 50  0001 C CNN
F 3 "" H 9850 1650 50  0001 C CNN
	1    9850 1650
	1    0    0    -1  
$EndComp
$Comp
L Device:CP C_CHRG1
U 1 1 5D497A16
P 10500 900
F 0 "C_CHRG1" H 10618 946 50  0000 L CNN
F 1 "10uF" H 10618 855 50  0000 L CNN
F 2 "Capacitor_SMD:C_1210_3225Metric" H 10538 750 50  0001 C CNN
F 3 "~" H 10500 900 50  0001 C CNN
	1    10500 900 
	-1   0    0    -1  
$EndComp
$Comp
L Device:CP C_CHRG2
U 1 1 5D498167
P 10800 900
F 0 "C_CHRG2" H 10918 946 50  0000 L CNN
F 1 "100uF" H 10918 855 50  0000 L CNN
F 2 "Capacitor_SMD:C_1210_3225Metric" H 10838 750 50  0001 C CNN
F 3 "~" H 10800 900 50  0001 C CNN
	1    10800 900 
	1    0    0    -1  
$EndComp
$Comp
L power:GND #PWR0146
U 1 1 5D4AC3EA
P 10650 1050
F 0 "#PWR0146" H 10650 800 50  0001 C CNN
F 1 "GND" H 10655 877 50  0000 C CNN
F 2 "" H 10650 1050 50  0001 C CNN
F 3 "" H 10650 1050 50  0001 C CNN
	1    10650 1050
	1    0    0    -1  
$EndComp
Connection ~ 10650 1050
Wire Wire Line
	10650 1050 10500 1050
Wire Wire Line
	10500 750  10800 750 
Wire Wire Line
	10650 1050 10800 1050
Text GLabel 10650 750  1    50   Input ~ 0
BAT
Wire Wire Line
	10450 1550 10450 1600
Text GLabel 10650 1550 1    50   Input ~ 0
SW
Wire Wire Line
	10450 1550 10850 1550
Text GLabel 10450 1900 3    50   Input ~ 0
BOOST
Wire Wire Line
	9400 1050 9500 1050
Connection ~ 9500 1050
Text GLabel 9500 750  2    50   Input ~ 0
BOOST
$Comp
L Device:R R_CHRG_shunt1
U 1 1 5D571826
P 9500 1200
F 0 "R_CHRG_shunt1" H 9570 1246 50  0000 L CNN
F 1 "0.05" H 9570 1155 50  0000 L CNN
F 2 "Resistor_SMD:R_0603_1608Metric_Pad1.05x0.95mm_HandSolder" V 9430 1200 50  0001 C CNN
F 3 "~" H 9500 1200 50  0001 C CNN
	1    9500 1200
	-1   0    0    1   
$EndComp
Text GLabel 9500 1350 0    50   Input ~ 0
SENSE
Wire Wire Line
	9500 1050 9850 1050
$Comp
L Device:L L_CHRG1
U 1 1 5D5A0415
P 9500 1500
F 0 "L_CHRG1" V 9690 1500 50  0000 C CNN
F 1 "6.8uH" V 9599 1500 50  0000 C CNN
F 2 "SamacSys_Parts:WE-PD_1030_105054" H 9500 1500 50  0001 C CNN
F 3 "~" H 9500 1500 50  0001 C CNN
	1    9500 1500
	1    0    0    -1  
$EndComp
Text GLabel 9500 1650 3    50   Input ~ 0
SW
Wire Wire Line
	6400 3300 6400 3600
Connection ~ 7000 3100
Wire Wire Line
	7000 3100 7800 3100
Wire Wire Line
	6000 2300 6000 3100
Wire Wire Line
	6000 3100 7000 3100
Text GLabel 1050 1750 1    50   Input ~ 0
panels_voltage
Text GLabel 5800 1050 0    50   Input ~ 0
panels_raw
$Comp
L Connector:Conn_01x02_Female J3
U 1 1 5D662003
P 11000 2400
F 0 "J3" H 11028 2376 50  0000 L CNN
F 1 "Batteries" H 11028 2285 50  0000 L CNN
F 2 "Connector_PinHeader_2.54mm:PinHeader_1x02_P2.54mm_Vertical" H 11000 2400 50  0001 C CNN
F 3 "~" H 11000 2400 50  0001 C CNN
	1    11000 2400
	1    0    0    -1  
$EndComp
$Comp
L power:GND #PWR0147
U 1 1 5D663C35
P 10800 2500
F 0 "#PWR0147" H 10800 2250 50  0001 C CNN
F 1 "GND" H 10805 2327 50  0000 C CNN
F 2 "" H 10800 2500 50  0001 C CNN
F 3 "" H 10800 2500 50  0001 C CNN
	1    10800 2500
	1    0    0    -1  
$EndComp
Text GLabel 10800 2400 0    50   Input ~ 0
BAT
$Comp
L ECS-80-20-4X:ECS-80-20-4X Y1
U 1 1 5D36AA47
P 7700 5900
F 0 "Y1" H 7700 6137 50  0000 C CNN
F 1 "ECS-80-20-4X" H 7700 6046 50  0000 C CNN
F 2 "XTAL_ECS-80-20-4X" H 7700 5900 50  0001 L BNN
F 3 "" H 7700 5900 50  0001 L BNN
F 4 "ECS-80-20-4X" H 7700 5900 50  0001 L BNN "Field4"
F 5 "None" H 7700 5900 50  0001 L BNN "Field5"
F 6 "HC-49USX Series 11.35 x 4.65 mm 8 MHz ±30 ppm 20 pF -10°C to +70°C Crystal" H 7700 5900 50  0001 L BNN "Field6"
F 7 "HC49/US ECS International" H 7700 5900 50  0001 L BNN "Field7"
F 8 "ECS Inc." H 7700 5900 50  0001 L BNN "Field8"
	1    7700 5900
	1    0    0    -1  
$EndComp
$Comp
L Transistor_FET:DMG2301L Q1
U 1 1 5D38ED66
P 2900 6200
F 0 "Q1" H 3106 6246 50  0000 L CNN
F 1 "DMG2301L" H 3106 6155 50  0000 L CNN
F 2 "Package_TO_SOT_SMD:SOT-23" H 3100 6125 50  0001 L CIN
F 3 "https://www.diodes.com/assets/Datasheets/DMG2301L.pdf" H 2900 6200 50  0001 L CNN
	1    2900 6200
	1    0    0    -1  
$EndComp
Text GLabel 8900 4150 0    50   Input ~ 0
GPIO_Output1
Text GLabel 8900 4050 0    50   Input Italic 0
GPIO_Output0
$Comp
L Device:R LED1_resistor1
U 1 1 5D414412
P 6750 4800
F 0 "LED1_resistor1" H 6820 4846 50  0000 L CNN
F 1 "220" H 6820 4755 50  0000 L CNN
F 2 "Resistor_SMD:R_0603_1608Metric_Pad1.05x0.95mm_HandSolder" V 6680 4800 50  0001 C CNN
F 3 "~" H 6750 4800 50  0001 C CNN
	1    6750 4800
	-1   0    0    1   
$EndComp
Wire Wire Line
	6500 3500 6500 4450
$Comp
L Device:R LED3_resistor1
U 1 1 5D41F324
P 7150 4800
F 0 "LED3_resistor1" H 7220 4846 50  0000 L CNN
F 1 "220" H 7220 4755 50  0000 L CNN
F 2 "Resistor_SMD:R_0603_1608Metric_Pad1.05x0.95mm_HandSolder" V 7080 4800 50  0001 C CNN
F 3 "~" H 7150 4800 50  0001 C CNN
	1    7150 4800
	-1   0    0    1   
$EndComp
$Comp
L Device:LED D5
U 1 1 5D451A1C
P 7150 5100
F 0 "D5" V 7189 4983 50  0000 R CNN
F 1 "LED3" V 7098 4983 50  0000 R CNN
F 2 "LED_SMD:LED_0805_2012Metric" H 7150 5100 50  0001 C CNN
F 3 "~" H 7150 5100 50  0001 C CNN
	1    7150 5100
	0    -1   -1   0   
$EndComp
$Comp
L Device:LED D4
U 1 1 5D4522C2
P 6950 5100
F 0 "D4" V 6989 4983 50  0000 R CNN
F 1 "LED2" V 6898 4983 50  0000 R CNN
F 2 "LED_SMD:LED_0805_2012Metric" H 6950 5100 50  0001 C CNN
F 3 "~" H 6950 5100 50  0001 C CNN
	1    6950 5100
	0    -1   -1   0   
$EndComp
$Comp
L Device:LED D3
U 1 1 5D452655
P 6750 5100
F 0 "D3" V 6789 4983 50  0000 R CNN
F 1 "LED1" V 6698 4983 50  0000 R CNN
F 2 "LED_SMD:LED_0805_2012Metric" H 6750 5100 50  0001 C CNN
F 3 "~" H 6750 5100 50  0001 C CNN
	1    6750 5100
	0    -1   -1   0   
$EndComp
$Comp
L power:GND #PWR0148
U 1 1 5D452A27
P 7150 5250
F 0 "#PWR0148" H 7150 5000 50  0001 C CNN
F 1 "GND" H 7155 5077 50  0000 C CNN
F 2 "" H 7150 5250 50  0001 C CNN
F 3 "" H 7150 5250 50  0001 C CNN
	1    7150 5250
	1    0    0    -1  
$EndComp
$Comp
L power:GND #PWR0149
U 1 1 5D452EE9
P 6950 5250
F 0 "#PWR0149" H 6950 5000 50  0001 C CNN
F 1 "GND" H 6955 5077 50  0000 C CNN
F 2 "" H 6950 5250 50  0001 C CNN
F 3 "" H 6950 5250 50  0001 C CNN
	1    6950 5250
	1    0    0    -1  
$EndComp
$Comp
L power:GND #PWR0150
U 1 1 5D4533BC
P 6750 5250
F 0 "#PWR0150" H 6750 5000 50  0001 C CNN
F 1 "GND" H 6755 5077 50  0000 C CNN
F 2 "" H 6750 5250 50  0001 C CNN
F 3 "" H 6750 5250 50  0001 C CNN
	1    6750 5250
	1    0    0    -1  
$EndComp
Text GLabel 6750 4650 1    50   Input Italic 0
GPIO_Output0
Text GLabel 6950 4650 1    50   Input ~ 0
GPIO_Output1
Text GLabel 7150 4650 1    50   Input ~ 0
GPIO_Output2
$Comp
L Device:R LED2_resistor1
U 1 1 5D41E307
P 6950 4800
F 0 "LED2_resistor1" H 7020 4846 50  0000 L CNN
F 1 "220" H 7020 4755 50  0000 L CNN
F 2 "Resistor_SMD:R_0603_1608Metric_Pad1.05x0.95mm_HandSolder" V 6880 4800 50  0001 C CNN
F 3 "~" H 6950 4800 50  0001 C CNN
	1    6950 4800
	-1   0    0    1   
$EndComp
$Comp
L power:GND #PWR0151
U 1 1 5D473486
P 9600 5150
F 0 "#PWR0151" H 9600 4900 50  0001 C CNN
F 1 "GND" H 9605 4977 50  0000 C CNN
F 2 "" H 9600 5150 50  0001 C CNN
F 3 "" H 9600 5150 50  0001 C CNN
	1    9600 5150
	1    0    0    -1  
$EndComp
Wire Wire Line
	5250 6700 5550 6700
Wire Wire Line
	5650 6400 5550 6400
$Comp
L TPS54339EDDA:TPS54339EDDA U11
U 1 1 5D47BF8A
P 6350 6850
F 0 "U11" H 6350 7820 50  0000 C CNN
F 1 "TPS54339EDDA" H 6350 7729 50  0000 C CNN
F 2 "SamacSys_Parts:SOIC127P600X170-9N" H 6350 6850 50  0001 L BNN
F 3 "" H 6350 6850 50  0001 L BNN
F 4 "Unavailable" H 6350 6850 50  0001 L BNN "Field4"
F 5 "Conv DC-DC 4.5V to 23V Step Down Single-Out 0.76V to 7V 10A 8-Pin HSOP EP Tube" H 6350 6850 50  0001 L BNN "Field5"
F 6 "Texas Instruments" H 6350 6850 50  0001 L BNN "Field6"
F 7 "SO-8 Texas Instruments" H 6350 6850 50  0001 L BNN "Field7"
F 8 "None" H 6350 6850 50  0001 L BNN "Field8"
	1    6350 6850
	1    0    0    -1  
$EndComp
$Comp
L Device:CP C27
U 1 1 5D47BF90
P 5500 6550
F 0 "C27" H 5618 6596 50  0000 L CNN
F 1 "1uF" H 5618 6505 50  0000 L CNN
F 2 "Capacitor_SMD:C_1210_3225Metric" H 5538 6400 50  0001 C CNN
F 3 "~" H 5500 6550 50  0001 C CNN
	1    5500 6550
	0    1    1    0   
$EndComp
$Comp
L Device:R R11
U 1 1 5D47BF96
P 5550 6250
F 0 "R11" H 5620 6296 50  0000 L CNN
F 1 "1k" H 5620 6205 50  0000 L CNN
F 2 "Resistor_SMD:R_0603_1608Metric_Pad1.05x0.95mm_HandSolder" V 5480 6250 50  0001 C CNN
F 3 "~" H 5550 6250 50  0001 C CNN
	1    5550 6250
	1    0    0    -1  
$EndComp
Wire Wire Line
	5650 6100 5650 6150
Wire Wire Line
	5650 6400 5650 6350
$Comp
L Device:CP C29
U 1 1 5D47BF9E
P 5650 7500
F 0 "C29" H 5768 7546 50  0000 L CNN
F 1 "1uF" H 5768 7455 50  0000 L CNN
F 2 "Capacitor_SMD:C_1210_3225Metric" H 5688 7350 50  0001 C CNN
F 3 "~" H 5650 7500 50  0001 C CNN
	1    5650 7500
	1    0    0    -1  
$EndComp
$Comp
L Device:CP C28
U 1 1 5D47BFA4
P 5550 6850
F 0 "C28" H 5668 6896 50  0000 L CNN
F 1 "1uF" H 5668 6805 50  0000 L CNN
F 2 "Capacitor_SMD:C_1210_3225Metric" H 5588 6700 50  0001 C CNN
F 3 "~" H 5550 6850 50  0001 C CNN
	1    5550 6850
	1    0    0    -1  
$EndComp
Connection ~ 5550 6700
Wire Wire Line
	5550 6700 5650 6700
Wire Wire Line
	5650 6700 5650 6750
Wire Wire Line
	5550 7000 5650 7000
Wire Wire Line
	5650 7000 5650 6950
$Comp
L power:GND #PWR0152
U 1 1 5D47BFAF
P 5650 7650
F 0 "#PWR0152" H 5650 7400 50  0001 C CNN
F 1 "GND" H 5655 7477 50  0000 C CNN
F 2 "" H 5650 7650 50  0001 C CNN
F 3 "" H 5650 7650 50  0001 C CNN
	1    5650 7650
	1    0    0    -1  
$EndComp
Wire Wire Line
	5550 6100 5650 6100
$Comp
L Device:L L3
U 1 1 5D491A35
P 5250 6550
F 0 "L3" V 5440 6550 50  0000 C CNN
F 1 "4.7uH" V 5349 6550 50  0000 C CNN
F 2 "SamacSys_Parts:WE-PD_1030_105054" H 5250 6550 50  0001 C CNN
F 3 "~" H 5250 6550 50  0001 C CNN
	1    5250 6550
	-1   0    0    1   
$EndComp
$Comp
L Device:CP C24
U 1 1 5D49CB84
P 5100 5550
F 0 "C24" H 5218 5596 50  0000 L CNN
F 1 "1uF" H 5218 5505 50  0000 L CNN
F 2 "Capacitor_SMD:C_1210_3225Metric" H 5138 5400 50  0001 C CNN
F 3 "~" H 5100 5550 50  0001 C CNN
	1    5100 5550
	1    0    0    -1  
$EndComp
Wire Wire Line
	5300 5400 5300 5300
$Comp
L power:GND #PWR0153
U 1 1 5D49CB8B
P 5300 5750
F 0 "#PWR0153" H 5300 5500 50  0001 C CNN
F 1 "GND" H 5305 5577 50  0000 C CNN
F 2 "" H 5300 5750 50  0001 C CNN
F 3 "" H 5300 5750 50  0001 C CNN
	1    5300 5750
	1    0    0    -1  
$EndComp
Wire Wire Line
	5100 5400 5300 5400
Connection ~ 5300 5400
Wire Wire Line
	5500 5400 5300 5400
Wire Wire Line
	5100 5700 5200 5700
Connection ~ 5300 5700
Wire Wire Line
	5500 5700 5300 5700
Wire Wire Line
	5300 5750 5300 5700
Wire Wire Line
	5200 5750 5200 5700
Connection ~ 5200 5700
Wire Wire Line
	5200 5700 5300 5700
$Comp
L Device:CP C25
U 1 1 5D49CB9B
P 5300 5550
F 0 "C25" H 5418 5596 50  0000 L CNN
F 1 "1uF" H 5418 5505 50  0000 L CNN
F 2 "Capacitor_SMD:C_1210_3225Metric" H 5338 5400 50  0001 C CNN
F 3 "~" H 5300 5550 50  0001 C CNN
	1    5300 5550
	1    0    0    -1  
$EndComp
$Comp
L Device:CP C26
U 1 1 5D49CBA1
P 5500 5550
F 0 "C26" H 5618 5596 50  0000 L CNN
F 1 "10uF" H 5618 5505 50  0000 L CNN
F 2 "Capacitor_SMD:C_1210_3225Metric" H 5538 5400 50  0001 C CNN
F 3 "~" H 5500 5550 50  0001 C CNN
	1    5500 5550
	1    0    0    -1  
$EndComp
$Comp
L Device:CP C30
U 1 1 5D49CBA7
P 5700 5550
F 0 "C30" H 5818 5596 50  0000 L CNN
F 1 "10uF" H 5818 5505 50  0000 L CNN
F 2 "Capacitor_SMD:C_1210_3225Metric" H 5738 5400 50  0001 C CNN
F 3 "~" H 5700 5550 50  0001 C CNN
	1    5700 5550
	1    0    0    -1  
$EndComp
Wire Wire Line
	5900 5400 5900 5300
$Comp
L power:GND #PWR0154
U 1 1 5D49CBAE
P 5900 5750
F 0 "#PWR0154" H 5900 5500 50  0001 C CNN
F 1 "GND" H 5905 5577 50  0000 C CNN
F 2 "" H 5900 5750 50  0001 C CNN
F 3 "" H 5900 5750 50  0001 C CNN
	1    5900 5750
	1    0    0    -1  
$EndComp
Wire Wire Line
	5700 5400 5900 5400
Connection ~ 5900 5400
Wire Wire Line
	6100 5400 5900 5400
Wire Wire Line
	5700 5700 5800 5700
Connection ~ 5900 5700
Wire Wire Line
	6100 5700 5900 5700
Wire Wire Line
	5900 5750 5900 5700
Wire Wire Line
	5800 5750 5800 5700
Connection ~ 5800 5700
Wire Wire Line
	5800 5700 5900 5700
$Comp
L Device:CP C31
U 1 1 5D49CBBE
P 5900 5550
F 0 "C31" H 6018 5596 50  0000 L CNN
F 1 "100uF" H 6018 5505 50  0000 L CNN
F 2 "Capacitor_SMD:C_1210_3225Metric" H 5938 5400 50  0001 C CNN
F 3 "~" H 5900 5550 50  0001 C CNN
	1    5900 5550
	1    0    0    -1  
$EndComp
$Comp
L Device:CP C32
U 1 1 5D49CBC4
P 6100 5550
F 0 "C32" H 6218 5596 50  0000 L CNN
F 1 "100uF" H 6218 5505 50  0000 L CNN
F 2 "Capacitor_SMD:C_1210_3225Metric" H 6138 5400 50  0001 C CNN
F 3 "~" H 6100 5550 50  0001 C CNN
	1    6100 5550
	1    0    0    -1  
$EndComp
Wire Wire Line
	5300 5300 5600 5300
Wire Wire Line
	5600 5250 5600 5300
Connection ~ 5600 5300
Wire Wire Line
	5600 5300 5900 5300
Wire Wire Line
	4450 4950 4050 4950
Wire Wire Line
	4050 4950 4050 6450
Wire Wire Line
	4850 4950 5800 4950
Wire Wire Line
	5800 4450 5800 4950
Text GLabel 1650 1750 1    50   Input ~ 0
NRG_IN
Text GLabel 2650 4050 1    50   Input ~ 0
NRG_IN
Wire Wire Line
	2600 4050 2700 4050
Text GLabel 3000 6000 1    50   Input ~ 0
NRG_IN
Wire Wire Line
	1450 1750 2600 1750
Text GLabel 5600 6100 1    50   Input ~ 0
NRG_IN
$Comp
L power:GND #PWR0155
U 1 1 5D500C07
P 7050 6150
F 0 "#PWR0155" H 7050 5900 50  0001 C CNN
F 1 "GND" H 7055 5977 50  0000 C CNN
F 2 "" H 7050 6150 50  0001 C CNN
F 3 "" H 7050 6150 50  0001 C CNN
	1    7050 6150
	1    0    0    -1  
$EndComp
Wire Wire Line
	5250 6400 5250 6000
Wire Wire Line
	5250 6000 4950 6000
Wire Wire Line
	4950 6000 4950 5250
Wire Wire Line
	4950 5250 5600 5250
$Comp
L power:VDDA #PWR0156
U 1 1 5D522365
P 5600 5250
F 0 "#PWR0156" H 5600 5100 50  0001 C CNN
F 1 "VDDA" H 5617 5423 50  0000 C CNN
F 2 "" H 5600 5250 50  0001 C CNN
F 3 "" H 5600 5250 50  0001 C CNN
	1    5600 5250
	1    0    0    -1  
$EndComp
Connection ~ 5600 5250
$Comp
L power:VDDA #PWR0157
U 1 1 5D522B7A
P 9600 2250
F 0 "#PWR0157" H 9600 2100 50  0001 C CNN
F 1 "VDDA" H 9617 2423 50  0000 C CNN
F 2 "" H 9600 2250 50  0001 C CNN
F 3 "" H 9600 2250 50  0001 C CNN
	1    9600 2250
	1    0    0    -1  
$EndComp
$Comp
L power:GND #PWR0158
U 1 1 5D523C30
P 5350 6550
F 0 "#PWR0158" H 5350 6300 50  0001 C CNN
F 1 "GND" H 5355 6377 50  0000 C CNN
F 2 "" H 5350 6550 50  0001 C CNN
F 3 "" H 5350 6550 50  0001 C CNN
	1    5350 6550
	-1   0    0    1   
$EndComp
$Comp
L power:GND #PWR0159
U 1 1 5D53ACB9
P 5650 7150
F 0 "#PWR0159" H 5650 6900 50  0001 C CNN
F 1 "GND" H 5655 6977 50  0000 C CNN
F 2 "" H 5650 7150 50  0001 C CNN
F 3 "" H 5650 7150 50  0001 C CNN
	1    5650 7150
	1    0    0    -1  
$EndComp
Text GLabel 8900 4450 0    50   Input ~ 0
GPIO_Output4
Text GLabel 8900 4550 0    50   Input ~ 0
GPIO_Output5
Text GLabel 8900 4750 0    50   Input ~ 0
GPIO_Output7
Text GLabel 8900 4850 0    50   Input ~ 0
GPIO_Output8
Text GLabel 8900 4950 0    50   Input ~ 0
GPIO_Output9
$Comp
L Device:R LED3_resistor2
U 1 1 5D5281A9
P 7400 4800
F 0 "LED3_resistor2" H 7470 4846 50  0000 L CNN
F 1 "220" H 7470 4755 50  0000 L CNN
F 2 "Resistor_SMD:R_0603_1608Metric_Pad1.05x0.95mm_HandSolder" V 7330 4800 50  0001 C CNN
F 3 "~" H 7400 4800 50  0001 C CNN
	1    7400 4800
	-1   0    0    1   
$EndComp
$Comp
L Device:LED D6
U 1 1 5D5281AF
P 7400 5100
F 0 "D6" V 7439 4983 50  0000 R CNN
F 1 "LED3" V 7348 4983 50  0000 R CNN
F 2 "LED_SMD:LED_0805_2012Metric" H 7400 5100 50  0001 C CNN
F 3 "~" H 7400 5100 50  0001 C CNN
	1    7400 5100
	0    -1   -1   0   
$EndComp
$Comp
L power:GND #PWR0160
U 1 1 5D5281B5
P 7400 5250
F 0 "#PWR0160" H 7400 5000 50  0001 C CNN
F 1 "GND" H 7405 5077 50  0000 C CNN
F 2 "" H 7400 5250 50  0001 C CNN
F 3 "" H 7400 5250 50  0001 C CNN
	1    7400 5250
	1    0    0    -1  
$EndComp
Text GLabel 7400 4650 1    50   Input ~ 0
GPIO_Output3
Text GLabel 7650 4650 1    50   Input ~ 0
GPIO_Output4
$Comp
L power:GND #PWR0161
U 1 1 5D53EA93
P 7650 5250
F 0 "#PWR0161" H 7650 5000 50  0001 C CNN
F 1 "GND" H 7655 5077 50  0000 C CNN
F 2 "" H 7650 5250 50  0001 C CNN
F 3 "" H 7650 5250 50  0001 C CNN
	1    7650 5250
	1    0    0    -1  
$EndComp
$Comp
L Device:LED D7
U 1 1 5D53EA8D
P 7650 5100
F 0 "D7" V 7689 4983 50  0000 R CNN
F 1 "LED3" V 7598 4983 50  0000 R CNN
F 2 "LED_SMD:LED_0805_2012Metric" H 7650 5100 50  0001 C CNN
F 3 "~" H 7650 5100 50  0001 C CNN
	1    7650 5100
	0    -1   -1   0   
$EndComp
$Comp
L Device:R LED3_resistor3
U 1 1 5D53EA87
P 7650 4800
F 0 "LED3_resistor3" H 7720 4846 50  0000 L CNN
F 1 "220" H 7720 4755 50  0000 L CNN
F 2 "Resistor_SMD:R_0603_1608Metric_Pad1.05x0.95mm_HandSolder" V 7580 4800 50  0001 C CNN
F 3 "~" H 7650 4800 50  0001 C CNN
	1    7650 4800
	-1   0    0    1   
$EndComp
$Comp
L Interface_CAN_LIN:SN65HVD233 U12
U 1 1 5D379F4C
P 7450 2400
F 0 "U12" H 7450 2881 50  0000 C CNN
F 1 "SN65HVD233" H 7100 2800 50  0000 C CNN
F 2 "Package_SO:SOIC-8_3.9x4.9mm_P1.27mm" H 7450 1900 50  0001 C CNN
F 3 "http://www.ti.com/lit/ds/symlink/sn65hvd234.pdf" H 7350 2800 50  0001 C CNN
	1    7450 2400
	1    0    0    -1  
$EndComp
$Comp
L power:+3.3V #PWR0162
U 1 1 5D37C50B
P 7450 2100
F 0 "#PWR0162" H 7450 1950 50  0001 C CNN
F 1 "+3.3V" H 7800 2200 50  0000 C CNN
F 2 "" H 7450 2100 50  0001 C CNN
F 3 "" H 7450 2100 50  0001 C CNN
	1    7450 2100
	1    0    0    -1  
$EndComp
$Comp
L power:GND #PWR0163
U 1 1 5D386DCB
P 7450 2800
F 0 "#PWR0163" H 7450 2550 50  0001 C CNN
F 1 "GND" H 7455 2627 50  0000 C CNN
F 2 "" H 7450 2800 50  0001 C CNN
F 3 "" H 7450 2800 50  0001 C CNN
	1    7450 2800
	1    0    0    -1  
$EndComp
Text GLabel 7850 2400 1    50   Input ~ 0
CANH
Text GLabel 7850 2500 3    50   Input ~ 0
CANL
Text GLabel 10850 3100 0    50   Input ~ 0
CANH
Text GLabel 10850 3000 0    50   Input ~ 0
CANL
Text GLabel 10850 2900 0    50   Input ~ 0
SYS_JTMS-SWDIO
Text GLabel 10100 4850 2    50   Input ~ 0
SYS_JTCK-SWCLK
Text GLabel 10850 2800 0    50   Input ~ 0
SYS_JTCK-SWCLK
$Comp
L power:GND #PWR0164
U 1 1 5D3A4550
P 7050 2600
F 0 "#PWR0164" H 7050 2350 50  0001 C CNN
F 1 "GND" H 7055 2427 50  0000 C CNN
F 2 "" H 7050 2600 50  0001 C CNN
F 3 "" H 7050 2600 50  0001 C CNN
	1    7050 2600
	0    1    1    0   
$EndComp
$Comp
L power:GND #PWR0165
U 1 1 5D3A4856
P 7050 2500
F 0 "#PWR0165" H 7050 2250 50  0001 C CNN
F 1 "GND" H 7055 2327 50  0000 C CNN
F 2 "" H 7050 2500 50  0001 C CNN
F 3 "" H 7050 2500 50  0001 C CNN
	1    7050 2500
	0    1    1    0   
$EndComp
Text GLabel 10100 4650 2    50   Input ~ 0
CAN_TX
Text GLabel 10100 4550 2    50   Input ~ 0
CAN_RX
Text GLabel 7050 2300 0    50   Input ~ 0
CAN_RX
Text GLabel 7050 2400 0    50   Input ~ 0
CAN_TX
$Comp
L Connector:Conn_01x04_Female J4
U 1 1 5D3BE5AB
P 11050 2900
F 0 "J4" H 11078 2876 50  0000 L CNN
F 1 "Conn_01x04_Female" H 11078 2785 50  0000 L CNN
F 2 "Connector_PinHeader_2.54mm:PinHeader_1x04_P2.54mm_Horizontal" H 11050 2900 50  0001 C CNN
F 3 "~" H 11050 2900 50  0001 C CNN
	1    11050 2900
	1    0    0    -1  
$EndComp
$Comp
L Connector:Conn_01x06_Female J5
U 1 1 5D38CD60
P 8000 3300
F 0 "J5" H 8028 3276 50  0000 L CNN
F 1 "Conn_01x06_Female" H 8028 3185 50  0000 L CNN
F 2 "Connector_PinHeader_2.54mm:PinHeader_1x06_P2.54mm_Vertical" H 8000 3300 50  0001 C CNN
F 3 "~" H 8000 3300 50  0001 C CNN
	1    8000 3300
	1    0    0    -1  
$EndComp
$Comp
L power:GND #PWR0166
U 1 1 5D3E5BBC
P 9300 5150
F 0 "#PWR0166" H 9300 4900 50  0001 C CNN
F 1 "GND" H 9305 4977 50  0000 C CNN
F 2 "" H 9300 5150 50  0001 C CNN
F 3 "" H 9300 5150 50  0001 C CNN
	1    9300 5150
	1    0    0    -1  
$EndComp
Text GLabel 8900 3050 0    50   Input ~ 0
GPIO_Output6
Text GLabel 10100 4150 2    50   Input ~ 0
bat_voltage
Text GLabel 10800 2400 1    50   Input ~ 0
bat_voltage
$Comp
L SamacSys_Parts:INA139NA_250 IC2
U 1 1 5D400053
P 4400 2750
F 0 "IC2" H 4450 2900 50  0000 C CNN
F 1 "INA139NA_250" H 4950 2700 50  0000 C CNN
F 2 "SOT95P280X145-5N" H 5350 2850 50  0001 L CNN
F 3 "http://www.ti.com/lit/ds/symlink/ina139.pdf" H 5350 2750 50  0001 L CNN
F 4 "36V, High-Side, High-Speed, Current Output Current Sense Amplifier" H 5350 2650 50  0001 L CNN "Description"
F 5 "1.45" H 5350 2550 50  0001 L CNN "Height"
F 6 "Texas Instruments" H 5350 2450 50  0001 L CNN "Manufacturer_Name"
F 7 "INA139NA/250" H 5350 2350 50  0001 L CNN "Manufacturer_Part_Number"
F 8 "595-INA139NA/250" H 5350 2250 50  0001 L CNN "Mouser Part Number"
F 9 "https://www.mouser.com/Search/Refine.aspx?Keyword=595-INA139NA%2F250" H 5350 2150 50  0001 L CNN "Mouser Price/Stock"
F 10 "4616558P" H 5350 2050 50  0001 L CNN "RS Part Number"
F 11 "http://uk.rs-online.com/web/p/products/4616558P" H 5350 1950 50  0001 L CNN "RS Price/Stock"
	1    4400 2750
	1    0    0    -1  
$EndComp
Wire Wire Line
	5500 2750 5500 2450
Wire Wire Line
	5500 2450 5100 2450
$Comp
L Device:R R13
U 1 1 5D41C774
P 4150 2750
F 0 "R13" H 4220 2796 50  0000 L CNN
F 1 "20k" H 4220 2705 50  0000 L CNN
F 2 "Resistor_SMD:R_0603_1608Metric_Pad1.05x0.95mm_HandSolder" V 4080 2750 50  0001 C CNN
F 3 "~" H 4150 2750 50  0001 C CNN
	1    4150 2750
	0    -1   -1   0   
$EndComp
$Comp
L power:GND #PWR0102
U 1 1 5D4295DA
P 4000 2750
F 0 "#PWR0102" H 4000 2500 50  0001 C CNN
F 1 "GND" H 4005 2577 50  0000 C CNN
F 2 "" H 4000 2750 50  0001 C CNN
F 3 "" H 4000 2750 50  0001 C CNN
	1    4000 2750
	1    0    0    -1  
$EndComp
$Comp
L power:GND #PWR0108
U 1 1 5D429891
P 4400 2850
F 0 "#PWR0108" H 4400 2600 50  0001 C CNN
F 1 "GND" H 4405 2677 50  0000 C CNN
F 2 "" H 4400 2850 50  0001 C CNN
F 3 "" H 4400 2850 50  0001 C CNN
	1    4400 2850
	0    1    1    0   
$EndComp
$Comp
L TPS54339EDDA:TPS54339EDDA U1
U 1 1 5D5CB8B6
P 3400 2500
F 0 "U1" H 3400 3470 50  0000 C CNN
F 1 "TPS54339EDDA" H 3400 3379 50  0000 C CNN
F 2 "SamacSys_Parts:SOIC127P600X170-9N" H 3400 2500 50  0001 L BNN
F 3 "" H 3400 2500 50  0001 L BNN
F 4 "Unavailable" H 3400 2500 50  0001 L BNN "Field4"
F 5 "Conv DC-DC 4.5V to 23V Step Down Single-Out 0.76V to 7V 10A 8-Pin HSOP EP Tube" H 3400 2500 50  0001 L BNN "Field5"
F 6 "Texas Instruments" H 3400 2500 50  0001 L BNN "Field6"
F 7 "SO-8 Texas Instruments" H 3400 2500 50  0001 L BNN "Field7"
F 8 "None" H 3400 2500 50  0001 L BNN "Field8"
	1    3400 2500
	1    0    0    -1  
$EndComp
Wire Wire Line
	4400 2950 4400 3150
Wire Wire Line
	4400 3150 4800 3150
Wire Wire Line
	4800 2300 4800 3150
Wire Wire Line
	4300 2750 4400 2750
Text GLabel 4600 4150 1    50   Input ~ 0
3.3V_current_monitor
$Comp
L power:+3.3V #PWR0117
U 1 1 5D45C6DF
P 5750 4250
F 0 "#PWR0117" H 5750 4100 50  0001 C CNN
F 1 "+3.3V" H 5765 4423 50  0000 C CNN
F 2 "" H 5750 4250 50  0001 C CNN
F 3 "" H 5750 4250 50  0001 C CNN
	1    5750 4250
	0    1    1    0   
$EndComp
$Comp
L SamacSys_Parts:INA139NA_250 IC3
U 1 1 5D45C6ED
P 4650 4150
F 0 "IC3" H 4700 4300 50  0000 C CNN
F 1 "INA139NA_250" H 5200 4100 50  0000 C CNN
F 2 "SOT95P280X145-5N" H 5600 4250 50  0001 L CNN
F 3 "http://www.ti.com/lit/ds/symlink/ina139.pdf" H 5600 4150 50  0001 L CNN
F 4 "36V, High-Side, High-Speed, Current Output Current Sense Amplifier" H 5600 4050 50  0001 L CNN "Description"
F 5 "1.45" H 5600 3950 50  0001 L CNN "Height"
F 6 "Texas Instruments" H 5600 3850 50  0001 L CNN "Manufacturer_Name"
F 7 "INA139NA/250" H 5600 3750 50  0001 L CNN "Manufacturer_Part_Number"
F 8 "595-INA139NA/250" H 5600 3650 50  0001 L CNN "Mouser Part Number"
F 9 "https://www.mouser.com/Search/Refine.aspx?Keyword=595-INA139NA%2F250" H 5600 3550 50  0001 L CNN "Mouser Price/Stock"
F 10 "4616558P" H 5600 3450 50  0001 L CNN "RS Part Number"
F 11 "http://uk.rs-online.com/web/p/products/4616558P" H 5600 3350 50  0001 L CNN "RS Price/Stock"
	1    4650 4150
	1    0    0    -1  
$EndComp
Wire Wire Line
	5750 4150 5750 3850
$Comp
L Device:R R14
U 1 1 5D45C6F5
P 4400 4150
F 0 "R14" H 4470 4196 50  0000 L CNN
F 1 "20k" H 4470 4105 50  0000 L CNN
F 2 "Resistor_SMD:R_0603_1608Metric_Pad1.05x0.95mm_HandSolder" V 4330 4150 50  0001 C CNN
F 3 "~" H 4400 4150 50  0001 C CNN
	1    4400 4150
	0    -1   -1   0   
$EndComp
$Comp
L power:GND #PWR0123
U 1 1 5D45C6FB
P 4650 4250
F 0 "#PWR0123" H 4650 4000 50  0001 C CNN
F 1 "GND" H 4655 4077 50  0000 C CNN
F 2 "" H 4650 4250 50  0001 C CNN
F 3 "" H 4650 4250 50  0001 C CNN
	1    4650 4250
	0    1    1    0   
$EndComp
Wire Wire Line
	4650 4350 4650 4550
Wire Wire Line
	4650 4550 4950 4550
Wire Wire Line
	4550 4150 4650 4150
$Comp
L power:GND #PWR0128
U 1 1 5D47C64B
P 4250 4150
F 0 "#PWR0128" H 4250 3900 50  0001 C CNN
F 1 "GND" H 4255 3977 50  0000 C CNN
F 2 "" H 4250 4150 50  0001 C CNN
F 3 "" H 4250 4150 50  0001 C CNN
	1    4250 4150
	1    0    0    -1  
$EndComp
Wire Wire Line
	4950 3700 4950 4550
Wire Wire Line
	5150 3850 5150 3700
Wire Wire Line
	5150 3850 5750 3850
Text GLabel 3500 7200 1    50   Input ~ 0
?V_current_monitor
$Comp
L power:+3.3V #PWR0167
U 1 1 5D4B28EE
P 4650 7300
F 0 "#PWR0167" H 4650 7150 50  0001 C CNN
F 1 "+3.3V" H 4665 7473 50  0000 C CNN
F 2 "" H 4650 7300 50  0001 C CNN
F 3 "" H 4650 7300 50  0001 C CNN
	1    4650 7300
	0    1    1    0   
$EndComp
$Comp
L SamacSys_Parts:INA139NA_250 IC1
U 1 1 5D4B28FC
P 3550 7200
F 0 "IC1" H 3600 7350 50  0000 C CNN
F 1 "INA139NA_250" H 4100 7150 50  0000 C CNN
F 2 "SOT95P280X145-5N" H 4500 7300 50  0001 L CNN
F 3 "http://www.ti.com/lit/ds/symlink/ina139.pdf" H 4500 7200 50  0001 L CNN
F 4 "36V, High-Side, High-Speed, Current Output Current Sense Amplifier" H 4500 7100 50  0001 L CNN "Description"
F 5 "1.45" H 4500 7000 50  0001 L CNN "Height"
F 6 "Texas Instruments" H 4500 6900 50  0001 L CNN "Manufacturer_Name"
F 7 "INA139NA/250" H 4500 6800 50  0001 L CNN "Manufacturer_Part_Number"
F 8 "595-INA139NA/250" H 4500 6700 50  0001 L CNN "Mouser Part Number"
F 9 "https://www.mouser.com/Search/Refine.aspx?Keyword=595-INA139NA%2F250" H 4500 6600 50  0001 L CNN "Mouser Price/Stock"
F 10 "4616558P" H 4500 6500 50  0001 L CNN "RS Part Number"
F 11 "http://uk.rs-online.com/web/p/products/4616558P" H 4500 6400 50  0001 L CNN "RS Price/Stock"
	1    3550 7200
	1    0    0    -1  
$EndComp
Wire Wire Line
	4650 7200 4650 6900
$Comp
L Device:R R12
U 1 1 5D4B2903
P 3300 7200
F 0 "R12" H 3370 7246 50  0000 L CNN
F 1 "20k" H 3370 7155 50  0000 L CNN
F 2 "Resistor_SMD:R_0603_1608Metric_Pad1.05x0.95mm_HandSolder" V 3230 7200 50  0001 C CNN
F 3 "~" H 3300 7200 50  0001 C CNN
	1    3300 7200
	0    -1   -1   0   
$EndComp
$Comp
L power:GND #PWR0168
U 1 1 5D4B2909
P 3550 7300
F 0 "#PWR0168" H 3550 7050 50  0001 C CNN
F 1 "GND" H 3555 7127 50  0000 C CNN
F 2 "" H 3550 7300 50  0001 C CNN
F 3 "" H 3550 7300 50  0001 C CNN
	1    3550 7300
	0    1    1    0   
$EndComp
Wire Wire Line
	3550 7400 3550 7600
Wire Wire Line
	3450 7200 3550 7200
$Comp
L power:GND #PWR0169
U 1 1 5D4B2911
P 3150 7200
F 0 "#PWR0169" H 3150 6950 50  0001 C CNN
F 1 "GND" H 3155 7027 50  0000 C CNN
F 2 "" H 3150 7200 50  0001 C CNN
F 3 "" H 3150 7200 50  0001 C CNN
	1    3150 7200
	1    0    0    -1  
$EndComp
Wire Wire Line
	3850 6750 3850 7600
Wire Wire Line
	4050 6900 4650 6900
Wire Wire Line
	3850 7600 3550 7600
Wire Wire Line
	3000 6450 3150 6450
Wire Wire Line
	3450 6450 4050 6450
Wire Wire Line
	3150 6450 3150 6750
Wire Wire Line
	3150 6750 3850 6750
Connection ~ 3150 6450
Wire Wire Line
	4050 6600 3450 6600
Wire Wire Line
	3450 6600 3450 6450
Wire Wire Line
	4050 6600 4050 6900
Connection ~ 3450 6450
$EndSCHEMATC
