  ABINIT 9.5.1
  
 DeprecationWarning: 

     The files file has been deprecated in Abinit9 and will be removed in Abinit10.
     Use the syntax `abinit t01.abi` where t01.abi is an input with pseudopotentials e.g.

            pseudos = "al.psp8, as.psp8"


  Give name for formatted input file: 
/home/fgoudreault/Workspace/abisuite/abisuite/unittests/test_workflows/test_files/abinit_Al/gs_smearing_convergence/tsmear0.01/ngkpt4_4_4/ngkpt4_4_4.in
  Give name for formatted output file:
/home/fgoudreault/Workspace/abisuite/abisuite/unittests/test_workflows/test_files/abinit_Al/gs_smearing_convergence/tsmear0.01/ngkpt4_4_4/ngkpt4_4_4.out
  Give root name for generic input files:
/home/fgoudreault/Workspace/abisuite/abisuite/unittests/test_workflows/test_files/abinit_Al/gs_smearing_convergence/tsmear0.01/ngkpt4_4_4/input_data/idat_ngkpt4_4_4
  Give root name for generic output files:
/home/fgoudreault/Workspace/abisuite/abisuite/unittests/test_workflows/test_files/abinit_Al/gs_smearing_convergence/tsmear0.01/ngkpt4_4_4/run/output_data/odat_ngkpt4_4_4
  Give root name for generic temporary files:
/home/fgoudreault/Workspace/abisuite/abisuite/unittests/test_workflows/test_files/abinit_Al/gs_smearing_convergence/tsmear0.01/ngkpt4_4_4/run/output_data/tmp_ngkpt4_4_4

.Version 9.5.1 of ABINIT 
.(MPI version, prepared for a x86_64_linux_gnu9.3 computer) 

.Copyright (C) 1998-2021 ABINIT group . 
 ABINIT comes with ABSOLUTELY NO WARRANTY.
 It is free software, and you are welcome to redistribute it
 under certain conditions (GNU General Public License,
 see ~abinit/COPYING or http://www.gnu.org/copyleft/gpl.txt).

 ABINIT is a project of the Universite Catholique de Louvain,
 Corning Inc. and other collaborators, see ~abinit/doc/developers/contributors.txt .
 Please read https://docs.abinit.org/theory/acknowledgments for suggested
 acknowledgments of the ABINIT effort.
 For more information, see https://www.abinit.org .

.Starting date : Tue 20 Apr 2021.
- ( at 10h30 )
  

 ++++++++++++++++++++++++++++++++++++++++++++++++++++++++++++++++++++++++++++++

 === Build Information === 
  Version       : 9.5.1
  Build target  : x86_64_linux_gnu9.3
  Build date    : 20210419

 === Compiler Suite === 
  C compiler       : gnu9.3
  C++ compiler     : gnu9.3
  Fortran compiler : gnu9.3
  CFLAGS           : -g -O2 -mtune=native -march=native
  CXXFLAGS         : -g -O2 -mtune=native -march=native
  FCFLAGS          : -g -ffree-line-length-none     -I/home/fgoudreault/Workspace/abinit ...
  FC_LDFLAGS       : 

 === Optimizations === 
  Debug level        : basic
  Optimization level : standard
  Architecture       : unknown_unknown

 === Multicore === 
  Parallel build : yes
  Parallel I/O   : yes
  openMP support : 
  GPU support    : 

 === Connectors / Fallbacks === 
  LINALG flavor  : netlib
  FFT flavor     : goedecker
  HDF5           : yes
  NetCDF         : yes
  NetCDF Fortran : yes
  LibXC          : yes
  Wannier90      : no

 === Experimental features === 
  Exports             : 
  GW double-precision : 

 ++++++++++++++++++++++++++++++++++++++++++++++++++++++++++++++++++++++++++++++


 ++++++++++++++++++++++++++++++++++++++++++++++++++++++++++++++++++++++++++++++
 Default optimizations:
   -O2 -mtune=native -march=native


 Optimizations for 43_ptgroups:
   -O0


 ++++++++++++++++++++++++++++++++++++++++++++++++++++++++++++++++++++++++++++++


 ++++++++++++++++++++++++++++++++++++++++++++++++++++++++++++++++++++++++++++++
 CPP options activated during the build:

                    CC_GNU                   CXX_GNU                    FC_GNU
 
 HAVE_FC_ALLOCATABLE_DT...             HAVE_FC_ASYNC         HAVE_FC_BACKTRACE
 
  HAVE_FC_COMMAND_ARGUMENT      HAVE_FC_COMMAND_LINE        HAVE_FC_CONTIGUOUS
 
           HAVE_FC_CPUTIME              HAVE_FC_EXIT             HAVE_FC_FLUSH
 
             HAVE_FC_GAMMA            HAVE_FC_GETENV   HAVE_FC_IEEE_ARITHMETIC
 
   HAVE_FC_IEEE_EXCEPTIONS          HAVE_FC_INT_QUAD             HAVE_FC_IOMSG
 
     HAVE_FC_ISO_C_BINDING  HAVE_FC_ISO_FORTRAN_2008        HAVE_FC_LONG_LINES
 
        HAVE_FC_MOVE_ALLOC  HAVE_FC_ON_THE_FLY_SHAPE           HAVE_FC_PRIVATE
 
         HAVE_FC_PROTECTED           HAVE_FC_SHIFTLR         HAVE_FC_STREAM_IO
 
            HAVE_FC_SYSTEM          HAVE_FORTRAN2003                 HAVE_HDF5
 
             HAVE_HDF5_MPI        HAVE_LIBPAW_ABINIT      HAVE_LIBTETRA_ABINIT
 
                HAVE_LIBXC         HAVE_LINALG_AXPBY        HAVE_LINALG_GEMM3M
 
                  HAVE_MPI                 HAVE_MPI2         HAVE_MPI2_INPLACE
 
       HAVE_MPI_IALLGATHER       HAVE_MPI_IALLREDUCE        HAVE_MPI_IALLTOALL
 
       HAVE_MPI_IALLTOALLV           HAVE_MPI_IBCAST         HAVE_MPI_IGATHERV
 
        HAVE_MPI_INTEGER16               HAVE_MPI_IO HAVE_MPI_TYPE_CREATE_S...
 
               HAVE_NETCDF       HAVE_NETCDF_DEFAULT       HAVE_NETCDF_FORTRAN
 
   HAVE_NETCDF_FORTRAN_MPI           HAVE_NETCDF_MPI             HAVE_OS_LINUX
 
         HAVE_TIMER_ABINIT                                                      
 ++++++++++++++++++++++++++++++++++++++++++++++++++++++++++++++++++++++++++++++

- input  file    -> /home/fgoudreault/Workspace/abisuite/abisuite/unittests/test_workflows/test_files/abinit_Al/gs_smearing_convergence/tsmear0.01/ngkpt4_4_4/ngkpt4_4_4.in
- output file    -> /home/fgoudreault/Workspace/abisuite/abisuite/unittests/test_workflows/test_files/abinit_Al/gs_smearing_convergence/tsmear0.01/ngkpt4_4_4/ngkpt4_4_4.out
- root for input  files -> /home/fgoudreault/Workspace/abisuite/abisuite/unittests/test_workflows/test_files/abinit_Al/gs_smearing_convergence/tsmear0.01/ngkpt4_4_4/input_data/idat_ngkpt4_4_4
- root for output files -> /home/fgoudreault/Workspace/abisuite/abisuite/unittests/test_workflows/test_files/abinit_Al/gs_smearing_convergence/tsmear0.01/ngkpt4_4_4/run/output_data/odat_ngkpt4_4_4

 Netcdf library supports MPI-IO
-instrng: 33 lines of input have been read from file /home/fgoudreault/Workspace/abisuite/abisuite/unittests/test_workflows/test_files/abinit_Al/gs_smearing_convergence/tsmear0.01/ngkpt4_4_4/ngkpt4_4_4.in


 Please give name of formatted atomic psp file (and finish with a newline character)
 For atom type 1, psp file is /home/fgoudreault/Workspace/abisuite/abisuite/unittests/test_workflows/test_files/pseudos/Al.psp8
  read the values zionpsp=  3.0 , pspcod=   8 , lmax=   2

 inpspheads: deduce mpsang = 3, n1xccc = 2501.

======================================================= 
 invars1m : enter jdtset= 0

 symlatt: the Bravais lattice is cF (face-centered cubic)
  xred   is defined in input file
 ingeo: takes atomic coordinates from input array xred

--- !COMMENT
src_file: m_ingeo.F90
src_line: 900
message: |
    The tolerance on symmetries =   1.000E-05 is bigger than 1.0e-8.
    In order to avoid spurious effects, the atomic coordinates have been
    symmetrized before storing them in the dataset internal variable.
    So, do not be surprised by the fact that your input variables (xcart, xred, ...)
    do not correspond exactly to the ones echoed by ABINIT, the latter being used to do the calculations.
    This is not a problem per se.
    Still, in order to avoid this symmetrization (e.g. for specific debugging/development), decrease tolsym to 1.0e-8 or lower,
    or (much preferred) use input primitive vectors that are accurate to better than 1.0e-8.
    This message will only be printed once, even if there are other datasets where tolsym is bigger than 1.0e-8.
...


 symlatt: the Bravais lattice is cF (face-centered cubic)

 symlatt: the Bravais lattice is cF (face-centered cubic)
 symspgr: spgroup= 225  Fm -3 m   (=Oh^5)
 symspgr: optical characteristics = isotropic
 invars2: take the default value of fband=  5.00000000E-01

--- !WARNING
src_file: m_mpinfo.F90
src_line: 2281
message: |
    nkpt*nsppol (10) is not a multiple of nproc_spkpt (4)
    The k-point parallelisation is inefficient. (Ignore this warning if this is not a GS run)
...

 For input ecut=  2.000000E+01 best grid ngfft=      24      24      24
       max ecut=  2.460566E+01

 ==== FFT mesh ====
  FFT mesh divisions ........................    24   24   24
  Augmented FFT divisions ...................    25   25   24
  FFT algorithm .............................   112
  FFT cache size ............................    16
 getmpw: optimal value of mpw= 489

 Symmetries : space group Fm -3 m (#225); Bravais cF (face-center cubic)

 getdim_nloc : deduce lmnmax  =  18, lnmax  =   6,
                      lmnmaxso=  18, lnmaxso=   6.
memory: analysis of memory needs
================================================================================
 Values of the parameters that define the memory need of the present run
     intxc =       0    ionmov =       0      iscf =       7    lmnmax =       6
     lnmax =       6     mgfft =      24  mpssoang =       3    mqgrid =    3001
     natom =       1  nloc_mem =       1    nspden =       1   nspinor =       1
    nsppol =       1      nsym =      48    n1xccc =    2501    ntypat =       1
    occopt =       4   xclevel =       1
-    mband =           3        mffmem =           1         mkmem =           3
       mpw =         489          nfft =       13824          nkpt =          10
================================================================================
P This job should need less than                       5.488 Mbytes of memory.
  Rough estimation (10% accuracy) of disk space for files :
_ WF disk file :      0.226 Mbytes ; DEN or POT disk file :      0.107 Mbytes.
================================================================================

 Biggest array : f_fftgr(disk), with      1.6895 MBytes.
 memana : allocated an array of      1.690 Mbytes, for testing purposes.
 memana: allocated       5.488Mbytes, for testing purposes. 
 The job will continue.
--------------------------------------------------------------------------------
------------- Echo of variables that govern the present computation ------------
--------------------------------------------------------------------------------
-
- outvars: echo of selected default values                                      
-   iomode0 =  3 , fftalg0 =112 , wfoptalg0 =  0
-
- outvars: echo of global parameters not present in the input file              
-  max_nthreads =    0
-
 -outvars: echo values of preprocessed input variables --------
 
 These variables are accessible in NetCDF format (/home/fgoudreault/Workspace/abisuite/abisuite/unittests/test_workflows/test_files/abinit_Al/gs_smearing_convergence/tsmear0.01/ngkpt4_4_4/run/output_data/odat_ngkpt4_4_4_OUT.nc)

            acell      7.6000000000E+00  7.6000000000E+00  7.6000000000E+00 Bohr
              amu      2.69815390E+01
             ecut      2.00000000E+01 Hartree
-          fftalg         112
              ixc       -1012
              kpt     -1.25000000E-01 -2.50000000E-01  0.00000000E+00
                      -1.25000000E-01  5.00000000E-01  0.00000000E+00
                      -2.50000000E-01 -3.75000000E-01  0.00000000E+00
                      -1.25000000E-01 -3.75000000E-01  1.25000000E-01
                      -1.25000000E-01  2.50000000E-01  0.00000000E+00
                      -2.50000000E-01  3.75000000E-01  0.00000000E+00
                      -3.75000000E-01  5.00000000E-01  0.00000000E+00
                      -2.50000000E-01  5.00000000E-01  1.25000000E-01
                      -1.25000000E-01  0.00000000E+00  0.00000000E+00
                      -3.75000000E-01  0.00000000E+00  0.00000000E+00
         kptrlatt        4   -4    4     -4    4    4     -4   -4    4
          kptrlen      3.04000000E+01
P           mkmem           3
            natom           1
            nband           3
            ngfft          24      24      24
             nkpt          10
            nstep          10
             nsym          48
           ntypat           1
              occ      2.000000  1.000000  0.000000
                       2.000000  1.000000  0.000000
                       2.000000  1.000000  0.000000
                       2.000000  1.000000  0.000000
                       2.000000  1.000000  0.000000
                       2.000000  1.000000  0.000000
                       2.000000  1.000000  0.000000
                       2.000000  1.000000  0.000000
                       2.000000  1.000000  0.000000
                       2.000000  1.000000  0.000000
           occopt           4
            rprim      0.0000000000E+00  5.0000000000E-01  5.0000000000E-01
                       5.0000000000E-01  0.0000000000E+00  5.0000000000E-01
                       5.0000000000E-01  5.0000000000E-01  0.0000000000E+00
           shiftk      5.00000000E-01  5.00000000E-01  5.00000000E-01
          spgroup         225
           symrel      1  0  0   0  1  0   0  0  1      -1  0  0   0 -1  0   0  0 -1
                       0 -1  1   0 -1  0   1 -1  0       0  1 -1   0  1  0  -1  1  0
                      -1  0  0  -1  0  1  -1  1  0       1  0  0   1  0 -1   1 -1  0
                       0  1 -1   1  0 -1   0  0 -1       0 -1  1  -1  0  1   0  0  1
                      -1  0  0  -1  1  0  -1  0  1       1  0  0   1 -1  0   1  0 -1
                       0 -1  1   1 -1  0   0 -1  0       0  1 -1  -1  1  0   0  1  0
                       1  0  0   0  0  1   0  1  0      -1  0  0   0  0 -1   0 -1  0
                       0  1 -1   0  0 -1   1  0 -1       0 -1  1   0  0  1  -1  0  1
                      -1  0  1  -1  1  0  -1  0  0       1  0 -1   1 -1  0   1  0  0
                       0 -1  0   1 -1  0   0 -1  1       0  1  0  -1  1  0   0  1 -1
                       1  0 -1   0  0 -1   0  1 -1      -1  0  1   0  0  1   0 -1  1
                       0  1  0   0  0  1   1  0  0       0 -1  0   0  0 -1  -1  0  0
                       1  0 -1   0  1 -1   0  0 -1      -1  0  1   0 -1  1   0  0  1
                       0 -1  0   0 -1  1   1 -1  0       0  1  0   0  1 -1  -1  1  0
                      -1  0  1  -1  0  0  -1  1  0       1  0 -1   1  0  0   1 -1  0
                       0  1  0   1  0  0   0  0  1       0 -1  0  -1  0  0   0  0 -1
                       0  0 -1   0  1 -1   1  0 -1       0  0  1   0 -1  1  -1  0  1
                       1 -1  0   0 -1  1   0 -1  0      -1  1  0   0  1 -1   0  1  0
                       0  0  1   1  0  0   0  1  0       0  0 -1  -1  0  0   0 -1  0
                      -1  1  0  -1  0  0  -1  0  1       1 -1  0   1  0  0   1  0 -1
                       0  0  1   0  1  0   1  0  0       0  0 -1   0 -1  0  -1  0  0
                       1 -1  0   0 -1  0   0 -1  1      -1  1  0   0  1  0   0  1 -1
                       0  0 -1   1  0 -1   0  1 -1       0  0  1  -1  0  1   0 -1  1
                      -1  1  0  -1  0  1  -1  0  0       1 -1  0   1  0 -1   1  0  0
           toldfe      1.00000000E-06 Hartree
            typat      1
              wtk        0.09375    0.09375    0.09375    0.18750    0.09375    0.09375
                         0.09375    0.18750    0.03125    0.03125
            znucl       13.00000

================================================================================

 chkinp: Checking input parameters for consistency.
 DATA TYPE INFORMATION: 
 REAL:      Data type name: REAL(DP) 
            Kind value:      8
            Precision:      15
            Smallest nonnegligible quantity relative to 1: 0.22204460E-015
            Smallest positive number:                      0.22250739E-307
            Largest representable number:                  0.17976931E+309
 INTEGER:   Data type name: INTEGER(default) 
            Kind value: 4
            Bit size:   32
            Largest representable number: 2147483647
 LOGICAL:   Data type name: LOGICAL 
            Kind value: 4
 CHARACTER: Data type name: CHARACTER             Kind value: 1

  ==== OpenMP parallelism is OFF ====
 
  ==== Using MPI-2 specifications ==== 
  MPI-IO support is ON
  xmpi_tag_ub ................   2147483647
  xmpi_bsize_ch ..............            1
  xmpi_bsize_int .............            4
  xmpi_bsize_sp ..............            4
  xmpi_bsize_dp ..............            8
  xmpi_bsize_spc .............            8
  xmpi_bsize_dpc .............           16
  xmpio_bsize_frm ............            4
  xmpi_address_kind ..........            8
  xmpi_offset_kind ...........            8
  MPI_WTICK ..................    1.0000000000000001E-009

================================================================================
== DATASET  1 ==================================================================
-   mpi_nproc: 4, omp_nthreads: -1 (-1 if OMP is not activated)


--- !COMMENT
src_file: m_xgScalapack.F90
src_line: 236
message: |
    xgScalapack in auto mode
...


 getdim_nloc : deduce lmnmax  =  18, lnmax  =   6,
                      lmnmaxso=  18, lnmaxso=   6.
 Slater exchange
 P. A. M. Dirac, Math. Proc. Cambridge Philos. Soc. 26, 376 (1930)
 F. Bloch, Z. Phys. 57, 545 (1929)
 Perdew & Wang
 J. P. Perdew and Y. Wang, Phys. Rev. B 45, 13244 (1992)

 Unit cell volume ucvol=  1.0974400E+02 bohr^3
 Angles (23,13,12)=  6.00000000E+01  6.00000000E+01  6.00000000E+01 degrees

 getcut: wavevector=  0.0000  0.0000  0.0000  ngfft=  24  24  24
         ecut(hartree)=     20.000   => boxcut(ratio)=   2.21836

 getcut : COMMENT -
  Note that boxcut > 2.2 ; recall that boxcut=Gcut(box)/Gcut(sphere) = 2
  is sufficient for exact treatment of convolution.
  Such a large boxcut is a waste : you could raise ecut
  e.g. ecut=   24.605662 Hartrees makes boxcut=2

- pspini: atom type   1  psp file is /home/fgoudreault/Workspace/abisuite/abisuite/unittests/test_workflows/test_files/pseudos/Al.psp8
- pspatm: opening atomic psp file    /home/fgoudreault/Workspace/abisuite/abisuite/unittests/test_workflows/test_files/pseudos/Al.psp8
- Al    ONCVPSP-3.3.0  r_core=   1.76802   1.76802   1.70587
- 13.00000   3.00000    171102                znucl, zion, pspdat
    8   -1012    2    4       600   0.00000   pspcod,pspxc,lmax,lloc,mmax,r2well
    5.99000000000000    5.00000000000000    0.00000000000000   rchrg,fchrg,qchrg
     nproj     2     2     2
     extension_switch     1
  valence charge integrates to:    2.9194977370493271     
  pspatm : epsatm=    0.57439192
         --- l  ekb(1:nproj) -->
             0    5.725870    0.726131
             1    6.190420    0.914022
             2   -4.229503   -0.925599
 pspatm: atomic psp has been read  and splines computed

   1.72317576E+00                                ecore*ucvol(ha*bohr**3)
 ==== Info on pseudopotentials ====
  Norm-conserving pseudopotentials
  Number of pseudopotentials ..    1
  Number of types of atoms   ..    1
  Scalar calculation (no spin-orbit term)
  Nonlocal part applied using Legendre polynomials
  Max number of non-local projectors over l and type   2
  Highest angular momentum +1 .......   3
  Max number of (l,n)   components ..   6
  Max number of (l,m,n) components ..   6

 Pseudo-Core Charge Info: 
   Number of radial points for pseudo-core charge .. 2501
   XC core-correction treatment (optnlxccc) ........    1
   Radius for pseudo-core charge for each type ..... 

  - Atom type    1 has pseudo-core radius ..  5.9900

 Info on the Q-grid used for form factors in spline form: 
   Number of q-points for radial functions ffspl ..   3001
   Number of q-points for vlspl ...................   3001
   vloc is computed in Reciprocal Space
   model core charge treated in real-space

  XC functional for type 1 is -1012
  Pseudo valence available: yes

 symatm: atom number 1 is reached starting at atom
   1  1  1  1  1  1  1  1  1  1  1  1  1  1  1  1  1  1  1  1  1  1  1  1
   1  1  1  1  1  1  1  1  1  1  1  1  1  1  1  1  1  1  1  1  1  1  1  1
 wfconv:     3 bands initialized randomly with npw=   477, for ikpt=     1
 wfconv:     3 bands initialized randomly with npw=   462, for ikpt=     2
 wfconv:     3 bands initialized randomly with npw=   463, for ikpt=     3
_setup2: Arith. and geom. avg. npw (full set) are     468.281     468.243
 initro: for itypat=  1, take pseudo charge density from pp file

================================================================================

 getcut: wavevector=  0.0000  0.0000  0.0000  ngfft=  24  24  24
         ecut(hartree)=     20.000   => boxcut(ratio)=   2.21836

 getcut : COMMENT -
  Note that boxcut > 2.2 ; recall that boxcut=Gcut(box)/Gcut(sphere) = 2
  is sufficient for exact treatment of convolution.
  Such a large boxcut is a waste : you could raise ecut
  e.g. ecut=   24.605662 Hartrees makes boxcut=2


 1/G**2 cut-off applied in the following step : cutoff-mode = CRYSTAL

 1/G**2 cut-off applied in the following step : cutoff-mode = CRYSTAL

 1/G**2 cut-off applied in the following step : cutoff-mode = CRYSTAL

 ITER STEP NUMBER     1
 Max number of non-self-consistent loops: 2
 newocc: new Fermi energy is       0.290784 , with nelect=      3.000000, Number of bisection calls: 48
 mkrho: echo density (plane-wave part only)
 Total charge density [el/Bohr^3]
      Maximum=    3.2595E-02  at reduced coord.    0.8333    0.8750    0.8750
      Minimum=    1.5213E-03  at reduced coord.    0.0000    0.0000    0.0000
   Integrated=    3.0000E+00
 Total charge density [el/Bohr^3]
      Maximum=    3.2595E-02  at reduced coord.    0.8333    0.8750    0.8750
      Minimum=    1.5213E-03  at reduced coord.    0.0000    0.0000    0.0000
   Integrated=    3.0000E+00

 1/G**2 cut-off applied in the following step : cutoff-mode = CRYSTAL
 ETOT  1  -2.3603804334130    -2.360E+00 2.959E-02 8.907E-01
 scprqt: <Vxc>= -3.6723564E-01 hartree

 Simple mixing update:
  residual square of the potential:   0.48847026085545364
{SCF_istep: 1 , Vnl|psi>: 90 , wall_time: '  0.13 [s] '} <<< TIME

 ITER STEP NUMBER     2
 Max number of non-self-consistent loops: 2
 newocc: new Fermi energy is       0.289436 , with nelect=      3.000000, Number of bisection calls: 46
 mkrho: echo density (plane-wave part only)
 Total charge density [el/Bohr^3]
      Maximum=    3.2650E-02  at reduced coord.    0.8333    0.8750    0.8750
      Minimum=    1.5083E-03  at reduced coord.    0.0000    0.0000    0.0000
   Integrated=    3.0000E+00
 Total charge density [el/Bohr^3]
      Maximum=    3.2650E-02  at reduced coord.    0.8333    0.8750    0.8750
      Minimum=    1.5083E-03  at reduced coord.    0.0000    0.0000    0.0000
   Integrated=    3.0000E+00
 ETOT  2  -2.3613449920559    -9.646E-04 1.270E-04 4.842E-02
 scprqt: <Vxc>= -3.6717363E-01 hartree

 Pulay update with  1 previous iterations:
 mixing of old trial potential: alpha(m:m-4)=   1.27     -0.267
{SCF_istep: 2 , Vnl|psi>: 90 , wall_time: '  0.16 [s] '} <<< TIME

 ITER STEP NUMBER     3
 newocc: new Fermi energy is       0.289542 , with nelect=      3.000000, Number of bisection calls: 48
 mkrho: echo density (plane-wave part only)
 Total charge density [el/Bohr^3]
      Maximum=    3.2704E-02  at reduced coord.    0.8333    0.8750    0.8750
      Minimum=    1.5244E-03  at reduced coord.    0.0000    0.0000    0.0000
   Integrated=    3.0000E+00
 Total charge density [el/Bohr^3]
      Maximum=    3.2704E-02  at reduced coord.    0.8333    0.8750    0.8750
      Minimum=    1.5244E-03  at reduced coord.    0.0000    0.0000    0.0000
   Integrated=    3.0000E+00
 ETOT  3  -2.3613502766460    -5.285E-06 1.771E-05 1.141E-04
 scprqt: <Vxc>= -3.6713834E-01 hartree

 Pulay update with  2 previous iterations:
 mixing of old trial potential: alpha(m:m-4)=   1.16     -0.213      0.486E-01
{SCF_istep: 3 , Vnl|psi>: 45 , wall_time: '  0.14 [s] '} <<< TIME

 ITER STEP NUMBER     4
 newocc: new Fermi energy is       0.289563 , with nelect=      3.000000, Number of bisection calls: 48
 mkrho: echo density (plane-wave part only)
 Total charge density [el/Bohr^3]
      Maximum=    3.2707E-02  at reduced coord.    0.8333    0.8750    0.8750
      Minimum=    1.5240E-03  at reduced coord.    0.0000    0.0000    0.0000
   Integrated=    3.0000E+00
 Total charge density [el/Bohr^3]
      Maximum=    3.2707E-02  at reduced coord.    0.8333    0.8750    0.8750
      Minimum=    1.5240E-03  at reduced coord.    0.0000    0.0000    0.0000
   Integrated=    3.0000E+00
 ETOT  4  -2.3613502900094    -1.336E-08 1.381E-06 1.149E-06
 scprqt: <Vxc>= -3.6713694E-01 hartree

 Pulay update with  3 previous iterations:
 mixing of old trial potential: alpha(m:m-4)=   1.13     -0.145      0.225E-01 -0.614E-02
{SCF_istep: 4 , Vnl|psi>: 41 , wall_time: '  0.07 [s] '} <<< TIME

 ITER STEP NUMBER     5
 newocc: new Fermi energy is       0.289564 , with nelect=      3.000000, Number of bisection calls: 48
 mkrho: echo density (plane-wave part only)
 Total charge density [el/Bohr^3]
      Maximum=    3.2708E-02  at reduced coord.    0.8333    0.8750    0.8750
      Minimum=    1.5240E-03  at reduced coord.    0.0000    0.0000    0.0000
   Integrated=    3.0000E+00
 Total charge density [el/Bohr^3]
      Maximum=    3.2708E-02  at reduced coord.    0.8333    0.8750    0.8750
      Minimum=    1.5240E-03  at reduced coord.    0.0000    0.0000    0.0000
   Integrated=    3.0000E+00
 ETOT  5  -2.3613502901614    -1.521E-10 1.519E-07 1.400E-08
 scprqt: <Vxc>= -3.6713674E-01 hartree

 At SCF step    5, etot is converged : 
  for the second time, diff in etot=  1.521E-10 < toldfe=  1.000E-06
 
 -------------------------------------------------------------------------------------------------
 Ekinetic   = :     8.696984E-01 Ha ,    2.366570E+01 eV
 Evext_l    = :     1.567840E-01 Ha ,    4.266311E+00 eV
 Evext_nl   = :     4.239774E-01 Ha ,    1.153701E+01 eV
 Epsp_core  = :     1.570178E-02 Ha ,    4.272671E-01 eV
 Ehartree   = :     3.847693E-03 Ha ,    1.047011E-01 eV
 Exc_ks     = :    -1.116076E+00 Ha ,   -3.036999E+01 eV
 Enn        = :    -2.714721E+00 Ha ,   -7.387131E+01 eV
 -------------------------------------------------------------------------------------------------
 Etot       = :    -2.360788E+00 Ha ,   -6.424031E+01 eV
 -------------------------------------------------------------------------------------------------

 Cartesian components of stress tensor (hartree/bohr^3)
  sigma(1 1)=  7.65295491E-05  sigma(3 2)=  0.00000000E+00
  sigma(2 2)=  7.65295491E-05  sigma(3 1)=  0.00000000E+00
  sigma(3 3)=  7.65295491E-05  sigma(2 1)=  0.00000000E+00


 fftdatar_write: About to write data to: /home/fgoudreault/Workspace/abisuite/abisuite/unittests/test_workflows/test_files/abinit_Al/gs_smearing_convergence/tsmear0.01/ngkpt4_4_4/run/output_data/odat_ngkpt4_4_4_DEN with iomode: IO_MODE_ETSF
- Creating HDf5 file with MPI-IO support: /home/fgoudreault/Workspace/abisuite/abisuite/unittests/test_workflows/test_files/abinit_Al/gs_smearing_convergence/tsmear0.01/ngkpt4_4_4/run/output_data/odat_ngkpt4_4_4_DEN.nc
- Opening HDf5 file with MPI-IO support: /home/fgoudreault/Workspace/abisuite/abisuite/unittests/test_workflows/test_files/abinit_Al/gs_smearing_convergence/tsmear0.01/ngkpt4_4_4/run/output_data/odat_ngkpt4_4_4_DEN.nc
 IO operation completed. cpu:  0.10 [s] , wall:  0.13 [s] <<< TIME
- Creating HDf5 file with MPI-IO support: /home/fgoudreault/Workspace/abisuite/abisuite/unittests/test_workflows/test_files/abinit_Al/gs_smearing_convergence/tsmear0.01/ngkpt4_4_4/run/output_data/odat_ngkpt4_4_4_GSR.nc
 Integrated electronic density in atomic spheres:
 ------------------------------------------------
 Atom  Sphere_radius  Integrated_density
    1        2.00000          0.90241644
================================================================================

 ----iterations are completed or convergence reached----

 Mean square residual over all n,k,spin=   98.157E-10; max=  15.188E-08
  -0.1250 -0.2500  0.0000    1  1.51878E-07 kpt; spin; max resid(k); each band:
   1.23E-12  2.50E-12  1.52E-07
  -0.1250  0.5000  0.0000    1  1.28161E-07 kpt; spin; max resid(k); each band:
   2.94E-12  4.34E-12  1.28E-07
  -0.2500 -0.3750  0.0000    1  5.03453E-09 kpt; spin; max resid(k); each band:
   2.18E-12  3.58E-12  5.03E-09
  -0.1250 -0.3750  0.1250    1  8.76368E-10 kpt; spin; max resid(k); each band:
   4.76E-12  2.79E-12  8.76E-10
  -0.1250  0.2500  0.0000    1  6.14879E-12 kpt; spin; max resid(k); each band:
   4.00E-12  2.05E-12  6.15E-12
  -0.2500  0.3750  0.0000    1  5.60961E-12 kpt; spin; max resid(k); each band:
   5.23E-12  2.24E-12  5.61E-12
  -0.3750  0.5000  0.0000    1  3.94223E-12 kpt; spin; max resid(k); each band:
   1.87E-12  3.94E-12  3.02E-12
  -0.2500  0.5000  0.1250    1  2.00122E-10 kpt; spin; max resid(k); each band:
   2.73E-12  4.24E-12  2.00E-10
  -0.1250  0.0000  0.0000    1  1.15676E-10 kpt; spin; max resid(k); each band:
   8.60E-13  1.56E-11  1.16E-10
  -0.3750  0.0000  0.0000    1  8.11730E-09 kpt; spin; max resid(k); each band:
   2.28E-12  2.28E-12  8.12E-09
in cg_ncwrite with path: /home/fgoudreault/Workspace/abisuite/abisuite/unittests/test_workflows/test_files/abinit_Al/gs_smearing_convergence/tsmear0.01/ngkpt4_4_4/run/output_data/odat_ngkpt4_4_4_WFK.nc
same layout Writing WFK file: /home/fgoudreault/Workspace/abisuite/abisuite/unittests/test_workflows/test_files/abinit_Al/gs_smearing_convergence/tsmear0.01/ngkpt4_4_4/run/output_data/odat_ngkpt4_4_4_WFK.nc, with iomode: IO_MODE_ETSF, single writer: F
Using collective IO for the CGs
 collective ncwrite completed. cpu:  0.06 [s] , wall:  0.07 [s] <<< TIME
 prteigrs : about to open file /home/fgoudreault/Workspace/abisuite/abisuite/unittests/test_workflows/test_files/abinit_Al/gs_smearing_convergence/tsmear0.01/ngkpt4_4_4/run/output_data/odat_ngkpt4_4_4_EIG
 Fermi (or HOMO) energy (hartree) =   0.28956   Average Vxc (hartree)=  -0.36714
 Eigenvalues (hartree) for nkpt=  10  k points:
 kpt#   1, nband=  3, wtk=  0.09375, kpt= -0.1250 -0.2500  0.0000 (reduced coord)
  -0.07068    0.47943    0.60902
      occupation numbers for kpt#   1
   2.00000    0.00000    0.00000
 kpt#   2, nband=  3, wtk=  0.09375, kpt= -0.1250  0.5000  0.0000 (reduced coord)
   0.09256    0.17287    0.56361
      occupation numbers for kpt#   2
   2.00000    2.00000    0.00000
 kpt#   3, nband=  3, wtk=  0.09375, kpt= -0.2500 -0.3750  0.0000 (reduced coord)
   0.01158    0.40284    0.48976
      occupation numbers for kpt#   3
   2.00000    0.00000    0.00000
 kpt#   4, nband=  3, wtk=  0.18750, kpt= -0.1250 -0.3750  0.1250 (reduced coord)
   0.05224    0.28878    0.45258
      occupation numbers for kpt#   4
   2.00000    0.97704    0.00000
 kpt#   5, nband=  3, wtk=  0.09375, kpt= -0.1250  0.2500  0.0000 (reduced coord)
  -0.02936    0.36633    0.52734
      occupation numbers for kpt#   5
   2.00000    0.00000    0.00000
 kpt#   6, nband=  3, wtk=  0.09375, kpt= -0.2500  0.3750  0.0000 (reduced coord)
   0.13248    0.21071    0.37705
      occupation numbers for kpt#   6
   2.00000    2.00000    0.00000
 kpt#   7, nband=  3, wtk=  0.09375, kpt= -0.3750  0.5000  0.0000 (reduced coord)
   0.13122    0.29747    0.36536
      occupation numbers for kpt#   7
   2.00000    0.04592    0.00000
 kpt#   8, nband=  3, wtk=  0.18750, kpt= -0.2500  0.5000  0.1250 (reduced coord)
   0.17069    0.24949    0.33746
      occupation numbers for kpt#   8
   2.00000    2.00000    0.00000
 kpt#   9, nband=  3, wtk=  0.03125, kpt= -0.1250  0.0000  0.0000 (reduced coord)
  -0.11232    0.59038    0.71309
      occupation numbers for kpt#   9
   2.00000    0.00000    0.00000
 kpt#  10, nband=  3, wtk=  0.03125, kpt= -0.3750  0.0000  0.0000 (reduced coord)
   0.01163    0.25170    0.68127
      occupation numbers for kpt#  10
   2.00000    2.00000    0.00000
 Total charge density [el/Bohr^3]
      Maximum=    3.2708E-02  at reduced coord.    0.8333    0.8750    0.8750
 Next maximum=    3.2708E-02  at reduced coord.    0.4167    0.8750    0.8750
      Minimum=    1.5240E-03  at reduced coord.    0.0000    0.0000    0.0000
 Next minimum=    2.8516E-03  at reduced coord.    0.0417    0.0000    0.0000
   Integrated=    3.0000E+00

 Cartesian components of stress tensor (hartree/bohr^3)
  sigma(1 1)=  7.65295491E-05  sigma(3 2)=  0.00000000E+00
  sigma(2 2)=  7.65295491E-05  sigma(3 1)=  0.00000000E+00
  sigma(3 3)=  7.65295491E-05  sigma(2 1)=  0.00000000E+00

-Cartesian components of stress tensor (GPa)         [Pressure= -2.2516E+00 GPa]
- sigma(1 1)=  2.25157669E+00  sigma(3 2)=  0.00000000E+00
- sigma(2 2)=  2.25157669E+00  sigma(3 1)=  0.00000000E+00
- sigma(3 3)=  2.25157669E+00  sigma(2 1)=  0.00000000E+00

== END DATASET(S) ==============================================================
================================================================================
  
 -outvars: echo values of variables after computation  --------
 
 These variables are accessible in NetCDF format (/home/fgoudreault/Workspace/abisuite/abisuite/unittests/test_workflows/test_files/abinit_Al/gs_smearing_convergence/tsmear0.01/ngkpt4_4_4/run/output_data/odat_ngkpt4_4_4_OUT.nc)

            acell      7.6000000000E+00  7.6000000000E+00  7.6000000000E+00 Bohr
              amu      2.69815390E+01
             ecut      2.00000000E+01 Hartree
           etotal     -2.3613502902E+00
            fcart     -0.0000000000E+00 -0.0000000000E+00 -0.0000000000E+00
-          fftalg         112
              ixc       -1012
              kpt     -1.25000000E-01 -2.50000000E-01  0.00000000E+00
                      -1.25000000E-01  5.00000000E-01  0.00000000E+00
                      -2.50000000E-01 -3.75000000E-01  0.00000000E+00
                      -1.25000000E-01 -3.75000000E-01  1.25000000E-01
                      -1.25000000E-01  2.50000000E-01  0.00000000E+00
                      -2.50000000E-01  3.75000000E-01  0.00000000E+00
                      -3.75000000E-01  5.00000000E-01  0.00000000E+00
                      -2.50000000E-01  5.00000000E-01  1.25000000E-01
                      -1.25000000E-01  0.00000000E+00  0.00000000E+00
                      -3.75000000E-01  0.00000000E+00  0.00000000E+00
         kptrlatt        4   -4    4     -4    4    4     -4   -4    4
          kptrlen      3.04000000E+01
P           mkmem           3
            natom           1
            nband           3
            ngfft          24      24      24
             nkpt          10
            nstep          10
             nsym          48
           ntypat           1
              occ      2.000000  0.000000  0.000000
                       2.000000  2.000000  0.000000
                       2.000000  0.000000  0.000000
                       2.000000  0.977037  0.000000
                       2.000000  0.000000  0.000000
                       2.000000  2.000000  0.000000
                       2.000000  0.045922  0.000000
                       2.000000  2.000001  0.000000
                       2.000000  0.000000  0.000000
                       2.000000  2.000004  0.000000
           occopt           4
            rprim      0.0000000000E+00  5.0000000000E-01  5.0000000000E-01
                       5.0000000000E-01  0.0000000000E+00  5.0000000000E-01
                       5.0000000000E-01  5.0000000000E-01  0.0000000000E+00
           shiftk      5.00000000E-01  5.00000000E-01  5.00000000E-01
          spgroup         225
           strten      7.6529549096E-05  7.6529549096E-05  7.6529549096E-05
                       0.0000000000E+00  0.0000000000E+00  0.0000000000E+00
           symrel      1  0  0   0  1  0   0  0  1      -1  0  0   0 -1  0   0  0 -1
                       0 -1  1   0 -1  0   1 -1  0       0  1 -1   0  1  0  -1  1  0
                      -1  0  0  -1  0  1  -1  1  0       1  0  0   1  0 -1   1 -1  0
                       0  1 -1   1  0 -1   0  0 -1       0 -1  1  -1  0  1   0  0  1
                      -1  0  0  -1  1  0  -1  0  1       1  0  0   1 -1  0   1  0 -1
                       0 -1  1   1 -1  0   0 -1  0       0  1 -1  -1  1  0   0  1  0
                       1  0  0   0  0  1   0  1  0      -1  0  0   0  0 -1   0 -1  0
                       0  1 -1   0  0 -1   1  0 -1       0 -1  1   0  0  1  -1  0  1
                      -1  0  1  -1  1  0  -1  0  0       1  0 -1   1 -1  0   1  0  0
                       0 -1  0   1 -1  0   0 -1  1       0  1  0  -1  1  0   0  1 -1
                       1  0 -1   0  0 -1   0  1 -1      -1  0  1   0  0  1   0 -1  1
                       0  1  0   0  0  1   1  0  0       0 -1  0   0  0 -1  -1  0  0
                       1  0 -1   0  1 -1   0  0 -1      -1  0  1   0 -1  1   0  0  1
                       0 -1  0   0 -1  1   1 -1  0       0  1  0   0  1 -1  -1  1  0
                      -1  0  1  -1  0  0  -1  1  0       1  0 -1   1  0  0   1 -1  0
                       0  1  0   1  0  0   0  0  1       0 -1  0  -1  0  0   0  0 -1
                       0  0 -1   0  1 -1   1  0 -1       0  0  1   0 -1  1  -1  0  1
                       1 -1  0   0 -1  1   0 -1  0      -1  1  0   0  1 -1   0  1  0
                       0  0  1   1  0  0   0  1  0       0  0 -1  -1  0  0   0 -1  0
                      -1  1  0  -1  0  0  -1  0  1       1 -1  0   1  0  0   1  0 -1
                       0  0  1   0  1  0   1  0  0       0  0 -1   0 -1  0  -1  0  0
                       1 -1  0   0 -1  0   0 -1  1      -1  1  0   0  1  0   0  1 -1
                       0  0 -1   1  0 -1   0  1 -1       0  0  1  -1  0  1   0 -1  1
                      -1  1  0  -1  0  1  -1  0  0       1 -1  0   1  0 -1   1  0  0
           toldfe      1.00000000E-06 Hartree
            typat      1
              wtk        0.09375    0.09375    0.09375    0.18750    0.09375    0.09375
                         0.09375    0.18750    0.03125    0.03125
            znucl       13.00000

================================================================================
  

================================================================================

 Suggested references for the acknowledgment of ABINIT usage.

 The users of ABINIT have little formal obligations with respect to the ABINIT group
 (those specified in the GNU General Public License, http://www.gnu.org/copyleft/gpl.txt).
 However, it is common practice in the scientific literature,
 to acknowledge the efforts of people that have made the research possible.
 In this spirit, please find below suggested citations of work written by ABINIT developers,
 corresponding to implementations inside of ABINIT that you have used in the present run.
 Note also that it will be of great value to readers of publications presenting these results,
 to read papers enabling them to understand the theoretical formalism and details
 of the ABINIT implementation.
 For information on why they are suggested, see also https://docs.abinit.org/theory/acknowledgments.
-
- [1] Specification of an extensible and portable file format for electronic structure and crystallographic data
- X. Gonze, C.-O. Almbladh, A. Cucca, D. Caliste, C. Freysoldt, M. Marques, V. Olevano, Y. Pouillon, M.J. Verstraete,
- Comput. Material Science 43, 1056 (2008).
- Comment: to be cited in case the ETSF_IO file format is used, i.e. iomode=3.
- DOI and bibtex: see https://docs.abinit.org/theory/bibliography/#gonze2008
-
- [2] Libxc: A library of exchange and correlation functionals for density functional theory.
- M.A.L. Marques, M.J.T. Oliveira, T. Burnus, Computer Physics Communications 183, 2227 (2012).
- Comment: to be cited when LibXC is used (negative value of ixc)
- Strong suggestion to cite this paper.
- DOI and bibtex: see https://docs.abinit.org/theory/bibliography/#marques2012
-
- [3] The Abinit project: Impact, environment and recent developments.
- Computer Phys. Comm. 248, 107042 (2020).
- X.Gonze, B. Amadon, G. Antonius, F.Arnardi, L.Baguet, J.-M.Beuken,
- J.Bieder, F.Bottin, J.Bouchet, E.Bousquet, N.Brouwer, F.Bruneval,
- G.Brunin, T.Cavignac, J.-B. Charraud, Wei Chen, M.Cote, S.Cottenier,
- J.Denier, G.Geneste, Ph.Ghosez, M.Giantomassi, Y.Gillet, O.Gingras,
- D.R.Hamann, G.Hautier, Xu He, N.Helbig, N.Holzwarth, Y.Jia, F.Jollet,
- W.Lafargue-Dit-Hauret, K.Lejaeghere, M.A.L.Marques, A.Martin, C.Martins,
- H.P.C. Miranda, F.Naccarato, K. Persson, G.Petretto, V.Planes, Y.Pouillon,
- S.Prokhorenko, F.Ricci, G.-M.Rignanese, A.H.Romero, M.M.Schmitt, M.Torrent,
- M.J.van Setten, B.Van Troeye, M.J.Verstraete, G.Zerah and J.W.Zwanzig
- Comment: the fifth generic paper describing the ABINIT project.
- Note that a version of this paper, that is not formatted for Computer Phys. Comm. 
- is available at https://www.abinit.org/sites/default/files/ABINIT20.pdf .
- The licence allows the authors to put it on the Web.
- DOI and bibtex: see https://docs.abinit.org/theory/bibliography/#gonze2020
-
- [4] Optimized norm-conserving Vanderbilt pseudopotentials.
- D.R. Hamann, Phys. Rev. B 88, 085117 (2013).
- Comment: Some pseudopotential generated using the ONCVPSP code were used.
- DOI and bibtex: see https://docs.abinit.org/theory/bibliography/#hamann2013
-
- [5] ABINIT: Overview, and focus on selected capabilities
- J. Chem. Phys. 152, 124102 (2020).
- A. Romero, D.C. Allan, B. Amadon, G. Antonius, T. Applencourt, L.Baguet,
- J.Bieder, F.Bottin, J.Bouchet, E.Bousquet, F.Bruneval,
- G.Brunin, D.Caliste, M.Cote,
- J.Denier, C. Dreyer, Ph.Ghosez, M.Giantomassi, Y.Gillet, O.Gingras,
- D.R.Hamann, G.Hautier, F.Jollet, G. Jomard,
- A.Martin, 
- H.P.C. Miranda, F.Naccarato, G.Petretto, N.A. Pike, V.Planes,
- S.Prokhorenko, T. Rangel, F.Ricci, G.-M.Rignanese, M.Royo, M.Stengel, M.Torrent,
- M.J.van Setten, B.Van Troeye, M.J.Verstraete, J.Wiktor, J.W.Zwanziger, and X.Gonze.
- Comment: a global overview of ABINIT, with focus on selected capabilities .
- Note that a version of this paper, that is not formatted for J. Chem. Phys 
- is available at https://www.abinit.org/sites/default/files/ABINIT20_JPC.pdf .
- The licence allows the authors to put it on the Web.
- DOI and bibtex: see https://docs.abinit.org/theory/bibliography/#romero2020
-
- [6] Recent developments in the ABINIT software package.
- Computer Phys. Comm. 205, 106 (2016).
- X.Gonze, F.Jollet, F.Abreu Araujo, D.Adams, B.Amadon, T.Applencourt,
- C.Audouze, J.-M.Beuken, J.Bieder, A.Bokhanchuk, E.Bousquet, F.Bruneval
- D.Caliste, M.Cote, F.Dahm, F.Da Pieve, M.Delaveau, M.Di Gennaro,
- B.Dorado, C.Espejo, G.Geneste, L.Genovese, A.Gerossier, M.Giantomassi,
- Y.Gillet, D.R.Hamann, L.He, G.Jomard, J.Laflamme Janssen, S.Le Roux,
- A.Levitt, A.Lherbier, F.Liu, I.Lukacevic, A.Martin, C.Martins,
- M.J.T.Oliveira, S.Ponce, Y.Pouillon, T.Rangel, G.-M.Rignanese,
- A.H.Romero, B.Rousseau, O.Rubel, A.A.Shukri, M.Stankovski, M.Torrent,
- M.J.Van Setten, B.Van Troeye, M.J.Verstraete, D.Waroquier, J.Wiktor,
- B.Xu, A.Zhou, J.W.Zwanziger.
- Comment: the fourth generic paper describing the ABINIT project.
- Note that a version of this paper, that is not formatted for Computer Phys. Comm. 
- is available at https://www.abinit.org/sites/default/files/ABINIT16.pdf .
- The licence allows the authors to put it on the Web.
- DOI and bibtex: see https://docs.abinit.org/theory/bibliography/#gonze2016
 Proc.   0 individual time (sec): cpu=          1.9  wall=          1.6

 Calculation completed.
.Delivered   0 WARNINGs and   2 COMMENTs to log file.

--- !FinalSummary
program: abinit
version: 9.5.1
start_datetime: Tue Apr 20 10:30:29 2021
end_datetime: Tue Apr 20 10:30:30 2021
overall_cpu_time:           7.9
overall_wall_time:           6.3
exit_requested_by_user: no 
timelimit: 0
pseudos: 
    Al  : fef18c0c4c106244421000999f2c9383
usepaw: 0
mpi_procs: 4
omp_threads: 1
num_warnings: 0
num_comments: 2
...
