
.Version 8.9.4 of ABINIT 
.(sequential version, prepared for a x86_64_linux_gnu7.3 computer) 

.Copyright (C) 1998-2018 ABINIT group . 
 ABINIT comes with ABSOLUTELY NO WARRANTY.
 It is free software, and you are welcome to redistribute it
 under certain conditions (GNU General Public License,
 see ~abinit/COPYING or http://www.gnu.org/copyleft/gpl.txt).

 ABINIT is a project of the Universite Catholique de Louvain,
 Corning Inc. and other collaborators, see ~abinit/doc/developers/contributors.txt .
 Please read https://docs.abinit.org/theory/acknowledgments for suggested
 acknowledgments of the ABINIT effort.
 For more information, see https://www.abinit.org .

.Starting date : Sun 14 Oct 2018.
- ( at 18h16 )
  
- input  file    -> /home/fgoudreault/Workspace/abilaunch/examples/masslauncher/ecut5/ecut5.in
- output file    -> /home/fgoudreault/Workspace/abilaunch/examples/masslauncher/ecut5/ecut5.out
- root for input  files -> /home/fgoudreault/Workspace/abilaunch/examples/masslauncher/ecut5/input_data/idat_ecut5
- root for output files -> /home/fgoudreault/Workspace/abilaunch/examples/masslauncher/ecut5/run/output_data/odat_ecut5


 Symmetries : space group P4/m m m (#123); Bravais tP (primitive tetrag.)
================================================================================
 Values of the parameters that define the memory need of the present run
     intxc =       0    ionmov =       0      iscf =       7    lmnmax =       1
     lnmax =       1     mgfft =      24  mpssoang =       1    mqgrid =    3001
     natom =       2  nloc_mem =       1    nspden =       1   nspinor =       1
    nsppol =       1      nsym =      16    n1xccc =       0    ntypat =       1
    occopt =       1   xclevel =       1
-    mband =           2        mffmem =           1         mkmem =           1
       mpw =         258          nfft =       13824          nkpt =           1
================================================================================
P This job should need less than                       4.163 Mbytes of memory.
  Rough estimation (10% accuracy) of disk space for files :
_ WF disk file :      0.010 Mbytes ; DEN or POT disk file :      0.107 Mbytes.
================================================================================

--------------------------------------------------------------------------------
------------- Echo of variables that govern the present computation ------------
--------------------------------------------------------------------------------
-
- outvars: echo of selected default values                                      
-   iomode0 =  0 , fftalg0 =112 , wfoptalg0 =  0
-
- outvars: echo of global parameters not present in the input file              
-  max_nthreads =    0
-
 -outvars: echo values of preprocessed input variables --------
            acell      1.0000000000E+01  1.0000000000E+01  1.0000000000E+01 Bohr
              amu      1.00794000E+00
           diemac      2.00000000E+00
             ecut      5.00000000E+00 Hartree
-          fftalg         112
           istwfk        2
           kptopt           0
P           mkmem           1
            natom           2
            nband           2
            ngfft          24      24      24
             nkpt           1
            nstep          10
             nsym          16
           ntypat           1
              occ      2.000000  0.000000
        optforces           1
          spgroup         123
           symrel      1  0  0   0  1  0   0  0  1      -1  0  0   0 -1  0   0  0 -1
                      -1  0  0   0  1  0   0  0 -1       1  0  0   0 -1  0   0  0  1
                      -1  0  0   0 -1  0   0  0  1       1  0  0   0  1  0   0  0 -1
                       1  0  0   0 -1  0   0  0 -1      -1  0  0   0  1  0   0  0  1
                       1  0  0   0  0  1   0  1  0      -1  0  0   0  0 -1   0 -1  0
                      -1  0  0   0  0  1   0 -1  0       1  0  0   0  0 -1   0  1  0
                      -1  0  0   0  0 -1   0  1  0       1  0  0   0  0  1   0 -1  0
                       1  0  0   0  0 -1   0 -1  0      -1  0  0   0  0  1   0  1  0
           toldfe      1.00000000E-06 Hartree
            typat      1  1
           xangst     -3.7042404601E-01  0.0000000000E+00  0.0000000000E+00
                       3.7042404601E-01  0.0000000000E+00  0.0000000000E+00
            xcart     -7.0000000000E-01  0.0000000000E+00  0.0000000000E+00
                       7.0000000000E-01  0.0000000000E+00  0.0000000000E+00
             xred     -7.0000000000E-02  0.0000000000E+00  0.0000000000E+00
                       7.0000000000E-02  0.0000000000E+00  0.0000000000E+00
            znucl        1.00000

================================================================================

 chkinp: Checking input parameters for consistency.

================================================================================
== DATASET  1 ==================================================================
-   nproc =    1

 Exchange-correlation functional for the present dataset will be:
  LDA: new Teter (4/93) with spin-polarized option - ixc=1
 Citation for XC functional:
  S. Goedecker, M. Teter, J. Huetter, PRB 54, 1703 (1996)

 Real(R)+Recip(G) space primitive vectors, cartesian coordinates (Bohr,Bohr^-1):
 R(1)= 10.0000000  0.0000000  0.0000000  G(1)=  0.1000000  0.0000000  0.0000000
 R(2)=  0.0000000 10.0000000  0.0000000  G(2)=  0.0000000  0.1000000  0.0000000
 R(3)=  0.0000000  0.0000000 10.0000000  G(3)=  0.0000000  0.0000000  0.1000000
 Unit cell volume ucvol=  1.0000000E+03 bohr^3
 Angles (23,13,12)=  9.00000000E+01  9.00000000E+01  9.00000000E+01 degrees

 getcut: wavevector=  0.0000  0.0000  0.0000  ngfft=  24  24  24
         ecut(hartree)=      5.000   => boxcut(ratio)=   2.38430

 getcut : COMMENT -
  Note that boxcut > 2.2 ; recall that boxcut=Gcut(box)/Gcut(sphere) = 2
  is sufficient for exact treatment of convolution.
  Such a large boxcut is a waste : you could raise ecut
  e.g. ecut=    7.106115 Hartrees makes boxcut=2


--- Pseudopotential description ------------------------------------------------
- pspini: atom type   1  psp file is /home/fgoudreault/Workspace/abilaunch/examples/pseudos/01h.pspgth
- pspatm: opening atomic psp file    /home/fgoudreault/Workspace/abilaunch/examples/pseudos/01h.pspgth
- Goedecker-Teter-Hutter  Wed May  8 14:27:44 EDT 1996
-  1.00000   1.00000    960508                znucl, zion, pspdat
    2    1    0    0      2001   0.00000      pspcod,pspxc,lmax,lloc,mmax,r2well
 rloc=   0.2000000
  cc1=  -4.0663326; cc2=   0.6778322; cc3=   0.0000000; cc4=   0.0000000
  rrs=   0.0000000; h1s=   0.0000000; h2s=   0.0000000
  rrp=   0.0000000; h1p=   0.0000000
-  Local part computed in reciprocal space.

 pspatm : COMMENT -
  the projectors are not normalized,
  so that the KB energies are not consistent with 
  definition in PRB44, 8503 (1991). 
  However, this does not influence the results obtained hereafter.
  pspatm : epsatm=   -0.00480358
         --- l  ekb(1:nproj) -->
 pspatm: atomic psp has been read  and splines computed

  -1.92143215E-02                                ecore*ucvol(ha*bohr**3)
--------------------------------------------------------------------------------

_setup2: Arith. and geom. avg. npw (full set) are     515.000     515.000

================================================================================

     iter   Etot(hartree)      deltaE(h)  residm     vres2    diffor    maxfor
 ETOT  1  -1.0606875208906    -1.061E+00 5.369E-05 3.762E+00 5.467E-02 5.467E-02
 ETOT  2  -1.0619285333837    -1.241E-03 5.213E-10 1.661E-01 6.448E-03 6.112E-02
 ETOT  3  -1.0619407529088    -1.222E-05 2.578E-07 6.127E-03 3.186E-04 6.144E-02
 ETOT  4  -1.0619421865626    -1.434E-06 1.395E-07 1.656E-04 4.081E-04 6.185E-02
 ETOT  5  -1.0619422150615    -2.850E-08 2.210E-09 4.924E-06 4.618E-05 6.180E-02
 ETOT  6  -1.0619422153680    -3.065E-10 1.083E-11 4.748E-07 3.249E-06 6.181E-02

 At SCF step    6, etot is converged : 
  for the second time, diff in etot=  3.065E-10 < toldfe=  1.000E-06

 Cartesian components of stress tensor (hartree/bohr^3)
  sigma(1 1)= -6.38424208E-05  sigma(3 2)=  0.00000000E+00
  sigma(2 2)=  7.97683204E-05  sigma(3 1)=  0.00000000E+00
  sigma(3 3)=  7.97683204E-05  sigma(2 1)=  0.00000000E+00

 Integrated electronic density in atomic spheres:
 ------------------------------------------------
 Atom  Sphere_radius  Integrated_density
    1        2.00000          1.43023734
    2        2.00000          1.43023734
================================================================================

 ----iterations are completed or convergence reached----

 Mean square residual over all n,k,spin=   10.129E-12; max=  10.830E-12
 reduced coordinates (array xred) for    2 atoms
      -0.070000000000      0.000000000000      0.000000000000
       0.070000000000      0.000000000000      0.000000000000
 rms dE/dt=  3.5683E-01; max dE/dt=  6.1805E-01; dE/dt below (all hartree)
    1       0.618052242671      0.000000000000      0.000000000000
    2      -0.618052242671      0.000000000000      0.000000000000

 cartesian coordinates (angstrom) at end:
    1     -0.37042404601300     0.00000000000000     0.00000000000000
    2      0.37042404601300     0.00000000000000     0.00000000000000

 cartesian forces (hartree/bohr) at end:
    1     -0.06180522426708    -0.00000000000000    -0.00000000000000
    2      0.06180522426708    -0.00000000000000    -0.00000000000000
 frms,max,avg= 3.5683263E-02 6.1805224E-02   0.000E+00  0.000E+00  0.000E+00 h/b

 cartesian forces (eV/Angstrom) at end:
    1     -3.17815214787159    -0.00000000000000    -0.00000000000000
    2      3.17815214787159    -0.00000000000000    -0.00000000000000
 frms,max,avg= 1.8349070E+00 3.1781521E+00   0.000E+00  0.000E+00  0.000E+00 e/A
 length scales= 10.000000000000 10.000000000000 10.000000000000 bohr
              =  5.291772085900  5.291772085900  5.291772085900 angstroms
 prteigrs : about to open file /home/fgoudreault/Workspace/abilaunch/examples/masslauncher/ecut5/run/output_data/odat_ecut5_EIG
 Fermi (or HOMO) energy (hartree) =  -0.35853   Average Vxc (hartree)=  -0.07563
 Eigenvalues (hartree) for nkpt=   1  k points:
 kpt#   1, nband=  2, wtk=  1.00000, kpt=  0.0000  0.0000  0.0000 (reduced coord)
  -0.35853   -0.01337

--------------------------------------------------------------------------------
 Components of total free energy (in Hartree) :

    Kinetic energy  =  9.20799607553272E-01
    Hartree energy  =  6.84420547815683E-01
    XC energy       = -6.17063070560715E-01
    Ewald energy    =  1.51051118525613E-01
    PspCore energy  = -1.92143215271889E-05
    Loc. psp. energy= -2.20113120438033E+00
    NL   psp  energy=  0.00000000000000E+00
    >>>>>>>>> Etotal= -1.06194221536800E+00

 Other information on the energy :
    Total energy(eV)= -2.88969172595175E+01 ; Band energy (Ha)=  -7.1706170157E-01
--------------------------------------------------------------------------------

 Cartesian components of stress tensor (hartree/bohr^3)
  sigma(1 1)= -6.38424208E-05  sigma(3 2)=  0.00000000E+00
  sigma(2 2)=  7.97683204E-05  sigma(3 1)=  0.00000000E+00
  sigma(3 3)=  7.97683204E-05  sigma(2 1)=  0.00000000E+00

-Cartesian components of stress tensor (GPa)         [Pressure= -9.3847E-01 GPa]
- sigma(1 1)= -1.87830855E+00  sigma(3 2)=  0.00000000E+00
- sigma(2 2)=  2.34686462E+00  sigma(3 1)=  0.00000000E+00
- sigma(3 3)=  2.34686462E+00  sigma(2 1)=  0.00000000E+00

== END DATASET(S) ==============================================================
================================================================================
  
 -outvars: echo values of variables after computation  --------
            acell      1.0000000000E+01  1.0000000000E+01  1.0000000000E+01 Bohr
              amu      1.00794000E+00
           diemac      2.00000000E+00
             ecut      5.00000000E+00 Hartree
           etotal     -1.0619422154E+00
            fcart     -6.1805224267E-02 -0.0000000000E+00 -0.0000000000E+00
                       6.1805224267E-02 -0.0000000000E+00 -0.0000000000E+00
-          fftalg         112
           istwfk        2
           kptopt           0
P           mkmem           1
            natom           2
            nband           2
            ngfft          24      24      24
             nkpt           1
            nstep          10
             nsym          16
           ntypat           1
              occ      2.000000  0.000000
        optforces           1
          spgroup         123
           strten     -6.3842420791E-05  7.9768320427E-05  7.9768320427E-05
                       0.0000000000E+00  0.0000000000E+00  0.0000000000E+00
           symrel      1  0  0   0  1  0   0  0  1      -1  0  0   0 -1  0   0  0 -1
                      -1  0  0   0  1  0   0  0 -1       1  0  0   0 -1  0   0  0  1
                      -1  0  0   0 -1  0   0  0  1       1  0  0   0  1  0   0  0 -1
                       1  0  0   0 -1  0   0  0 -1      -1  0  0   0  1  0   0  0  1
                       1  0  0   0  0  1   0  1  0      -1  0  0   0  0 -1   0 -1  0
                      -1  0  0   0  0  1   0 -1  0       1  0  0   0  0 -1   0  1  0
                      -1  0  0   0  0 -1   0  1  0       1  0  0   0  0  1   0 -1  0
                       1  0  0   0  0 -1   0 -1  0      -1  0  0   0  0  1   0  1  0
           toldfe      1.00000000E-06 Hartree
            typat      1  1
           xangst     -3.7042404601E-01  0.0000000000E+00  0.0000000000E+00
                       3.7042404601E-01  0.0000000000E+00  0.0000000000E+00
            xcart     -7.0000000000E-01  0.0000000000E+00  0.0000000000E+00
                       7.0000000000E-01  0.0000000000E+00  0.0000000000E+00
             xred     -7.0000000000E-02  0.0000000000E+00  0.0000000000E+00
                       7.0000000000E-02  0.0000000000E+00  0.0000000000E+00
            znucl        1.00000

================================================================================

- Total cpu        time (s,m,h):          0.3        0.00      0.000
- Total wall clock time (s,m,h):          0.3        0.00      0.000
-
- For major independent code sections, cpu and wall times (sec),
-  as well as % of the time and number of calls for node 0-
-<BEGIN_TIMER mpi_nprocs = 1, omp_nthreads = 1, mpi_rank = 0>
- cpu_time =            0.3, wall_time =            0.3
-
- routine                        cpu     %       wall     %      number of calls  Gflops    Speedup Efficacity
-                                                                  (-1=no count)
- timing timab                   0.145  49.1      0.145  49.2             11      -1.00        1.00       1.00
- ewald                          0.063  21.4      0.063  21.4              1      -1.00        1.00       1.00
- stress                         0.042  14.2      0.042  14.2              1      -1.00        1.00       1.00
- ewald2 (+vdw_dftd)             0.041  14.0      0.041  13.9              1      -1.00        1.01       1.01
- invars2                        0.008   2.7      0.008   2.7              1      -1.00        1.00       1.00
- fourwf%(pot)                   0.006   2.1      0.007   2.4             69      -1.00        0.89       0.89
- xc:pot/=fourdp                 0.004   1.3      0.004   1.4              7      -1.00        0.92       0.92
- fourdp                         0.003   1.1      0.004   1.4             31      -1.00        0.82       0.82
- abinit(2)                      0.002   0.7      0.002   0.7              1      -1.00        1.02       1.02
- symrhg(no FFT)                 0.002   0.7      0.004   1.4              6      -1.00        0.51       0.51
- others (103)                   0.005   1.8      0.003   1.0             -1      -1.00        1.79       1.79
-<END_TIMER>
-
- subtotal                       0.322 109.0      0.323 109.5                                  1.00       1.00

- For major independent code sections, cpu and wall times (sec),
- as well as % of the total time and number of calls 

-<BEGIN_TIMER mpi_nprocs = 1, omp_nthreads = 1, mpi_rank = world>
- cpu_time =           0.3, wall_time =           0.3
-
- routine                         cpu     %       wall     %      number of calls Gflops    Speedup Efficacity
-                                                                  (-1=no count)
- timing timab                   0.145  49.1      0.145  49.2             11      -1.00        1.00       1.00
- ewald                          0.063  21.4      0.063  21.4              1      -1.00        1.00       1.00
- stress                         0.042  14.2      0.042  14.2              1      -1.00        1.00       1.00
- ewald2 (+vdw_dftd)             0.041  14.0      0.041  13.9              1      -1.00        1.01       1.01
- invars2                        0.008   2.7      0.008   2.7              1      -1.00        1.00       1.00
- fourwf%(pot)                   0.006   2.1      0.007   2.4             69      -1.00        0.89       0.89
- xc:pot/=fourdp                 0.004   1.3      0.004   1.4              7      -1.00        0.92       0.92
- fourdp                         0.003   1.1      0.004   1.4             31      -1.00        0.82       0.82
- abinit(2)                      0.002   0.7      0.002   0.7              1      -1.00        1.02       1.02
- symrhg(no FFT)                 0.002   0.7      0.004   1.4              6      -1.00        0.51       0.51
- others (103)                   0.005   1.8      0.003   1.0             -1      -1.00        1.79       1.79
-<END_TIMER>

- subtotal                       0.322 109.0      0.323 109.5                                  1.00       1.00

================================================================================

 Suggested references for the acknowledgment of ABINIT usage.

 The users of ABINIT have little formal obligations with respect to the ABINIT group
 (those specified in the GNU General Public License, http://www.gnu.org/copyleft/gpl.txt).
 However, it is common practice in the scientific literature,
 to acknowledge the efforts of people that have made the research possible.
 In this spirit, please find below suggested citations of work written by ABINIT developers,
 corresponding to implementations inside of ABINIT that you have used in the present run.
 Note also that it will be of great value to readers of publications presenting these results,
 to read papers enabling them to understand the theoretical formalism and details
 of the ABINIT implementation.
 For information on why they are suggested, see also https://docs.abinit.org/theory/acknowledgments.
-
- [1] Recent developments in the ABINIT software package.
- Computer Phys. Comm. 205, 106 (2016).
- X.Gonze, F.Jollet, F.Abreu Araujo, D.Adams, B.Amadon, T.Applencourt,
- C.Audouze, J.-M.Beuken, J.Bieder, A.Bokhanchuk, E.Bousquet, F.Bruneval
- D.Caliste, M.Cote, F.Dahm, F.Da Pieve, M.Delaveau, M.Di Gennaro,
- B.Dorado, C.Espejo, G.Geneste, L.Genovese, A.Gerossier, M.Giantomassi,
- Y.Gillet, D.R.Hamann, L.He, G.Jomard, J.Laflamme Janssen, S.Le Roux,
- A.Levitt, A.Lherbier, F.Liu, I.Lukacevic, A.Martin, C.Martins,
- M.J.T.Oliveira, S.Ponce, Y.Pouillon, T.Rangel, G.-M.Rignanese,
- A.H.Romero, B.Rousseau, O.Rubel, A.A.Shukri, M.Stankovski, M.Torrent,
- M.J.Van Setten, B.Van Troeye, M.J.Verstraete, D.Waroquier, J.Wiktor,
- B.Xu, A.Zhou, J.W.Zwanziger.
- Comment : the fourth generic paper describing the ABINIT project.
- Note that a version of this paper, that is not formatted for Computer Phys. Comm. 
- is available at https://www.abinit.org/about/ABINIT16.pdf .
- The licence allows the authors to put it on the Web.
- DOI and bibtex : see https://docs.abinit.org/theory/bibliography/#gonze2016
-
- [2] ABINIT : First-principles approach of materials and nanosystem properties.
- Computer Phys. Comm. 180, 2582-2615 (2009).
- X. Gonze, B. Amadon, P.-M. Anglade, J.-M. Beuken, F. Bottin, P. Boulanger, F. Bruneval,
- D. Caliste, R. Caracas, M. Cote, T. Deutsch, L. Genovese, Ph. Ghosez, M. Giantomassi
- S. Goedecker, D.R. Hamann, P. Hermet, F. Jollet, G. Jomard, S. Leroux, M. Mancini, S. Mazevet,
- M.J.T. Oliveira, G. Onida, Y. Pouillon, T. Rangel, G.-M. Rignanese, D. Sangalli, R. Shaltaf,
- M. Torrent, M.J. Verstraete, G. Zerah, J.W. Zwanziger
- Comment : the third generic paper describing the ABINIT project.
- Note that a version of this paper, that is not formatted for Computer Phys. Comm. 
- is available at https://www.abinit.org/about/ABINIT_CPC_v10.pdf .
- The licence allows the authors to put it on the Web.
- DOI and bibtex : see https://docs.abinit.org/theory/bibliography/#gonze2009
-
- [3] A brief introduction to the ABINIT software package.
- Z. Kristallogr. 220, 558-562 (2005).
- X. Gonze, G.-M. Rignanese, M. Verstraete, J.-M. Beuken, Y. Pouillon, R. Caracas, F. Jollet,
- M. Torrent, G. Zerah, M. Mikami, Ph. Ghosez, M. Veithen, J.-Y. Raty, V. Olevano, F. Bruneval,
- L. Reining, R. Godby, G. Onida, D.R. Hamann, and D.C. Allan.
- Comment : the second generic paper describing the ABINIT project. Note that this paper
- should be cited especially if you are using the GW part of ABINIT, as several authors
- of this part are not in the list of authors of the first or third paper.
- The .pdf of the latter paper is available at https://www.abinit.org/about/zfk_0505-06_558-562.pdf.
- Note that it should not redistributed (Copyright by Oldenburg Wissenshaftverlag,
- the licence allows the authors to put it on the Web).
- DOI and bibtex : see https://docs.abinit.org/theory/bibliography/#gonze2005
-
- And optionally:
-
- [4] First-principles computation of material properties : the ABINIT software project. 
- X. Gonze, J.-M. Beuken, R. Caracas, F. Detraux, M. Fuchs, G.-M. Rignanese, L. Sindic,
- M. Verstraete, G. Zerah, F. Jollet, M. Torrent, A. Roy, M. Mikami, Ph. Ghosez, J.-Y. Raty, D.C. Allan.
- Computational Materials Science 25, 478-492 (2002). http://dx.doi.org/10.1016/S0927-0256(02)00325-7
- Comment : the original paper describing the ABINIT project.
- DOI and bibtex : see https://docs.abinit.org/theory/bibliography/#gonze2002
-
- Proc.   0 individual time (sec): cpu=          0.3  wall=          0.3

================================================================================

 Calculation completed.
.Delivered   1 WARNINGs and   7 COMMENTs to log file.
+Overall time at end (sec) : cpu=          0.3  wall=          0.3
