  ABINIT 9.5.1
  
 DeprecationWarning: 

     The files file has been deprecated in Abinit9 and will be removed in Abinit10.
     Use the syntax `abinit t01.abi` where t01.abi is an input with pseudopotentials e.g.

            pseudos = "al.psp8, as.psp8"


  Give name for formatted input file: 
/home/fgoudreault/Workspace/abisuite/abisuite/unittests/test_sequencers/files/abinit_Al_smearing_convergence/phonons_runs/tsmear0.1/ngkpt5_5_5/ngkpt5_5_5.in
  Give name for formatted output file:
/home/fgoudreault/Workspace/abisuite/abisuite/unittests/test_sequencers/files/abinit_Al_smearing_convergence/phonons_runs/tsmear0.1/ngkpt5_5_5/ngkpt5_5_5.out
  Give root name for generic input files:
/home/fgoudreault/Workspace/abisuite/abisuite/unittests/test_sequencers/files/abinit_Al_smearing_convergence/phonons_runs/tsmear0.1/ngkpt5_5_5/input_data/idat_ngkpt5_5_5
  Give root name for generic output files:
/home/fgoudreault/Workspace/abisuite/abisuite/unittests/test_sequencers/files/abinit_Al_smearing_convergence/phonons_runs/tsmear0.1/ngkpt5_5_5/run/output_data/odat_ngkpt5_5_5
  Give root name for generic temporary files:
/home/fgoudreault/Workspace/abisuite/abisuite/unittests/test_sequencers/files/abinit_Al_smearing_convergence/phonons_runs/tsmear0.1/ngkpt5_5_5/run/output_data/tmp_ngkpt5_5_5

.Version 9.5.1 of ABINIT 
.(MPI version, prepared for a x86_64_linux_gnu9.3 computer) 

.Copyright (C) 1998-2021 ABINIT group . 
 ABINIT comes with ABSOLUTELY NO WARRANTY.
 It is free software, and you are welcome to redistribute it
 under certain conditions (GNU General Public License,
 see ~abinit/COPYING or http://www.gnu.org/copyleft/gpl.txt).

 ABINIT is a project of the Universite Catholique de Louvain,
 Corning Inc. and other collaborators, see ~abinit/doc/developers/contributors.txt .
 Please read https://docs.abinit.org/theory/acknowledgments for suggested
 acknowledgments of the ABINIT effort.
 For more information, see https://www.abinit.org .

.Starting date : Tue 20 Apr 2021.
- ( at 11h06 )
  

 ++++++++++++++++++++++++++++++++++++++++++++++++++++++++++++++++++++++++++++++

 === Build Information === 
  Version       : 9.5.1
  Build target  : x86_64_linux_gnu9.3
  Build date    : 20210419

 === Compiler Suite === 
  C compiler       : gnu9.3
  C++ compiler     : gnu9.3
  Fortran compiler : gnu9.3
  CFLAGS           : -g -O2 -mtune=native -march=native
  CXXFLAGS         : -g -O2 -mtune=native -march=native
  FCFLAGS          : -g -ffree-line-length-none     -I/home/fgoudreault/Workspace/abinit ...
  FC_LDFLAGS       : 

 === Optimizations === 
  Debug level        : basic
  Optimization level : standard
  Architecture       : unknown_unknown

 === Multicore === 
  Parallel build : yes
  Parallel I/O   : yes
  openMP support : 
  GPU support    : 

 === Connectors / Fallbacks === 
  LINALG flavor  : netlib
  FFT flavor     : goedecker
  HDF5           : yes
  NetCDF         : yes
  NetCDF Fortran : yes
  LibXC          : yes
  Wannier90      : no

 === Experimental features === 
  Exports             : 
  GW double-precision : 

 ++++++++++++++++++++++++++++++++++++++++++++++++++++++++++++++++++++++++++++++


 ++++++++++++++++++++++++++++++++++++++++++++++++++++++++++++++++++++++++++++++
 Default optimizations:
   -O2 -mtune=native -march=native


 Optimizations for 43_ptgroups:
   -O0


 ++++++++++++++++++++++++++++++++++++++++++++++++++++++++++++++++++++++++++++++


 ++++++++++++++++++++++++++++++++++++++++++++++++++++++++++++++++++++++++++++++
 CPP options activated during the build:

                    CC_GNU                   CXX_GNU                    FC_GNU
 
 HAVE_FC_ALLOCATABLE_DT...             HAVE_FC_ASYNC         HAVE_FC_BACKTRACE
 
  HAVE_FC_COMMAND_ARGUMENT      HAVE_FC_COMMAND_LINE        HAVE_FC_CONTIGUOUS
 
           HAVE_FC_CPUTIME              HAVE_FC_EXIT             HAVE_FC_FLUSH
 
             HAVE_FC_GAMMA            HAVE_FC_GETENV   HAVE_FC_IEEE_ARITHMETIC
 
   HAVE_FC_IEEE_EXCEPTIONS          HAVE_FC_INT_QUAD             HAVE_FC_IOMSG
 
     HAVE_FC_ISO_C_BINDING  HAVE_FC_ISO_FORTRAN_2008        HAVE_FC_LONG_LINES
 
        HAVE_FC_MOVE_ALLOC  HAVE_FC_ON_THE_FLY_SHAPE           HAVE_FC_PRIVATE
 
         HAVE_FC_PROTECTED           HAVE_FC_SHIFTLR         HAVE_FC_STREAM_IO
 
            HAVE_FC_SYSTEM          HAVE_FORTRAN2003                 HAVE_HDF5
 
             HAVE_HDF5_MPI        HAVE_LIBPAW_ABINIT      HAVE_LIBTETRA_ABINIT
 
                HAVE_LIBXC         HAVE_LINALG_AXPBY        HAVE_LINALG_GEMM3M
 
                  HAVE_MPI                 HAVE_MPI2         HAVE_MPI2_INPLACE
 
       HAVE_MPI_IALLGATHER       HAVE_MPI_IALLREDUCE        HAVE_MPI_IALLTOALL
 
       HAVE_MPI_IALLTOALLV           HAVE_MPI_IBCAST         HAVE_MPI_IGATHERV
 
        HAVE_MPI_INTEGER16               HAVE_MPI_IO HAVE_MPI_TYPE_CREATE_S...
 
               HAVE_NETCDF       HAVE_NETCDF_DEFAULT       HAVE_NETCDF_FORTRAN
 
   HAVE_NETCDF_FORTRAN_MPI           HAVE_NETCDF_MPI             HAVE_OS_LINUX
 
         HAVE_TIMER_ABINIT                                                      
 ++++++++++++++++++++++++++++++++++++++++++++++++++++++++++++++++++++++++++++++

- input  file    -> /home/fgoudreault/Workspace/abisuite/abisuite/unittests/test_sequencers/files/abinit_Al_smearing_convergence/phonons_runs/tsmear0.1/ngkpt5_5_5/ngkpt5_5_5.in
- output file    -> /home/fgoudreault/Workspace/abisuite/abisuite/unittests/test_sequencers/files/abinit_Al_smearing_convergence/phonons_runs/tsmear0.1/ngkpt5_5_5/ngkpt5_5_5.out
- root for input  files -> /home/fgoudreault/Workspace/abisuite/abisuite/unittests/test_sequencers/files/abinit_Al_smearing_convergence/phonons_runs/tsmear0.1/ngkpt5_5_5/input_data/idat_ngkpt5_5_5
- root for output files -> /home/fgoudreault/Workspace/abisuite/abisuite/unittests/test_sequencers/files/abinit_Al_smearing_convergence/phonons_runs/tsmear0.1/ngkpt5_5_5/run/output_data/odat_ngkpt5_5_5

 Netcdf library supports MPI-IO
-instrng: 48 lines of input have been read from file /home/fgoudreault/Workspace/abisuite/abisuite/unittests/test_sequencers/files/abinit_Al_smearing_convergence/phonons_runs/tsmear0.1/ngkpt5_5_5/ngkpt5_5_5.in


 Please give name of formatted atomic psp file (and finish with a newline character)
 For atom type 1, psp file is /home/fgoudreault/Workspace/abisuite/abisuite/unittests/test_sequencers/files/pseudos/Al.psp8
  read the values zionpsp=  3.0 , pspcod=   8 , lmax=   2

 inpspheads: deduce mpsang = 3, n1xccc = 2501.

======================================================= 
 invars1m : enter jdtset= 0

 symlatt: the Bravais lattice is cF (face-centered cubic)
  xred   is defined in input file
 ingeo: takes atomic coordinates from input array xred

--- !COMMENT
src_file: m_ingeo.F90
src_line: 900
message: |
    The tolerance on symmetries =   1.000E-05 is bigger than 1.0e-8.
    In order to avoid spurious effects, the atomic coordinates have been
    symmetrized before storing them in the dataset internal variable.
    So, do not be surprised by the fact that your input variables (xcart, xred, ...)
    do not correspond exactly to the ones echoed by ABINIT, the latter being used to do the calculations.
    This is not a problem per se.
    Still, in order to avoid this symmetrization (e.g. for specific debugging/development), decrease tolsym to 1.0e-8 or lower,
    or (much preferred) use input primitive vectors that are accurate to better than 1.0e-8.
    This message will only be printed once, even if there are other datasets where tolsym is bigger than 1.0e-8.
...


 symlatt: the Bravais lattice is cF (face-centered cubic)

 symlatt: the Bravais lattice is cF (face-centered cubic)
 symspgr: spgroup= 225  Fm -3 m   (=Oh^5)
 symspgr: optical characteristics = isotropic
 invars2: take the default value of fband=  5.00000000E-01
 For input ecut=  6.000000E+00 best grid ngfft=      12      12      12
       max ecut=  6.151415E+00

 ==== FFT mesh ====
  FFT mesh divisions ........................    12   12   12
  Augmented FFT divisions ...................    13   13   12
  FFT algorithm .............................   112
  FFT cache size ............................    16
 getmpw: optimal value of mpw= 82
 getmpw: optimal value of mpw= 82

 Symmetries : space group Fm -3 m (#225); Bravais cF (face-center cubic)

 getdim_nloc : deduce lmnmax  =  18, lnmax  =   6,
                      lmnmaxso=  18, lnmaxso=   6.
 memorf : analysis of memory needs
================================================================================
 Values of the parameters that define the memory need of the present run (RF).
     intxc =       0      iscf =       7    lmnmax =       6     lnmax =       6
     mgfft =      12  mpssoang =       3    mqgrid =    3001     natom =       1
  nloc_mem =       1    nspden =       1   nspinor =       1    nsppol =       1
      nsym =      48    n1xccc =    2501    ntypat =       1    occopt =       4
   xclevel =       1
-    mband =           3        mffmem =           1         mkmem =          64
-   mkqmem =          64        mk1mem =          64           mpw =          82
      nfft =        1728          nkpt =         252
================================================================================
P This job should need less than                       2.775 Mbytes of memory.
  Rough estimation (10% accuracy) of disk space for files :
_ WF disk file :      0.948 Mbytes ; DEN or POT disk file :      0.015 Mbytes.
================================================================================

 Biggest array : cg(disk), with      0.2422 MBytes.
 memana : allocated an array of      0.242 Mbytes, for testing purposes.
 memana: allocated       2.775Mbytes, for testing purposes. 
 The job will continue.
--------------------------------------------------------------------------------
------------- Echo of variables that govern the present computation ------------
--------------------------------------------------------------------------------
-
- outvars: echo of selected default values                                      
-   iomode0 =  3 , fftalg0 =112 , wfoptalg0 =  0
-
- outvars: echo of global parameters not present in the input file              
-  max_nthreads =    0
-
 -outvars: echo values of preprocessed input variables --------
 
 These variables are accessible in NetCDF format (/home/fgoudreault/Workspace/abisuite/abisuite/unittests/test_sequencers/files/abinit_Al_smearing_convergence/phonons_runs/tsmear0.1/ngkpt5_5_5/run/output_data/odat_ngkpt5_5_5_OUT.nc)

            acell      7.6000000000E+00  7.6000000000E+00  7.6000000000E+00 Bohr
              amu      2.69815390E+01
           diemac      9.00000000E+00
             ecut      6.00000000E+00 Hartree
-          fftalg         112
           irdwfk           1
              ixc       -1012
              kpt     -1.00000000E-01 -2.00000000E-01  0.00000000E+00
                      -2.00000000E-01 -1.00000000E-01  0.00000000E+00
                      -1.00000000E-01 -1.00000000E-01  1.00000000E-01
                      -1.00000000E-01 -4.00000000E-01  0.00000000E+00
                      -2.00000000E-01 -3.00000000E-01  0.00000000E+00
                      -1.00000000E-01 -3.00000000E-01  1.00000000E-01
                      -3.00000000E-01 -2.00000000E-01  0.00000000E+00
                      -2.00000000E-01 -2.00000000E-01  1.00000000E-01
                      -1.00000000E-01 -2.00000000E-01  2.00000000E-01
                      -4.00000000E-01 -1.00000000E-01  0.00000000E+00
                      -3.00000000E-01 -1.00000000E-01  1.00000000E-01
                      -2.00000000E-01 -1.00000000E-01  2.00000000E-01
                      -1.00000000E-01 -1.00000000E-01  3.00000000E-01
                      -1.00000000E-01  4.00000000E-01  0.00000000E+00
                      -2.00000000E-01  5.00000000E-01  0.00000000E+00
                      -1.00000000E-01  5.00000000E-01  1.00000000E-01
                      -3.00000000E-01 -4.00000000E-01  0.00000000E+00
                      -2.00000000E-01 -4.00000000E-01  1.00000000E-01
                      -1.00000000E-01 -4.00000000E-01  2.00000000E-01
                      -4.00000000E-01 -3.00000000E-01  0.00000000E+00
                      -3.00000000E-01 -3.00000000E-01  1.00000000E-01
                      -2.00000000E-01 -3.00000000E-01  2.00000000E-01
                      -1.00000000E-01 -3.00000000E-01  3.00000000E-01
                       5.00000000E-01 -2.00000000E-01  0.00000000E+00
                      -4.00000000E-01 -2.00000000E-01  1.00000000E-01
                      -3.00000000E-01 -2.00000000E-01  2.00000000E-01
                      -2.00000000E-01 -2.00000000E-01  3.00000000E-01
                      -1.00000000E-01 -2.00000000E-01  4.00000000E-01
                       4.00000000E-01 -1.00000000E-01  0.00000000E+00
                       5.00000000E-01 -1.00000000E-01  1.00000000E-01
                      -4.00000000E-01 -1.00000000E-01  2.00000000E-01
                      -3.00000000E-01 -1.00000000E-01  3.00000000E-01
                      -2.00000000E-01 -1.00000000E-01  4.00000000E-01
                      -1.00000000E-01 -1.00000000E-01  5.00000000E-01
                      -1.00000000E-01  2.00000000E-01  0.00000000E+00
                      -2.00000000E-01  3.00000000E-01  0.00000000E+00
                      -1.00000000E-01  3.00000000E-01  1.00000000E-01
                      -3.00000000E-01  4.00000000E-01  0.00000000E+00
                      -2.00000000E-01  4.00000000E-01  1.00000000E-01
                      -1.00000000E-01  4.00000000E-01  2.00000000E-01
                      -4.00000000E-01  5.00000000E-01  0.00000000E+00
                      -3.00000000E-01  5.00000000E-01  1.00000000E-01
                      -2.00000000E-01  5.00000000E-01  2.00000000E-01
                      -1.00000000E-01  5.00000000E-01  3.00000000E-01
                       5.00000000E-01 -4.00000000E-01  0.00000000E+00
                      -4.00000000E-01 -4.00000000E-01  1.00000000E-01
                      -3.00000000E-01 -4.00000000E-01  2.00000000E-01
                      -2.00000000E-01 -4.00000000E-01  3.00000000E-01
                      -1.00000000E-01 -4.00000000E-01  4.00000000E-01
                       4.00000000E-01 -3.00000000E-01  0.00000000E+00
                       outvar_i_n : Printing only first  50 k-points.
           kptopt           2
         kptrlatt        5   -5    5     -5    5    5     -5   -5    5
          kptrlen      3.80000000E+01
P           mkmem          64
P          mkqmem          64
P          mk1mem          64
            natom           1
            nband           3
           nbdbuf           2
            ngfft          12      12      12
             nkpt         252
             nqpt           1
            nstep          25
             nsym          48
           ntypat           1
              occ      2.000000  1.000000  0.000000
                       2.000000  1.000000  0.000000
                       2.000000  1.000000  0.000000
                       2.000000  1.000000  0.000000
                       2.000000  1.000000  0.000000
                       2.000000  1.000000  0.000000
                       2.000000  1.000000  0.000000
                       2.000000  1.000000  0.000000
                       2.000000  1.000000  0.000000
                       2.000000  1.000000  0.000000
                       2.000000  1.000000  0.000000
                       2.000000  1.000000  0.000000
                       2.000000  1.000000  0.000000
                       2.000000  1.000000  0.000000
                       2.000000  1.000000  0.000000
                       2.000000  1.000000  0.000000
                       2.000000  1.000000  0.000000
                       2.000000  1.000000  0.000000
                       2.000000  1.000000  0.000000
                       2.000000  1.000000  0.000000
                       2.000000  1.000000  0.000000
                       2.000000  1.000000  0.000000
                       2.000000  1.000000  0.000000
                       2.000000  1.000000  0.000000
                       2.000000  1.000000  0.000000
                       2.000000  1.000000  0.000000
                       2.000000  1.000000  0.000000
                       2.000000  1.000000  0.000000
                       2.000000  1.000000  0.000000
                       2.000000  1.000000  0.000000
                       2.000000  1.000000  0.000000
                       2.000000  1.000000  0.000000
                       2.000000  1.000000  0.000000
                       2.000000  1.000000  0.000000
                       2.000000  1.000000  0.000000
                       2.000000  1.000000  0.000000
                       2.000000  1.000000  0.000000
                       2.000000  1.000000  0.000000
                       2.000000  1.000000  0.000000
                       2.000000  1.000000  0.000000
                       2.000000  1.000000  0.000000
                       2.000000  1.000000  0.000000
                       2.000000  1.000000  0.000000
                       2.000000  1.000000  0.000000
                       2.000000  1.000000  0.000000
                       2.000000  1.000000  0.000000
                       2.000000  1.000000  0.000000
                       2.000000  1.000000  0.000000
                       2.000000  1.000000  0.000000
                       2.000000  1.000000  0.000000
                       prtocc : prtvol=0, do not print more k-points.
           occopt           4
        optdriver           1
            rfdir           1       1       1
           rfphon           1
            rprim      0.0000000000E+00  5.0000000000E-01  5.0000000000E-01
                       5.0000000000E-01  0.0000000000E+00  5.0000000000E-01
                       5.0000000000E-01  5.0000000000E-01  0.0000000000E+00
           shiftk      5.00000000E-01  5.00000000E-01  5.00000000E-01
          spgroup         225
           symrel      1  0  0   0  1  0   0  0  1      -1  0  0   0 -1  0   0  0 -1
                       0 -1  1   0 -1  0   1 -1  0       0  1 -1   0  1  0  -1  1  0
                      -1  0  0  -1  0  1  -1  1  0       1  0  0   1  0 -1   1 -1  0
                       0  1 -1   1  0 -1   0  0 -1       0 -1  1  -1  0  1   0  0  1
                      -1  0  0  -1  1  0  -1  0  1       1  0  0   1 -1  0   1  0 -1
                       0 -1  1   1 -1  0   0 -1  0       0  1 -1  -1  1  0   0  1  0
                       1  0  0   0  0  1   0  1  0      -1  0  0   0  0 -1   0 -1  0
                       0  1 -1   0  0 -1   1  0 -1       0 -1  1   0  0  1  -1  0  1
                      -1  0  1  -1  1  0  -1  0  0       1  0 -1   1 -1  0   1  0  0
                       0 -1  0   1 -1  0   0 -1  1       0  1  0  -1  1  0   0  1 -1
                       1  0 -1   0  0 -1   0  1 -1      -1  0  1   0  0  1   0 -1  1
                       0  1  0   0  0  1   1  0  0       0 -1  0   0  0 -1  -1  0  0
                       1  0 -1   0  1 -1   0  0 -1      -1  0  1   0 -1  1   0  0  1
                       0 -1  0   0 -1  1   1 -1  0       0  1  0   0  1 -1  -1  1  0
                      -1  0  1  -1  0  0  -1  1  0       1  0 -1   1  0  0   1 -1  0
                       0  1  0   1  0  0   0  0  1       0 -1  0  -1  0  0   0  0 -1
                       0  0 -1   0  1 -1   1  0 -1       0  0  1   0 -1  1  -1  0  1
                       1 -1  0   0 -1  1   0 -1  0      -1  1  0   0  1 -1   0  1  0
                       0  0  1   1  0  0   0  1  0       0  0 -1  -1  0  0   0 -1  0
                      -1  1  0  -1  0  0  -1  0  1       1 -1  0   1  0  0   1  0 -1
                       0  0  1   0  1  0   1  0  0       0  0 -1   0 -1  0  -1  0  0
                       1 -1  0   0 -1  0   0 -1  1      -1  1  0   0  1  0   0  1 -1
                       0  0 -1   1  0 -1   0  1 -1       0  0  1  -1  0  1   0 -1  1
                      -1  1  0  -1  0  1  -1  0  0       1 -1  0   1  0 -1   1  0  0
           tolvrs      1.00000000E-08
           tsmear      1.00000000E-01 Hartree
            typat      1
              wtk        0.00400    0.00400    0.00400    0.00400    0.00400    0.00400
                         0.00400    0.00400    0.00400    0.00400    0.00400    0.00400
                         0.00400    0.00400    0.00400    0.00400    0.00400    0.00400
                         0.00400    0.00400    0.00400    0.00400    0.00400    0.00400
                         0.00400    0.00400    0.00400    0.00400    0.00400    0.00400
                         0.00400    0.00400    0.00400    0.00400    0.00400    0.00400
                         0.00400    0.00400    0.00400    0.00400    0.00400    0.00400
                         0.00400    0.00400    0.00400    0.00400    0.00400    0.00400
                         0.00400    0.00400
                       outvars : Printing only first  50 k-points.
            znucl       13.00000

================================================================================

 chkinp: Checking input parameters for consistency.
 DATA TYPE INFORMATION: 
 REAL:      Data type name: REAL(DP) 
            Kind value:      8
            Precision:      15
            Smallest nonnegligible quantity relative to 1: 0.22204460E-015
            Smallest positive number:                      0.22250739E-307
            Largest representable number:                  0.17976931E+309
 INTEGER:   Data type name: INTEGER(default) 
            Kind value: 4
            Bit size:   32
            Largest representable number: 2147483647
 LOGICAL:   Data type name: LOGICAL 
            Kind value: 4
 CHARACTER: Data type name: CHARACTER             Kind value: 1

  ==== OpenMP parallelism is OFF ====
 
  ==== Using MPI-2 specifications ==== 
  MPI-IO support is ON
  xmpi_tag_ub ................   2147483647
  xmpi_bsize_ch ..............            1
  xmpi_bsize_int .............            4
  xmpi_bsize_sp ..............            4
  xmpi_bsize_dp ..............            8
  xmpi_bsize_spc .............            8
  xmpi_bsize_dpc .............           16
  xmpio_bsize_frm ............            4
  xmpi_address_kind ..........            8
  xmpi_offset_kind ...........            8
  MPI_WTICK ..................    1.0000000000000001E-009

================================================================================
== DATASET  1 ==================================================================
-   mpi_nproc: 4, omp_nthreads: -1 (-1 if OMP is not activated)


--- !COMMENT
src_file: m_xgScalapack.F90
src_line: 236
message: |
    xgScalapack in auto mode
...


 getdim_nloc : deduce lmnmax  =  18, lnmax  =   6,
                      lmnmaxso=  18, lnmaxso=   6.
 Slater exchange
 P. A. M. Dirac, Math. Proc. Cambridge Philos. Soc. 26, 376 (1930)
 F. Bloch, Z. Phys. 57, 545 (1929)
 Perdew & Wang
 J. P. Perdew and Y. Wang, Phys. Rev. B 45, 13244 (1992)

 Unit cell volume ucvol=  1.0974400E+02 bohr^3
 Angles (23,13,12)=  6.00000000E+01  6.00000000E+01  6.00000000E+01 degrees
 setup1 : take into account q-point for computing boxcut.

 getcut: wavevector=  0.0000  0.0000  0.0000  ngfft=  12  12  12
         ecut(hartree)=      6.000   => boxcut(ratio)=   2.02508
- pspini: atom type   1  psp file is /home/fgoudreault/Workspace/abisuite/abisuite/unittests/test_sequencers/files/pseudos/Al.psp8
- pspatm: opening atomic psp file    /home/fgoudreault/Workspace/abisuite/abisuite/unittests/test_sequencers/files/pseudos/Al.psp8
- Al    ONCVPSP-3.3.0  r_core=   1.76802   1.76802   1.70587
- 13.00000   3.00000    171102                znucl, zion, pspdat
    8   -1012    2    4       600   0.00000   pspcod,pspxc,lmax,lloc,mmax,r2well
    5.99000000000000    5.00000000000000    0.00000000000000   rchrg,fchrg,qchrg
     nproj     2     2     2
     extension_switch     1
  valence charge integrates to:    2.9194977370493271     
  pspatm : epsatm=    0.57439192
         --- l  ekb(1:nproj) -->
             0    5.725870    0.726131
             1    6.190420    0.914022
             2   -4.229503   -0.925599
 pspatm: atomic psp has been read  and splines computed

   1.72317576E+00                                ecore*ucvol(ha*bohr**3)
 ==== Info on pseudopotentials ====
  Norm-conserving pseudopotentials
  Number of pseudopotentials ..    1
  Number of types of atoms   ..    1
  Scalar calculation (no spin-orbit term)
  Nonlocal part applied using Legendre polynomials
  Max number of non-local projectors over l and type   2
  Highest angular momentum +1 .......   3
  Max number of (l,n)   components ..   6
  Max number of (l,m,n) components ..   6

 Pseudo-Core Charge Info: 
   Number of radial points for pseudo-core charge .. 2501
   XC core-correction treatment (optnlxccc) ........    1
   Radius for pseudo-core charge for each type ..... 

  - Atom type    1 has pseudo-core radius ..  5.9900

 Info on the Q-grid used for form factors in spline form: 
   Number of q-points for radial functions ffspl ..   3001
   Number of q-points for vlspl ...................   3001
   vloc is computed in Reciprocal Space
   model core charge treated in real-space

  XC functional for type 1 is -1012
  Pseudo valence available: yes

- File: /home/fgoudreault/Workspace/abisuite/abisuite/unittests/test_sequencers/files/abinit_Al_smearing_convergence/phonons_runs/tsmear0.1/ngkpt5_5_5/input_data/idat_ngkpt5_5_5_WFK does not exist but found netcdf file with similar name.
- Opening HDf5 file with MPI-IO support: /home/fgoudreault/Workspace/abisuite/abisuite/unittests/test_sequencers/files/abinit_Al_smearing_convergence/phonons_runs/tsmear0.1/ngkpt5_5_5/input_data/idat_ngkpt5_5_5_WFK.nc
 inwffil: examining the header of disk file: /home/fgoudreault/Workspace/abisuite/abisuite/unittests/test_sequencers/files/abinit_Al_smearing_convergence/phonons_runs/tsmear0.1/ngkpt5_5_5/input_data/idat_ngkpt5_5_5_WFK.nc

================================================================================

          - hdr_check: checking restart file header for consistency -


          current calculation                           restart file
          -------------------                           ------------

  calculation expects a wf_planewave        |  input file contains a wf_planewave
. ABINIT  code version 9.5.1                |  ABINIT  code version 9.5.1
. date 20210420 bantot      756 natom    1  |  date 20210420 bantot       57 natom    1
  nkpt     252 nsym 48 ngfft  12,  12,  12  |  nkpt      19 nsym 48 ngfft  12,  12,  12
  ntypat  1 ecut_eff   6.0000000            |  ntypat  1 ecut_eff   6.0000000
  usepaw  0                                 |  usepaw  0
  usewvl  0                                 |  usewvl  0
  rprimd:                                   |  rprimd:
     0.0000000   3.8000000   3.8000000      |     0.0000000   3.8000000   3.8000000
     3.8000000   0.0000000   3.8000000      |     3.8000000   0.0000000   3.8000000
     3.8000000   3.8000000   0.0000000      |     3.8000000   3.8000000   0.0000000

--- !COMMENT
src_file: m_hdr.F90
src_line: 4172
message: |
    input nkpt=252 not equal disk file nkpt=19
...

  symafm:                                   |  symafm:
    1  1  1  1  1  1  1  1  1  1  1  1      |    1  1  1  1  1  1  1  1  1  1  1  1
    1  1  1  1  1  1  1  1  1  1  1  1      |    1  1  1  1  1  1  1  1  1  1  1  1
    1  1  1  1  1  1  1  1  1  1  1  1      |    1  1  1  1  1  1  1  1  1  1  1  1
    1  1  1  1  1  1  1  1  1  1  1  1      |    1  1  1  1  1  1  1  1  1  1  1  1
  symrel:                                   |  symrel:
    1  0  0  0  1  0  0  0  1               |    1  0  0  0  1  0  0  0  1
   -1  0  0  0 -1  0  0  0 -1               |   -1  0  0  0 -1  0  0  0 -1
    0 -1  1  0 -1  0  1 -1  0               |    0 -1  1  0 -1  0  1 -1  0
    0  1 -1  0  1  0 -1  1  0               |    0  1 -1  0  1  0 -1  1  0
   -1  0  0 -1  0  1 -1  1  0               |   -1  0  0 -1  0  1 -1  1  0
    1  0  0  1  0 -1  1 -1  0               |    1  0  0  1  0 -1  1 -1  0
    0  1 -1  1  0 -1  0  0 -1               |    0  1 -1  1  0 -1  0  0 -1
    0 -1  1 -1  0  1  0  0  1               |    0 -1  1 -1  0  1  0  0  1
   -1  0  0 -1  1  0 -1  0  1               |   -1  0  0 -1  1  0 -1  0  1
    1  0  0  1 -1  0  1  0 -1               |    1  0  0  1 -1  0  1  0 -1
    0 -1  1  1 -1  0  0 -1  0               |    0 -1  1  1 -1  0  0 -1  0
    0  1 -1 -1  1  0  0  1  0               |    0  1 -1 -1  1  0  0  1  0
    1  0  0  0  0  1  0  1  0               |    1  0  0  0  0  1  0  1  0
   -1  0  0  0  0 -1  0 -1  0               |   -1  0  0  0  0 -1  0 -1  0
    0  1 -1  0  0 -1  1  0 -1               |    0  1 -1  0  0 -1  1  0 -1
    0 -1  1  0  0  1 -1  0  1               |    0 -1  1  0  0  1 -1  0  1
   -1  0  1 -1  1  0 -1  0  0               |   -1  0  1 -1  1  0 -1  0  0
    1  0 -1  1 -1  0  1  0  0               |    1  0 -1  1 -1  0  1  0  0
    0 -1  0  1 -1  0  0 -1  1               |    0 -1  0  1 -1  0  0 -1  1
    0  1  0 -1  1  0  0  1 -1               |    0  1  0 -1  1  0  0  1 -1
    1  0 -1  0  0 -1  0  1 -1               |    1  0 -1  0  0 -1  0  1 -1
   -1  0  1  0  0  1  0 -1  1               |   -1  0  1  0  0  1  0 -1  1
    0  1  0  0  0  1  1  0  0               |    0  1  0  0  0  1  1  0  0
    0 -1  0  0  0 -1 -1  0  0               |    0 -1  0  0  0 -1 -1  0  0
    1  0 -1  0  1 -1  0  0 -1               |    1  0 -1  0  1 -1  0  0 -1
   -1  0  1  0 -1  1  0  0  1               |   -1  0  1  0 -1  1  0  0  1
    0 -1  0  0 -1  1  1 -1  0               |    0 -1  0  0 -1  1  1 -1  0
    0  1  0  0  1 -1 -1  1  0               |    0  1  0  0  1 -1 -1  1  0
   -1  0  1 -1  0  0 -1  1  0               |   -1  0  1 -1  0  0 -1  1  0
    1  0 -1  1  0  0  1 -1  0               |    1  0 -1  1  0  0  1 -1  0
    0  1  0  1  0  0  0  0  1               |    0  1  0  1  0  0  0  0  1
    0 -1  0 -1  0  0  0  0 -1               |    0 -1  0 -1  0  0  0  0 -1
    0  0 -1  0  1 -1  1  0 -1               |    0  0 -1  0  1 -1  1  0 -1
    0  0  1  0 -1  1 -1  0  1               |    0  0  1  0 -1  1 -1  0  1
    1 -1  0  0 -1  1  0 -1  0               |    1 -1  0  0 -1  1  0 -1  0
   -1  1  0  0  1 -1  0  1  0               |   -1  1  0  0  1 -1  0  1  0
    0  0  1  1  0  0  0  1  0               |    0  0  1  1  0  0  0  1  0
    0  0 -1 -1  0  0  0 -1  0               |    0  0 -1 -1  0  0  0 -1  0
   -1  1  0 -1  0  0 -1  0  1               |   -1  1  0 -1  0  0 -1  0  1
    1 -1  0  1  0  0  1  0 -1               |    1 -1  0  1  0  0  1  0 -1
    0  0  1  0  1  0  1  0  0               |    0  0  1  0  1  0  1  0  0
    0  0 -1  0 -1  0 -1  0  0               |    0  0 -1  0 -1  0 -1  0  0
    1 -1  0  0 -1  0  0 -1  1               |    1 -1  0  0 -1  0  0 -1  1
   -1  1  0  0  1  0  0  1 -1               |   -1  1  0  0  1  0  0  1 -1
    0  0 -1  1  0 -1  0  1 -1               |    0  0 -1  1  0 -1  0  1 -1
    0  0  1 -1  0  1  0 -1  1               |    0  0  1 -1  0  1  0 -1  1
   -1  1  0 -1  0  1 -1  0  0               |   -1  1  0 -1  0  1 -1  0  0
    1 -1  0  1  0 -1  1  0  0               |    1 -1  0  1  0 -1  1  0  0
  typat:                                    |  typat:
    1                                       |    1
  so_psp  :                                 |  so_psp  :
    1                                       |    1

--- !COMMENT
src_file: m_hdr.F90
src_line: 4420
message: |
    input kptopt = 2  /= disk file kptopt = 1
...


--- !WARNING
src_file: m_hdr.F90
src_line: 4441
message: |
    input ival=0 not equal disk file ival=1
...

  tnons:                                    |  tnons:
     0.0000000   0.0000000   0.0000000      |     0.0000000   0.0000000   0.0000000
     0.0000000   0.0000000   0.0000000      |     0.0000000   0.0000000   0.0000000
     0.0000000   0.0000000   0.0000000      |     0.0000000   0.0000000   0.0000000
     0.0000000   0.0000000   0.0000000      |     0.0000000   0.0000000   0.0000000
     0.0000000   0.0000000   0.0000000      |     0.0000000   0.0000000   0.0000000
     0.0000000   0.0000000   0.0000000      |     0.0000000   0.0000000   0.0000000
     0.0000000   0.0000000   0.0000000      |     0.0000000   0.0000000   0.0000000
     0.0000000   0.0000000   0.0000000      |     0.0000000   0.0000000   0.0000000
     0.0000000   0.0000000   0.0000000      |     0.0000000   0.0000000   0.0000000
     0.0000000   0.0000000   0.0000000      |     0.0000000   0.0000000   0.0000000
     0.0000000   0.0000000   0.0000000      |     0.0000000   0.0000000   0.0000000
     0.0000000   0.0000000   0.0000000      |     0.0000000   0.0000000   0.0000000
     0.0000000   0.0000000   0.0000000      |     0.0000000   0.0000000   0.0000000
     0.0000000   0.0000000   0.0000000      |     0.0000000   0.0000000   0.0000000
     0.0000000   0.0000000   0.0000000      |     0.0000000   0.0000000   0.0000000
     0.0000000   0.0000000   0.0000000      |     0.0000000   0.0000000   0.0000000
     0.0000000   0.0000000   0.0000000      |     0.0000000   0.0000000   0.0000000
     0.0000000   0.0000000   0.0000000      |     0.0000000   0.0000000   0.0000000
     0.0000000   0.0000000   0.0000000      |     0.0000000   0.0000000   0.0000000
     0.0000000   0.0000000   0.0000000      |     0.0000000   0.0000000   0.0000000
     0.0000000   0.0000000   0.0000000      |     0.0000000   0.0000000   0.0000000
     0.0000000   0.0000000   0.0000000      |     0.0000000   0.0000000   0.0000000
     0.0000000   0.0000000   0.0000000      |     0.0000000   0.0000000   0.0000000
     0.0000000   0.0000000   0.0000000      |     0.0000000   0.0000000   0.0000000
     0.0000000   0.0000000   0.0000000      |     0.0000000   0.0000000   0.0000000
     0.0000000   0.0000000   0.0000000      |     0.0000000   0.0000000   0.0000000
     0.0000000   0.0000000   0.0000000      |     0.0000000   0.0000000   0.0000000
     0.0000000   0.0000000   0.0000000      |     0.0000000   0.0000000   0.0000000
     0.0000000   0.0000000   0.0000000      |     0.0000000   0.0000000   0.0000000
     0.0000000   0.0000000   0.0000000      |     0.0000000   0.0000000   0.0000000
     0.0000000   0.0000000   0.0000000      |     0.0000000   0.0000000   0.0000000
     0.0000000   0.0000000   0.0000000      |     0.0000000   0.0000000   0.0000000
     0.0000000   0.0000000   0.0000000      |     0.0000000   0.0000000   0.0000000
     0.0000000   0.0000000   0.0000000      |     0.0000000   0.0000000   0.0000000
     0.0000000   0.0000000   0.0000000      |     0.0000000   0.0000000   0.0000000
     0.0000000   0.0000000   0.0000000      |     0.0000000   0.0000000   0.0000000
     0.0000000   0.0000000   0.0000000      |     0.0000000   0.0000000   0.0000000
     0.0000000   0.0000000   0.0000000      |     0.0000000   0.0000000   0.0000000
     0.0000000   0.0000000   0.0000000      |     0.0000000   0.0000000   0.0000000
     0.0000000   0.0000000   0.0000000      |     0.0000000   0.0000000   0.0000000
     0.0000000   0.0000000   0.0000000      |     0.0000000   0.0000000   0.0000000
     0.0000000   0.0000000   0.0000000      |     0.0000000   0.0000000   0.0000000
     0.0000000   0.0000000   0.0000000      |     0.0000000   0.0000000   0.0000000
     0.0000000   0.0000000   0.0000000      |     0.0000000   0.0000000   0.0000000
     0.0000000   0.0000000   0.0000000      |     0.0000000   0.0000000   0.0000000
     0.0000000   0.0000000   0.0000000      |     0.0000000   0.0000000   0.0000000
     0.0000000   0.0000000   0.0000000      |     0.0000000   0.0000000   0.0000000
     0.0000000   0.0000000   0.0000000      |     0.0000000   0.0000000   0.0000000
   znucl:                                   |   znucl:
   13.00                                    |       13.00
  pseudopotential atom type  1:             |  pseudopotential atom type  1:
  pspso   0 pspxc ***                       |  pspso   0 pspxc ***
  pspdat   171102 pspcod    8 zion   3.0    |  pspdat   171102 pspcod    8 zion   3.0
  xred:                                     |  xred:
     0.0000000   0.0000000   0.0000000      |     0.0000000   0.0000000   0.0000000

--- !COMMENT
src_file: m_hdr.F90
src_line: 4715
message: |
    Restart of self-consistent calculation need translated wavefunctions.
...

  Indeed, critical differences between current calculation and
  restart file have been detected in:
        * the number, position, or weight of k-points
        * the format of wavefunctions (istwfk)
================================================================================
-inwffil : will read wavefunctions from disk file /home/fgoudreault/Workspace/abisuite/abisuite/unittests/test_sequencers/files/abinit_Al_smearing_convergence/phonons_runs/tsmear0.1/ngkpt5_5_5/input_data/idat_ngkpt5_5_5_WFK.nc
 initwf: disk file gives npw= 71 nband= 3 for kpt number= 1
 initwf: 3 bands have been initialized from disk
 initwf: disk file gives npw= 74 nband= 3 for kpt number= 2
 initwf: 3 bands have been initialized from disk
 initwf: disk file gives npw= 79 nband= 3 for kpt number= 3
 initwf: 3 bands have been initialized from disk
 initwf: disk file gives npw= 78 nband= 3 for kpt number= 4
 initwf: 3 bands have been initialized from disk
 initwf: disk file gives npw= 77 nband= 3 for kpt number= 5
 initwf: 3 bands have been initialized from disk
 initwf: disk file gives npw= 78 nband= 3 for kpt number= 6
 initwf: 3 bands have been initialized from disk
 initwf: disk file gives npw= 78 nband= 3 for kpt number= 7
 initwf: 3 bands have been initialized from disk
 initwf: disk file gives npw= 79 nband= 3 for kpt number= 8
 initwf: 3 bands have been initialized from disk
 initwf: disk file gives npw= 80 nband= 3 for kpt number= 9
 initwf: 3 bands have been initialized from disk
 initwf: disk file gives npw= 82 nband= 3 for kpt number= 10
 initwf: 3 bands have been initialized from disk
 initwf: disk file gives npw= 75 nband= 3 for kpt number= 11
 initwf: 3 bands have been initialized from disk
 initwf: disk file gives npw= 77 nband= 3 for kpt number= 12
 initwf: 3 bands have been initialized from disk
 initwf: disk file gives npw= 78 nband= 3 for kpt number= 13
 initwf: 3 bands have been initialized from disk
 initwf: disk file gives npw= 77 nband= 3 for kpt number= 14
 initwf: 3 bands have been initialized from disk
 initwf: disk file gives npw= 77 nband= 3 for kpt number= 15
 initwf: 3 bands have been initialized from disk
 initwf: disk file gives npw= 78 nband= 3 for kpt number= 16
 initwf: 3 bands have been initialized from disk
- newkpt: read input wf with ikpt,npw=   1      71, make ikpt,npw=   1      71
- newkpt: read input wf with ikpt,npw=   1      71, make ikpt,npw=   2      71
- newkpt: read input wf with ikpt,npw=   1      71, make ikpt,npw=   3      71
- newkpt: read input wf with ikpt,npw=   2      74, make ikpt,npw=   4      74
- newkpt: read input wf with ikpt,npw=   3      79, make ikpt,npw=   5      79
- newkpt: read input wf with ikpt,npw=   4      78, make ikpt,npw=   6      78
- newkpt: read input wf with ikpt,npw=   3      79, make ikpt,npw=   7      79
- newkpt: read input wf with ikpt,npw=   3      79, make ikpt,npw=   8      79
- newkpt: read input wf with ikpt,npw=   4      78, make ikpt,npw=   9      78
- newkpt: read input wf with ikpt,npw=   2      74, make ikpt,npw=  10      74
- newkpt: read input wf with ikpt,npw=   4      78, make ikpt,npw=  11      78
- newkpt: read input wf with ikpt,npw=   4      78, make ikpt,npw=  12      78
- newkpt: read input wf with ikpt,npw=   2      74, make ikpt,npw=  13      74
- newkpt: read input wf with ikpt,npw=   5      77, make ikpt,npw=  14      77
- newkpt: read input wf with ikpt,npw=   6      78, make ikpt,npw=  15      78
- newkpt: read input wf with ikpt,npw=   7      78, make ikpt,npw=  16      78
- newkpt: read input wf with ikpt,npw=   8      79, make ikpt,npw=  17      79
- newkpt: read input wf with ikpt,npw=   9      80, make ikpt,npw=  18      80
- newkpt: read input wf with ikpt,npw=  10      82, make ikpt,npw=  19      82
- newkpt: read input wf with ikpt,npw=   8      79, make ikpt,npw=  20      79
- newkpt: read input wf with ikpt,npw=   8      79, make ikpt,npw=  21      79
- newkpt: read input wf with ikpt,npw=   9      80, make ikpt,npw=  22      80
- newkpt: read input wf with ikpt,npw=  10      82, make ikpt,npw=  23      82
- newkpt: read input wf with ikpt,npw=   6      78, make ikpt,npw=  24      78
- newkpt: read input wf with ikpt,npw=   9      80, make ikpt,npw=  25      80
- newkpt: read input wf with ikpt,npw=   9      80, make ikpt,npw=  26      80
- newkpt: read input wf with ikpt,npw=   6      78, make ikpt,npw=  27      78
- newkpt: read input wf with ikpt,npw=   7      78, make ikpt,npw=  28      78
- newkpt: read input wf with ikpt,npw=   5      77, make ikpt,npw=  29      77
- newkpt: read input wf with ikpt,npw=   7      78, make ikpt,npw=  30      78
- newkpt: read input wf with ikpt,npw=  10      82, make ikpt,npw=  31      82
- newkpt: read input wf with ikpt,npw=  10      82, make ikpt,npw=  32      82
- newkpt: read input wf with ikpt,npw=   7      78, make ikpt,npw=  33      78
- newkpt: read input wf with ikpt,npw=   5      77, make ikpt,npw=  34      77
- newkpt: read input wf with ikpt,npw=  11      75, make ikpt,npw=  35      75
- newkpt: read input wf with ikpt,npw=  12      77, make ikpt,npw=  36      77
- newkpt: read input wf with ikpt,npw=   4      78, make ikpt,npw=  37      78
- newkpt: read input wf with ikpt,npw=  13      78, make ikpt,npw=  38      78
- newkpt: read input wf with ikpt,npw=  10      82, make ikpt,npw=  39      82
- newkpt: read input wf with ikpt,npw=   9      80, make ikpt,npw=  40      80
- newkpt: read input wf with ikpt,npw=  14      77, make ikpt,npw=  41      77
- newkpt: read input wf with ikpt,npw=  15      77, make ikpt,npw=  42      77
- newkpt: read input wf with ikpt,npw=  16      78, make ikpt,npw=  43      78
- newkpt: read input wf with ikpt,npw=  15      77, make ikpt,npw=  44      77
- newkpt: read input wf with ikpt,npw=  14      77, make ikpt,npw=  45      77
- newkpt: read input wf with ikpt,npw=  14      77, make ikpt,npw=  46      77
- newkpt: read input wf with ikpt,npw=  15      77, make ikpt,npw=  47      77
- newkpt: read input wf with ikpt,npw=  16      78, make ikpt,npw=  48      78
- newkpt: read input wf with ikpt,npw=  15      77, make ikpt,npw=  49      77
- newkpt: read input wf with ikpt,npw=  13      78, make ikpt,npw=  50      78
- newkpt: prtvol=0 or 1, do not print more k-points.

 respfn : eigen0 array
 symatm: atom number 1 is reached starting at atom
   1  1  1  1  1  1  1  1  1  1  1  1  1  1  1  1  1  1  1  1  1  1  1  1
   1  1  1  1  1  1  1  1  1  1  1  1  1  1  1  1  1  1  1  1  1  1  1  1
 newocc: new Fermi energy is       0.286041 , with nelect=      3.000000, Number of bisection calls: 47

 getcut: wavevector=  0.0000  0.0000  0.0000  ngfft=  12  12  12
         ecut(hartree)=      6.000   => boxcut(ratio)=   2.02508
 mkrho: echo density (plane-wave part only)
 Total charge density [el/Bohr^3]
      Maximum=    3.2569E-02  at reduced coord.    0.8333    0.8333    0.9167
      Minimum=    1.7325E-03  at reduced coord.    0.0000    0.0000    0.0000
   Integrated=    3.0000E+00

 1/G**2 cut-off applied in the following step : cutoff-mode = CRYSTAL

 1/G**2 cut-off applied in the following step : cutoff-mode = CRYSTAL

 ==> Calculation of the frozen part of the second order derivatives, this can take some time...


 ==> Calculation of the frozen part of the second order derivative done


 1/G**2 cut-off applied in the following step : cutoff-mode = CRYSTAL

 ==>  initialize data related to q vector <== 

 respfn : the norm of the phonon wavelength (as input) was small (<1.d-7).
  q has been set exactly to (0 0 0)
 The list of irreducible perturbations for this q vector is:
    1)    idir= 1    ipert=   1

================================================================================
 Real(R)+Recip(G) space primitive vectors, cartesian coordinates (Bohr,Bohr^-1):
 R(1)=  0.0000000  3.8000000  3.8000000  G(1)= -0.1315789  0.1315789  0.1315789
 R(2)=  3.8000000  0.0000000  3.8000000  G(2)=  0.1315789 -0.1315789  0.1315789
 R(3)=  3.8000000  3.8000000  0.0000000  G(3)=  0.1315789  0.1315789 -0.1315789
 Unit cell volume ucvol=  1.0974400E+02 bohr^3
 Unit cell volume ucvol=  1.0974400E+02 bohr^3
 Angles (23,13,12)=  6.00000000E+01  6.00000000E+01  6.00000000E+01 degrees
 Angles (23,13,12)=  6.00000000E+01  6.00000000E+01  6.00000000E+01 degrees

 getcut: wavevector=  0.0000  0.0000  0.0000  ngfft=  12  12  12
         ecut(hartree)=      6.000   => boxcut(ratio)=   2.02508

 The perturbation idir=   2  ipert=   1 is
 symmetric of a previously calculated perturbation.
 So, its SCF calculation is not needed.


 The perturbation idir=   3  ipert=   1 is
 symmetric of a previously calculated perturbation.
 So, its SCF calculation is not needed.


--------------------------------------------------------------------------------
 Perturbation wavevector (in red.coord.)   0.000000  0.000000  0.000000
 Perturbation : displacement of atom   1   along direction   1
 littlegroup_pert: found     4 symmetries that leave the perturbation invariant:
   1   0   0   0   1   0   0   0   1
   1   0   0   1   0  -1   1  -1   0
   1   0   0   1  -1   0   1   0  -1
   1   0   0   0   0   1   0   1   0
 symatm: atom number 1 is reached starting at atom
   1  1  1  1
 symkpt : the number of k-points, thanks to the symmetries,
 is reduced to    78 .
 getmpw: optimal value of mpw= 82
- File: /home/fgoudreault/Workspace/abisuite/abisuite/unittests/test_sequencers/files/abinit_Al_smearing_convergence/phonons_runs/tsmear0.1/ngkpt5_5_5/input_data/idat_ngkpt5_5_5_WFK does not exist but found netcdf file with similar name.
- Opening HDf5 file with MPI-IO support: /home/fgoudreault/Workspace/abisuite/abisuite/unittests/test_sequencers/files/abinit_Al_smearing_convergence/phonons_runs/tsmear0.1/ngkpt5_5_5/input_data/idat_ngkpt5_5_5_WFK.nc
 inwffil: examining the header of disk file: /home/fgoudreault/Workspace/abisuite/abisuite/unittests/test_sequencers/files/abinit_Al_smearing_convergence/phonons_runs/tsmear0.1/ngkpt5_5_5/input_data/idat_ngkpt5_5_5_WFK.nc

================================================================================

          - hdr_check: checking restart file header for consistency -


          current calculation                           restart file
          -------------------                           ------------

  calculation expects a wf_planewave        |  input file contains a wf_planewave
. ABINIT  code version 9.5.1                |  ABINIT  code version 9.5.1
. date 20210420 bantot      234 natom    1  |  date 20210420 bantot       57 natom    1
  nkpt      78 nsym 48 ngfft  12,  12,  12  |  nkpt      19 nsym 48 ngfft  12,  12,  12
  ntypat  1 ecut_eff   6.0000000            |  ntypat  1 ecut_eff   6.0000000
  usepaw  0                                 |  usepaw  0
  usewvl  0                                 |  usewvl  0
  rprimd:                                   |  rprimd:
     0.0000000   3.8000000   3.8000000      |     0.0000000   3.8000000   3.8000000
     3.8000000   0.0000000   3.8000000      |     3.8000000   0.0000000   3.8000000
     3.8000000   3.8000000   0.0000000      |     3.8000000   3.8000000   0.0000000

--- !COMMENT
src_file: m_hdr.F90
src_line: 4172
message: |
    input nkpt=78 not equal disk file nkpt=19
...

  symafm:                                   |  symafm:
    1  1  1  1  1  1  1  1  1  1  1  1      |    1  1  1  1  1  1  1  1  1  1  1  1
    1  1  1  1  1  1  1  1  1  1  1  1      |    1  1  1  1  1  1  1  1  1  1  1  1
    1  1  1  1  1  1  1  1  1  1  1  1      |    1  1  1  1  1  1  1  1  1  1  1  1
    1  1  1  1  1  1  1  1  1  1  1  1      |    1  1  1  1  1  1  1  1  1  1  1  1
  symrel:                                   |  symrel:
    1  0  0  0  1  0  0  0  1               |    1  0  0  0  1  0  0  0  1
   -1  0  0  0 -1  0  0  0 -1               |   -1  0  0  0 -1  0  0  0 -1
    0 -1  1  0 -1  0  1 -1  0               |    0 -1  1  0 -1  0  1 -1  0
    0  1 -1  0  1  0 -1  1  0               |    0  1 -1  0  1  0 -1  1  0
   -1  0  0 -1  0  1 -1  1  0               |   -1  0  0 -1  0  1 -1  1  0
    1  0  0  1  0 -1  1 -1  0               |    1  0  0  1  0 -1  1 -1  0
    0  1 -1  1  0 -1  0  0 -1               |    0  1 -1  1  0 -1  0  0 -1
    0 -1  1 -1  0  1  0  0  1               |    0 -1  1 -1  0  1  0  0  1
   -1  0  0 -1  1  0 -1  0  1               |   -1  0  0 -1  1  0 -1  0  1
    1  0  0  1 -1  0  1  0 -1               |    1  0  0  1 -1  0  1  0 -1
    0 -1  1  1 -1  0  0 -1  0               |    0 -1  1  1 -1  0  0 -1  0
    0  1 -1 -1  1  0  0  1  0               |    0  1 -1 -1  1  0  0  1  0
    1  0  0  0  0  1  0  1  0               |    1  0  0  0  0  1  0  1  0
   -1  0  0  0  0 -1  0 -1  0               |   -1  0  0  0  0 -1  0 -1  0
    0  1 -1  0  0 -1  1  0 -1               |    0  1 -1  0  0 -1  1  0 -1
    0 -1  1  0  0  1 -1  0  1               |    0 -1  1  0  0  1 -1  0  1
   -1  0  1 -1  1  0 -1  0  0               |   -1  0  1 -1  1  0 -1  0  0
    1  0 -1  1 -1  0  1  0  0               |    1  0 -1  1 -1  0  1  0  0
    0 -1  0  1 -1  0  0 -1  1               |    0 -1  0  1 -1  0  0 -1  1
    0  1  0 -1  1  0  0  1 -1               |    0  1  0 -1  1  0  0  1 -1
    1  0 -1  0  0 -1  0  1 -1               |    1  0 -1  0  0 -1  0  1 -1
   -1  0  1  0  0  1  0 -1  1               |   -1  0  1  0  0  1  0 -1  1
    0  1  0  0  0  1  1  0  0               |    0  1  0  0  0  1  1  0  0
    0 -1  0  0  0 -1 -1  0  0               |    0 -1  0  0  0 -1 -1  0  0
    1  0 -1  0  1 -1  0  0 -1               |    1  0 -1  0  1 -1  0  0 -1
   -1  0  1  0 -1  1  0  0  1               |   -1  0  1  0 -1  1  0  0  1
    0 -1  0  0 -1  1  1 -1  0               |    0 -1  0  0 -1  1  1 -1  0
    0  1  0  0  1 -1 -1  1  0               |    0  1  0  0  1 -1 -1  1  0
   -1  0  1 -1  0  0 -1  1  0               |   -1  0  1 -1  0  0 -1  1  0
    1  0 -1  1  0  0  1 -1  0               |    1  0 -1  1  0  0  1 -1  0
    0  1  0  1  0  0  0  0  1               |    0  1  0  1  0  0  0  0  1
    0 -1  0 -1  0  0  0  0 -1               |    0 -1  0 -1  0  0  0  0 -1
    0  0 -1  0  1 -1  1  0 -1               |    0  0 -1  0  1 -1  1  0 -1
    0  0  1  0 -1  1 -1  0  1               |    0  0  1  0 -1  1 -1  0  1
    1 -1  0  0 -1  1  0 -1  0               |    1 -1  0  0 -1  1  0 -1  0
   -1  1  0  0  1 -1  0  1  0               |   -1  1  0  0  1 -1  0  1  0
    0  0  1  1  0  0  0  1  0               |    0  0  1  1  0  0  0  1  0
    0  0 -1 -1  0  0  0 -1  0               |    0  0 -1 -1  0  0  0 -1  0
   -1  1  0 -1  0  0 -1  0  1               |   -1  1  0 -1  0  0 -1  0  1
    1 -1  0  1  0  0  1  0 -1               |    1 -1  0  1  0  0  1  0 -1
    0  0  1  0  1  0  1  0  0               |    0  0  1  0  1  0  1  0  0
    0  0 -1  0 -1  0 -1  0  0               |    0  0 -1  0 -1  0 -1  0  0
    1 -1  0  0 -1  0  0 -1  1               |    1 -1  0  0 -1  0  0 -1  1
   -1  1  0  0  1  0  0  1 -1               |   -1  1  0  0  1  0  0  1 -1
    0  0 -1  1  0 -1  0  1 -1               |    0  0 -1  1  0 -1  0  1 -1
    0  0  1 -1  0  1  0 -1  1               |    0  0  1 -1  0  1  0 -1  1
   -1  1  0 -1  0  1 -1  0  0               |   -1  1  0 -1  0  1 -1  0  0
    1 -1  0  1  0 -1  1  0  0               |    1 -1  0  1  0 -1  1  0  0
  typat:                                    |  typat:
    1                                       |    1
  so_psp  :                                 |  so_psp  :
    1                                       |    1

--- !COMMENT
src_file: m_hdr.F90
src_line: 4420
message: |
    input kptopt = 2  /= disk file kptopt = 1
...


--- !WARNING
src_file: m_hdr.F90
src_line: 4441
message: |
    input ival=0 not equal disk file ival=1
...

  tnons:                                    |  tnons:
     0.0000000   0.0000000   0.0000000      |     0.0000000   0.0000000   0.0000000
     0.0000000   0.0000000   0.0000000      |     0.0000000   0.0000000   0.0000000
     0.0000000   0.0000000   0.0000000      |     0.0000000   0.0000000   0.0000000
     0.0000000   0.0000000   0.0000000      |     0.0000000   0.0000000   0.0000000
     0.0000000   0.0000000   0.0000000      |     0.0000000   0.0000000   0.0000000
     0.0000000   0.0000000   0.0000000      |     0.0000000   0.0000000   0.0000000
     0.0000000   0.0000000   0.0000000      |     0.0000000   0.0000000   0.0000000
     0.0000000   0.0000000   0.0000000      |     0.0000000   0.0000000   0.0000000
     0.0000000   0.0000000   0.0000000      |     0.0000000   0.0000000   0.0000000
     0.0000000   0.0000000   0.0000000      |     0.0000000   0.0000000   0.0000000
     0.0000000   0.0000000   0.0000000      |     0.0000000   0.0000000   0.0000000
     0.0000000   0.0000000   0.0000000      |     0.0000000   0.0000000   0.0000000
     0.0000000   0.0000000   0.0000000      |     0.0000000   0.0000000   0.0000000
     0.0000000   0.0000000   0.0000000      |     0.0000000   0.0000000   0.0000000
     0.0000000   0.0000000   0.0000000      |     0.0000000   0.0000000   0.0000000
     0.0000000   0.0000000   0.0000000      |     0.0000000   0.0000000   0.0000000
     0.0000000   0.0000000   0.0000000      |     0.0000000   0.0000000   0.0000000
     0.0000000   0.0000000   0.0000000      |     0.0000000   0.0000000   0.0000000
     0.0000000   0.0000000   0.0000000      |     0.0000000   0.0000000   0.0000000
     0.0000000   0.0000000   0.0000000      |     0.0000000   0.0000000   0.0000000
     0.0000000   0.0000000   0.0000000      |     0.0000000   0.0000000   0.0000000
     0.0000000   0.0000000   0.0000000      |     0.0000000   0.0000000   0.0000000
     0.0000000   0.0000000   0.0000000      |     0.0000000   0.0000000   0.0000000
     0.0000000   0.0000000   0.0000000      |     0.0000000   0.0000000   0.0000000
     0.0000000   0.0000000   0.0000000      |     0.0000000   0.0000000   0.0000000
     0.0000000   0.0000000   0.0000000      |     0.0000000   0.0000000   0.0000000
     0.0000000   0.0000000   0.0000000      |     0.0000000   0.0000000   0.0000000
     0.0000000   0.0000000   0.0000000      |     0.0000000   0.0000000   0.0000000
     0.0000000   0.0000000   0.0000000      |     0.0000000   0.0000000   0.0000000
     0.0000000   0.0000000   0.0000000      |     0.0000000   0.0000000   0.0000000
     0.0000000   0.0000000   0.0000000      |     0.0000000   0.0000000   0.0000000
     0.0000000   0.0000000   0.0000000      |     0.0000000   0.0000000   0.0000000
     0.0000000   0.0000000   0.0000000      |     0.0000000   0.0000000   0.0000000
     0.0000000   0.0000000   0.0000000      |     0.0000000   0.0000000   0.0000000
     0.0000000   0.0000000   0.0000000      |     0.0000000   0.0000000   0.0000000
     0.0000000   0.0000000   0.0000000      |     0.0000000   0.0000000   0.0000000
     0.0000000   0.0000000   0.0000000      |     0.0000000   0.0000000   0.0000000
     0.0000000   0.0000000   0.0000000      |     0.0000000   0.0000000   0.0000000
     0.0000000   0.0000000   0.0000000      |     0.0000000   0.0000000   0.0000000
     0.0000000   0.0000000   0.0000000      |     0.0000000   0.0000000   0.0000000
     0.0000000   0.0000000   0.0000000      |     0.0000000   0.0000000   0.0000000
     0.0000000   0.0000000   0.0000000      |     0.0000000   0.0000000   0.0000000
     0.0000000   0.0000000   0.0000000      |     0.0000000   0.0000000   0.0000000
     0.0000000   0.0000000   0.0000000      |     0.0000000   0.0000000   0.0000000
     0.0000000   0.0000000   0.0000000      |     0.0000000   0.0000000   0.0000000
     0.0000000   0.0000000   0.0000000      |     0.0000000   0.0000000   0.0000000
     0.0000000   0.0000000   0.0000000      |     0.0000000   0.0000000   0.0000000
     0.0000000   0.0000000   0.0000000      |     0.0000000   0.0000000   0.0000000
   znucl:                                   |   znucl:
   13.00                                    |       13.00
  pseudopotential atom type  1:             |  pseudopotential atom type  1:
  pspso   0 pspxc ***                       |  pspso   0 pspxc ***
  pspdat   171102 pspcod    8 zion   3.0    |  pspdat   171102 pspcod    8 zion   3.0
  xred:                                     |  xred:
     0.0000000   0.0000000   0.0000000      |     0.0000000   0.0000000   0.0000000

--- !COMMENT
src_file: m_hdr.F90
src_line: 4715
message: |
    Restart of self-consistent calculation need translated wavefunctions.
...

  Indeed, critical differences between current calculation and
  restart file have been detected in:
        * the number, position, or weight of k-points
        * the format of wavefunctions (istwfk)
================================================================================
-inwffil : will read wavefunctions from disk file /home/fgoudreault/Workspace/abisuite/abisuite/unittests/test_sequencers/files/abinit_Al_smearing_convergence/phonons_runs/tsmear0.1/ngkpt5_5_5/input_data/idat_ngkpt5_5_5_WFK.nc
 initwf: disk file gives npw= 71 nband= 3 for kpt number= 1
 initwf: 3 bands have been initialized from disk
 initwf: disk file gives npw= 74 nband= 3 for kpt number= 2
 initwf: 3 bands have been initialized from disk
 initwf: disk file gives npw= 79 nband= 3 for kpt number= 3
 initwf: 3 bands have been initialized from disk
 initwf: disk file gives npw= 78 nband= 3 for kpt number= 4
 initwf: 3 bands have been initialized from disk
 initwf: disk file gives npw= 77 nband= 3 for kpt number= 5
 initwf: 3 bands have been initialized from disk
 initwf: disk file gives npw= 78 nband= 3 for kpt number= 6
 initwf: 3 bands have been initialized from disk
 initwf: disk file gives npw= 78 nband= 3 for kpt number= 7
 initwf: 3 bands have been initialized from disk
 initwf: disk file gives npw= 79 nband= 3 for kpt number= 8
 initwf: 3 bands have been initialized from disk
 initwf: disk file gives npw= 80 nband= 3 for kpt number= 9
 initwf: 3 bands have been initialized from disk
 initwf: disk file gives npw= 82 nband= 3 for kpt number= 10
 initwf: 3 bands have been initialized from disk
- newkpt: read input wf with ikpt,npw=   1      71, make ikpt,npw=   1      71
- newkpt: read input wf with ikpt,npw=   1      71, make ikpt,npw=   2      71
- newkpt: read input wf with ikpt,npw=   2      74, make ikpt,npw=   3      74
- newkpt: read input wf with ikpt,npw=   3      79, make ikpt,npw=   4      79
- newkpt: read input wf with ikpt,npw=   4      78, make ikpt,npw=   5      78
- newkpt: read input wf with ikpt,npw=   3      79, make ikpt,npw=   6      79
- newkpt: read input wf with ikpt,npw=   2      74, make ikpt,npw=   7      74
- newkpt: read input wf with ikpt,npw=   4      78, make ikpt,npw=   8      78
- newkpt: read input wf with ikpt,npw=   4      78, make ikpt,npw=   9      78
- newkpt: read input wf with ikpt,npw=   5      77, make ikpt,npw=  10      77
- newkpt: read input wf with ikpt,npw=   6      78, make ikpt,npw=  11      78
- newkpt: read input wf with ikpt,npw=   7      78, make ikpt,npw=  12      78
- newkpt: read input wf with ikpt,npw=   8      79, make ikpt,npw=  13      79
- newkpt: read input wf with ikpt,npw=   9      80, make ikpt,npw=  14      80
- newkpt: read input wf with ikpt,npw=  10      82, make ikpt,npw=  15      82
- newkpt: read input wf with ikpt,npw=   8      79, make ikpt,npw=  16      79
- newkpt: read input wf with ikpt,npw=   6      78, make ikpt,npw=  17      78
- newkpt: read input wf with ikpt,npw=   9      80, make ikpt,npw=  18      80
- newkpt: read input wf with ikpt,npw=   9      80, make ikpt,npw=  19      80
- newkpt: read input wf with ikpt,npw=   5      77, make ikpt,npw=  20      77
 getmpw: optimal value of mpw= 82
 qpt is Gamma, psi_k+q initialized from psi_k in memory
 dfpt_looppert : total number of electrons, from k and k+q
  fully or partially occupied states are    3.000000E+00 and    3.000000E+00.
 Initialisation of the first-order wave-functions :
  ireadwf=   0
 wfconv:3 bands set=0 with npw=71, for ikpt=1
 wfconv:3 bands set=0 with npw=71, for ikpt=2
 wfconv:3 bands set=0 with npw=74, for ikpt=3
 wfconv:3 bands set=0 with npw=79, for ikpt=4
 wfconv:3 bands set=0 with npw=78, for ikpt=5
 wfconv:3 bands set=0 with npw=79, for ikpt=6
 wfconv:3 bands set=0 with npw=74, for ikpt=7
 wfconv:3 bands set=0 with npw=78, for ikpt=8
 wfconv:3 bands set=0 with npw=78, for ikpt=9
 wfconv:3 bands set=0 with npw=77, for ikpt=10
 wfconv:3 bands set=0 with npw=78, for ikpt=11
 wfconv:3 bands set=0 with npw=78, for ikpt=12
 wfconv:3 bands set=0 with npw=79, for ikpt=13
 wfconv:3 bands set=0 with npw=80, for ikpt=14
 wfconv:3 bands set=0 with npw=82, for ikpt=15
 wfconv:3 bands set=0 with npw=79, for ikpt=16
 wfconv:3 bands set=0 with npw=78, for ikpt=17
 wfconv:3 bands set=0 with npw=80, for ikpt=18
 wfconv:3 bands set=0 with npw=80, for ikpt=19
 wfconv:3 bands set=0 with npw=77, for ikpt=20
 Initializing rhor1 from valence densities taken from pseudopotential files

 getcut: wavevector=  0.0000  0.0000  0.0000  ngfft=  12  12  12
         ecut(hartree)=      6.000   => boxcut(ratio)=   2.02508

 1/G**2 cut-off applied in the following step : cutoff-mode = CRYSTAL

 ITER STEP NUMBER     1
-ETOT  1   4.3093400844267     -6.824E+00 2.038E-02 1.829E+00

 Simple mixing update:
  residual square of the potential:    1.2791044339223008
 dfpt_scfcv: previous iteration took  0.04 [s]

 ITER STEP NUMBER     2
 ETOT  2   4.3053254381598     -4.015E-03 1.433E-05 2.114E-02

 Pulay update with  1 previous iterations:
 mixing of old trial potential: alpha(m:m-4)=   1.10     -0.986E-01
 dfpt_scfcv: previous iteration took  0.02 [s]

 ITER STEP NUMBER     3
 ETOT  3   4.3052723220254     -5.312E-05 1.541E-07 6.255E-05

 Pulay update with  2 previous iterations:
 mixing of old trial potential: alpha(m:m-4)=   1.10     -0.111      0.854E-02
 dfpt_scfcv: previous iteration took  0.03 [s]

 ITER STEP NUMBER     4
 ETOT  4   4.3052721275026     -1.945E-07 8.885E-10 2.211E-07

 Pulay update with  3 previous iterations:
 mixing of old trial potential: alpha(m:m-4)=   1.11     -0.119      0.919E-02 -0.590E-03
 dfpt_scfcv: previous iteration took  0.02 [s]

 ITER STEP NUMBER     5
 ETOT  5   4.3052721270504     -4.522E-10 2.294E-12 7.814E-10

 At SCF step    5       vres2   =  7.81E-10 < tolvrs=  1.00E-08 =>converged.

 fftdatar_write: About to write data to: /home/fgoudreault/Workspace/abisuite/abisuite/unittests/test_sequencers/files/abinit_Al_smearing_convergence/phonons_runs/tsmear0.1/ngkpt5_5_5/run/output_data/odat_ngkpt5_5_5_DEN1 with iomode: IO_MODE_ETSF
- Creating HDf5 file with MPI-IO support: /home/fgoudreault/Workspace/abisuite/abisuite/unittests/test_sequencers/files/abinit_Al_smearing_convergence/phonons_runs/tsmear0.1/ngkpt5_5_5/run/output_data/odat_ngkpt5_5_5_DEN1.nc
- Opening HDf5 file with MPI-IO support: /home/fgoudreault/Workspace/abisuite/abisuite/unittests/test_sequencers/files/abinit_Al_smearing_convergence/phonons_runs/tsmear0.1/ngkpt5_5_5/run/output_data/odat_ngkpt5_5_5_DEN1.nc
 IO operation completed. cpu:  0.04 [s] , wall:  0.05 [s] <<< TIME

 fftdatar_write: About to write data to: /home/fgoudreault/Workspace/abisuite/abisuite/unittests/test_sequencers/files/abinit_Al_smearing_convergence/phonons_runs/tsmear0.1/ngkpt5_5_5/run/output_data/odat_ngkpt5_5_5_POT1 with iomode: IO_MODE_ETSF
- Creating HDf5 file with MPI-IO support: /home/fgoudreault/Workspace/abisuite/abisuite/unittests/test_sequencers/files/abinit_Al_smearing_convergence/phonons_runs/tsmear0.1/ngkpt5_5_5/run/output_data/odat_ngkpt5_5_5_POT1.nc
- Opening HDf5 file with MPI-IO support: /home/fgoudreault/Workspace/abisuite/abisuite/unittests/test_sequencers/files/abinit_Al_smearing_convergence/phonons_runs/tsmear0.1/ngkpt5_5_5/run/output_data/odat_ngkpt5_5_5_POT1.nc
 IO operation completed. cpu:  0.04 [s] , wall:  0.05 [s] <<< TIME
- Opening HDf5 file with MPI-IO support: /home/fgoudreault/Workspace/abisuite/abisuite/unittests/test_sequencers/files/abinit_Al_smearing_convergence/phonons_runs/tsmear0.1/ngkpt5_5_5/run/output_data/odat_ngkpt5_5_5_POT1.nc
================================================================================

 ----iterations are completed or convergence reached----

 Mean square residual over all n,k,spin=   76.373E-14; max=  22.940E-13
  -0.1000 -0.2000  0.0000    1  1.40717E-12 kpt; spin; max resid(k); each band:
   1.41E-12 -1.00E-01 -1.00E-01
  -0.2000 -0.1000  0.0000    1  1.00379E-12 kpt; spin; max resid(k); each band:
   1.00E-12 -1.00E-01 -1.00E-01
  -0.1000 -0.4000  0.0000    1  1.32003E-12 kpt; spin; max resid(k); each band:
   1.32E-12 -1.00E-01 -1.00E-01
  -0.2000 -0.3000  0.0000    1  1.89415E-12 kpt; spin; max resid(k); each band:
   1.89E-12 -1.00E-01 -1.00E-01
  -0.1000 -0.3000  0.1000    1  1.69163E-12 kpt; spin; max resid(k); each band:
   1.69E-12 -1.00E-01 -1.00E-01
  -0.3000 -0.2000  0.0000    1  4.87690E-13 kpt; spin; max resid(k); each band:
   4.88E-13 -1.00E-01 -1.00E-01
  -0.4000 -0.1000  0.0000    1  4.09011E-13 kpt; spin; max resid(k); each band:
   4.09E-13 -1.00E-01 -1.00E-01
  -0.3000 -0.1000  0.1000    1  9.26835E-13 kpt; spin; max resid(k); each band:
   9.27E-13 -1.00E-01 -1.00E-01
  -0.2000 -0.1000  0.2000    1  1.79874E-12 kpt; spin; max resid(k); each band:
   1.80E-12 -1.00E-01 -1.00E-01
  -0.1000  0.4000  0.0000    1  4.05881E-13 kpt; spin; max resid(k); each band:
   4.06E-13 -1.00E-01 -1.00E-01
  -0.2000  0.5000  0.0000    1  1.59278E-12 kpt; spin; max resid(k); each band:
   1.59E-12 -1.00E-01 -1.00E-01
  -0.1000  0.5000  0.1000    1  3.82701E-13 kpt; spin; max resid(k); each band:
   3.83E-13 -1.00E-01 -1.00E-01
  -0.3000 -0.4000  0.0000    1  1.23973E-12 kpt; spin; max resid(k); each band:
   1.24E-12 -1.00E-01 -1.00E-01
  -0.2000 -0.4000  0.1000    1  6.87260E-13 kpt; spin; max resid(k); each band:
   6.87E-13 -1.00E-01 -1.00E-01
  -0.1000 -0.4000  0.2000    1  1.26783E-13 kpt; spin; max resid(k); each band:
   1.27E-13 -1.00E-01 -1.00E-01
  -0.4000 -0.3000  0.0000    1  5.04830E-13 kpt; spin; max resid(k); each band:
   5.05E-13 -1.00E-01 -1.00E-01
   0.5000 -0.2000  0.0000    1  4.91546E-13 kpt; spin; max resid(k); each band:
   4.92E-13 -1.00E-01 -1.00E-01
  -0.4000 -0.2000  0.1000    1  4.51040E-13 kpt; spin; max resid(k); each band:
   4.51E-13 -1.00E-01 -1.00E-01
  -0.3000 -0.2000  0.2000    1  1.78467E-12 kpt; spin; max resid(k); each band:
   1.78E-12 -1.00E-01 -1.00E-01
   0.4000 -0.1000  0.0000    1  8.19282E-13 kpt; spin; max resid(k); each band:
   8.19E-13 -1.00E-01 -1.00E-01
   0.5000 -0.1000  0.1000    1  7.16723E-13 kpt; spin; max resid(k); each band:
   7.17E-13 -1.00E-01 -1.00E-01
  -0.4000 -0.1000  0.2000    1  1.08944E-12 kpt; spin; max resid(k); each band:
   1.09E-12 -1.00E-01 -1.00E-01
  -0.3000 -0.1000  0.3000    1  1.09710E-12 kpt; spin; max resid(k); each band:
   1.10E-12 -1.00E-01 -1.00E-01
  -0.2000 -0.1000  0.4000    1  5.54918E-13 kpt; spin; max resid(k); each band:
   5.55E-13 -1.00E-01 -1.00E-01
  -0.1000  0.2000  0.0000    1  3.30436E-13 kpt; spin; max resid(k); each band:
   3.30E-13 -1.00E-01 -1.00E-01
  -0.2000  0.3000  0.0000    1  8.30331E-13 kpt; spin; max resid(k); each band:
   8.30E-13 -1.00E-01 -1.00E-01
  -0.1000  0.3000  0.1000    1  7.07035E-13 kpt; spin; max resid(k); each band:
   7.07E-13 -1.00E-01 -1.00E-01
  -0.3000  0.4000  0.0000    1  1.07025E-12 kpt; spin; max resid(k); each band:
   1.07E-12 -1.00E-01 -1.00E-01
  -0.2000  0.4000  0.1000    1  4.84145E-13 kpt; spin; max resid(k); each band:
   4.84E-13 -1.00E-01 -1.00E-01
  -0.1000  0.4000  0.2000    1  1.68632E-12 kpt; spin; max resid(k); each band:
   1.69E-12 -1.00E-01 -1.00E-01
  -0.4000  0.5000  0.0000    1  2.41120E-13 kpt; spin; max resid(k); each band:
   2.41E-13 -1.00E-01 -1.00E-01
  -0.3000  0.5000  0.1000    1  1.54370E-13 kpt; spin; max resid(k); each band:
   1.54E-13 -1.00E-01 -1.00E-01
  -0.2000  0.5000  0.2000    1  1.02899E-12 kpt; spin; max resid(k); each band:
   1.03E-12 -1.00E-01 -1.00E-01
  -0.1000  0.5000  0.3000    1  7.67768E-13 kpt; spin; max resid(k); each band:
   7.68E-13 -1.00E-01 -1.00E-01
   0.5000 -0.4000  0.0000    1  1.10384E-12 kpt; spin; max resid(k); each band:
   1.10E-12 -1.00E-01 -1.00E-01
   0.4000 -0.3000  0.0000    1  7.89026E-13 kpt; spin; max resid(k); each band:
   7.89E-13 -1.00E-01 -1.00E-01
   0.5000 -0.3000  0.1000    1  7.41227E-13 kpt; spin; max resid(k); each band:
   7.41E-13 -1.00E-01 -1.00E-01
  -0.4000 -0.3000  0.2000    1  6.18861E-13 kpt; spin; max resid(k); each band:
   6.19E-13 -1.00E-01 -1.00E-01
   0.3000 -0.2000  0.0000    1  7.58525E-13 kpt; spin; max resid(k); each band:
   7.59E-13 -1.00E-01 -1.00E-01
   0.5000 -0.2000  0.2000    1  9.16889E-14 kpt; spin; max resid(k); each band:
   9.17E-14 -1.00E-01 -1.00E-01
  -0.4000 -0.2000  0.3000    1  6.71607E-13 kpt; spin; max resid(k); each band:
   6.72E-13 -1.00E-01 -1.00E-01
   0.2000 -0.1000  0.0000    1  1.57524E-12 kpt; spin; max resid(k); each band:
   1.58E-12 -1.00E-01 -1.00E-01
  -0.1000  0.0000  0.0000    1  9.76170E-13 kpt; spin; max resid(k); each band:
   9.76E-13 -1.00E-01 -1.00E-01
  -0.1000  0.1000  0.1000    1  2.29399E-12 kpt; spin; max resid(k); each band:
   2.29E-12 -1.00E-01 -1.00E-01
  -0.2000  0.2000  0.1000    1  6.53218E-13 kpt; spin; max resid(k); each band:
   6.53E-13 -1.00E-01 -1.00E-01
  -0.1000  0.2000  0.2000    1  3.41191E-13 kpt; spin; max resid(k); each band:
   3.41E-13 -1.00E-01 -1.00E-01
  -0.3000  0.3000  0.1000    1  8.69444E-13 kpt; spin; max resid(k); each band:
   8.69E-13 -1.00E-01 -1.00E-01
  -0.2000  0.3000  0.2000    1  4.38191E-13 kpt; spin; max resid(k); each band:
   4.38E-13 -1.00E-01 -1.00E-01
  -0.1000  0.3000  0.3000    1  4.01099E-13 kpt; spin; max resid(k); each band:
   4.01E-13 -1.00E-01 -1.00E-01
  -0.4000  0.4000  0.1000    1  1.19938E-13 kpt; spin; max resid(k); each band:
   1.20E-13 -1.00E-01 -1.00E-01
 outwf : prtvol=0 or 1, do not print more k-points.

in cg_ncwrite with path: /home/fgoudreault/Workspace/abisuite/abisuite/unittests/test_sequencers/files/abinit_Al_smearing_convergence/phonons_runs/tsmear0.1/ngkpt5_5_5/run/output_data/odat_ngkpt5_5_5_1WF1.nc
same layout Writing WFK file: /home/fgoudreault/Workspace/abisuite/abisuite/unittests/test_sequencers/files/abinit_Al_smearing_convergence/phonons_runs/tsmear0.1/ngkpt5_5_5/run/output_data/odat_ngkpt5_5_5_1WF1.nc, with iomode: IO_MODE_ETSF, single writer: F
Using individual IO for the CGs
 collective ncwrite completed. cpu:  0.05 [s] , wall:  0.06 [s] <<< TIME

 Thirteen components of 2nd-order total energy (hartree) are
 1,2,3: 0th-order hamiltonian combined with 1st-order wavefunctions
     kin0=   5.69229678E+00 eigvalue=  -1.93195474E-01  local=  -3.96339690E+00
 4,5,6: 1st-order hamiltonian combined with 1st and 0th-order wfs
 loc psp =   1.08663252E+01  Hartree=   1.36449060E-01     xc=  -1.30683951E-01
 note that "loc psp" includes a xc core correction that could be resolved
 7,8,9: eventually, occupation + non-local contributions
    edocc=   2.25990174E-01     enl0=   5.06047206E+00   enl1=  -2.45221902E+01
 1-9 gives the relaxation energy (to be shifted if some occ is /=2.0)
   erelax=  -6.82793324E+00
 10,11,12 Non-relaxation  contributions : frozen-wavefunctions and Ewald
 fr.local=  -7.66483464E+00 fr.nonlo=   1.94294836E+01  Ewald=   0.00000000E+00
 dfpt_prtene : non-relax=    1.176465E+01
 13,14 Frozen wf xc core corrections (1) and (2)
 frxc 1  =  -2.78431825E+00  frxc 2 =   2.15287466E+00
 Resulting in :
 2DEtotal=    0.4305272127E+01 Ha. Also 2DEtotal=    0.117152412471E+03 eV
    (2DErelax=   -6.8279332388E+00 Ha. 2DEnonrelax=    1.1133205366E+01 Ha)
    (  non-var. 2DEtotal :    4.3052728708E+00 Ha)

================================================================================

 ---- first-order wavefunction calculations are completed ----


 ==> Compute Derivative Database <==
- Creating HDf5 file with MPI-IO support: /home/fgoudreault/Workspace/abisuite/abisuite/unittests/test_sequencers/files/abinit_Al_smearing_convergence/phonons_runs/tsmear0.1/ngkpt5_5_5/run/output_data/odat_ngkpt5_5_5_DDB.nc
 
 phonon wavelength (reduced coordinates) , norm, and energies in hartree
  0.00 0.00 0.00 1.00
  1.740958173E-03  1.740958173E-03  1.740958173E-03

 Zero Point Motion energy (sum of freqs/2)=  2.611437260E-03
  efmasval_free_array : enter 

== END DATASET(S) ==============================================================
================================================================================
  
 -outvars: echo values of variables after computation  --------
 
 These variables are accessible in NetCDF format (/home/fgoudreault/Workspace/abisuite/abisuite/unittests/test_sequencers/files/abinit_Al_smearing_convergence/phonons_runs/tsmear0.1/ngkpt5_5_5/run/output_data/odat_ngkpt5_5_5_OUT.nc)

            acell      7.6000000000E+00  7.6000000000E+00  7.6000000000E+00 Bohr
              amu      2.69815390E+01
           diemac      9.00000000E+00
             ecut      6.00000000E+00 Hartree
           etotal      4.3052721271E+00
            fcart      0.0000000000E+00  0.0000000000E+00  0.0000000000E+00
-          fftalg         112
           irdwfk           1
              ixc       -1012
              kpt     -1.00000000E-01 -2.00000000E-01  0.00000000E+00
                      -2.00000000E-01 -1.00000000E-01  0.00000000E+00
                      -1.00000000E-01 -1.00000000E-01  1.00000000E-01
                      -1.00000000E-01 -4.00000000E-01  0.00000000E+00
                      -2.00000000E-01 -3.00000000E-01  0.00000000E+00
                      -1.00000000E-01 -3.00000000E-01  1.00000000E-01
                      -3.00000000E-01 -2.00000000E-01  0.00000000E+00
                      -2.00000000E-01 -2.00000000E-01  1.00000000E-01
                      -1.00000000E-01 -2.00000000E-01  2.00000000E-01
                      -4.00000000E-01 -1.00000000E-01  0.00000000E+00
                      -3.00000000E-01 -1.00000000E-01  1.00000000E-01
                      -2.00000000E-01 -1.00000000E-01  2.00000000E-01
                      -1.00000000E-01 -1.00000000E-01  3.00000000E-01
                      -1.00000000E-01  4.00000000E-01  0.00000000E+00
                      -2.00000000E-01  5.00000000E-01  0.00000000E+00
                      -1.00000000E-01  5.00000000E-01  1.00000000E-01
                      -3.00000000E-01 -4.00000000E-01  0.00000000E+00
                      -2.00000000E-01 -4.00000000E-01  1.00000000E-01
                      -1.00000000E-01 -4.00000000E-01  2.00000000E-01
                      -4.00000000E-01 -3.00000000E-01  0.00000000E+00
                      -3.00000000E-01 -3.00000000E-01  1.00000000E-01
                      -2.00000000E-01 -3.00000000E-01  2.00000000E-01
                      -1.00000000E-01 -3.00000000E-01  3.00000000E-01
                       5.00000000E-01 -2.00000000E-01  0.00000000E+00
                      -4.00000000E-01 -2.00000000E-01  1.00000000E-01
                      -3.00000000E-01 -2.00000000E-01  2.00000000E-01
                      -2.00000000E-01 -2.00000000E-01  3.00000000E-01
                      -1.00000000E-01 -2.00000000E-01  4.00000000E-01
                       4.00000000E-01 -1.00000000E-01  0.00000000E+00
                       5.00000000E-01 -1.00000000E-01  1.00000000E-01
                      -4.00000000E-01 -1.00000000E-01  2.00000000E-01
                      -3.00000000E-01 -1.00000000E-01  3.00000000E-01
                      -2.00000000E-01 -1.00000000E-01  4.00000000E-01
                      -1.00000000E-01 -1.00000000E-01  5.00000000E-01
                      -1.00000000E-01  2.00000000E-01  0.00000000E+00
                      -2.00000000E-01  3.00000000E-01  0.00000000E+00
                      -1.00000000E-01  3.00000000E-01  1.00000000E-01
                      -3.00000000E-01  4.00000000E-01  0.00000000E+00
                      -2.00000000E-01  4.00000000E-01  1.00000000E-01
                      -1.00000000E-01  4.00000000E-01  2.00000000E-01
                      -4.00000000E-01  5.00000000E-01  0.00000000E+00
                      -3.00000000E-01  5.00000000E-01  1.00000000E-01
                      -2.00000000E-01  5.00000000E-01  2.00000000E-01
                      -1.00000000E-01  5.00000000E-01  3.00000000E-01
                       5.00000000E-01 -4.00000000E-01  0.00000000E+00
                      -4.00000000E-01 -4.00000000E-01  1.00000000E-01
                      -3.00000000E-01 -4.00000000E-01  2.00000000E-01
                      -2.00000000E-01 -4.00000000E-01  3.00000000E-01
                      -1.00000000E-01 -4.00000000E-01  4.00000000E-01
                       4.00000000E-01 -3.00000000E-01  0.00000000E+00
                       outvar_i_n : Printing only first  50 k-points.
           kptopt           2
         kptrlatt        5   -5    5     -5    5    5     -5   -5    5
          kptrlen      3.80000000E+01
P           mkmem          64
P          mkqmem          64
P          mk1mem          64
            natom           1
            nband           3
           nbdbuf           2
            ngfft          12      12      12
             nkpt         252
             nqpt           1
            nstep          25
             nsym          48
           ntypat           1
              occ      2.000004  0.001073  0.000007
                       2.000004  0.001073  0.000007
                       2.000004  0.001073  0.000007
                       2.002278  1.086013  0.000028
                       2.000135  0.005250  0.000317
                       2.000601  0.035925  0.003216
                       2.000135  0.005250  0.000317
                       2.000135  0.005250  0.000317
                       2.000601  0.035925  0.003216
                       2.002278  1.086013  0.000028
                       2.000601  0.035925  0.003216
                       2.000601  0.035925  0.003216
                       2.002278  1.086013  0.000028
                       2.019669  2.066880  0.000283
                       2.044504  1.865981  0.004883
                       2.121101  2.132159  0.002084
                       2.007208  0.000292  0.002433
                       2.019526  0.365291  0.004423
                       2.083721  1.564147  0.013661
                       2.007208  0.000292  0.002433
                       2.007208  0.000292  0.002433
                       2.019526  0.365291  0.004423
                       2.083721  1.564147  0.013661
                       2.044504  1.865981  0.004883
                       2.019526  0.365291  0.004423
                       2.019526  0.365291  0.004423
                       2.044504  1.865981  0.004883
                       2.121101  2.132159  0.002084
                       2.019669  2.066880  0.000283
                       2.121101  2.132159  0.002084
                       2.083721  1.564147  0.013661
                       2.083721  1.564147  0.013661
                       2.121101  2.132159  0.002084
                       2.019669  2.066880  0.000283
                       2.000026  0.004216  0.000272
                       2.007265  0.707982  0.002591
                       2.000601  0.035925  0.003216
                       2.095445  2.051542  0.235253
                       2.083721  1.564147  0.013661
                       2.019526  0.365291  0.004423
                       2.123909  0.949787  0.003822
                       2.140898  0.759148  0.495276
                       1.934274  1.851751  0.128320
                       2.140898  0.759148  0.495276
                       2.123909  0.949787  0.003822
                       2.123909  0.949787  0.003822
                       2.140898  0.759148  0.495276
                       1.934274  1.851751  0.128320
                       2.140898  0.759148  0.495276
                       2.095445  2.051542  0.235253
                       prtocc : prtvol=0, do not print more k-points.
           occopt           4
        optdriver           1
            rfdir           1       1       1
           rfphon           1
            rprim      0.0000000000E+00  5.0000000000E-01  5.0000000000E-01
                       5.0000000000E-01  0.0000000000E+00  5.0000000000E-01
                       5.0000000000E-01  5.0000000000E-01  0.0000000000E+00
           shiftk      5.00000000E-01  5.00000000E-01  5.00000000E-01
          spgroup         225
           strten      0.0000000000E+00  0.0000000000E+00  0.0000000000E+00
                       0.0000000000E+00  0.0000000000E+00  0.0000000000E+00
           symrel      1  0  0   0  1  0   0  0  1      -1  0  0   0 -1  0   0  0 -1
                       0 -1  1   0 -1  0   1 -1  0       0  1 -1   0  1  0  -1  1  0
                      -1  0  0  -1  0  1  -1  1  0       1  0  0   1  0 -1   1 -1  0
                       0  1 -1   1  0 -1   0  0 -1       0 -1  1  -1  0  1   0  0  1
                      -1  0  0  -1  1  0  -1  0  1       1  0  0   1 -1  0   1  0 -1
                       0 -1  1   1 -1  0   0 -1  0       0  1 -1  -1  1  0   0  1  0
                       1  0  0   0  0  1   0  1  0      -1  0  0   0  0 -1   0 -1  0
                       0  1 -1   0  0 -1   1  0 -1       0 -1  1   0  0  1  -1  0  1
                      -1  0  1  -1  1  0  -1  0  0       1  0 -1   1 -1  0   1  0  0
                       0 -1  0   1 -1  0   0 -1  1       0  1  0  -1  1  0   0  1 -1
                       1  0 -1   0  0 -1   0  1 -1      -1  0  1   0  0  1   0 -1  1
                       0  1  0   0  0  1   1  0  0       0 -1  0   0  0 -1  -1  0  0
                       1  0 -1   0  1 -1   0  0 -1      -1  0  1   0 -1  1   0  0  1
                       0 -1  0   0 -1  1   1 -1  0       0  1  0   0  1 -1  -1  1  0
                      -1  0  1  -1  0  0  -1  1  0       1  0 -1   1  0  0   1 -1  0
                       0  1  0   1  0  0   0  0  1       0 -1  0  -1  0  0   0  0 -1
                       0  0 -1   0  1 -1   1  0 -1       0  0  1   0 -1  1  -1  0  1
                       1 -1  0   0 -1  1   0 -1  0      -1  1  0   0  1 -1   0  1  0
                       0  0  1   1  0  0   0  1  0       0  0 -1  -1  0  0   0 -1  0
                      -1  1  0  -1  0  0  -1  0  1       1 -1  0   1  0  0   1  0 -1
                       0  0  1   0  1  0   1  0  0       0  0 -1   0 -1  0  -1  0  0
                       1 -1  0   0 -1  0   0 -1  1      -1  1  0   0  1  0   0  1 -1
                       0  0 -1   1  0 -1   0  1 -1       0  0  1  -1  0  1   0 -1  1
                      -1  1  0  -1  0  1  -1  0  0       1 -1  0   1  0 -1   1  0  0
           tolvrs      1.00000000E-08
           tsmear      1.00000000E-01 Hartree
            typat      1
              wtk        0.00400    0.00400    0.00400    0.00400    0.00400    0.00400
                         0.00400    0.00400    0.00400    0.00400    0.00400    0.00400
                         0.00400    0.00400    0.00400    0.00400    0.00400    0.00400
                         0.00400    0.00400    0.00400    0.00400    0.00400    0.00400
                         0.00400    0.00400    0.00400    0.00400    0.00400    0.00400
                         0.00400    0.00400    0.00400    0.00400    0.00400    0.00400
                         0.00400    0.00400    0.00400    0.00400    0.00400    0.00400
                         0.00400    0.00400    0.00400    0.00400    0.00400    0.00400
                         0.00400    0.00400
                       outvars : Printing only first  50 k-points.
            znucl       13.00000

================================================================================
  

================================================================================

 Suggested references for the acknowledgment of ABINIT usage.

 The users of ABINIT have little formal obligations with respect to the ABINIT group
 (those specified in the GNU General Public License, http://www.gnu.org/copyleft/gpl.txt).
 However, it is common practice in the scientific literature,
 to acknowledge the efforts of people that have made the research possible.
 In this spirit, please find below suggested citations of work written by ABINIT developers,
 corresponding to implementations inside of ABINIT that you have used in the present run.
 Note also that it will be of great value to readers of publications presenting these results,
 to read papers enabling them to understand the theoretical formalism and details
 of the ABINIT implementation.
 For information on why they are suggested, see also https://docs.abinit.org/theory/acknowledgments.
-
- [1] Specification of an extensible and portable file format for electronic structure and crystallographic data
- X. Gonze, C.-O. Almbladh, A. Cucca, D. Caliste, C. Freysoldt, M. Marques, V. Olevano, Y. Pouillon, M.J. Verstraete,
- Comput. Material Science 43, 1056 (2008).
- Comment: to be cited in case the ETSF_IO file format is used, i.e. iomode=3.
- DOI and bibtex: see https://docs.abinit.org/theory/bibliography/#gonze2008
-
- [2] Libxc: A library of exchange and correlation functionals for density functional theory.
- M.A.L. Marques, M.J.T. Oliveira, T. Burnus, Computer Physics Communications 183, 2227 (2012).
- Comment: to be cited when LibXC is used (negative value of ixc)
- Strong suggestion to cite this paper.
- DOI and bibtex: see https://docs.abinit.org/theory/bibliography/#marques2012
-
- [3] The Abinit project: Impact, environment and recent developments.
- Computer Phys. Comm. 248, 107042 (2020).
- X.Gonze, B. Amadon, G. Antonius, F.Arnardi, L.Baguet, J.-M.Beuken,
- J.Bieder, F.Bottin, J.Bouchet, E.Bousquet, N.Brouwer, F.Bruneval,
- G.Brunin, T.Cavignac, J.-B. Charraud, Wei Chen, M.Cote, S.Cottenier,
- J.Denier, G.Geneste, Ph.Ghosez, M.Giantomassi, Y.Gillet, O.Gingras,
- D.R.Hamann, G.Hautier, Xu He, N.Helbig, N.Holzwarth, Y.Jia, F.Jollet,
- W.Lafargue-Dit-Hauret, K.Lejaeghere, M.A.L.Marques, A.Martin, C.Martins,
- H.P.C. Miranda, F.Naccarato, K. Persson, G.Petretto, V.Planes, Y.Pouillon,
- S.Prokhorenko, F.Ricci, G.-M.Rignanese, A.H.Romero, M.M.Schmitt, M.Torrent,
- M.J.van Setten, B.Van Troeye, M.J.Verstraete, G.Zerah and J.W.Zwanzig
- Comment: the fifth generic paper describing the ABINIT project.
- Note that a version of this paper, that is not formatted for Computer Phys. Comm. 
- is available at https://www.abinit.org/sites/default/files/ABINIT20.pdf .
- The licence allows the authors to put it on the Web.
- DOI and bibtex: see https://docs.abinit.org/theory/bibliography/#gonze2020
-
- [4] First-principles responses of solids to atomic displacements and homogeneous electric fields:,
- implementation of a conjugate-gradient algorithm. X. Gonze, Phys. Rev. B55, 10337 (1997).
- Comment: Non-vanishing rfphon and/or rfelfd, in the norm-conserving case.
- DOI and bibtex: see https://docs.abinit.org/theory/bibliography/#gonze1997
-
- [5] Dynamical matrices, Born effective charges, dielectric permittivity tensors, and ,
- interatomic force constants from density-functional perturbation theory,
- X. Gonze and C. Lee, Phys. Rev. B55, 10355 (1997).
- Comment: Non-vanishing rfphon and/or rfelfd, in the norm-conserving case.
- DOI and bibtex: see https://docs.abinit.org/theory/bibliography/#gonze1997a
-
- [6] Optimized norm-conserving Vanderbilt pseudopotentials.
- D.R. Hamann, Phys. Rev. B 88, 085117 (2013).
- Comment: Some pseudopotential generated using the ONCVPSP code were used.
- DOI and bibtex: see https://docs.abinit.org/theory/bibliography/#hamann2013
-
- [7] ABINIT: Overview, and focus on selected capabilities
- J. Chem. Phys. 152, 124102 (2020).
- A. Romero, D.C. Allan, B. Amadon, G. Antonius, T. Applencourt, L.Baguet,
- J.Bieder, F.Bottin, J.Bouchet, E.Bousquet, F.Bruneval,
- G.Brunin, D.Caliste, M.Cote,
- J.Denier, C. Dreyer, Ph.Ghosez, M.Giantomassi, Y.Gillet, O.Gingras,
- D.R.Hamann, G.Hautier, F.Jollet, G. Jomard,
- A.Martin, 
- H.P.C. Miranda, F.Naccarato, G.Petretto, N.A. Pike, V.Planes,
- S.Prokhorenko, T. Rangel, F.Ricci, G.-M.Rignanese, M.Royo, M.Stengel, M.Torrent,
- M.J.van Setten, B.Van Troeye, M.J.Verstraete, J.Wiktor, J.W.Zwanziger, and X.Gonze.
- Comment: a global overview of ABINIT, with focus on selected capabilities .
- Note that a version of this paper, that is not formatted for J. Chem. Phys 
- is available at https://www.abinit.org/sites/default/files/ABINIT20_JPC.pdf .
- The licence allows the authors to put it on the Web.
- DOI and bibtex: see https://docs.abinit.org/theory/bibliography/#romero2020
-
- [8] Recent developments in the ABINIT software package.
- Computer Phys. Comm. 205, 106 (2016).
- X.Gonze, F.Jollet, F.Abreu Araujo, D.Adams, B.Amadon, T.Applencourt,
- C.Audouze, J.-M.Beuken, J.Bieder, A.Bokhanchuk, E.Bousquet, F.Bruneval
- D.Caliste, M.Cote, F.Dahm, F.Da Pieve, M.Delaveau, M.Di Gennaro,
- B.Dorado, C.Espejo, G.Geneste, L.Genovese, A.Gerossier, M.Giantomassi,
- Y.Gillet, D.R.Hamann, L.He, G.Jomard, J.Laflamme Janssen, S.Le Roux,
- A.Levitt, A.Lherbier, F.Liu, I.Lukacevic, A.Martin, C.Martins,
- M.J.T.Oliveira, S.Ponce, Y.Pouillon, T.Rangel, G.-M.Rignanese,
- A.H.Romero, B.Rousseau, O.Rubel, A.A.Shukri, M.Stankovski, M.Torrent,
- M.J.Van Setten, B.Van Troeye, M.J.Verstraete, D.Waroquier, J.Wiktor,
- B.Xu, A.Zhou, J.W.Zwanziger.
- Comment: the fourth generic paper describing the ABINIT project.
- Note that a version of this paper, that is not formatted for Computer Phys. Comm. 
- is available at https://www.abinit.org/sites/default/files/ABINIT16.pdf .
- The licence allows the authors to put it on the Web.
- DOI and bibtex: see https://docs.abinit.org/theory/bibliography/#gonze2016
 Proc.   0 individual time (sec): cpu=          1.0  wall=          1.0

 Calculation completed.
.Delivered   0 WARNINGs and   0 COMMENTs to log file.

--- !FinalSummary
program: abinit
version: 9.5.1
start_datetime: Tue Apr 20 11:06:36 2021
end_datetime: Tue Apr 20 11:06:37 2021
overall_cpu_time:           4.0
overall_wall_time:           3.9
exit_requested_by_user: no 
timelimit: 0
pseudos: 
    Al  : fef18c0c4c106244421000999f2c9383
usepaw: 0
mpi_procs: 4
omp_threads: 1
num_warnings: 0
num_comments: 0
...
