  ABINIT 9.5.1
  
 DeprecationWarning: 

     The files file has been deprecated in Abinit9 and will be removed in Abinit10.
     Use the syntax `abinit t01.abi` where t01.abi is an input with pseudopotentials e.g.

            pseudos = "al.psp8, as.psp8"


  Give name for formatted input file: 
/home/fgoudreault/Workspace/abisuite/abisuite/unittests/test_sequencers/files/abinit_AlAs_ecut_convergence_noddk/ph_run/ecut/ecut_5.0/ecut_5.0.in
  Give name for formatted output file:
/home/fgoudreault/Workspace/abisuite/abisuite/unittests/test_sequencers/files/abinit_AlAs_ecut_convergence_noddk/ph_run/ecut/ecut_5.0/ecut_5.0.out
  Give root name for generic input files:
/home/fgoudreault/Workspace/abisuite/abisuite/unittests/test_sequencers/files/abinit_AlAs_ecut_convergence_noddk/ph_run/ecut/ecut_5.0/input_data/idat_ecut_5.0
  Give root name for generic output files:
/home/fgoudreault/Workspace/abisuite/abisuite/unittests/test_sequencers/files/abinit_AlAs_ecut_convergence_noddk/ph_run/ecut/ecut_5.0/run/output_data/odat_ecut_5.0
  Give root name for generic temporary files:
/home/fgoudreault/Workspace/abisuite/abisuite/unittests/test_sequencers/files/abinit_AlAs_ecut_convergence_noddk/ph_run/ecut/ecut_5.0/run/output_data/tmp_ecut_5.0

.Version 9.5.1 of ABINIT 
.(MPI version, prepared for a x86_64_linux_gnu9.3 computer) 

.Copyright (C) 1998-2021 ABINIT group . 
 ABINIT comes with ABSOLUTELY NO WARRANTY.
 It is free software, and you are welcome to redistribute it
 under certain conditions (GNU General Public License,
 see ~abinit/COPYING or http://www.gnu.org/copyleft/gpl.txt).

 ABINIT is a project of the Universite Catholique de Louvain,
 Corning Inc. and other collaborators, see ~abinit/doc/developers/contributors.txt .
 Please read https://docs.abinit.org/theory/acknowledgments for suggested
 acknowledgments of the ABINIT effort.
 For more information, see https://www.abinit.org .

.Starting date : Mon 19 Apr 2021.
- ( at 09h41 )
  

 ++++++++++++++++++++++++++++++++++++++++++++++++++++++++++++++++++++++++++++++

 === Build Information === 
  Version       : 9.5.1
  Build target  : x86_64_linux_gnu9.3
  Build date    : 20210416

 === Compiler Suite === 
  C compiler       : gnu9.3
  C++ compiler     : gnu9.3
  Fortran compiler : gnu9.3
  CFLAGS           : -g -O2 -mtune=native -march=native
  CXXFLAGS         : -g -O2 -mtune=native -march=native
  FCFLAGS          : -g -ffree-line-length-none     -I/home/fgoudreault/Workspace/abinit ...
  FC_LDFLAGS       : 

 === Optimizations === 
  Debug level        : basic
  Optimization level : standard
  Architecture       : unknown_unknown

 === Multicore === 
  Parallel build : yes
  Parallel I/O   : yes
  openMP support : 
  GPU support    : 

 === Connectors / Fallbacks === 
  LINALG flavor  : netlib
  FFT flavor     : goedecker
  HDF5           : yes
  NetCDF         : yes
  NetCDF Fortran : yes
  LibXC          : yes
  Wannier90      : no

 === Experimental features === 
  Exports             : 
  GW double-precision : 

 ++++++++++++++++++++++++++++++++++++++++++++++++++++++++++++++++++++++++++++++


 ++++++++++++++++++++++++++++++++++++++++++++++++++++++++++++++++++++++++++++++
 Default optimizations:
   -O2 -mtune=native -march=native


 Optimizations for 43_ptgroups:
   -O0


 ++++++++++++++++++++++++++++++++++++++++++++++++++++++++++++++++++++++++++++++


 ++++++++++++++++++++++++++++++++++++++++++++++++++++++++++++++++++++++++++++++
 CPP options activated during the build:

                    CC_GNU                   CXX_GNU                    FC_GNU
 
 HAVE_FC_ALLOCATABLE_DT...             HAVE_FC_ASYNC         HAVE_FC_BACKTRACE
 
  HAVE_FC_COMMAND_ARGUMENT      HAVE_FC_COMMAND_LINE        HAVE_FC_CONTIGUOUS
 
           HAVE_FC_CPUTIME              HAVE_FC_EXIT             HAVE_FC_FLUSH
 
             HAVE_FC_GAMMA            HAVE_FC_GETENV   HAVE_FC_IEEE_ARITHMETIC
 
   HAVE_FC_IEEE_EXCEPTIONS          HAVE_FC_INT_QUAD             HAVE_FC_IOMSG
 
     HAVE_FC_ISO_C_BINDING  HAVE_FC_ISO_FORTRAN_2008        HAVE_FC_LONG_LINES
 
        HAVE_FC_MOVE_ALLOC  HAVE_FC_ON_THE_FLY_SHAPE           HAVE_FC_PRIVATE
 
         HAVE_FC_PROTECTED           HAVE_FC_SHIFTLR         HAVE_FC_STREAM_IO
 
            HAVE_FC_SYSTEM          HAVE_FORTRAN2003                 HAVE_HDF5
 
             HAVE_HDF5_MPI        HAVE_LIBPAW_ABINIT      HAVE_LIBTETRA_ABINIT
 
                HAVE_LIBXC         HAVE_LINALG_AXPBY        HAVE_LINALG_GEMM3M
 
                  HAVE_MPI                 HAVE_MPI2         HAVE_MPI2_INPLACE
 
       HAVE_MPI_IALLGATHER       HAVE_MPI_IALLREDUCE        HAVE_MPI_IALLTOALL
 
       HAVE_MPI_IALLTOALLV           HAVE_MPI_IBCAST         HAVE_MPI_IGATHERV
 
        HAVE_MPI_INTEGER16               HAVE_MPI_IO HAVE_MPI_TYPE_CREATE_S...
 
               HAVE_NETCDF       HAVE_NETCDF_DEFAULT       HAVE_NETCDF_FORTRAN
 
   HAVE_NETCDF_FORTRAN_MPI           HAVE_NETCDF_MPI             HAVE_OS_LINUX
 
         HAVE_TIMER_ABINIT                                                      
 ++++++++++++++++++++++++++++++++++++++++++++++++++++++++++++++++++++++++++++++

- input  file    -> /home/fgoudreault/Workspace/abisuite/abisuite/unittests/test_sequencers/files/abinit_AlAs_ecut_convergence_noddk/ph_run/ecut/ecut_5.0/ecut_5.0.in
- output file    -> /home/fgoudreault/Workspace/abisuite/abisuite/unittests/test_sequencers/files/abinit_AlAs_ecut_convergence_noddk/ph_run/ecut/ecut_5.0/ecut_5.0.out
- root for input  files -> /home/fgoudreault/Workspace/abisuite/abisuite/unittests/test_sequencers/files/abinit_AlAs_ecut_convergence_noddk/ph_run/ecut/ecut_5.0/input_data/idat_ecut_5.0
- root for output files -> /home/fgoudreault/Workspace/abisuite/abisuite/unittests/test_sequencers/files/abinit_AlAs_ecut_convergence_noddk/ph_run/ecut/ecut_5.0/run/output_data/odat_ecut_5.0

 Netcdf library supports MPI-IO
-instrng: 51 lines of input have been read from file /home/fgoudreault/Workspace/abisuite/abisuite/unittests/test_sequencers/files/abinit_AlAs_ecut_convergence_noddk/ph_run/ecut/ecut_5.0/ecut_5.0.in


 Please give name of formatted atomic psp file (and finish with a newline character)
 For atom type 1, psp file is /home/fgoudreault/Workspace/pseudos/13al.981214.fhi

 Please give name of formatted atomic psp file (and finish with a newline character)
 For atom type 2, psp file is /home/fgoudreault/Workspace/pseudos/33as.pspnc
  read the values zionpsp=  3.0 , pspcod=   6 , lmax=   2
  read the values zionpsp=  5.0 , pspcod=   1 , lmax=   1

 inpspheads: deduce mpsang = 3, n1xccc = 2501.

======================================================= 
 invars1m : enter jdtset= 0

 symlatt: the Bravais lattice is cF (face-centered cubic)
  xred   is defined in input file
 ingeo: takes atomic coordinates from input array xred

--- !COMMENT
src_file: m_ingeo.F90
src_line: 900
message: |
    The tolerance on symmetries =   1.000E-05 is bigger than 1.0e-8.
    In order to avoid spurious effects, the atomic coordinates have been
    symmetrized before storing them in the dataset internal variable.
    So, do not be surprised by the fact that your input variables (xcart, xred, ...)
    do not correspond exactly to the ones echoed by ABINIT, the latter being used to do the calculations.
    This is not a problem per se.
    Still, in order to avoid this symmetrization (e.g. for specific debugging/development), decrease tolsym to 1.0e-8 or lower,
    or (much preferred) use input primitive vectors that are accurate to better than 1.0e-8.
    This message will only be printed once, even if there are other datasets where tolsym is bigger than 1.0e-8.
...


 symlatt: the Bravais lattice is cF (face-centered cubic)

 symlatt: the Bravais lattice is cF (face-centered cubic)
 symspgr: spgroup= 216  F-4 3 m   (=Td^2)
 symspgr: optical characteristics = isotropic
 For input ecut=  5.000000E+00 best grid ngfft=      16      16      16
       max ecut=  5.611112E+00

 ==== FFT mesh ====
  FFT mesh divisions ........................    16   16   16
  Augmented FFT divisions ...................    17   17   16
  FFT algorithm .............................   112
  FFT cache size ............................    16
 getmpw: optimal value of mpw= 165
 getmpw: optimal value of mpw= 165

 Symmetries : space group F-4 3 m (#216); Bravais cF (face-center cubic)

 getdim_nloc : deduce lmnmax  =   9, lnmax  =   3,
                      lmnmaxso=   9, lnmaxso=   3.
 memorf : analysis of memory needs
================================================================================
 Values of the parameters that define the memory need of the present run (RF).
     intxc =       0      iscf =       7    lmnmax =       3     lnmax =       3
     mgfft =      16  mpssoang =       3    mqgrid =    3001     natom =       2
  nloc_mem =       1    nspden =       1   nspinor =       1    nsppol =       1
      nsym =      24    n1xccc =    2501    ntypat =       2    occopt =       1
   xclevel =       1
-    mband =           4        mffmem =           1         mkmem =          32
-   mkqmem =          32        mk1mem =          32           mpw =         165
      nfft =        4096          nkpt =         128
================================================================================
P This job should need less than                       2.933 Mbytes of memory.
  Rough estimation (10% accuracy) of disk space for files :
_ WF disk file :      1.291 Mbytes ; DEN or POT disk file :      0.033 Mbytes.
================================================================================

 Biggest array : cg(disk), with      0.3243 MBytes.
 memana : allocated an array of      0.324 Mbytes, for testing purposes.
 memana: allocated       2.933Mbytes, for testing purposes. 
 The job will continue.
--------------------------------------------------------------------------------
------------- Echo of variables that govern the present computation ------------
--------------------------------------------------------------------------------
-
- outvars: echo of selected default values                                      
-   iomode0 =  3 , fftalg0 =112 , wfoptalg0 =  0
-
- outvars: echo of global parameters not present in the input file              
-  max_nthreads =    0
-
 -outvars: echo values of preprocessed input variables --------
 
 These variables are accessible in NetCDF format (/home/fgoudreault/Workspace/abisuite/abisuite/unittests/test_sequencers/files/abinit_AlAs_ecut_convergence_noddk/ph_run/ecut/ecut_5.0/run/output_data/odat_ecut_5.0_OUT.nc)

            acell      1.0610000000E+01  1.0610000000E+01  1.0610000000E+01 Bohr
              amu      2.69815390E+01  7.49215900E+01
           diemac      9.00000000E+00
             ecut      5.00000000E+00 Hartree
-          fftalg         112
           irdwfk           1
              kpt     -1.25000000E-01 -2.50000000E-01  0.00000000E+00
                      -2.50000000E-01 -1.25000000E-01  0.00000000E+00
                      -1.25000000E-01 -1.25000000E-01  1.25000000E-01
                      -1.25000000E-01  5.00000000E-01  0.00000000E+00
                      -2.50000000E-01 -3.75000000E-01  0.00000000E+00
                      -1.25000000E-01 -3.75000000E-01  1.25000000E-01
                      -3.75000000E-01 -2.50000000E-01  0.00000000E+00
                      -2.50000000E-01 -2.50000000E-01  1.25000000E-01
                      -1.25000000E-01 -2.50000000E-01  2.50000000E-01
                       5.00000000E-01 -1.25000000E-01  0.00000000E+00
                      -3.75000000E-01 -1.25000000E-01  1.25000000E-01
                      -2.50000000E-01 -1.25000000E-01  2.50000000E-01
                      -1.25000000E-01 -1.25000000E-01  3.75000000E-01
                      -1.25000000E-01  2.50000000E-01  0.00000000E+00
                      -2.50000000E-01  3.75000000E-01  0.00000000E+00
                      -1.25000000E-01  3.75000000E-01  1.25000000E-01
                      -3.75000000E-01  5.00000000E-01  0.00000000E+00
                      -2.50000000E-01  5.00000000E-01  1.25000000E-01
                      -1.25000000E-01  5.00000000E-01  2.50000000E-01
                       5.00000000E-01 -3.75000000E-01  0.00000000E+00
                      -3.75000000E-01 -3.75000000E-01  1.25000000E-01
                      -2.50000000E-01 -3.75000000E-01  2.50000000E-01
                      -1.25000000E-01 -3.75000000E-01  3.75000000E-01
                       3.75000000E-01 -2.50000000E-01  0.00000000E+00
                       5.00000000E-01 -2.50000000E-01  1.25000000E-01
                      -3.75000000E-01 -2.50000000E-01  2.50000000E-01
                      -2.50000000E-01 -2.50000000E-01  3.75000000E-01
                      -1.25000000E-01 -2.50000000E-01  5.00000000E-01
                       2.50000000E-01 -1.25000000E-01  0.00000000E+00
                       3.75000000E-01 -1.25000000E-01  1.25000000E-01
                       5.00000000E-01 -1.25000000E-01  2.50000000E-01
                      -3.75000000E-01 -1.25000000E-01  3.75000000E-01
                      -2.50000000E-01 -1.25000000E-01  5.00000000E-01
                      -1.25000000E-01 -1.25000000E-01 -3.75000000E-01
                      -1.25000000E-01  0.00000000E+00  0.00000000E+00
                      -1.25000000E-01  1.25000000E-01  1.25000000E-01
                      -2.50000000E-01  2.50000000E-01  1.25000000E-01
                      -1.25000000E-01  2.50000000E-01  2.50000000E-01
                      -3.75000000E-01  3.75000000E-01  1.25000000E-01
                      -2.50000000E-01  3.75000000E-01  2.50000000E-01
                      -1.25000000E-01  3.75000000E-01  3.75000000E-01
                       5.00000000E-01  5.00000000E-01  1.25000000E-01
                      -3.75000000E-01  5.00000000E-01  2.50000000E-01
                      -2.50000000E-01  5.00000000E-01  3.75000000E-01
                      -1.25000000E-01  5.00000000E-01  5.00000000E-01
                       3.75000000E-01 -3.75000000E-01  1.25000000E-01
                       5.00000000E-01 -3.75000000E-01  2.50000000E-01
                      -3.75000000E-01 -3.75000000E-01  3.75000000E-01
                      -2.50000000E-01 -3.75000000E-01  5.00000000E-01
                      -1.25000000E-01 -3.75000000E-01 -3.75000000E-01
                       outvar_i_n : Printing only first  50 k-points.
           kptopt           2
         kptrlatt        4   -4    4     -4    4    4     -4   -4    4
          kptrlen      4.24400000E+01
P           mkmem          32
P          mkqmem          32
P          mk1mem          32
            natom           2
            nband           4
            ngfft          16      16      16
             nkpt         128
             nqpt           1
            nstep          25
             nsym          24
           ntypat           2
              occ      2.000000  2.000000  2.000000  2.000000
        optdriver           1
          rfatpol           1       2
            rfdir           1       1       1
           rfphon           1
            rprim      0.0000000000E+00  5.0000000000E-01  5.0000000000E-01
                       5.0000000000E-01  0.0000000000E+00  5.0000000000E-01
                       5.0000000000E-01  5.0000000000E-01  0.0000000000E+00
           shiftk      5.00000000E-01  5.00000000E-01  5.00000000E-01
          spgroup         216
           symrel      1  0  0   0  1  0   0  0  1       0 -1  1   0 -1  0   1 -1  0
                      -1  0  0  -1  0  1  -1  1  0       0  1 -1   1  0 -1   0  0 -1
                      -1  0  0  -1  1  0  -1  0  1       0 -1  1   1 -1  0   0 -1  0
                       1  0  0   0  0  1   0  1  0       0  1 -1   0  0 -1   1  0 -1
                      -1  0  1  -1  1  0  -1  0  0       0 -1  0   1 -1  0   0 -1  1
                       1  0 -1   0  0 -1   0  1 -1       0  1  0   0  0  1   1  0  0
                       1  0 -1   0  1 -1   0  0 -1       0 -1  0   0 -1  1   1 -1  0
                      -1  0  1  -1  0  0  -1  1  0       0  1  0   1  0  0   0  0  1
                       0  0 -1   0  1 -1   1  0 -1       1 -1  0   0 -1  1   0 -1  0
                       0  0  1   1  0  0   0  1  0      -1  1  0  -1  0  0  -1  0  1
                       0  0  1   0  1  0   1  0  0       1 -1  0   0 -1  0   0 -1  1
                       0  0 -1   1  0 -1   0  1 -1      -1  1  0  -1  0  1  -1  0  0
           tolvrs      1.00000000E-08
            typat      1  2
              wtk        0.00781    0.00781    0.00781    0.00781    0.00781    0.00781
                         0.00781    0.00781    0.00781    0.00781    0.00781    0.00781
                         0.00781    0.00781    0.00781    0.00781    0.00781    0.00781
                         0.00781    0.00781    0.00781    0.00781    0.00781    0.00781
                         0.00781    0.00781    0.00781    0.00781    0.00781    0.00781
                         0.00781    0.00781    0.00781    0.00781    0.00781    0.00781
                         0.00781    0.00781    0.00781    0.00781    0.00781    0.00781
                         0.00781    0.00781    0.00781    0.00781    0.00781    0.00781
                         0.00781    0.00781
                       outvars : Printing only first  50 k-points.
           xangst      0.0000000000E+00  0.0000000000E+00  0.0000000000E+00
                       1.4036425458E+00  1.4036425458E+00  1.4036425458E+00
            xcart      0.0000000000E+00  0.0000000000E+00  0.0000000000E+00
                       2.6525000000E+00  2.6525000000E+00  2.6525000000E+00
             xred      0.0000000000E+00  0.0000000000E+00  0.0000000000E+00
                       2.5000000000E-01  2.5000000000E-01  2.5000000000E-01
            znucl       13.00000   33.00000

================================================================================

 chkinp: Checking input parameters for consistency.
 DATA TYPE INFORMATION: 
 REAL:      Data type name: REAL(DP) 
            Kind value:      8
            Precision:      15
            Smallest nonnegligible quantity relative to 1: 0.22204460E-015
            Smallest positive number:                      0.22250739E-307
            Largest representable number:                  0.17976931E+309
 INTEGER:   Data type name: INTEGER(default) 
            Kind value: 4
            Bit size:   32
            Largest representable number: 2147483647
 LOGICAL:   Data type name: LOGICAL 
            Kind value: 4
 CHARACTER: Data type name: CHARACTER             Kind value: 1

  ==== OpenMP parallelism is OFF ====
 
  ==== Using MPI-2 specifications ==== 
  MPI-IO support is ON
  xmpi_tag_ub ................   2147483647
  xmpi_bsize_ch ..............            1
  xmpi_bsize_int .............            4
  xmpi_bsize_sp ..............            4
  xmpi_bsize_dp ..............            8
  xmpi_bsize_spc .............            8
  xmpi_bsize_dpc .............           16
  xmpio_bsize_frm ............            4
  xmpi_address_kind ..........            8
  xmpi_offset_kind ...........            8
  MPI_WTICK ..................    1.0000000000000001E-009

================================================================================
== DATASET  1 ==================================================================
-   mpi_nproc: 4, omp_nthreads: -1 (-1 if OMP is not activated)


--- !COMMENT
src_file: m_xgScalapack.F90
src_line: 236
message: |
    xgScalapack in auto mode
...


 getdim_nloc : deduce lmnmax  =   9, lnmax  =   3,
                      lmnmaxso=   9, lnmaxso=   3.
 Exchange-correlation functional for the present dataset will be:
  LDA: new Teter (4/93) with spin-polarized option - ixc=1
 Citation for XC functional:
  S. Goedecker, M. Teter, J. Huetter, PRB 54, 1703 (1996)

 Unit cell volume ucvol=  2.9859750E+02 bohr^3
 Angles (23,13,12)=  6.00000000E+01  6.00000000E+01  6.00000000E+01 degrees
 setup1 : take into account q-point for computing boxcut.

 getcut: wavevector=  0.0000  0.0000  0.0000  ngfft=  16  16  16
         ecut(hartree)=      5.000   => boxcut(ratio)=   2.11870
- pspini: atom type   1  psp file is /home/fgoudreault/Workspace/pseudos/13al.981214.fhi
- pspatm: opening atomic psp file    /home/fgoudreault/Workspace/pseudos/13al.981214.fhi
- Aluminum, fhi98PP : Hamann-type, LDA CA PerdewWang, l=2 local
- 13.00000   3.00000    981214                znucl, zion, pspdat
    6    7    2    2       493   0.00000      pspcod,pspxc,lmax,lloc,mmax,r2well

--- !WARNING
src_file: m_pspini.F90
src_line: 1036
message: |
    Pseudopotential file pspxc: 7, not equal to input ixc: 1.
    These parameters must agree to get the same xc in ABINIT code as in psp construction.
    Action: check psp design or input file.
    Assume experienced user. Execution will continue.
...

  No XC core correction.
  1.024700          amesh (Hamman grid)
  pspatm : epsatm=    1.36305739
         --- l  ekb(1:nproj) -->
             0    1.768744
             1    0.900554
 pspatm: atomic psp has been read  and splines computed

- pspini: atom type   2  psp file is /home/fgoudreault/Workspace/pseudos/33as.pspnc
- pspatm: opening atomic psp file    /home/fgoudreault/Workspace/pseudos/33as.pspnc
-  Troullier-Martins psp for element  As        Thu Oct 27 17:37:14 EDT 1994
- 33.00000   5.00000    940714                znucl, zion, pspdat
    1    1    1    1      2001   0.00000      pspcod,pspxc,lmax,lloc,mmax,r2well
    0   4.772  10.829    1   2.5306160        l,e99.0,e99.9,nproj,rcpsp
   0.00000000   0.00000000   0.00000000   0.00000000     rms, ekb1, ekb2, epsatm
    1   2.745   5.580    0   2.5306160        l,e99.0,e99.9,nproj,rcpsp
   0.00000000   0.00000000   0.00000000   0.00000000     rms, ekb1, ekb2, epsatm
    2.05731715564010    0.36322996461007    2.76014815959125   rchrg,fchrg,qchrg
  pspatm : epsatm=   27.20579911
         --- l  ekb(1:nproj) -->
             0    0.838751
 pspatm: atomic psp has been read  and splines computed

   2.28550852E+02                                ecore*ucvol(ha*bohr**3)
 ==== Info on pseudopotentials ====
  Norm-conserving pseudopotentials
  Number of pseudopotentials ..    2
  Number of types of atoms   ..    2
  Scalar calculation (no spin-orbit term)
  Nonlocal part applied using Legendre polynomials
  Max number of non-local projectors over l and type   1
  Highest angular momentum +1 .......   3
  Max number of (l,n)   components ..   3
  Max number of (l,m,n) components ..   3

 Pseudo-Core Charge Info: 
   Number of radial points for pseudo-core charge .. 2501
   XC core-correction treatment (optnlxccc) ........    1
   Radius for pseudo-core charge for each type ..... 

  - Atom type    1 has pseudo-core radius ..  0.0000
  - Atom type    2 has pseudo-core radius ..  6.1720

 Info on the Q-grid used for form factors in spline form: 
   Number of q-points for radial functions ffspl ..   3001
   Number of q-points for vlspl ...................   3001
   vloc is computed in Reciprocal Space
   model core charge treated in real-space

  XC functional for type 1 is 7
  Pseudo valence available: no
  XC functional for type 2 is 1
  Pseudo valence available: no

- File: /home/fgoudreault/Workspace/abisuite/abisuite/unittests/test_sequencers/files/abinit_AlAs_ecut_convergence_noddk/ph_run/ecut/ecut_5.0/input_data/idat_ecut_5.0_WFK does not exist but found netcdf file with similar name.
- Opening HDf5 file with MPI-IO support: /home/fgoudreault/Workspace/abisuite/abisuite/unittests/test_sequencers/files/abinit_AlAs_ecut_convergence_noddk/ph_run/ecut/ecut_5.0/input_data/idat_ecut_5.0_WFK.nc
 inwffil: examining the header of disk file: /home/fgoudreault/Workspace/abisuite/abisuite/unittests/test_sequencers/files/abinit_AlAs_ecut_convergence_noddk/ph_run/ecut/ecut_5.0/input_data/idat_ecut_5.0_WFK.nc

================================================================================

          - hdr_check: checking restart file header for consistency -


          current calculation                           restart file
          -------------------                           ------------

  calculation expects a wf_planewave        |  input file contains a wf_planewave
. ABINIT  code version 9.5.1                |  ABINIT  code version 9.5.1
. date 20210419 bantot      512 natom    2  |  date 20210419 bantot       40 natom    2
  nkpt     128 nsym 24 ngfft  16,  16,  16  |  nkpt      10 nsym 24 ngfft  16,  16,  16
  ntypat  2 ecut_eff   5.0000000            |  ntypat  2 ecut_eff   5.0000000
  usepaw  0                                 |  usepaw  0
  usewvl  0                                 |  usewvl  0
  rprimd:                                   |  rprimd:
     0.0000000   5.3050000   5.3050000      |     0.0000000   5.3050000   5.3050000
     5.3050000   0.0000000   5.3050000      |     5.3050000   0.0000000   5.3050000
     5.3050000   5.3050000   0.0000000      |     5.3050000   5.3050000   0.0000000

--- !COMMENT
src_file: m_hdr.F90
src_line: 4172
message: |
    input nkpt=128 not equal disk file nkpt=10
...

  symafm:                                   |  symafm:
    1  1  1  1  1  1  1  1  1  1  1  1      |    1  1  1  1  1  1  1  1  1  1  1  1
    1  1  1  1  1  1  1  1  1  1  1  1      |    1  1  1  1  1  1  1  1  1  1  1  1
  symrel:                                   |  symrel:
    1  0  0  0  1  0  0  0  1               |    1  0  0  0  1  0  0  0  1
    0 -1  1  0 -1  0  1 -1  0               |    0 -1  1  0 -1  0  1 -1  0
   -1  0  0 -1  0  1 -1  1  0               |   -1  0  0 -1  0  1 -1  1  0
    0  1 -1  1  0 -1  0  0 -1               |    0  1 -1  1  0 -1  0  0 -1
   -1  0  0 -1  1  0 -1  0  1               |   -1  0  0 -1  1  0 -1  0  1
    0 -1  1  1 -1  0  0 -1  0               |    0 -1  1  1 -1  0  0 -1  0
    1  0  0  0  0  1  0  1  0               |    1  0  0  0  0  1  0  1  0
    0  1 -1  0  0 -1  1  0 -1               |    0  1 -1  0  0 -1  1  0 -1
   -1  0  1 -1  1  0 -1  0  0               |   -1  0  1 -1  1  0 -1  0  0
    0 -1  0  1 -1  0  0 -1  1               |    0 -1  0  1 -1  0  0 -1  1
    1  0 -1  0  0 -1  0  1 -1               |    1  0 -1  0  0 -1  0  1 -1
    0  1  0  0  0  1  1  0  0               |    0  1  0  0  0  1  1  0  0
    1  0 -1  0  1 -1  0  0 -1               |    1  0 -1  0  1 -1  0  0 -1
    0 -1  0  0 -1  1  1 -1  0               |    0 -1  0  0 -1  1  1 -1  0
   -1  0  1 -1  0  0 -1  1  0               |   -1  0  1 -1  0  0 -1  1  0
    0  1  0  1  0  0  0  0  1               |    0  1  0  1  0  0  0  0  1
    0  0 -1  0  1 -1  1  0 -1               |    0  0 -1  0  1 -1  1  0 -1
    1 -1  0  0 -1  1  0 -1  0               |    1 -1  0  0 -1  1  0 -1  0
    0  0  1  1  0  0  0  1  0               |    0  0  1  1  0  0  0  1  0
   -1  1  0 -1  0  0 -1  0  1               |   -1  1  0 -1  0  0 -1  0  1
    0  0  1  0  1  0  1  0  0               |    0  0  1  0  1  0  1  0  0
    1 -1  0  0 -1  0  0 -1  1               |    1 -1  0  0 -1  0  0 -1  1
    0  0 -1  1  0 -1  0  1 -1               |    0  0 -1  1  0 -1  0  1 -1
   -1  1  0 -1  0  1 -1  0  0               |   -1  1  0 -1  0  1 -1  0  0
  typat:                                    |  typat:
    1  2                                    |    1  2
  so_psp  :                                 |  so_psp  :
    1  1                                    |    1  1

--- !COMMENT
src_file: m_hdr.F90
src_line: 4420
message: |
    input kptopt = 2  /= disk file kptopt = 1
...


--- !WARNING
src_file: m_hdr.F90
src_line: 4441
message: |
    input ival=0 not equal disk file ival=4
...

  tnons:                                    |  tnons:
     0.0000000   0.0000000   0.0000000      |     0.0000000   0.0000000   0.0000000
     0.0000000   0.0000000   0.0000000      |     0.0000000   0.0000000   0.0000000
     0.0000000   0.0000000   0.0000000      |     0.0000000   0.0000000   0.0000000
     0.0000000   0.0000000   0.0000000      |     0.0000000   0.0000000   0.0000000
     0.0000000   0.0000000   0.0000000      |     0.0000000   0.0000000   0.0000000
     0.0000000   0.0000000   0.0000000      |     0.0000000   0.0000000   0.0000000
     0.0000000   0.0000000   0.0000000      |     0.0000000   0.0000000   0.0000000
     0.0000000   0.0000000   0.0000000      |     0.0000000   0.0000000   0.0000000
     0.0000000   0.0000000   0.0000000      |     0.0000000   0.0000000   0.0000000
     0.0000000   0.0000000   0.0000000      |     0.0000000   0.0000000   0.0000000
     0.0000000   0.0000000   0.0000000      |     0.0000000   0.0000000   0.0000000
     0.0000000   0.0000000   0.0000000      |     0.0000000   0.0000000   0.0000000
     0.0000000   0.0000000   0.0000000      |     0.0000000   0.0000000   0.0000000
     0.0000000   0.0000000   0.0000000      |     0.0000000   0.0000000   0.0000000
     0.0000000   0.0000000   0.0000000      |     0.0000000   0.0000000   0.0000000
     0.0000000   0.0000000   0.0000000      |     0.0000000   0.0000000   0.0000000
     0.0000000   0.0000000   0.0000000      |     0.0000000   0.0000000   0.0000000
     0.0000000   0.0000000   0.0000000      |     0.0000000   0.0000000   0.0000000
     0.0000000   0.0000000   0.0000000      |     0.0000000   0.0000000   0.0000000
     0.0000000   0.0000000   0.0000000      |     0.0000000   0.0000000   0.0000000
     0.0000000   0.0000000   0.0000000      |     0.0000000   0.0000000   0.0000000
     0.0000000   0.0000000   0.0000000      |     0.0000000   0.0000000   0.0000000
     0.0000000   0.0000000   0.0000000      |     0.0000000   0.0000000   0.0000000
     0.0000000   0.0000000   0.0000000      |     0.0000000   0.0000000   0.0000000
   znucl:                                   |   znucl:
   13.00 33.00                              |       13.00 33.00
  pseudopotential atom type  1:             |  pseudopotential atom type  1:
  pspso   0 pspxc   7                       |  pspso   0 pspxc   7
  pspdat   981214 pspcod    6 zion   3.0    |  pspdat   981214 pspcod    6 zion   3.0
  pseudopotential atom type  2:             |  pseudopotential atom type  2:
  pspso   0 pspxc   1                       |  pspso   0 pspxc   1
  pspdat   940714 pspcod    1 zion   5.0    |  pspdat   940714 pspcod    1 zion   5.0
  xred:                                     |  xred:
     0.0000000   0.0000000   0.0000000      |     0.0000000   0.0000000   0.0000000
     0.2500000   0.2500000   0.2500000      |     0.2500000   0.2500000   0.2500000

--- !COMMENT
src_file: m_hdr.F90
src_line: 4715
message: |
    Restart of self-consistent calculation need translated wavefunctions.
...

  Indeed, critical differences between current calculation and
  restart file have been detected in:
        * the number, position, or weight of k-points
        * the format of wavefunctions (istwfk)
================================================================================
-inwffil : will read wavefunctions from disk file /home/fgoudreault/Workspace/abisuite/abisuite/unittests/test_sequencers/files/abinit_AlAs_ecut_convergence_noddk/ph_run/ecut/ecut_5.0/input_data/idat_ecut_5.0_WFK.nc
 initwf: disk file gives npw= 160 nband= 4 for kpt number= 1
 initwf: 4 bands have been initialized from disk
 initwf: disk file gives npw= 161 nband= 4 for kpt number= 2
 initwf: 4 bands have been initialized from disk
 initwf: disk file gives npw= 160 nband= 4 for kpt number= 3
 initwf: 4 bands have been initialized from disk
 initwf: disk file gives npw= 158 nband= 4 for kpt number= 4
 initwf: 4 bands have been initialized from disk
 initwf: disk file gives npw= 157 nband= 4 for kpt number= 5
 initwf: 4 bands have been initialized from disk
 initwf: disk file gives npw= 160 nband= 4 for kpt number= 6
 initwf: 4 bands have been initialized from disk
 initwf: disk file gives npw= 162 nband= 4 for kpt number= 7
 initwf: 4 bands have been initialized from disk
 initwf: disk file gives npw= 159 nband= 4 for kpt number= 8
 initwf: 4 bands have been initialized from disk
- newkpt: read input wf with ikpt,npw=   1     160, make ikpt,npw=   1     160
- newkpt: read input wf with ikpt,npw=   1     160, make ikpt,npw=   2     160
- newkpt: read input wf with ikpt,npw=   1     160, make ikpt,npw=   3     160
- newkpt: read input wf with ikpt,npw=   2     161, make ikpt,npw=   4     161
- newkpt: read input wf with ikpt,npw=   3     160, make ikpt,npw=   5     160
- newkpt: read input wf with ikpt,npw=   4     158, make ikpt,npw=   6     158
- newkpt: read input wf with ikpt,npw=   3     160, make ikpt,npw=   7     160
- newkpt: read input wf with ikpt,npw=   3     160, make ikpt,npw=   8     160
- newkpt: read input wf with ikpt,npw=   4     158, make ikpt,npw=   9     158
- newkpt: read input wf with ikpt,npw=   2     161, make ikpt,npw=  10     161
- newkpt: read input wf with ikpt,npw=   4     158, make ikpt,npw=  11     158
- newkpt: read input wf with ikpt,npw=   4     158, make ikpt,npw=  12     158
- newkpt: read input wf with ikpt,npw=   2     161, make ikpt,npw=  13     161
- newkpt: read input wf with ikpt,npw=   5     157, make ikpt,npw=  14     157
- newkpt: read input wf with ikpt,npw=   6     160, make ikpt,npw=  15     160
- newkpt: read input wf with ikpt,npw=   4     158, make ikpt,npw=  16     158
- newkpt: read input wf with ikpt,npw=   7     162, make ikpt,npw=  17     162
- newkpt: read input wf with ikpt,npw=   8     159, make ikpt,npw=  18     159
- newkpt: read input wf with ikpt,npw=   8     159, make ikpt,npw=  19     159
- newkpt: read input wf with ikpt,npw=   7     162, make ikpt,npw=  20     162
- newkpt: read input wf with ikpt,npw=   7     162, make ikpt,npw=  21     162
- newkpt: read input wf with ikpt,npw=   8     159, make ikpt,npw=  22     159
- newkpt: read input wf with ikpt,npw=   8     159, make ikpt,npw=  23     159
- newkpt: read input wf with ikpt,npw=   6     160, make ikpt,npw=  24     160
- newkpt: read input wf with ikpt,npw=   8     159, make ikpt,npw=  25     159
- newkpt: read input wf with ikpt,npw=   8     159, make ikpt,npw=  26     159
- newkpt: read input wf with ikpt,npw=   6     160, make ikpt,npw=  27     160
- newkpt: read input wf with ikpt,npw=   4     158, make ikpt,npw=  28     158
- newkpt: read input wf with ikpt,npw=   5     157, make ikpt,npw=  29     157
- newkpt: read input wf with ikpt,npw=   4     158, make ikpt,npw=  30     158
- newkpt: read input wf with ikpt,npw=   8     159, make ikpt,npw=  31     159
- newkpt: read input wf with ikpt,npw=   8     159, make ikpt,npw=  32     159

 respfn : eigen0 array
 symatm: atom number 1 is reached starting at atom
   1  1  1  1  1  1  1  1  1  1  1  1  1  1  1  1  1  1  1  1  1  1  1  1
 symatm: atom number 2 is reached starting at atom
   2  2  2  2  2  2  2  2  2  2  2  2  2  2  2  2  2  2  2  2  2  2  2  2

 getcut: wavevector=  0.0000  0.0000  0.0000  ngfft=  16  16  16
         ecut(hartree)=      5.000   => boxcut(ratio)=   2.11870
 mkrho: echo density (plane-wave part only)
 Total charge density [el/Bohr^3]
      Maximum=    9.3343E-02  at reduced coord.    0.1875    0.1875    0.5000
      Minimum=    2.7950E-03  at reduced coord.    0.7500    0.7500    0.7500
   Integrated=    8.0000E+00

 1/G**2 cut-off applied in the following step : cutoff-mode = CRYSTAL

 1/G**2 cut-off applied in the following step : cutoff-mode = CRYSTAL

 ==> Calculation of the frozen part of the second order derivatives, this can take some time...


 ==> Calculation of the frozen part of the second order derivative done


 1/G**2 cut-off applied in the following step : cutoff-mode = CRYSTAL

 ==>  initialize data related to q vector <== 

 respfn : the norm of the phonon wavelength (as input) was small (<1.d-7).
  q has been set exactly to (0 0 0)
 The list of irreducible perturbations for this q vector is:
    1)    idir= 1    ipert=   1
    2)    idir= 1    ipert=   2

================================================================================
 Real(R)+Recip(G) space primitive vectors, cartesian coordinates (Bohr,Bohr^-1):
 R(1)=  0.0000000  5.3050000  5.3050000  G(1)= -0.0942507  0.0942507  0.0942507
 R(2)=  5.3050000  0.0000000  5.3050000  G(2)=  0.0942507 -0.0942507  0.0942507
 R(3)=  5.3050000  5.3050000  0.0000000  G(3)=  0.0942507  0.0942507 -0.0942507
 Unit cell volume ucvol=  2.9859750E+02 bohr^3
 Unit cell volume ucvol=  2.9859750E+02 bohr^3
 Angles (23,13,12)=  6.00000000E+01  6.00000000E+01  6.00000000E+01 degrees
 Angles (23,13,12)=  6.00000000E+01  6.00000000E+01  6.00000000E+01 degrees

 getcut: wavevector=  0.0000  0.0000  0.0000  ngfft=  16  16  16
         ecut(hartree)=      5.000   => boxcut(ratio)=   2.11870

 The perturbation idir=   2  ipert=   1 is
 symmetric of a previously calculated perturbation.
 So, its SCF calculation is not needed.


 The perturbation idir=   3  ipert=   1 is
 symmetric of a previously calculated perturbation.
 So, its SCF calculation is not needed.


 The perturbation idir=   2  ipert=   2 is
 symmetric of a previously calculated perturbation.
 So, its SCF calculation is not needed.


 The perturbation idir=   3  ipert=   2 is
 symmetric of a previously calculated perturbation.
 So, its SCF calculation is not needed.


--------------------------------------------------------------------------------
 Perturbation wavevector (in red.coord.)   0.000000  0.000000  0.000000
 Perturbation : displacement of atom   1   along direction   1
 littlegroup_pert: found     2 symmetries that leave the perturbation invariant:
   1   0   0   0   1   0   0   0   1
   1   0   0   0   0   1   0   1   0
 symatm: atom number 1 is reached starting at atom
   1  1
 symatm: atom number 2 is reached starting at atom
   2  2
 symkpt : the number of k-points, thanks to the symmetries,
 is reduced to    72 .
 getmpw: optimal value of mpw= 165
- File: /home/fgoudreault/Workspace/abisuite/abisuite/unittests/test_sequencers/files/abinit_AlAs_ecut_convergence_noddk/ph_run/ecut/ecut_5.0/input_data/idat_ecut_5.0_WFK does not exist but found netcdf file with similar name.
- Opening HDf5 file with MPI-IO support: /home/fgoudreault/Workspace/abisuite/abisuite/unittests/test_sequencers/files/abinit_AlAs_ecut_convergence_noddk/ph_run/ecut/ecut_5.0/input_data/idat_ecut_5.0_WFK.nc
 inwffil: examining the header of disk file: /home/fgoudreault/Workspace/abisuite/abisuite/unittests/test_sequencers/files/abinit_AlAs_ecut_convergence_noddk/ph_run/ecut/ecut_5.0/input_data/idat_ecut_5.0_WFK.nc

================================================================================

          - hdr_check: checking restart file header for consistency -


          current calculation                           restart file
          -------------------                           ------------

  calculation expects a wf_planewave        |  input file contains a wf_planewave
. ABINIT  code version 9.5.1                |  ABINIT  code version 9.5.1
. date 20210419 bantot      288 natom    2  |  date 20210419 bantot       40 natom    2
  nkpt      72 nsym 24 ngfft  16,  16,  16  |  nkpt      10 nsym 24 ngfft  16,  16,  16
  ntypat  2 ecut_eff   5.0000000            |  ntypat  2 ecut_eff   5.0000000
  usepaw  0                                 |  usepaw  0
  usewvl  0                                 |  usewvl  0
  rprimd:                                   |  rprimd:
     0.0000000   5.3050000   5.3050000      |     0.0000000   5.3050000   5.3050000
     5.3050000   0.0000000   5.3050000      |     5.3050000   0.0000000   5.3050000
     5.3050000   5.3050000   0.0000000      |     5.3050000   5.3050000   0.0000000

--- !COMMENT
src_file: m_hdr.F90
src_line: 4172
message: |
    input nkpt=72 not equal disk file nkpt=10
...

  symafm:                                   |  symafm:
    1  1  1  1  1  1  1  1  1  1  1  1      |    1  1  1  1  1  1  1  1  1  1  1  1
    1  1  1  1  1  1  1  1  1  1  1  1      |    1  1  1  1  1  1  1  1  1  1  1  1
  symrel:                                   |  symrel:
    1  0  0  0  1  0  0  0  1               |    1  0  0  0  1  0  0  0  1
    0 -1  1  0 -1  0  1 -1  0               |    0 -1  1  0 -1  0  1 -1  0
   -1  0  0 -1  0  1 -1  1  0               |   -1  0  0 -1  0  1 -1  1  0
    0  1 -1  1  0 -1  0  0 -1               |    0  1 -1  1  0 -1  0  0 -1
   -1  0  0 -1  1  0 -1  0  1               |   -1  0  0 -1  1  0 -1  0  1
    0 -1  1  1 -1  0  0 -1  0               |    0 -1  1  1 -1  0  0 -1  0
    1  0  0  0  0  1  0  1  0               |    1  0  0  0  0  1  0  1  0
    0  1 -1  0  0 -1  1  0 -1               |    0  1 -1  0  0 -1  1  0 -1
   -1  0  1 -1  1  0 -1  0  0               |   -1  0  1 -1  1  0 -1  0  0
    0 -1  0  1 -1  0  0 -1  1               |    0 -1  0  1 -1  0  0 -1  1
    1  0 -1  0  0 -1  0  1 -1               |    1  0 -1  0  0 -1  0  1 -1
    0  1  0  0  0  1  1  0  0               |    0  1  0  0  0  1  1  0  0
    1  0 -1  0  1 -1  0  0 -1               |    1  0 -1  0  1 -1  0  0 -1
    0 -1  0  0 -1  1  1 -1  0               |    0 -1  0  0 -1  1  1 -1  0
   -1  0  1 -1  0  0 -1  1  0               |   -1  0  1 -1  0  0 -1  1  0
    0  1  0  1  0  0  0  0  1               |    0  1  0  1  0  0  0  0  1
    0  0 -1  0  1 -1  1  0 -1               |    0  0 -1  0  1 -1  1  0 -1
    1 -1  0  0 -1  1  0 -1  0               |    1 -1  0  0 -1  1  0 -1  0
    0  0  1  1  0  0  0  1  0               |    0  0  1  1  0  0  0  1  0
   -1  1  0 -1  0  0 -1  0  1               |   -1  1  0 -1  0  0 -1  0  1
    0  0  1  0  1  0  1  0  0               |    0  0  1  0  1  0  1  0  0
    1 -1  0  0 -1  0  0 -1  1               |    1 -1  0  0 -1  0  0 -1  1
    0  0 -1  1  0 -1  0  1 -1               |    0  0 -1  1  0 -1  0  1 -1
   -1  1  0 -1  0  1 -1  0  0               |   -1  1  0 -1  0  1 -1  0  0
  typat:                                    |  typat:
    1  2                                    |    1  2
  so_psp  :                                 |  so_psp  :
    1  1                                    |    1  1

--- !COMMENT
src_file: m_hdr.F90
src_line: 4420
message: |
    input kptopt = 2  /= disk file kptopt = 1
...


--- !WARNING
src_file: m_hdr.F90
src_line: 4441
message: |
    input ival=0 not equal disk file ival=4
...

  tnons:                                    |  tnons:
     0.0000000   0.0000000   0.0000000      |     0.0000000   0.0000000   0.0000000
     0.0000000   0.0000000   0.0000000      |     0.0000000   0.0000000   0.0000000
     0.0000000   0.0000000   0.0000000      |     0.0000000   0.0000000   0.0000000
     0.0000000   0.0000000   0.0000000      |     0.0000000   0.0000000   0.0000000
     0.0000000   0.0000000   0.0000000      |     0.0000000   0.0000000   0.0000000
     0.0000000   0.0000000   0.0000000      |     0.0000000   0.0000000   0.0000000
     0.0000000   0.0000000   0.0000000      |     0.0000000   0.0000000   0.0000000
     0.0000000   0.0000000   0.0000000      |     0.0000000   0.0000000   0.0000000
     0.0000000   0.0000000   0.0000000      |     0.0000000   0.0000000   0.0000000
     0.0000000   0.0000000   0.0000000      |     0.0000000   0.0000000   0.0000000
     0.0000000   0.0000000   0.0000000      |     0.0000000   0.0000000   0.0000000
     0.0000000   0.0000000   0.0000000      |     0.0000000   0.0000000   0.0000000
     0.0000000   0.0000000   0.0000000      |     0.0000000   0.0000000   0.0000000
     0.0000000   0.0000000   0.0000000      |     0.0000000   0.0000000   0.0000000
     0.0000000   0.0000000   0.0000000      |     0.0000000   0.0000000   0.0000000
     0.0000000   0.0000000   0.0000000      |     0.0000000   0.0000000   0.0000000
     0.0000000   0.0000000   0.0000000      |     0.0000000   0.0000000   0.0000000
     0.0000000   0.0000000   0.0000000      |     0.0000000   0.0000000   0.0000000
     0.0000000   0.0000000   0.0000000      |     0.0000000   0.0000000   0.0000000
     0.0000000   0.0000000   0.0000000      |     0.0000000   0.0000000   0.0000000
     0.0000000   0.0000000   0.0000000      |     0.0000000   0.0000000   0.0000000
     0.0000000   0.0000000   0.0000000      |     0.0000000   0.0000000   0.0000000
     0.0000000   0.0000000   0.0000000      |     0.0000000   0.0000000   0.0000000
     0.0000000   0.0000000   0.0000000      |     0.0000000   0.0000000   0.0000000
   znucl:                                   |   znucl:
   13.00 33.00                              |       13.00 33.00
  pseudopotential atom type  1:             |  pseudopotential atom type  1:
  pspso   0 pspxc   7                       |  pspso   0 pspxc   7
  pspdat   981214 pspcod    6 zion   3.0    |  pspdat   981214 pspcod    6 zion   3.0
  pseudopotential atom type  2:             |  pseudopotential atom type  2:
  pspso   0 pspxc   1                       |  pspso   0 pspxc   1
  pspdat   940714 pspcod    1 zion   5.0    |  pspdat   940714 pspcod    1 zion   5.0
  xred:                                     |  xred:
     0.0000000   0.0000000   0.0000000      |     0.0000000   0.0000000   0.0000000
     0.2500000   0.2500000   0.2500000      |     0.2500000   0.2500000   0.2500000

--- !COMMENT
src_file: m_hdr.F90
src_line: 4715
message: |
    Restart of self-consistent calculation need translated wavefunctions.
...

  Indeed, critical differences between current calculation and
  restart file have been detected in:
        * the number, position, or weight of k-points
        * the format of wavefunctions (istwfk)
================================================================================
-inwffil : will read wavefunctions from disk file /home/fgoudreault/Workspace/abisuite/abisuite/unittests/test_sequencers/files/abinit_AlAs_ecut_convergence_noddk/ph_run/ecut/ecut_5.0/input_data/idat_ecut_5.0_WFK.nc
 initwf: disk file gives npw= 160 nband= 4 for kpt number= 1
 initwf: 4 bands have been initialized from disk
 initwf: disk file gives npw= 161 nband= 4 for kpt number= 2
 initwf: 4 bands have been initialized from disk
 initwf: disk file gives npw= 160 nband= 4 for kpt number= 3
 initwf: 4 bands have been initialized from disk
 initwf: disk file gives npw= 158 nband= 4 for kpt number= 4
 initwf: 4 bands have been initialized from disk
 initwf: disk file gives npw= 157 nband= 4 for kpt number= 5
 initwf: 4 bands have been initialized from disk
 initwf: disk file gives npw= 160 nband= 4 for kpt number= 6
 initwf: 4 bands have been initialized from disk
 initwf: disk file gives npw= 162 nband= 4 for kpt number= 7
 initwf: 4 bands have been initialized from disk
 initwf: disk file gives npw= 159 nband= 4 for kpt number= 8
 initwf: 4 bands have been initialized from disk
- newkpt: read input wf with ikpt,npw=   1     160, make ikpt,npw=   1     160
- newkpt: read input wf with ikpt,npw=   1     160, make ikpt,npw=   2     160
- newkpt: read input wf with ikpt,npw=   1     160, make ikpt,npw=   3     160
- newkpt: read input wf with ikpt,npw=   2     161, make ikpt,npw=   4     161
- newkpt: read input wf with ikpt,npw=   3     160, make ikpt,npw=   5     160
- newkpt: read input wf with ikpt,npw=   4     158, make ikpt,npw=   6     158
- newkpt: read input wf with ikpt,npw=   3     160, make ikpt,npw=   7     160
- newkpt: read input wf with ikpt,npw=   3     160, make ikpt,npw=   8     160
- newkpt: read input wf with ikpt,npw=   4     158, make ikpt,npw=   9     158
- newkpt: read input wf with ikpt,npw=   2     161, make ikpt,npw=  10     161
- newkpt: read input wf with ikpt,npw=   4     158, make ikpt,npw=  11     158
- newkpt: read input wf with ikpt,npw=   4     158, make ikpt,npw=  12     158
- newkpt: read input wf with ikpt,npw=   2     161, make ikpt,npw=  13     161
- newkpt: read input wf with ikpt,npw=   5     157, make ikpt,npw=  14     157
- newkpt: read input wf with ikpt,npw=   6     160, make ikpt,npw=  15     160
- newkpt: read input wf with ikpt,npw=   4     158, make ikpt,npw=  16     158
- newkpt: read input wf with ikpt,npw=   7     162, make ikpt,npw=  17     162
- newkpt: read input wf with ikpt,npw=   8     159, make ikpt,npw=  18     159
 getmpw: optimal value of mpw= 165
 qpt is Gamma, psi_k+q initialized from psi_k in memory
 Initialisation of the first-order wave-functions :
  ireadwf=   0
 wfconv:4 bands set=0 with npw=160, for ikpt=1
 wfconv:4 bands set=0 with npw=160, for ikpt=2
 wfconv:4 bands set=0 with npw=160, for ikpt=3
 wfconv:4 bands set=0 with npw=161, for ikpt=4
 wfconv:4 bands set=0 with npw=160, for ikpt=5
 wfconv:4 bands set=0 with npw=158, for ikpt=6
 wfconv:4 bands set=0 with npw=160, for ikpt=7
 wfconv:4 bands set=0 with npw=160, for ikpt=8
 wfconv:4 bands set=0 with npw=158, for ikpt=9
 wfconv:4 bands set=0 with npw=161, for ikpt=10
 wfconv:4 bands set=0 with npw=158, for ikpt=11
 wfconv:4 bands set=0 with npw=158, for ikpt=12
 wfconv:4 bands set=0 with npw=161, for ikpt=13
 wfconv:4 bands set=0 with npw=157, for ikpt=14
 wfconv:4 bands set=0 with npw=160, for ikpt=15
 wfconv:4 bands set=0 with npw=158, for ikpt=16
 wfconv:4 bands set=0 with npw=162, for ikpt=17
 wfconv:4 bands set=0 with npw=159, for ikpt=18

 getcut: wavevector=  0.0000  0.0000  0.0000  ngfft=  16  16  16
         ecut(hartree)=      5.000   => boxcut(ratio)=   2.11870

 1/G**2 cut-off applied in the following step : cutoff-mode = CRYSTAL

 ITER STEP NUMBER     1
-ETOT  1   6.9311626216119     -1.878E+01 2.270E-02 4.827E+02

 Simple mixing update:
  residual square of the potential:    193.85276337123469
 dfpt_scfcv: previous iteration took  0.03 [s]

 ITER STEP NUMBER     2
 ETOT  2   5.3817843158174     -1.549E+00 1.240E-03 5.072E+00

 Pulay update with  1 previous iterations:
 mixing of old trial potential: alpha(m:m-4)=   1.06     -0.575E-01
 dfpt_scfcv: previous iteration took  0.03 [s]

 ITER STEP NUMBER     3
 ETOT  3   5.3669733582694     -1.481E-02 9.866E-06 1.507E-01

 Pulay update with  2 previous iterations:
 mixing of old trial potential: alpha(m:m-4)=   1.03     -0.180E-01 -0.105E-01
 dfpt_scfcv: previous iteration took  0.03 [s]

 ITER STEP NUMBER     4
 ETOT  4   5.3665994997791     -3.739E-04 2.731E-07 5.882E-03

 Pulay update with  3 previous iterations:
 mixing of old trial potential: alpha(m:m-4)=   1.08     -0.545E-01 -0.304E-01  0.157E-02
 dfpt_scfcv: previous iteration took  0.03 [s]

 ITER STEP NUMBER     5
 ETOT  5   5.3665866014740     -1.290E-05 9.706E-09 1.026E-04

 Pulay update with  4 previous iterations:
 mixing of old trial potential: alpha(m:m-4)=   1.18     -0.172     -0.152E-01  0.569E-02 -0.812E-04
 dfpt_scfcv: previous iteration took  0.03 [s]

 ITER STEP NUMBER     6
 ETOT  6   5.3665864234997     -1.780E-07 1.475E-10 6.995E-07

 Pulay update with  5 previous iterations:
 mixing of old trial potential: alpha(m:m-4)=   1.17     -0.193      0.195E-01  0.236E-02 -0.660E-03
 dfpt_scfcv: previous iteration took  0.03 [s]

 ITER STEP NUMBER     7
 ETOT  7   5.3665864223087     -1.191E-09 1.191E-12 9.607E-09

 At SCF step    7       vres2   =  9.61E-09 < tolvrs=  1.00E-08 =>converged.

 fftdatar_write: About to write data to: /home/fgoudreault/Workspace/abisuite/abisuite/unittests/test_sequencers/files/abinit_AlAs_ecut_convergence_noddk/ph_run/ecut/ecut_5.0/run/output_data/odat_ecut_5.0_DEN1 with iomode: IO_MODE_ETSF
- Creating HDf5 file with MPI-IO support: /home/fgoudreault/Workspace/abisuite/abisuite/unittests/test_sequencers/files/abinit_AlAs_ecut_convergence_noddk/ph_run/ecut/ecut_5.0/run/output_data/odat_ecut_5.0_DEN1.nc
- Opening HDf5 file with MPI-IO support: /home/fgoudreault/Workspace/abisuite/abisuite/unittests/test_sequencers/files/abinit_AlAs_ecut_convergence_noddk/ph_run/ecut/ecut_5.0/run/output_data/odat_ecut_5.0_DEN1.nc
 IO operation completed. cpu:  0.02 [s] , wall:  0.03 [s] <<< TIME

 fftdatar_write: About to write data to: /home/fgoudreault/Workspace/abisuite/abisuite/unittests/test_sequencers/files/abinit_AlAs_ecut_convergence_noddk/ph_run/ecut/ecut_5.0/run/output_data/odat_ecut_5.0_POT1 with iomode: IO_MODE_ETSF
- Creating HDf5 file with MPI-IO support: /home/fgoudreault/Workspace/abisuite/abisuite/unittests/test_sequencers/files/abinit_AlAs_ecut_convergence_noddk/ph_run/ecut/ecut_5.0/run/output_data/odat_ecut_5.0_POT1.nc
- Opening HDf5 file with MPI-IO support: /home/fgoudreault/Workspace/abisuite/abisuite/unittests/test_sequencers/files/abinit_AlAs_ecut_convergence_noddk/ph_run/ecut/ecut_5.0/run/output_data/odat_ecut_5.0_POT1.nc
 IO operation completed. cpu:  0.02 [s] , wall:  0.03 [s] <<< TIME
- Opening HDf5 file with MPI-IO support: /home/fgoudreault/Workspace/abisuite/abisuite/unittests/test_sequencers/files/abinit_AlAs_ecut_convergence_noddk/ph_run/ecut/ecut_5.0/run/output_data/odat_ecut_5.0_POT1.nc
================================================================================

 ----iterations are completed or convergence reached----

 Mean square residual over all n,k,spin=   37.601E-14; max=  11.913E-13
  -0.1250 -0.2500  0.0000    1  9.49413E-13 kpt; spin; max resid(k); each band:
   5.97E-13  9.49E-13  9.20E-14  8.00E-14
  -0.2500 -0.1250  0.0000    1  5.85150E-13 kpt; spin; max resid(k); each band:
   5.42E-13  5.85E-13  8.58E-14  2.22E-13
  -0.1250 -0.1250  0.1250    1  9.59695E-13 kpt; spin; max resid(k); each band:
   5.69E-13  9.60E-13  9.11E-14  2.00E-13
  -0.1250  0.5000  0.0000    1  9.61832E-13 kpt; spin; max resid(k); each band:
   1.92E-13  9.62E-13  3.17E-13  7.28E-14
  -0.2500 -0.3750  0.0000    1  8.86661E-13 kpt; spin; max resid(k); each band:
   4.25E-14  8.87E-13  7.25E-14  1.11E-13
  -0.1250 -0.3750  0.1250    1  8.85981E-13 kpt; spin; max resid(k); each band:
   2.08E-13  8.86E-13  3.78E-13  4.90E-13
  -0.3750 -0.2500  0.0000    1  4.62918E-13 kpt; spin; max resid(k); each band:
   4.93E-14  4.63E-13  1.55E-13  1.09E-13
  -0.2500 -0.2500  0.1250    1  8.96176E-13 kpt; spin; max resid(k); each band:
   4.33E-14  8.96E-13  6.78E-14  1.10E-13
  -0.1250 -0.2500  0.2500    1  8.92289E-13 kpt; spin; max resid(k); each band:
   2.01E-13  8.92E-13  3.54E-13  4.99E-13
   0.5000 -0.1250  0.0000    1  5.76741E-13 kpt; spin; max resid(k); each band:
   4.92E-14  5.77E-13  1.77E-13  1.02E-13
  -0.3750 -0.1250  0.1250    1  1.13375E-12 kpt; spin; max resid(k); each band:
   3.74E-14  5.21E-13  1.13E-12  4.17E-14
  -0.2500 -0.1250  0.2500    1  8.54864E-13 kpt; spin; max resid(k); each band:
   3.32E-14  8.55E-13  4.98E-13  5.01E-14
  -0.1250 -0.1250  0.3750    1  9.67366E-13 kpt; spin; max resid(k); each band:
   1.76E-13  9.67E-13  1.30E-13  7.19E-14
  -0.1250  0.2500  0.0000    1  6.87311E-13 kpt; spin; max resid(k); each band:
   3.64E-13  6.87E-13  8.21E-14  5.05E-14
  -0.2500  0.3750  0.0000    1  1.12784E-12 kpt; spin; max resid(k); each band:
   2.33E-14  1.13E-12  5.28E-13  4.52E-13
  -0.1250  0.3750  0.1250    1  7.46968E-13 kpt; spin; max resid(k); each band:
   3.70E-13  6.48E-13  7.47E-13  6.69E-14
  -0.3750  0.5000  0.0000    1  1.14753E-12 kpt; spin; max resid(k); each band:
   2.44E-14  1.15E-12  1.03E-13  1.33E-13
  -0.2500  0.5000  0.1250    1  9.84262E-13 kpt; spin; max resid(k); each band:
   1.44E-13  9.84E-13  4.87E-13  4.60E-13
  -0.1250  0.5000  0.2500    1  1.07701E-12 kpt; spin; max resid(k); each band:
   1.42E-13  6.20E-13  3.80E-13  1.08E-12
   0.5000 -0.3750  0.0000    1  9.86793E-13 kpt; spin; max resid(k); each band:
   3.17E-14  9.87E-13  1.26E-13  1.33E-13
  -0.3750 -0.3750  0.1250    1  1.15946E-12 kpt; spin; max resid(k); each band:
   2.45E-14  1.16E-12  1.05E-13  1.30E-13
  -0.2500 -0.3750  0.2500    1  9.87194E-13 kpt; spin; max resid(k); each band:
   1.38E-13  9.87E-13  4.92E-13  4.30E-13
  -0.1250 -0.3750  0.3750    1  1.07616E-12 kpt; spin; max resid(k); each band:
   1.44E-13  6.18E-13  3.85E-13  1.08E-12
   0.3750 -0.2500  0.0000    1  1.13384E-12 kpt; spin; max resid(k); each band:
   4.05E-14  6.55E-13  1.13E-12  4.73E-13
   0.5000 -0.2500  0.1250    1  9.18561E-13 kpt; spin; max resid(k); each band:
   2.09E-14  7.48E-13  9.19E-13  5.35E-13
  -0.3750 -0.2500  0.2500    1  9.72071E-13 kpt; spin; max resid(k); each band:
   1.69E-13  9.72E-13  4.29E-13  7.46E-13
  -0.2500 -0.2500  0.3750    1  1.12800E-12 kpt; spin; max resid(k); each band:
   2.16E-14  1.13E-12  5.54E-13  4.42E-13
  -0.1250 -0.2500  0.5000    1  7.70433E-13 kpt; spin; max resid(k); each band:
   3.61E-14  6.46E-13  7.70E-13  6.50E-14
   0.2500 -0.1250  0.0000    1  6.50855E-13 kpt; spin; max resid(k); each band:
   3.97E-14  6.51E-13  1.25E-13  4.24E-14
  -0.3750 -0.1250  0.3750    1  9.67982E-13 kpt; spin; max resid(k); each band:
   1.76E-13  9.68E-13  4.30E-13  7.61E-13
  -0.2500 -0.1250  0.5000    1  8.47011E-13 kpt; spin; max resid(k); each band:
   3.19E-14  8.47E-13  5.46E-13  4.78E-14
  -0.1250 -0.1250 -0.3750    1  6.85754E-13 kpt; spin; max resid(k); each band:
   3.72E-13  6.86E-13  8.77E-14  4.67E-14
  -0.1250  0.0000  0.0000    1  2.40756E-13 kpt; spin; max resid(k); each band:
   2.41E-13  2.23E-13  1.28E-13  1.14E-13
  -0.1250  0.1250  0.1250    1  9.95380E-13 kpt; spin; max resid(k); each band:
   2.90E-13  9.95E-13  7.70E-14  2.75E-13
  -0.2500  0.2500  0.1250    1  6.29784E-13 kpt; spin; max resid(k); each band:
   4.46E-14  6.30E-13  7.92E-14  5.51E-13
  -0.1250  0.2500  0.2500    1  5.54135E-13 kpt; spin; max resid(k); each band:
   4.87E-14  5.54E-13  2.12E-13  7.04E-14
  -0.3750  0.3750  0.1250    1  8.95418E-13 kpt; spin; max resid(k); each band:
   2.69E-14  7.17E-13  8.08E-13  8.95E-13
  -0.2500  0.3750  0.2500    1  9.02347E-13 kpt; spin; max resid(k); each band:
   3.35E-14  6.16E-13  9.02E-13  4.36E-13
  -0.1250  0.3750  0.3750    1  4.92745E-13 kpt; spin; max resid(k); each band:
   3.35E-14  4.93E-13  1.85E-13  6.94E-14
   0.5000  0.5000  0.1250    1  9.86375E-13 kpt; spin; max resid(k); each band:
   3.13E-14  9.86E-13  1.29E-13  1.29E-13
  -0.3750  0.5000  0.2500    1  8.66309E-13 kpt; spin; max resid(k); each band:
   2.63E-14  7.06E-13  8.39E-13  8.66E-13
  -0.2500  0.5000  0.3750    1  9.27419E-13 kpt; spin; max resid(k); each band:
   3.28E-14  5.96E-13  9.27E-13  4.12E-13
  -0.1250  0.5000  0.5000    1  4.81868E-13 kpt; spin; max resid(k); each band:
   3.29E-14  4.82E-13  1.85E-13  6.94E-14
   0.5000 -0.3750  0.2500    1  9.52208E-13 kpt; spin; max resid(k); each band:
   1.99E-14  7.38E-13  9.52E-13  4.99E-13
  -0.3750 -0.3750  0.3750    1  1.18336E-12 kpt; spin; max resid(k); each band:
   3.85E-14  6.26E-13  1.18E-12  4.66E-13
  -0.2500 -0.3750  0.5000    1  5.90436E-13 kpt; spin; max resid(k); each band:
   4.31E-14  5.90E-13  8.16E-14  5.18E-13
  -0.1250 -0.3750 -0.3750    1  5.20060E-13 kpt; spin; max resid(k); each band:
   4.77E-14  5.20E-13  2.15E-13  7.11E-14
  -0.3750 -0.2500  0.5000    1  1.19133E-12 kpt; spin; max resid(k); each band:
   3.61E-14  4.96E-13  1.19E-12  4.29E-14
  -0.2500 -0.2500 -0.3750    1  6.09581E-13 kpt; spin; max resid(k); each band:
   3.79E-14  6.10E-13  1.29E-13  3.85E-14
  -0.1250 -0.2500 -0.2500    1  9.37776E-13 kpt; spin; max resid(k); each band:
   3.12E-13  9.38E-13  8.26E-14  2.81E-13
 outwf : prtvol=0 or 1, do not print more k-points.

in cg_ncwrite with path: /home/fgoudreault/Workspace/abisuite/abisuite/unittests/test_sequencers/files/abinit_AlAs_ecut_convergence_noddk/ph_run/ecut/ecut_5.0/run/output_data/odat_ecut_5.0_1WF1.nc
same layout Writing WFK file: /home/fgoudreault/Workspace/abisuite/abisuite/unittests/test_sequencers/files/abinit_AlAs_ecut_convergence_noddk/ph_run/ecut/ecut_5.0/run/output_data/odat_ecut_5.0_1WF1.nc, with iomode: IO_MODE_ETSF, single writer: F
Using individual IO for the CGs
 collective ncwrite completed. cpu:  0.02 [s] , wall:  0.03 [s] <<< TIME

 Thirteen components of 2nd-order total energy (hartree) are
 1,2,3: 0th-order hamiltonian combined with 1st-order wavefunctions
     kin0=   2.41688410E+01 eigvalue=   8.04433219E-01  local=  -1.33387693E+01
 4,5,6: 1st-order hamiltonian combined with 1st and 0th-order wfs
 loc psp =  -1.56470627E+01  Hartree=   3.78558380E+00     xc=  -2.00027183E+00
 note that "loc psp" includes a xc core correction that could be resolved
 7,8,9: eventually, occupation + non-local contributions
    edocc=   0.00000000E+00     enl0=   6.91987200E+00   enl1=  -2.50323226E+01
 1-9 gives the relaxation energy (to be shifted if some occ is /=2.0)
   erelax=  -2.03396964E+01
 10,11,12 Non-relaxation  contributions : frozen-wavefunctions and Ewald
 fr.local=  -5.77298689E+00 fr.nonlo=   1.96353765E+01  Ewald=   1.18438931E+01
 dfpt_prtene : non-relax=    2.570628E+01
 13,14 Frozen wf xc core corrections (1) and (2)
 frxc 1  =   0.00000000E+00  frxc 2 =   0.00000000E+00
 Resulting in :
 2DEtotal=    0.5366586422E+01 Ha. Also 2DEtotal=    0.146032243155E+03 eV
    (2DErelax=   -2.0339696356E+01 Ha. 2DEnonrelax=    2.5706282778E+01 Ha)
    (  non-var. 2DEtotal :    5.3665901426E+00 Ha)


--------------------------------------------------------------------------------
 Perturbation wavevector (in red.coord.)   0.000000  0.000000  0.000000
 Perturbation : displacement of atom   2   along direction   1
 littlegroup_pert: found     2 symmetries that leave the perturbation invariant:
   1   0   0   0   1   0   0   0   1
   1   0   0   0   0   1   0   1   0
 symatm: atom number 1 is reached starting at atom
   1  1
 symatm: atom number 2 is reached starting at atom
   2  2
 symkpt : the number of k-points, thanks to the symmetries,
 is reduced to    72 .
 getmpw: optimal value of mpw= 165
- File: /home/fgoudreault/Workspace/abisuite/abisuite/unittests/test_sequencers/files/abinit_AlAs_ecut_convergence_noddk/ph_run/ecut/ecut_5.0/input_data/idat_ecut_5.0_WFK does not exist but found netcdf file with similar name.
- Opening HDf5 file with MPI-IO support: /home/fgoudreault/Workspace/abisuite/abisuite/unittests/test_sequencers/files/abinit_AlAs_ecut_convergence_noddk/ph_run/ecut/ecut_5.0/input_data/idat_ecut_5.0_WFK.nc
 inwffil: examining the header of disk file: /home/fgoudreault/Workspace/abisuite/abisuite/unittests/test_sequencers/files/abinit_AlAs_ecut_convergence_noddk/ph_run/ecut/ecut_5.0/input_data/idat_ecut_5.0_WFK.nc

================================================================================

          - hdr_check: checking restart file header for consistency -


          current calculation                           restart file
          -------------------                           ------------

  calculation expects a wf_planewave        |  input file contains a wf_planewave
. ABINIT  code version 9.5.1                |  ABINIT  code version 9.5.1
. date 20210419 bantot      288 natom    2  |  date 20210419 bantot       40 natom    2
  nkpt      72 nsym 24 ngfft  16,  16,  16  |  nkpt      10 nsym 24 ngfft  16,  16,  16
  ntypat  2 ecut_eff   5.0000000            |  ntypat  2 ecut_eff   5.0000000
  usepaw  0                                 |  usepaw  0
  usewvl  0                                 |  usewvl  0
  rprimd:                                   |  rprimd:
     0.0000000   5.3050000   5.3050000      |     0.0000000   5.3050000   5.3050000
     5.3050000   0.0000000   5.3050000      |     5.3050000   0.0000000   5.3050000
     5.3050000   5.3050000   0.0000000      |     5.3050000   5.3050000   0.0000000

--- !COMMENT
src_file: m_hdr.F90
src_line: 4172
message: |
    input nkpt=72 not equal disk file nkpt=10
...

  symafm:                                   |  symafm:
    1  1  1  1  1  1  1  1  1  1  1  1      |    1  1  1  1  1  1  1  1  1  1  1  1
    1  1  1  1  1  1  1  1  1  1  1  1      |    1  1  1  1  1  1  1  1  1  1  1  1
  symrel:                                   |  symrel:
    1  0  0  0  1  0  0  0  1               |    1  0  0  0  1  0  0  0  1
    0 -1  1  0 -1  0  1 -1  0               |    0 -1  1  0 -1  0  1 -1  0
   -1  0  0 -1  0  1 -1  1  0               |   -1  0  0 -1  0  1 -1  1  0
    0  1 -1  1  0 -1  0  0 -1               |    0  1 -1  1  0 -1  0  0 -1
   -1  0  0 -1  1  0 -1  0  1               |   -1  0  0 -1  1  0 -1  0  1
    0 -1  1  1 -1  0  0 -1  0               |    0 -1  1  1 -1  0  0 -1  0
    1  0  0  0  0  1  0  1  0               |    1  0  0  0  0  1  0  1  0
    0  1 -1  0  0 -1  1  0 -1               |    0  1 -1  0  0 -1  1  0 -1
   -1  0  1 -1  1  0 -1  0  0               |   -1  0  1 -1  1  0 -1  0  0
    0 -1  0  1 -1  0  0 -1  1               |    0 -1  0  1 -1  0  0 -1  1
    1  0 -1  0  0 -1  0  1 -1               |    1  0 -1  0  0 -1  0  1 -1
    0  1  0  0  0  1  1  0  0               |    0  1  0  0  0  1  1  0  0
    1  0 -1  0  1 -1  0  0 -1               |    1  0 -1  0  1 -1  0  0 -1
    0 -1  0  0 -1  1  1 -1  0               |    0 -1  0  0 -1  1  1 -1  0
   -1  0  1 -1  0  0 -1  1  0               |   -1  0  1 -1  0  0 -1  1  0
    0  1  0  1  0  0  0  0  1               |    0  1  0  1  0  0  0  0  1
    0  0 -1  0  1 -1  1  0 -1               |    0  0 -1  0  1 -1  1  0 -1
    1 -1  0  0 -1  1  0 -1  0               |    1 -1  0  0 -1  1  0 -1  0
    0  0  1  1  0  0  0  1  0               |    0  0  1  1  0  0  0  1  0
   -1  1  0 -1  0  0 -1  0  1               |   -1  1  0 -1  0  0 -1  0  1
    0  0  1  0  1  0  1  0  0               |    0  0  1  0  1  0  1  0  0
    1 -1  0  0 -1  0  0 -1  1               |    1 -1  0  0 -1  0  0 -1  1
    0  0 -1  1  0 -1  0  1 -1               |    0  0 -1  1  0 -1  0  1 -1
   -1  1  0 -1  0  1 -1  0  0               |   -1  1  0 -1  0  1 -1  0  0
  typat:                                    |  typat:
    1  2                                    |    1  2
  so_psp  :                                 |  so_psp  :
    1  1                                    |    1  1

--- !COMMENT
src_file: m_hdr.F90
src_line: 4420
message: |
    input kptopt = 2  /= disk file kptopt = 1
...


--- !WARNING
src_file: m_hdr.F90
src_line: 4441
message: |
    input ival=0 not equal disk file ival=4
...

  tnons:                                    |  tnons:
     0.0000000   0.0000000   0.0000000      |     0.0000000   0.0000000   0.0000000
     0.0000000   0.0000000   0.0000000      |     0.0000000   0.0000000   0.0000000
     0.0000000   0.0000000   0.0000000      |     0.0000000   0.0000000   0.0000000
     0.0000000   0.0000000   0.0000000      |     0.0000000   0.0000000   0.0000000
     0.0000000   0.0000000   0.0000000      |     0.0000000   0.0000000   0.0000000
     0.0000000   0.0000000   0.0000000      |     0.0000000   0.0000000   0.0000000
     0.0000000   0.0000000   0.0000000      |     0.0000000   0.0000000   0.0000000
     0.0000000   0.0000000   0.0000000      |     0.0000000   0.0000000   0.0000000
     0.0000000   0.0000000   0.0000000      |     0.0000000   0.0000000   0.0000000
     0.0000000   0.0000000   0.0000000      |     0.0000000   0.0000000   0.0000000
     0.0000000   0.0000000   0.0000000      |     0.0000000   0.0000000   0.0000000
     0.0000000   0.0000000   0.0000000      |     0.0000000   0.0000000   0.0000000
     0.0000000   0.0000000   0.0000000      |     0.0000000   0.0000000   0.0000000
     0.0000000   0.0000000   0.0000000      |     0.0000000   0.0000000   0.0000000
     0.0000000   0.0000000   0.0000000      |     0.0000000   0.0000000   0.0000000
     0.0000000   0.0000000   0.0000000      |     0.0000000   0.0000000   0.0000000
     0.0000000   0.0000000   0.0000000      |     0.0000000   0.0000000   0.0000000
     0.0000000   0.0000000   0.0000000      |     0.0000000   0.0000000   0.0000000
     0.0000000   0.0000000   0.0000000      |     0.0000000   0.0000000   0.0000000
     0.0000000   0.0000000   0.0000000      |     0.0000000   0.0000000   0.0000000
     0.0000000   0.0000000   0.0000000      |     0.0000000   0.0000000   0.0000000
     0.0000000   0.0000000   0.0000000      |     0.0000000   0.0000000   0.0000000
     0.0000000   0.0000000   0.0000000      |     0.0000000   0.0000000   0.0000000
     0.0000000   0.0000000   0.0000000      |     0.0000000   0.0000000   0.0000000
   znucl:                                   |   znucl:
   13.00 33.00                              |       13.00 33.00
  pseudopotential atom type  1:             |  pseudopotential atom type  1:
  pspso   0 pspxc   7                       |  pspso   0 pspxc   7
  pspdat   981214 pspcod    6 zion   3.0    |  pspdat   981214 pspcod    6 zion   3.0
  pseudopotential atom type  2:             |  pseudopotential atom type  2:
  pspso   0 pspxc   1                       |  pspso   0 pspxc   1
  pspdat   940714 pspcod    1 zion   5.0    |  pspdat   940714 pspcod    1 zion   5.0
  xred:                                     |  xred:
     0.0000000   0.0000000   0.0000000      |     0.0000000   0.0000000   0.0000000
     0.2500000   0.2500000   0.2500000      |     0.2500000   0.2500000   0.2500000

--- !COMMENT
src_file: m_hdr.F90
src_line: 4715
message: |
    Restart of self-consistent calculation need translated wavefunctions.
...

  Indeed, critical differences between current calculation and
  restart file have been detected in:
        * the number, position, or weight of k-points
        * the format of wavefunctions (istwfk)
================================================================================
-inwffil : will read wavefunctions from disk file /home/fgoudreault/Workspace/abisuite/abisuite/unittests/test_sequencers/files/abinit_AlAs_ecut_convergence_noddk/ph_run/ecut/ecut_5.0/input_data/idat_ecut_5.0_WFK.nc
 initwf: disk file gives npw= 160 nband= 4 for kpt number= 1
 initwf: 4 bands have been initialized from disk
 initwf: disk file gives npw= 161 nband= 4 for kpt number= 2
 initwf: 4 bands have been initialized from disk
 initwf: disk file gives npw= 160 nband= 4 for kpt number= 3
 initwf: 4 bands have been initialized from disk
 initwf: disk file gives npw= 158 nband= 4 for kpt number= 4
 initwf: 4 bands have been initialized from disk
 initwf: disk file gives npw= 157 nband= 4 for kpt number= 5
 initwf: 4 bands have been initialized from disk
 initwf: disk file gives npw= 160 nband= 4 for kpt number= 6
 initwf: 4 bands have been initialized from disk
 initwf: disk file gives npw= 162 nband= 4 for kpt number= 7
 initwf: 4 bands have been initialized from disk
 initwf: disk file gives npw= 159 nband= 4 for kpt number= 8
 initwf: 4 bands have been initialized from disk
- newkpt: read input wf with ikpt,npw=   1     160, make ikpt,npw=   1     160
- newkpt: read input wf with ikpt,npw=   1     160, make ikpt,npw=   2     160
- newkpt: read input wf with ikpt,npw=   1     160, make ikpt,npw=   3     160
- newkpt: read input wf with ikpt,npw=   2     161, make ikpt,npw=   4     161
- newkpt: read input wf with ikpt,npw=   3     160, make ikpt,npw=   5     160
- newkpt: read input wf with ikpt,npw=   4     158, make ikpt,npw=   6     158
- newkpt: read input wf with ikpt,npw=   3     160, make ikpt,npw=   7     160
- newkpt: read input wf with ikpt,npw=   3     160, make ikpt,npw=   8     160
- newkpt: read input wf with ikpt,npw=   4     158, make ikpt,npw=   9     158
- newkpt: read input wf with ikpt,npw=   2     161, make ikpt,npw=  10     161
- newkpt: read input wf with ikpt,npw=   4     158, make ikpt,npw=  11     158
- newkpt: read input wf with ikpt,npw=   4     158, make ikpt,npw=  12     158
- newkpt: read input wf with ikpt,npw=   2     161, make ikpt,npw=  13     161
- newkpt: read input wf with ikpt,npw=   5     157, make ikpt,npw=  14     157
- newkpt: read input wf with ikpt,npw=   6     160, make ikpt,npw=  15     160
- newkpt: read input wf with ikpt,npw=   4     158, make ikpt,npw=  16     158
- newkpt: read input wf with ikpt,npw=   7     162, make ikpt,npw=  17     162
- newkpt: read input wf with ikpt,npw=   8     159, make ikpt,npw=  18     159
 getmpw: optimal value of mpw= 165
 qpt is Gamma, psi_k+q initialized from psi_k in memory
 Initialisation of the first-order wave-functions :
  ireadwf=   0
 wfconv:4 bands set=0 with npw=160, for ikpt=1
 wfconv:4 bands set=0 with npw=160, for ikpt=2
 wfconv:4 bands set=0 with npw=160, for ikpt=3
 wfconv:4 bands set=0 with npw=161, for ikpt=4
 wfconv:4 bands set=0 with npw=160, for ikpt=5
 wfconv:4 bands set=0 with npw=158, for ikpt=6
 wfconv:4 bands set=0 with npw=160, for ikpt=7
 wfconv:4 bands set=0 with npw=160, for ikpt=8
 wfconv:4 bands set=0 with npw=158, for ikpt=9
 wfconv:4 bands set=0 with npw=161, for ikpt=10
 wfconv:4 bands set=0 with npw=158, for ikpt=11
 wfconv:4 bands set=0 with npw=158, for ikpt=12
 wfconv:4 bands set=0 with npw=161, for ikpt=13
 wfconv:4 bands set=0 with npw=157, for ikpt=14
 wfconv:4 bands set=0 with npw=160, for ikpt=15
 wfconv:4 bands set=0 with npw=158, for ikpt=16
 wfconv:4 bands set=0 with npw=162, for ikpt=17
 wfconv:4 bands set=0 with npw=159, for ikpt=18

 getcut: wavevector=  0.0000  0.0000  0.0000  ngfft=  16  16  16
         ecut(hartree)=      5.000   => boxcut(ratio)=   2.11870

 ITER STEP NUMBER     1
-ETOT  1   38.567614106995     -5.256E+01 1.340E-01 8.414E+03

 Simple mixing update:
  residual square of the potential:    3235.8050515031632
 dfpt_scfcv: previous iteration took  0.03 [s]

 ITER STEP NUMBER     2
 ETOT  2   6.1333839809029     -3.243E+01 2.633E-02 1.501E+02

 Pulay update with  1 previous iterations:
 mixing of old trial potential: alpha(m:m-4)=  0.886      0.114
 dfpt_scfcv: previous iteration took  0.03 [s]

 ITER STEP NUMBER     3
 ETOT  3   5.3728312167555     -7.606E-01 8.430E-04 2.439E+00

 Pulay update with  2 previous iterations:
 mixing of old trial potential: alpha(m:m-4)=   1.13     -0.107     -0.263E-01
 dfpt_scfcv: previous iteration took  0.03 [s]

 ITER STEP NUMBER     4
 ETOT  4   5.3665718603508     -6.259E-03 4.852E-06 3.169E-02

 Pulay update with  3 previous iterations:
 mixing of old trial potential: alpha(m:m-4)=   1.21     -0.226      0.115E-01  0.318E-02
 dfpt_scfcv: previous iteration took  0.03 [s]

 ITER STEP NUMBER     5
 ETOT  5   5.3665189327214     -5.293E-05 6.436E-08 2.050E-04

 Pulay update with  4 previous iterations:
 mixing of old trial potential: alpha(m:m-4)=   1.23     -0.270      0.448E-01 -0.254E-02 -0.625E-03
 dfpt_scfcv: previous iteration took  0.03 [s]

 ITER STEP NUMBER     6
 ETOT  6   5.3665186447649     -2.880E-07 2.656E-10 2.234E-06

 Pulay update with  5 previous iterations:
 mixing of old trial potential: alpha(m:m-4)=   1.16     -0.192      0.334E-01 -0.558E-02  0.355E-03
 dfpt_scfcv: previous iteration took  0.03 [s]

 ITER STEP NUMBER     7
 ETOT  7   5.3665186405766     -4.188E-09 4.351E-12 1.273E-07

 Pulay update with  6 previous iterations:
 mixing of old trial potential: alpha(m:m-4)=  0.871      0.181     -0.630E-01  0.124E-01 -0.202E-02
 dfpt_scfcv: previous iteration took  0.03 [s]

 ITER STEP NUMBER     8
 ETOT  8   5.3665186401761     -4.005E-10 2.415E-13 4.003E-09

 At SCF step    8       vres2   =  4.00E-09 < tolvrs=  1.00E-08 =>converged.

 fftdatar_write: About to write data to: /home/fgoudreault/Workspace/abisuite/abisuite/unittests/test_sequencers/files/abinit_AlAs_ecut_convergence_noddk/ph_run/ecut/ecut_5.0/run/output_data/odat_ecut_5.0_DEN4 with iomode: IO_MODE_ETSF
- Creating HDf5 file with MPI-IO support: /home/fgoudreault/Workspace/abisuite/abisuite/unittests/test_sequencers/files/abinit_AlAs_ecut_convergence_noddk/ph_run/ecut/ecut_5.0/run/output_data/odat_ecut_5.0_DEN4.nc
- Opening HDf5 file with MPI-IO support: /home/fgoudreault/Workspace/abisuite/abisuite/unittests/test_sequencers/files/abinit_AlAs_ecut_convergence_noddk/ph_run/ecut/ecut_5.0/run/output_data/odat_ecut_5.0_DEN4.nc
 IO operation completed. cpu:  0.02 [s] , wall:  0.03 [s] <<< TIME

 fftdatar_write: About to write data to: /home/fgoudreault/Workspace/abisuite/abisuite/unittests/test_sequencers/files/abinit_AlAs_ecut_convergence_noddk/ph_run/ecut/ecut_5.0/run/output_data/odat_ecut_5.0_POT4 with iomode: IO_MODE_ETSF
- Creating HDf5 file with MPI-IO support: /home/fgoudreault/Workspace/abisuite/abisuite/unittests/test_sequencers/files/abinit_AlAs_ecut_convergence_noddk/ph_run/ecut/ecut_5.0/run/output_data/odat_ecut_5.0_POT4.nc
- Opening HDf5 file with MPI-IO support: /home/fgoudreault/Workspace/abisuite/abisuite/unittests/test_sequencers/files/abinit_AlAs_ecut_convergence_noddk/ph_run/ecut/ecut_5.0/run/output_data/odat_ecut_5.0_POT4.nc
 IO operation completed. cpu:  0.02 [s] , wall:  0.03 [s] <<< TIME
- Opening HDf5 file with MPI-IO support: /home/fgoudreault/Workspace/abisuite/abisuite/unittests/test_sequencers/files/abinit_AlAs_ecut_convergence_noddk/ph_run/ecut/ecut_5.0/run/output_data/odat_ecut_5.0_POT4.nc
================================================================================

 ----iterations are completed or convergence reached----

 Mean square residual over all n,k,spin=   85.226E-15; max=  24.150E-14
  -0.1250 -0.2500  0.0000    1  1.48956E-13 kpt; spin; max resid(k); each band:
   3.36E-14  1.23E-14  1.49E-13  4.03E-14
  -0.2500 -0.1250  0.0000    1  1.50040E-13 kpt; spin; max resid(k); each band:
   2.77E-14  9.62E-14  1.50E-13  4.70E-14
  -0.1250 -0.1250  0.1250    1  1.18557E-13 kpt; spin; max resid(k); each band:
   2.79E-14  1.09E-13  1.19E-13  5.12E-14
  -0.1250  0.5000  0.0000    1  1.68080E-13 kpt; spin; max resid(k); each band:
   1.68E-13  1.03E-13  3.21E-14  1.07E-13
  -0.2500 -0.3750  0.0000    1  1.34465E-13 kpt; spin; max resid(k); each band:
   2.44E-14  1.12E-13  1.34E-13  9.15E-14
  -0.1250 -0.3750  0.1250    1  1.50409E-13 kpt; spin; max resid(k); each band:
   1.50E-13  1.07E-13  1.13E-13  1.15E-13
  -0.3750 -0.2500  0.0000    1  1.10959E-13 kpt; spin; max resid(k); each band:
   2.05E-14  1.11E-13  2.83E-14  8.82E-14
  -0.2500 -0.2500  0.1250    1  1.18542E-13 kpt; spin; max resid(k); each band:
   2.42E-14  1.19E-13  2.43E-14  5.08E-14
  -0.1250 -0.2500  0.2500    1  1.85818E-13 kpt; spin; max resid(k); each band:
   1.86E-13  1.11E-13  1.41E-13  1.35E-13
   0.5000 -0.1250  0.0000    1  1.43333E-13 kpt; spin; max resid(k); each band:
   1.23E-13  1.43E-13  4.08E-14  1.05E-13
  -0.3750 -0.1250  0.1250    1  1.29029E-13 kpt; spin; max resid(k); each band:
   1.29E-13  1.11E-13  1.28E-13  1.13E-13
  -0.2500 -0.1250  0.2500    1  1.54451E-13 kpt; spin; max resid(k); each band:
   1.54E-13  1.16E-13  1.20E-13  1.24E-13
  -0.1250 -0.1250  0.3750    1  2.15675E-13 kpt; spin; max resid(k); each band:
   2.16E-13  1.10E-13  3.37E-14  8.13E-14
  -0.1250  0.2500  0.0000    1  1.06963E-13 kpt; spin; max resid(k); each band:
   2.07E-14  1.07E-13  2.35E-14  1.60E-14
  -0.2500  0.3750  0.0000    1  1.25516E-13 kpt; spin; max resid(k); each band:
   1.26E-13  1.19E-13  9.24E-14  7.93E-14
  -0.1250  0.3750  0.1250    1  1.27406E-13 kpt; spin; max resid(k); each band:
   1.27E-13  1.10E-13  1.15E-13  1.16E-13
  -0.3750  0.5000  0.0000    1  1.62071E-13 kpt; spin; max resid(k); each band:
   1.62E-13  1.13E-13  9.78E-14  7.49E-14
  -0.2500  0.5000  0.1250    1  1.11780E-13 kpt; spin; max resid(k); each band:
   8.83E-14  1.12E-13  8.64E-14  7.61E-14
  -0.1250  0.5000  0.2500    1  1.24314E-13 kpt; spin; max resid(k); each band:
   1.08E-13  1.24E-13  7.97E-14  8.11E-14
   0.5000 -0.3750  0.0000    1  1.55655E-13 kpt; spin; max resid(k); each band:
   1.56E-13  1.27E-13  1.17E-13  7.32E-14
  -0.3750 -0.3750  0.1250    1  1.21684E-13 kpt; spin; max resid(k); each band:
   1.83E-14  1.22E-13  9.60E-14  3.55E-14
  -0.2500 -0.3750  0.2500    1  1.35588E-13 kpt; spin; max resid(k); each band:
   1.36E-13  9.92E-14  9.20E-14  9.63E-14
  -0.1250 -0.3750  0.3750    1  1.15544E-13 kpt; spin; max resid(k); each band:
   1.16E-13  1.04E-13  8.20E-14  8.85E-14
   0.3750 -0.2500  0.0000    1  1.44241E-13 kpt; spin; max resid(k); each band:
   1.07E-13  1.44E-13  1.14E-13  7.78E-14
   0.5000 -0.2500  0.1250    1  1.32999E-13 kpt; spin; max resid(k); each band:
   7.93E-14  1.33E-13  9.46E-14  7.33E-14
  -0.3750 -0.2500  0.2500    1  1.33305E-13 kpt; spin; max resid(k); each band:
   1.30E-13  1.33E-13  7.40E-14  1.05E-13
  -0.2500 -0.2500  0.3750    1  1.51277E-13 kpt; spin; max resid(k); each band:
   3.10E-14  1.51E-13  1.05E-13  5.62E-14
  -0.1250 -0.2500  0.5000    1  1.81873E-13 kpt; spin; max resid(k); each band:
   1.82E-13  1.17E-13  1.24E-13  1.46E-13
   0.2500 -0.1250  0.0000    1  9.90088E-14 kpt; spin; max resid(k); each band:
   1.95E-14  9.90E-14  2.46E-14  1.95E-14
  -0.3750 -0.1250  0.3750    1  1.18033E-13 kpt; spin; max resid(k); each band:
   9.80E-14  1.18E-13  7.04E-14  8.86E-14
  -0.2500 -0.1250  0.5000    1  2.02710E-13 kpt; spin; max resid(k); each band:
   2.03E-13  1.16E-13  1.04E-13  1.35E-13
  -0.1250 -0.1250 -0.3750    1  1.10190E-13 kpt; spin; max resid(k); each band:
   3.11E-14  1.10E-13  2.63E-14  2.07E-14
  -0.1250  0.0000  0.0000    1  4.36122E-14 kpt; spin; max resid(k); each band:
   3.85E-14  1.92E-14  4.36E-14  4.25E-14
  -0.1250  0.1250  0.1250    1  1.13622E-13 kpt; spin; max resid(k); each band:
   2.48E-14  1.05E-13  1.14E-13  5.40E-14
  -0.2500  0.2500  0.1250    1  1.36021E-13 kpt; spin; max resid(k); each band:
   1.29E-13  1.33E-13  1.36E-13  1.14E-13
  -0.1250  0.2500  0.2500    1  1.26762E-13 kpt; spin; max resid(k); each band:
   2.05E-14  1.27E-13  3.24E-14  4.54E-14
  -0.3750  0.3750  0.1250    1  1.15393E-13 kpt; spin; max resid(k); each band:
   8.37E-14  1.15E-13  9.85E-14  8.50E-14
  -0.2500  0.3750  0.2500    1  1.49808E-13 kpt; spin; max resid(k); each band:
   9.55E-14  1.50E-13  9.68E-14  8.15E-14
  -0.1250  0.3750  0.3750    1  1.65805E-13 kpt; spin; max resid(k); each band:
   1.66E-13  1.52E-13  1.39E-13  3.16E-14
   0.5000  0.5000  0.1250    1  1.09081E-13 kpt; spin; max resid(k); each band:
   2.14E-14  1.09E-13  8.06E-14  3.51E-14
  -0.3750  0.5000  0.2500    1  1.37105E-13 kpt; spin; max resid(k); each band:
   1.37E-13  9.73E-14  6.75E-14  1.19E-13
  -0.2500  0.5000  0.3750    1  1.41495E-13 kpt; spin; max resid(k); each band:
   1.41E-13  1.21E-13  6.30E-14  9.91E-14
  -0.1250  0.5000  0.5000    1  1.86048E-13 kpt; spin; max resid(k); each band:
   1.86E-13  1.37E-13  1.13E-13  3.31E-14
   0.5000 -0.3750  0.2500    1  1.45858E-13 kpt; spin; max resid(k); each band:
   1.46E-13  1.02E-13  6.22E-14  1.13E-13
  -0.3750 -0.3750  0.3750    1  1.31680E-13 kpt; spin; max resid(k); each band:
   3.63E-14  1.32E-13  8.28E-14  5.95E-14
  -0.2500 -0.3750  0.5000    1  2.41502E-13 kpt; spin; max resid(k); each band:
   2.42E-13  7.93E-15  9.24E-14  1.18E-13
  -0.1250 -0.3750 -0.3750    1  1.16860E-13 kpt; spin; max resid(k); each band:
   3.17E-14  8.55E-15  1.17E-13  4.97E-14
  -0.3750 -0.2500  0.5000    1  1.43952E-13 kpt; spin; max resid(k); each band:
   3.03E-14  1.37E-13  8.99E-14  1.44E-13
  -0.2500 -0.2500 -0.3750    1  3.11672E-14 kpt; spin; max resid(k); each band:
   3.12E-14  9.35E-15  1.95E-14  1.90E-14
  -0.1250 -0.2500 -0.2500    1  1.15155E-13 kpt; spin; max resid(k); each band:
   3.53E-14  1.35E-14  1.15E-13  3.40E-14
 outwf : prtvol=0 or 1, do not print more k-points.

in cg_ncwrite with path: /home/fgoudreault/Workspace/abisuite/abisuite/unittests/test_sequencers/files/abinit_AlAs_ecut_convergence_noddk/ph_run/ecut/ecut_5.0/run/output_data/odat_ecut_5.0_1WF4.nc
same layout Writing WFK file: /home/fgoudreault/Workspace/abisuite/abisuite/unittests/test_sequencers/files/abinit_AlAs_ecut_convergence_noddk/ph_run/ecut/ecut_5.0/run/output_data/odat_ecut_5.0_1WF4.nc, with iomode: IO_MODE_ETSF, single writer: F
Using individual IO for the CGs
 collective ncwrite completed. cpu:  0.02 [s] , wall:  0.03 [s] <<< TIME

 Thirteen components of 2nd-order total energy (hartree) are
 1,2,3: 0th-order hamiltonian combined with 1st-order wavefunctions
     kin0=   1.03239949E+02 eigvalue=   7.30016911E-01  local=  -5.38205052E+01
 4,5,6: 1st-order hamiltonian combined with 1st and 0th-order wfs
 loc psp =  -1.37705306E+02  Hartree=   3.62673719E+01     xc=  -1.12640456E+01
 note that "loc psp" includes a xc core correction that could be resolved
 7,8,9: eventually, occupation + non-local contributions
    edocc=   0.00000000E+00     enl0=   1.06038295E+01   enl1=  -3.38079200E+01
 1-9 gives the relaxation energy (to be shifted if some occ is /=2.0)
   erelax=  -8.57566096E+01
 10,11,12 Non-relaxation  contributions : frozen-wavefunctions and Ewald
 fr.local=   5.94329236E+01 fr.nonlo=   1.69307263E+01  Ewald=   1.18438931E+01
 dfpt_prtene : non-relax=    8.820754E+01
 13,14 Frozen wf xc core corrections (1) and (2)
 frxc 1  =  -1.85841497E+01  frxc 2 =   2.14997350E+01
 Resulting in :
 2DEtotal=    0.5366518640E+01 Ha. Also 2DEtotal=    0.146030398710E+03 eV
    (2DErelax=   -8.5756609581E+01 Ha. 2DEnonrelax=    9.1123128221E+01 Ha)
    (  non-var. 2DEtotal :    5.3665152921E+00 Ha)

================================================================================

 ---- first-order wavefunction calculations are completed ----


 ==> Compute Derivative Database <==
- Creating HDf5 file with MPI-IO support: /home/fgoudreault/Workspace/abisuite/abisuite/unittests/test_sequencers/files/abinit_AlAs_ecut_convergence_noddk/ph_run/ecut/ecut_5.0/run/output_data/odat_ecut_5.0_DDB.nc
 
 phonon wavelength (reduced coordinates) , norm, and energies in hartree
  0.00 0.00 0.00 1.00
  2.270267363E-06  2.270267765E-06  2.270268974E-06  1.623769788E-03  1.623769788E-03
  1.623769788E-03

 Zero Point Motion energy (sum of freqs/2)=  2.439060084E-03
  efmasval_free_array : enter 

== END DATASET(S) ==============================================================
================================================================================
  
 -outvars: echo values of variables after computation  --------
 
 These variables are accessible in NetCDF format (/home/fgoudreault/Workspace/abisuite/abisuite/unittests/test_sequencers/files/abinit_AlAs_ecut_convergence_noddk/ph_run/ecut/ecut_5.0/run/output_data/odat_ecut_5.0_OUT.nc)

            acell      1.0610000000E+01  1.0610000000E+01  1.0610000000E+01 Bohr
              amu      2.69815390E+01  7.49215900E+01
           diemac      9.00000000E+00
             ecut      5.00000000E+00 Hartree
           etotal      5.3665186402E+00
            fcart      0.0000000000E+00  0.0000000000E+00  0.0000000000E+00
                       0.0000000000E+00  0.0000000000E+00  0.0000000000E+00
-          fftalg         112
           irdwfk           1
              kpt     -1.25000000E-01 -2.50000000E-01  0.00000000E+00
                      -2.50000000E-01 -1.25000000E-01  0.00000000E+00
                      -1.25000000E-01 -1.25000000E-01  1.25000000E-01
                      -1.25000000E-01  5.00000000E-01  0.00000000E+00
                      -2.50000000E-01 -3.75000000E-01  0.00000000E+00
                      -1.25000000E-01 -3.75000000E-01  1.25000000E-01
                      -3.75000000E-01 -2.50000000E-01  0.00000000E+00
                      -2.50000000E-01 -2.50000000E-01  1.25000000E-01
                      -1.25000000E-01 -2.50000000E-01  2.50000000E-01
                       5.00000000E-01 -1.25000000E-01  0.00000000E+00
                      -3.75000000E-01 -1.25000000E-01  1.25000000E-01
                      -2.50000000E-01 -1.25000000E-01  2.50000000E-01
                      -1.25000000E-01 -1.25000000E-01  3.75000000E-01
                      -1.25000000E-01  2.50000000E-01  0.00000000E+00
                      -2.50000000E-01  3.75000000E-01  0.00000000E+00
                      -1.25000000E-01  3.75000000E-01  1.25000000E-01
                      -3.75000000E-01  5.00000000E-01  0.00000000E+00
                      -2.50000000E-01  5.00000000E-01  1.25000000E-01
                      -1.25000000E-01  5.00000000E-01  2.50000000E-01
                       5.00000000E-01 -3.75000000E-01  0.00000000E+00
                      -3.75000000E-01 -3.75000000E-01  1.25000000E-01
                      -2.50000000E-01 -3.75000000E-01  2.50000000E-01
                      -1.25000000E-01 -3.75000000E-01  3.75000000E-01
                       3.75000000E-01 -2.50000000E-01  0.00000000E+00
                       5.00000000E-01 -2.50000000E-01  1.25000000E-01
                      -3.75000000E-01 -2.50000000E-01  2.50000000E-01
                      -2.50000000E-01 -2.50000000E-01  3.75000000E-01
                      -1.25000000E-01 -2.50000000E-01  5.00000000E-01
                       2.50000000E-01 -1.25000000E-01  0.00000000E+00
                       3.75000000E-01 -1.25000000E-01  1.25000000E-01
                       5.00000000E-01 -1.25000000E-01  2.50000000E-01
                      -3.75000000E-01 -1.25000000E-01  3.75000000E-01
                      -2.50000000E-01 -1.25000000E-01  5.00000000E-01
                      -1.25000000E-01 -1.25000000E-01 -3.75000000E-01
                      -1.25000000E-01  0.00000000E+00  0.00000000E+00
                      -1.25000000E-01  1.25000000E-01  1.25000000E-01
                      -2.50000000E-01  2.50000000E-01  1.25000000E-01
                      -1.25000000E-01  2.50000000E-01  2.50000000E-01
                      -3.75000000E-01  3.75000000E-01  1.25000000E-01
                      -2.50000000E-01  3.75000000E-01  2.50000000E-01
                      -1.25000000E-01  3.75000000E-01  3.75000000E-01
                       5.00000000E-01  5.00000000E-01  1.25000000E-01
                      -3.75000000E-01  5.00000000E-01  2.50000000E-01
                      -2.50000000E-01  5.00000000E-01  3.75000000E-01
                      -1.25000000E-01  5.00000000E-01  5.00000000E-01
                       3.75000000E-01 -3.75000000E-01  1.25000000E-01
                       5.00000000E-01 -3.75000000E-01  2.50000000E-01
                      -3.75000000E-01 -3.75000000E-01  3.75000000E-01
                      -2.50000000E-01 -3.75000000E-01  5.00000000E-01
                      -1.25000000E-01 -3.75000000E-01 -3.75000000E-01
                       outvar_i_n : Printing only first  50 k-points.
           kptopt           2
         kptrlatt        4   -4    4     -4    4    4     -4   -4    4
          kptrlen      4.24400000E+01
P           mkmem          32
P          mkqmem          32
P          mk1mem          32
            natom           2
            nband           4
            ngfft          16      16      16
             nkpt         128
             nqpt           1
            nstep          25
             nsym          24
           ntypat           2
              occ      2.000000  2.000000  2.000000  2.000000
        optdriver           1
          rfatpol           1       2
            rfdir           1       1       1
           rfphon           1
            rprim      0.0000000000E+00  5.0000000000E-01  5.0000000000E-01
                       5.0000000000E-01  0.0000000000E+00  5.0000000000E-01
                       5.0000000000E-01  5.0000000000E-01  0.0000000000E+00
           shiftk      5.00000000E-01  5.00000000E-01  5.00000000E-01
          spgroup         216
           strten      0.0000000000E+00  0.0000000000E+00  0.0000000000E+00
                       0.0000000000E+00  0.0000000000E+00  0.0000000000E+00
           symrel      1  0  0   0  1  0   0  0  1       0 -1  1   0 -1  0   1 -1  0
                      -1  0  0  -1  0  1  -1  1  0       0  1 -1   1  0 -1   0  0 -1
                      -1  0  0  -1  1  0  -1  0  1       0 -1  1   1 -1  0   0 -1  0
                       1  0  0   0  0  1   0  1  0       0  1 -1   0  0 -1   1  0 -1
                      -1  0  1  -1  1  0  -1  0  0       0 -1  0   1 -1  0   0 -1  1
                       1  0 -1   0  0 -1   0  1 -1       0  1  0   0  0  1   1  0  0
                       1  0 -1   0  1 -1   0  0 -1       0 -1  0   0 -1  1   1 -1  0
                      -1  0  1  -1  0  0  -1  1  0       0  1  0   1  0  0   0  0  1
                       0  0 -1   0  1 -1   1  0 -1       1 -1  0   0 -1  1   0 -1  0
                       0  0  1   1  0  0   0  1  0      -1  1  0  -1  0  0  -1  0  1
                       0  0  1   0  1  0   1  0  0       1 -1  0   0 -1  0   0 -1  1
                       0  0 -1   1  0 -1   0  1 -1      -1  1  0  -1  0  1  -1  0  0
           tolvrs      1.00000000E-08
            typat      1  2
              wtk        0.00781    0.00781    0.00781    0.00781    0.00781    0.00781
                         0.00781    0.00781    0.00781    0.00781    0.00781    0.00781
                         0.00781    0.00781    0.00781    0.00781    0.00781    0.00781
                         0.00781    0.00781    0.00781    0.00781    0.00781    0.00781
                         0.00781    0.00781    0.00781    0.00781    0.00781    0.00781
                         0.00781    0.00781    0.00781    0.00781    0.00781    0.00781
                         0.00781    0.00781    0.00781    0.00781    0.00781    0.00781
                         0.00781    0.00781    0.00781    0.00781    0.00781    0.00781
                         0.00781    0.00781
                       outvars : Printing only first  50 k-points.
           xangst      0.0000000000E+00  0.0000000000E+00  0.0000000000E+00
                       1.4036425458E+00  1.4036425458E+00  1.4036425458E+00
            xcart      0.0000000000E+00  0.0000000000E+00  0.0000000000E+00
                       2.6525000000E+00  2.6525000000E+00  2.6525000000E+00
             xred      0.0000000000E+00  0.0000000000E+00  0.0000000000E+00
                       2.5000000000E-01  2.5000000000E-01  2.5000000000E-01
            znucl       13.00000   33.00000

================================================================================
  

================================================================================

 Suggested references for the acknowledgment of ABINIT usage.

 The users of ABINIT have little formal obligations with respect to the ABINIT group
 (those specified in the GNU General Public License, http://www.gnu.org/copyleft/gpl.txt).
 However, it is common practice in the scientific literature,
 to acknowledge the efforts of people that have made the research possible.
 In this spirit, please find below suggested citations of work written by ABINIT developers,
 corresponding to implementations inside of ABINIT that you have used in the present run.
 Note also that it will be of great value to readers of publications presenting these results,
 to read papers enabling them to understand the theoretical formalism and details
 of the ABINIT implementation.
 For information on why they are suggested, see also https://docs.abinit.org/theory/acknowledgments.
-
- [1] Specification of an extensible and portable file format for electronic structure and crystallographic data
- X. Gonze, C.-O. Almbladh, A. Cucca, D. Caliste, C. Freysoldt, M. Marques, V. Olevano, Y. Pouillon, M.J. Verstraete,
- Comput. Material Science 43, 1056 (2008).
- Comment: to be cited in case the ETSF_IO file format is used, i.e. iomode=3.
- DOI and bibtex: see https://docs.abinit.org/theory/bibliography/#gonze2008
-
- [2] The Abinit project: Impact, environment and recent developments.
- Computer Phys. Comm. 248, 107042 (2020).
- X.Gonze, B. Amadon, G. Antonius, F.Arnardi, L.Baguet, J.-M.Beuken,
- J.Bieder, F.Bottin, J.Bouchet, E.Bousquet, N.Brouwer, F.Bruneval,
- G.Brunin, T.Cavignac, J.-B. Charraud, Wei Chen, M.Cote, S.Cottenier,
- J.Denier, G.Geneste, Ph.Ghosez, M.Giantomassi, Y.Gillet, O.Gingras,
- D.R.Hamann, G.Hautier, Xu He, N.Helbig, N.Holzwarth, Y.Jia, F.Jollet,
- W.Lafargue-Dit-Hauret, K.Lejaeghere, M.A.L.Marques, A.Martin, C.Martins,
- H.P.C. Miranda, F.Naccarato, K. Persson, G.Petretto, V.Planes, Y.Pouillon,
- S.Prokhorenko, F.Ricci, G.-M.Rignanese, A.H.Romero, M.M.Schmitt, M.Torrent,
- M.J.van Setten, B.Van Troeye, M.J.Verstraete, G.Zerah and J.W.Zwanzig
- Comment: the fifth generic paper describing the ABINIT project.
- Note that a version of this paper, that is not formatted for Computer Phys. Comm. 
- is available at https://www.abinit.org/sites/default/files/ABINIT20.pdf .
- The licence allows the authors to put it on the Web.
- DOI and bibtex: see https://docs.abinit.org/theory/bibliography/#gonze2020
-
- [3] First-principles responses of solids to atomic displacements and homogeneous electric fields:,
- implementation of a conjugate-gradient algorithm. X. Gonze, Phys. Rev. B55, 10337 (1997).
- Comment: Non-vanishing rfphon and/or rfelfd, in the norm-conserving case.
- DOI and bibtex: see https://docs.abinit.org/theory/bibliography/#gonze1997
-
- [4] Dynamical matrices, Born effective charges, dielectric permittivity tensors, and ,
- interatomic force constants from density-functional perturbation theory,
- X. Gonze and C. Lee, Phys. Rev. B55, 10355 (1997).
- Comment: Non-vanishing rfphon and/or rfelfd, in the norm-conserving case.
- DOI and bibtex: see https://docs.abinit.org/theory/bibliography/#gonze1997a
-
- [5] Ab initio pseudopotentials for electronic structure calculations of poly-atomic systems, 
- using density-functional theory.
- M. Fuchs and, M. Scheffler, Comput. Phys. Commun. 119, 67 (1999).
- Comment: Some pseudopotential generated using the FHI code were used.
- DOI and bibtex: see https://docs.abinit.org/theory/bibliography/#fuchs1999
-
- [6] ABINIT: Overview, and focus on selected capabilities
- J. Chem. Phys. 152, 124102 (2020).
- A. Romero, D.C. Allan, B. Amadon, G. Antonius, T. Applencourt, L.Baguet,
- J.Bieder, F.Bottin, J.Bouchet, E.Bousquet, F.Bruneval,
- G.Brunin, D.Caliste, M.Cote,
- J.Denier, C. Dreyer, Ph.Ghosez, M.Giantomassi, Y.Gillet, O.Gingras,
- D.R.Hamann, G.Hautier, F.Jollet, G. Jomard,
- A.Martin, 
- H.P.C. Miranda, F.Naccarato, G.Petretto, N.A. Pike, V.Planes,
- S.Prokhorenko, T. Rangel, F.Ricci, G.-M.Rignanese, M.Royo, M.Stengel, M.Torrent,
- M.J.van Setten, B.Van Troeye, M.J.Verstraete, J.Wiktor, J.W.Zwanziger, and X.Gonze.
- Comment: a global overview of ABINIT, with focus on selected capabilities .
- Note that a version of this paper, that is not formatted for J. Chem. Phys 
- is available at https://www.abinit.org/sites/default/files/ABINIT20_JPC.pdf .
- The licence allows the authors to put it on the Web.
- DOI and bibtex: see https://docs.abinit.org/theory/bibliography/#romero2020
-
- [7] Recent developments in the ABINIT software package.
- Computer Phys. Comm. 205, 106 (2016).
- X.Gonze, F.Jollet, F.Abreu Araujo, D.Adams, B.Amadon, T.Applencourt,
- C.Audouze, J.-M.Beuken, J.Bieder, A.Bokhanchuk, E.Bousquet, F.Bruneval
- D.Caliste, M.Cote, F.Dahm, F.Da Pieve, M.Delaveau, M.Di Gennaro,
- B.Dorado, C.Espejo, G.Geneste, L.Genovese, A.Gerossier, M.Giantomassi,
- Y.Gillet, D.R.Hamann, L.He, G.Jomard, J.Laflamme Janssen, S.Le Roux,
- A.Levitt, A.Lherbier, F.Liu, I.Lukacevic, A.Martin, C.Martins,
- M.J.T.Oliveira, S.Ponce, Y.Pouillon, T.Rangel, G.-M.Rignanese,
- A.H.Romero, B.Rousseau, O.Rubel, A.A.Shukri, M.Stankovski, M.Torrent,
- M.J.Van Setten, B.Van Troeye, M.J.Verstraete, D.Waroquier, J.Wiktor,
- B.Xu, A.Zhou, J.W.Zwanziger.
- Comment: the fourth generic paper describing the ABINIT project.
- Note that a version of this paper, that is not formatted for Computer Phys. Comm. 
- is available at https://www.abinit.org/sites/default/files/ABINIT16.pdf .
- The licence allows the authors to put it on the Web.
- DOI and bibtex: see https://docs.abinit.org/theory/bibliography/#gonze2016
 Proc.   0 individual time (sec): cpu=          1.0  wall=          1.0

 Calculation completed.
.Delivered   0 WARNINGs and   0 COMMENTs to log file.

--- !FinalSummary
program: abinit
version: 9.5.1
start_datetime: Mon Apr 19 09:41:31 2021
end_datetime: Mon Apr 19 09:41:32 2021
overall_cpu_time:           4.2
overall_wall_time:           4.0
exit_requested_by_user: no 
timelimit: 0
pseudos: 
    Al  : 45177dc68580e70ffd690f1e65e9b174
    As  : 56f075499613b4e8e69cc77bd15edc6d
usepaw: 0
mpi_procs: 4
omp_threads: 1
num_warnings: 0
num_comments: 0
...
