  ABINIT 9.5.1
  
 DeprecationWarning: 

     The files file has been deprecated in Abinit9 and will be removed in Abinit10.
     Use the syntax `abinit t01.abi` where t01.abi is an input with pseudopotentials e.g.

            pseudos = "al.psp8, as.psp8"


  Give name for formatted input file: 
/home/fgoudreault/Workspace/abisuite/abisuite/unittests/test_workflows/test_files/abinit_si/nc/phonon_dispersion_qgrid_convergence/qgrid_6_6_6/phonons_runs/ph_q11/ph_q11.in
  Give name for formatted output file:
/home/fgoudreault/Workspace/abisuite/abisuite/unittests/test_workflows/test_files/abinit_si/nc/phonon_dispersion_qgrid_convergence/qgrid_6_6_6/phonons_runs/ph_q11/ph_q11.out
  Give root name for generic input files:
/home/fgoudreault/Workspace/abisuite/abisuite/unittests/test_workflows/test_files/abinit_si/nc/phonon_dispersion_qgrid_convergence/qgrid_6_6_6/phonons_runs/ph_q11/input_data/idat_ph_q11
  Give root name for generic output files:
/home/fgoudreault/Workspace/abisuite/abisuite/unittests/test_workflows/test_files/abinit_si/nc/phonon_dispersion_qgrid_convergence/qgrid_6_6_6/phonons_runs/ph_q11/run/output_data/odat_ph_q11
  Give root name for generic temporary files:
/home/fgoudreault/Workspace/abisuite/abisuite/unittests/test_workflows/test_files/abinit_si/nc/phonon_dispersion_qgrid_convergence/qgrid_6_6_6/phonons_runs/ph_q11/run/output_data/tmp_ph_q11

.Version 9.5.1 of ABINIT 
.(MPI version, prepared for a x86_64_linux_gnu9.3 computer) 

.Copyright (C) 1998-2021 ABINIT group . 
 ABINIT comes with ABSOLUTELY NO WARRANTY.
 It is free software, and you are welcome to redistribute it
 under certain conditions (GNU General Public License,
 see ~abinit/COPYING or http://www.gnu.org/copyleft/gpl.txt).

 ABINIT is a project of the Universite Catholique de Louvain,
 Corning Inc. and other collaborators, see ~abinit/doc/developers/contributors.txt .
 Please read https://docs.abinit.org/theory/acknowledgments for suggested
 acknowledgments of the ABINIT effort.
 For more information, see https://www.abinit.org .

.Starting date : Thu  1 Jul 2021.
- ( at 14h49 )
  

 ++++++++++++++++++++++++++++++++++++++++++++++++++++++++++++++++++++++++++++++

 === Build Information === 
  Version       : 9.5.1
  Build target  : x86_64_linux_gnu9.3
  Build date    : 20210420

 === Compiler Suite === 
  C compiler       : gnu9.3
  C++ compiler     : gnu9.3
  Fortran compiler : gnu9.3
  CFLAGS           : -g -O2 -mtune=native -march=native
  CXXFLAGS         : -g -O2 -mtune=native -march=native
  FCFLAGS          : -g -ffree-line-length-none     -I/home/fgoudreault/Workspace/abinit ...
  FC_LDFLAGS       : 

 === Optimizations === 
  Debug level        : basic
  Optimization level : standard
  Architecture       : unknown_unknown

 === Multicore === 
  Parallel build : yes
  Parallel I/O   : yes
  openMP support : 
  GPU support    : 

 === Connectors / Fallbacks === 
  LINALG flavor  : netlib
  FFT flavor     : goedecker
  HDF5           : yes
  NetCDF         : yes
  NetCDF Fortran : yes
  LibXC          : yes
  Wannier90      : no

 === Experimental features === 
  Exports             : 
  GW double-precision : 

 ++++++++++++++++++++++++++++++++++++++++++++++++++++++++++++++++++++++++++++++


 ++++++++++++++++++++++++++++++++++++++++++++++++++++++++++++++++++++++++++++++
 Default optimizations:
   -O2 -mtune=native -march=native


 Optimizations for 43_ptgroups:
   -O0


 ++++++++++++++++++++++++++++++++++++++++++++++++++++++++++++++++++++++++++++++


 ++++++++++++++++++++++++++++++++++++++++++++++++++++++++++++++++++++++++++++++
 CPP options activated during the build:

                    CC_GNU                   CXX_GNU                    FC_GNU
 
 HAVE_FC_ALLOCATABLE_DT...             HAVE_FC_ASYNC         HAVE_FC_BACKTRACE
 
  HAVE_FC_COMMAND_ARGUMENT      HAVE_FC_COMMAND_LINE        HAVE_FC_CONTIGUOUS
 
           HAVE_FC_CPUTIME              HAVE_FC_EXIT             HAVE_FC_FLUSH
 
             HAVE_FC_GAMMA            HAVE_FC_GETENV   HAVE_FC_IEEE_ARITHMETIC
 
   HAVE_FC_IEEE_EXCEPTIONS          HAVE_FC_INT_QUAD             HAVE_FC_IOMSG
 
     HAVE_FC_ISO_C_BINDING  HAVE_FC_ISO_FORTRAN_2008        HAVE_FC_LONG_LINES
 
        HAVE_FC_MOVE_ALLOC  HAVE_FC_ON_THE_FLY_SHAPE           HAVE_FC_PRIVATE
 
         HAVE_FC_PROTECTED           HAVE_FC_SHIFTLR         HAVE_FC_STREAM_IO
 
            HAVE_FC_SYSTEM          HAVE_FORTRAN2003                 HAVE_HDF5
 
             HAVE_HDF5_MPI        HAVE_LIBPAW_ABINIT      HAVE_LIBTETRA_ABINIT
 
                HAVE_LIBXC         HAVE_LINALG_AXPBY        HAVE_LINALG_GEMM3M
 
                  HAVE_MPI                 HAVE_MPI2         HAVE_MPI2_INPLACE
 
       HAVE_MPI_IALLGATHER       HAVE_MPI_IALLREDUCE        HAVE_MPI_IALLTOALL
 
       HAVE_MPI_IALLTOALLV           HAVE_MPI_IBCAST         HAVE_MPI_IGATHERV
 
        HAVE_MPI_INTEGER16               HAVE_MPI_IO HAVE_MPI_TYPE_CREATE_S...
 
               HAVE_NETCDF       HAVE_NETCDF_DEFAULT       HAVE_NETCDF_FORTRAN
 
   HAVE_NETCDF_FORTRAN_MPI           HAVE_NETCDF_MPI             HAVE_OS_LINUX
 
         HAVE_TIMER_ABINIT                                                      
 ++++++++++++++++++++++++++++++++++++++++++++++++++++++++++++++++++++++++++++++

- input  file    -> /home/fgoudreault/Workspace/abisuite/abisuite/unittests/test_workflows/test_files/abinit_si/nc/phonon_dispersion_qgrid_convergence/qgrid_6_6_6/phonons_runs/ph_q11/ph_q11.in
- output file    -> /home/fgoudreault/Workspace/abisuite/abisuite/unittests/test_workflows/test_files/abinit_si/nc/phonon_dispersion_qgrid_convergence/qgrid_6_6_6/phonons_runs/ph_q11/ph_q11.out
- root for input  files -> /home/fgoudreault/Workspace/abisuite/abisuite/unittests/test_workflows/test_files/abinit_si/nc/phonon_dispersion_qgrid_convergence/qgrid_6_6_6/phonons_runs/ph_q11/input_data/idat_ph_q11
- root for output files -> /home/fgoudreault/Workspace/abisuite/abisuite/unittests/test_workflows/test_files/abinit_si/nc/phonon_dispersion_qgrid_convergence/qgrid_6_6_6/phonons_runs/ph_q11/run/output_data/odat_ph_q11

 Netcdf library supports MPI-IO
-instrng: 45 lines of input have been read from file /home/fgoudreault/Workspace/abisuite/abisuite/unittests/test_workflows/test_files/abinit_si/nc/phonon_dispersion_qgrid_convergence/qgrid_6_6_6/phonons_runs/ph_q11/ph_q11.in


 Please give name of formatted atomic psp file (and finish with a newline character)
 For atom type 1, psp file is /home/fgoudreault/Workspace/abisuite/abisuite/unittests/test_workflows/test_files/pseudos/Si.psp8
  read the values zionpsp=  4.0 , pspcod=   8 , lmax=   2

 inpspheads: deduce mpsang = 3, n1xccc = 2501.

======================================================= 
 invars1m : enter jdtset= 0

 symlatt: the Bravais lattice is cF (face-centered cubic)
  xred   is defined in input file
 ingeo: takes atomic coordinates from input array xred

--- !COMMENT
src_file: m_ingeo.F90
src_line: 900
message: |
    The tolerance on symmetries =   1.000E-05 is bigger than 1.0e-8.
    In order to avoid spurious effects, the atomic coordinates have been
    symmetrized before storing them in the dataset internal variable.
    So, do not be surprised by the fact that your input variables (xcart, xred, ...)
    do not correspond exactly to the ones echoed by ABINIT, the latter being used to do the calculations.
    This is not a problem per se.
    Still, in order to avoid this symmetrization (e.g. for specific debugging/development), decrease tolsym to 1.0e-8 or lower,
    or (much preferred) use input primitive vectors that are accurate to better than 1.0e-8.
    This message will only be printed once, even if there are other datasets where tolsym is bigger than 1.0e-8.
...


 symlatt: the Bravais lattice is cF (face-centered cubic)

 symlatt: the Bravais lattice is cF (face-centered cubic)
 symspgr: spgroup= 227  Fd -3 m   (=Oh^7)
 symspgr: optical characteristics = isotropic
 invars2: take the default value of fband=  1.25000000E-01
 For input ecut=  1.000000E+01 best grid ngfft=      24      24      24
       max ecut=  1.367784E+01

 ==== FFT mesh ====
  FFT mesh divisions ........................    24   24   24
  Augmented FFT divisions ...................    25   25   24
  FFT algorithm .............................   112
  FFT cache size ............................    16
 getmpw: optimal value of mpw= 405
 getmpw: optimal value of mpw= 405

 Symmetries : space group Fd -3 m (#227); Bravais cF (face-center cubic)

 getdim_nloc : deduce lmnmax  =  18, lnmax  =   6,
                      lmnmaxso=  18, lnmaxso=   6.
 memorf : analysis of memory needs
================================================================================
 Values of the parameters that define the memory need of the present run (RF).
     intxc =       0      iscf =       7    lmnmax =       6     lnmax =       6
     mgfft =      24  mpssoang =       3    mqgrid =    3001     natom =       2
  nloc_mem =       1    nspden =       1   nspinor =       1    nsppol =       1
      nsym =      48    n1xccc =    2501    ntypat =       1    occopt =       1
   xclevel =       1
-    mband =           5        mffmem =           1         mkmem =         217
-   mkqmem =         217        mk1mem =         217           mpw =         405
      nfft =       13824          nkpt =         864
================================================================================
P This job should need less than                      27.225 Mbytes of memory.
  Rough estimation (10% accuracy) of disk space for files :
_ WF disk file :     26.699 Mbytes ; DEN or POT disk file :      0.107 Mbytes.
================================================================================

 Biggest array : cg(disk), with      6.7071 MBytes.
 memana : allocated an array of      6.707 Mbytes, for testing purposes.
 memana: allocated      27.225Mbytes, for testing purposes. 
 The job will continue.
--------------------------------------------------------------------------------
------------- Echo of variables that govern the present computation ------------
--------------------------------------------------------------------------------
-
- outvars: echo of selected default values                                      
-   iomode0 =  3 , fftalg0 =112 , wfoptalg0 =  0
-
- outvars: echo of global parameters not present in the input file              
-  max_nthreads =    0
-
 -outvars: echo values of preprocessed input variables --------
 
 These variables are accessible in NetCDF format (/home/fgoudreault/Workspace/abisuite/abisuite/unittests/test_workflows/test_files/abinit_si/nc/phonon_dispersion_qgrid_convergence/qgrid_6_6_6/phonons_runs/ph_q11/run/output_data/odat_ph_q11_OUT.nc)

            acell      7.2078778121E+00  7.2078778121E+00  7.2078778121E+00 Bohr
              amu      2.80855000E+01
           diemac      1.20000000E+01
             ecut      1.00000000E+01 Hartree
-          fftalg         112
           irdwfk           1
              ixc       -1012
              kpt     -8.33333333E-02 -1.66666667E-01  0.00000000E+00
                      -1.66666667E-01 -8.33333333E-02  0.00000000E+00
                      -8.33333333E-02 -8.33333333E-02  8.33333333E-02
                      -8.33333333E-02 -3.33333333E-01  0.00000000E+00
                      -1.66666667E-01 -2.50000000E-01  0.00000000E+00
                      -8.33333333E-02 -2.50000000E-01  8.33333333E-02
                      -2.50000000E-01 -1.66666667E-01  0.00000000E+00
                      -1.66666667E-01 -1.66666667E-01  8.33333333E-02
                      -8.33333333E-02 -1.66666667E-01  1.66666667E-01
                      -3.33333333E-01 -8.33333333E-02  0.00000000E+00
                      -2.50000000E-01 -8.33333333E-02  8.33333333E-02
                      -1.66666667E-01 -8.33333333E-02  1.66666667E-01
                      -8.33333333E-02 -8.33333333E-02  2.50000000E-01
                      -8.33333333E-02  5.00000000E-01  0.00000000E+00
                      -1.66666667E-01 -4.16666667E-01  0.00000000E+00
                      -8.33333333E-02 -4.16666667E-01  8.33333333E-02
                      -2.50000000E-01 -3.33333333E-01  0.00000000E+00
                      -1.66666667E-01 -3.33333333E-01  8.33333333E-02
                      -8.33333333E-02 -3.33333333E-01  1.66666667E-01
                      -3.33333333E-01 -2.50000000E-01  0.00000000E+00
                      -2.50000000E-01 -2.50000000E-01  8.33333333E-02
                      -1.66666667E-01 -2.50000000E-01  1.66666667E-01
                      -8.33333333E-02 -2.50000000E-01  2.50000000E-01
                      -4.16666667E-01 -1.66666667E-01  0.00000000E+00
                      -3.33333333E-01 -1.66666667E-01  8.33333333E-02
                      -2.50000000E-01 -1.66666667E-01  1.66666667E-01
                      -1.66666667E-01 -1.66666667E-01  2.50000000E-01
                      -8.33333333E-02 -1.66666667E-01  3.33333333E-01
                       5.00000000E-01 -8.33333333E-02  0.00000000E+00
                      -4.16666667E-01 -8.33333333E-02  8.33333333E-02
                      -3.33333333E-01 -8.33333333E-02  1.66666667E-01
                      -2.50000000E-01 -8.33333333E-02  2.50000000E-01
                      -1.66666667E-01 -8.33333333E-02  3.33333333E-01
                      -8.33333333E-02 -8.33333333E-02  4.16666667E-01
                      -8.33333333E-02  3.33333333E-01  0.00000000E+00
                      -1.66666667E-01  4.16666667E-01  0.00000000E+00
                      -8.33333333E-02  4.16666667E-01  8.33333333E-02
                      -2.50000000E-01  5.00000000E-01  0.00000000E+00
                      -1.66666667E-01  5.00000000E-01  8.33333333E-02
                      -8.33333333E-02  5.00000000E-01  1.66666667E-01
                      -3.33333333E-01 -4.16666667E-01  0.00000000E+00
                      -2.50000000E-01 -4.16666667E-01  8.33333333E-02
                      -1.66666667E-01 -4.16666667E-01  1.66666667E-01
                      -8.33333333E-02 -4.16666667E-01  2.50000000E-01
                      -4.16666667E-01 -3.33333333E-01  0.00000000E+00
                      -3.33333333E-01 -3.33333333E-01  8.33333333E-02
                      -2.50000000E-01 -3.33333333E-01  1.66666667E-01
                      -1.66666667E-01 -3.33333333E-01  2.50000000E-01
                      -8.33333333E-02 -3.33333333E-01  3.33333333E-01
                       5.00000000E-01 -2.50000000E-01  0.00000000E+00
                       outvar_i_n : Printing only first  50 k-points.
           kptopt           3
         kptrlatt        6   -6    6     -6    6    6     -6   -6    6
          kptrlen      6.11608713E+01
P           mkmem         217
P          mkqmem         217
P          mk1mem         217
            natom           2
            nband           5
            ngfft          24      24      24
             nkpt         864
             nqpt           1
            nstep          25
             nsym          48
           ntypat           1
              occ      2.000000  2.000000  2.000000  2.000000  0.000000
        optdriver           1
              qpt      5.00000000E-01  3.33333333E-01  0.00000000E+00
          rfatpol           1       2
            rfdir           1       1       1
           rfphon           1
            rprim      0.0000000000E+00  7.0710678119E-01  7.0710678119E-01
                       7.0710678119E-01  0.0000000000E+00  7.0710678119E-01
                       7.0710678119E-01  7.0710678119E-01  0.0000000000E+00
           shiftk      5.00000000E-01  5.00000000E-01  5.00000000E-01
          spgroup         227
           symrel      1  0  0   0  1  0   0  0  1      -1  0  0   0 -1  0   0  0 -1
                       0 -1  1   0 -1  0   1 -1  0       0  1 -1   0  1  0  -1  1  0
                      -1  0  0  -1  0  1  -1  1  0       1  0  0   1  0 -1   1 -1  0
                       0  1 -1   1  0 -1   0  0 -1       0 -1  1  -1  0  1   0  0  1
                      -1  0  0  -1  1  0  -1  0  1       1  0  0   1 -1  0   1  0 -1
                       0 -1  1   1 -1  0   0 -1  0       0  1 -1  -1  1  0   0  1  0
                       1  0  0   0  0  1   0  1  0      -1  0  0   0  0 -1   0 -1  0
                       0  1 -1   0  0 -1   1  0 -1       0 -1  1   0  0  1  -1  0  1
                      -1  0  1  -1  1  0  -1  0  0       1  0 -1   1 -1  0   1  0  0
                       0 -1  0   1 -1  0   0 -1  1       0  1  0  -1  1  0   0  1 -1
                       1  0 -1   0  0 -1   0  1 -1      -1  0  1   0  0  1   0 -1  1
                       0  1  0   0  0  1   1  0  0       0 -1  0   0  0 -1  -1  0  0
                       1  0 -1   0  1 -1   0  0 -1      -1  0  1   0 -1  1   0  0  1
                       0 -1  0   0 -1  1   1 -1  0       0  1  0   0  1 -1  -1  1  0
                      -1  0  1  -1  0  0  -1  1  0       1  0 -1   1  0  0   1 -1  0
                       0  1  0   1  0  0   0  0  1       0 -1  0  -1  0  0   0  0 -1
                       0  0 -1   0  1 -1   1  0 -1       0  0  1   0 -1  1  -1  0  1
                       1 -1  0   0 -1  1   0 -1  0      -1  1  0   0  1 -1   0  1  0
                       0  0  1   1  0  0   0  1  0       0  0 -1  -1  0  0   0 -1  0
                      -1  1  0  -1  0  0  -1  0  1       1 -1  0   1  0  0   1  0 -1
                       0  0  1   0  1  0   1  0  0       0  0 -1   0 -1  0  -1  0  0
                       1 -1  0   0 -1  0   0 -1  1      -1  1  0   0  1  0   0  1 -1
                       0  0 -1   1  0 -1   0  1 -1       0  0  1  -1  0  1   0 -1  1
                      -1  1  0  -1  0  1  -1  0  0       1 -1  0   1  0 -1   1  0  0
            tnons      0.0000000  0.0000000  0.0000000     0.2500000  0.2500000  0.2500000
                       0.0000000  0.0000000  0.0000000     0.2500000  0.2500000  0.2500000
                       0.0000000  0.0000000  0.0000000     0.2500000  0.2500000  0.2500000
                       0.0000000  0.0000000  0.0000000     0.2500000  0.2500000  0.2500000
                       0.0000000  0.0000000  0.0000000     0.2500000  0.2500000  0.2500000
                       0.0000000  0.0000000  0.0000000     0.2500000  0.2500000  0.2500000
                       0.0000000  0.0000000  0.0000000     0.2500000  0.2500000  0.2500000
                       0.0000000  0.0000000  0.0000000     0.2500000  0.2500000  0.2500000
                       0.0000000  0.0000000  0.0000000     0.2500000  0.2500000  0.2500000
                       0.0000000  0.0000000  0.0000000     0.2500000  0.2500000  0.2500000
                       0.0000000  0.0000000  0.0000000     0.2500000  0.2500000  0.2500000
                       0.0000000  0.0000000  0.0000000     0.2500000  0.2500000  0.2500000
                       0.0000000  0.0000000  0.0000000     0.2500000  0.2500000  0.2500000
                       0.0000000  0.0000000  0.0000000     0.2500000  0.2500000  0.2500000
                       0.0000000  0.0000000  0.0000000     0.2500000  0.2500000  0.2500000
                       0.0000000  0.0000000  0.0000000     0.2500000  0.2500000  0.2500000
                       0.0000000  0.0000000  0.0000000     0.2500000  0.2500000  0.2500000
                       0.0000000  0.0000000  0.0000000     0.2500000  0.2500000  0.2500000
                       0.0000000  0.0000000  0.0000000     0.2500000  0.2500000  0.2500000
                       0.0000000  0.0000000  0.0000000     0.2500000  0.2500000  0.2500000
                       0.0000000  0.0000000  0.0000000     0.2500000  0.2500000  0.2500000
                       0.0000000  0.0000000  0.0000000     0.2500000  0.2500000  0.2500000
                       0.0000000  0.0000000  0.0000000     0.2500000  0.2500000  0.2500000
                       0.0000000  0.0000000  0.0000000     0.2500000  0.2500000  0.2500000
           tolvrs      1.00000000E-08
            typat      1  1
              wtk        0.00116    0.00116    0.00116    0.00116    0.00116    0.00116
                         0.00116    0.00116    0.00116    0.00116    0.00116    0.00116
                         0.00116    0.00116    0.00116    0.00116    0.00116    0.00116
                         0.00116    0.00116    0.00116    0.00116    0.00116    0.00116
                         0.00116    0.00116    0.00116    0.00116    0.00116    0.00116
                         0.00116    0.00116    0.00116    0.00116    0.00116    0.00116
                         0.00116    0.00116    0.00116    0.00116    0.00116    0.00116
                         0.00116    0.00116    0.00116    0.00116    0.00116    0.00116
                         0.00116    0.00116
                       outvars : Printing only first  50 k-points.
           xangst      0.0000000000E+00  0.0000000000E+00  0.0000000000E+00
                       1.3485391323E+00  1.3485391323E+00  1.3485391323E+00
            xcart      0.0000000000E+00  0.0000000000E+00  0.0000000000E+00
                       2.5483696395E+00  2.5483696395E+00  2.5483696395E+00
             xred      0.0000000000E+00  0.0000000000E+00  0.0000000000E+00
                       2.5000000000E-01  2.5000000000E-01  2.5000000000E-01
            znucl       14.00000

================================================================================

 chkinp: Checking input parameters for consistency.
 DATA TYPE INFORMATION: 
 REAL:      Data type name: REAL(DP) 
            Kind value:      8
            Precision:      15
            Smallest nonnegligible quantity relative to 1: 0.22204460E-015
            Smallest positive number:                      0.22250739E-307
            Largest representable number:                  0.17976931E+309
 INTEGER:   Data type name: INTEGER(default) 
            Kind value: 4
            Bit size:   32
            Largest representable number: 2147483647
 LOGICAL:   Data type name: LOGICAL 
            Kind value: 4
 CHARACTER: Data type name: CHARACTER             Kind value: 1

  ==== OpenMP parallelism is OFF ====
 
  ==== Using MPI-2 specifications ==== 
  MPI-IO support is ON
  xmpi_tag_ub ................   2147483647
  xmpi_bsize_ch ..............            1
  xmpi_bsize_int .............            4
  xmpi_bsize_sp ..............            4
  xmpi_bsize_dp ..............            8
  xmpi_bsize_spc .............            8
  xmpi_bsize_dpc .............           16
  xmpio_bsize_frm ............            4
  xmpi_address_kind ..........            8
  xmpi_offset_kind ...........            8
  MPI_WTICK ..................    1.0000000000000001E-009

================================================================================
== DATASET  1 ==================================================================
-   mpi_nproc: 4, omp_nthreads: -1 (-1 if OMP is not activated)


--- !COMMENT
src_file: m_xgScalapack.F90
src_line: 236
message: |
    xgScalapack in auto mode
...


 getdim_nloc : deduce lmnmax  =  18, lnmax  =   6,
                      lmnmaxso=  18, lnmaxso=   6.
 Slater exchange
 P. A. M. Dirac, Math. Proc. Cambridge Philos. Soc. 26, 376 (1930)
 F. Bloch, Z. Phys. 57, 545 (1929)
 Perdew & Wang
 J. P. Perdew and Y. Wang, Phys. Rev. B 45, 13244 (1992)

 Unit cell volume ucvol=  2.6479346E+02 bohr^3
 Angles (23,13,12)=  6.00000000E+01  6.00000000E+01  6.00000000E+01 degrees
 setup1 : take into account q-point for computing boxcut.

 getcut: wavevector=  0.5000  0.3333  0.0000  ngfft=  24  24  24
         ecut(hartree)=     10.000   => boxcut(ratio)=   2.24264

 getcut : COMMENT -
  Note that boxcut > 2.2 ; recall that boxcut=Gcut(box)/Gcut(sphere) = 2
  is sufficient for exact treatment of convolution.
  Such a large boxcut is a waste : you could raise ecut
  e.g. ecut=   12.573636 Hartrees makes boxcut=2

- pspini: atom type   1  psp file is /home/fgoudreault/Workspace/abisuite/abisuite/unittests/test_workflows/test_files/pseudos/Si.psp8
- pspatm: opening atomic psp file    /home/fgoudreault/Workspace/abisuite/abisuite/unittests/test_workflows/test_files/pseudos/Si.psp8
- Si    ONCVPSP-3.3.0  r_core=   1.60303   1.72197   1.91712
- 14.00000   4.00000    171102                znucl, zion, pspdat
    8   -1012    2    4       600   0.00000   pspcod,pspxc,lmax,lloc,mmax,r2well
    5.99000000000000    4.00000000000000    0.00000000000000   rchrg,fchrg,qchrg
     nproj     2     2     2
     extension_switch     1
  valence charge integrates to:    3.9545012856495880     
  pspatm : epsatm=    6.67004110
         --- l  ekb(1:nproj) -->
             0    5.565958    0.856966
             1    2.726111    0.629828
             2   -2.124804   -0.444604
 pspatm: atomic psp has been read  and splines computed

   1.06720658E+02                                ecore*ucvol(ha*bohr**3)
 ==== Info on pseudopotentials ====
  Norm-conserving pseudopotentials
  Number of pseudopotentials ..    1
  Number of types of atoms   ..    1
  Scalar calculation (no spin-orbit term)
  Nonlocal part applied using Legendre polynomials
  Max number of non-local projectors over l and type   2
  Highest angular momentum +1 .......   3
  Max number of (l,n)   components ..   6
  Max number of (l,m,n) components ..   6

 Pseudo-Core Charge Info: 
   Number of radial points for pseudo-core charge .. 2501
   XC core-correction treatment (optnlxccc) ........    1
   Radius for pseudo-core charge for each type ..... 

  - Atom type    1 has pseudo-core radius ..  5.9900

 Info on the Q-grid used for form factors in spline form: 
   Number of q-points for radial functions ffspl ..   3001
   Number of q-points for vlspl ...................   3001
   vloc is computed in Reciprocal Space
   model core charge treated in real-space

  XC functional for type 1 is -1012
  Pseudo valence available: yes

- File: /home/fgoudreault/Workspace/abisuite/abisuite/unittests/test_workflows/test_files/abinit_si/nc/phonon_dispersion_qgrid_convergence/qgrid_6_6_6/phonons_runs/ph_q11/input_data/idat_ph_q11_WFK does not exist but found netcdf file with similar name.

 respfn : eigen0 array
 symatm: atom number 1 is reached starting at atom
   1  2  1  2  1  2  1  2  1  2  1  2  1  2  1  2  1  2  1  2  1  2  1  2
   1  2  1  2  1  2  1  2  1  2  1  2  1  2  1  2  1  2  1  2  1  2  1  2
 symatm: atom number 2 is reached starting at atom
   2  1  2  1  2  1  2  1  2  1  2  1  2  1  2  1  2  1  2  1  2  1  2  1
   2  1  2  1  2  1  2  1  2  1  2  1  2  1  2  1  2  1  2  1  2  1  2  1

 getcut: wavevector=  0.0000  0.0000  0.0000  ngfft=  24  24  24
         ecut(hartree)=     10.000   => boxcut(ratio)=   2.33905

 getcut : COMMENT -
  Note that boxcut > 2.2 ; recall that boxcut=Gcut(box)/Gcut(sphere) = 2
  is sufficient for exact treatment of convolution.
  Such a large boxcut is a waste : you could raise ecut
  e.g. ecut=   13.677837 Hartrees makes boxcut=2

 mkrho: echo density (plane-wave part only)
 Total charge density [el/Bohr^3]
      Maximum=    8.5686E-02  at reduced coord.    0.0833    0.1250    0.7083
      Minimum=    1.4766E-03  at reduced coord.    0.0000    0.0000    0.0000
   Integrated=    8.0000E+00

 1/G**2 cut-off applied in the following step : cutoff-mode = CRYSTAL

 1/G**2 cut-off applied in the following step : cutoff-mode = CRYSTAL

 ==> Calculation of the frozen part of the second order derivatives, this can take some time...


 ==> Calculation of the frozen part of the second order derivative done


 1/G**2 cut-off applied in the following step : cutoff-mode = CRYSTAL

 ==>  initialize data related to q vector <== 

 The list of irreducible perturbations for this q vector is:
    1)    idir= 1    ipert=   1
    2)    idir= 2    ipert=   1
    3)    idir= 3    ipert=   1

================================================================================
 Real(R)+Recip(G) space primitive vectors, cartesian coordinates (Bohr,Bohr^-1):
 R(1)=  0.0000000  5.0967393  5.0967393  G(1)= -0.0981019  0.0981019  0.0981019
 R(2)=  5.0967393  0.0000000  5.0967393  G(2)=  0.0981019 -0.0981019  0.0981019
 R(3)=  5.0967393  5.0967393  0.0000000  G(3)=  0.0981019  0.0981019 -0.0981019
 Unit cell volume ucvol=  2.6479346E+02 bohr^3
 Unit cell volume ucvol=  2.6479346E+02 bohr^3
 Angles (23,13,12)=  6.00000000E+01  6.00000000E+01  6.00000000E+01 degrees
 Angles (23,13,12)=  6.00000000E+01  6.00000000E+01  6.00000000E+01 degrees

 getcut: wavevector=  0.5000  0.3333  0.0000  ngfft=  24  24  24
         ecut(hartree)=     10.000   => boxcut(ratio)=   2.24264

 getcut : COMMENT -
  Note that boxcut > 2.2 ; recall that boxcut=Gcut(box)/Gcut(sphere) = 2
  is sufficient for exact treatment of convolution.
  Such a large boxcut is a waste : you could raise ecut
  e.g. ecut=   12.573636 Hartrees makes boxcut=2


 The perturbation idir=   1  ipert=   2 is
 symmetric of a previously calculated perturbation.
 So, its SCF calculation is not needed.


 The perturbation idir=   2  ipert=   2 is
 symmetric of a previously calculated perturbation.
 So, its SCF calculation is not needed.


 The perturbation idir=   3  ipert=   2 is
 symmetric of a previously calculated perturbation.
 So, its SCF calculation is not needed.


--------------------------------------------------------------------------------
 Perturbation wavevector (in red.coord.)   0.500000  0.333333  0.000000
 Perturbation : displacement of atom   1   along direction   1
 littlegroup_pert: only one element in the set of symmetries for this perturbation:
   1   0   0   0   1   0   0   0   1
 symatm: atom number 1 is reached starting at atom
   1
 symatm: atom number 2 is reached starting at atom
   2
 symkpt : not enough symmetry to change the number of k points.
 getmpw: optimal value of mpw= 405
- File: /home/fgoudreault/Workspace/abisuite/abisuite/unittests/test_workflows/test_files/abinit_si/nc/phonon_dispersion_qgrid_convergence/qgrid_6_6_6/phonons_runs/ph_q11/input_data/idat_ph_q11_WFK does not exist but found netcdf file with similar name.
 getmpw: optimal value of mpw= 405
- File: /home/fgoudreault/Workspace/abisuite/abisuite/unittests/test_workflows/test_files/abinit_si/nc/phonon_dispersion_qgrid_convergence/qgrid_6_6_6/phonons_runs/ph_q11/input_data/idat_ph_q11_WFK does not exist but found netcdf file with similar name.
 Initialisation of the first-order wave-functions :
  ireadwf=   0
 Initializing rhor1 from valence densities taken from pseudopotential files

 getcut: wavevector=  0.0000  0.0000  0.0000  ngfft=  24  24  24
         ecut(hartree)=     10.000   => boxcut(ratio)=   2.33905

 getcut : COMMENT -
  Note that boxcut > 2.2 ; recall that boxcut=Gcut(box)/Gcut(sphere) = 2
  is sufficient for exact treatment of convolution.
  Such a large boxcut is a waste : you could raise ecut
  e.g. ecut=   13.677837 Hartrees makes boxcut=2


 1/G**2 cut-off applied in the following step : cutoff-mode = CRYSTAL

 ITER STEP NUMBER     1
-ETOT  1   8.4701156231693     -9.441E+01 6.154E+00 1.642E+03

 Simple mixing update:
  residual square of the potential:    270.91920373810791
 dfpt_scfcv: previous iteration took  2.48 [s]

 ITER STEP NUMBER     2
 ETOT  2   7.6194933310207     -8.506E-01 9.975E-01 1.240E+02

 Pulay update with  1 previous iterations:
 mixing of old trial potential: alpha(m:m-4)=  0.799      0.201
 dfpt_scfcv: previous iteration took  4.10 [s]

 ITER STEP NUMBER     3
 ETOT  3   7.5554071137188     -6.409E-02 4.730E+00 1.125E+00

 Pulay update with  2 previous iterations:
 mixing of old trial potential: alpha(m:m-4)=  0.944      0.586E-01 -0.224E-02
 dfpt_scfcv: previous iteration took  3.20 [s]

 ITER STEP NUMBER     4
 ETOT  4   7.5549320829867     -4.750E-04 1.207E+00 3.435E-02

 Pulay update with  3 previous iterations:
 mixing of old trial potential: alpha(m:m-4)=   1.08     -0.409E-01 -0.321E-01 -0.101E-01
 dfpt_scfcv: previous iteration took  3.93 [s]

 ITER STEP NUMBER     5
 ETOT  5   7.5549158785108     -1.620E-05 4.695E+00 4.786E-04

 Pulay update with  4 previous iterations:
 mixing of old trial potential: alpha(m:m-4)=   1.13     -0.105     -0.243E-01  0.268E-02  0.127E-02
 dfpt_scfcv: previous iteration took  3.04 [s]

 ITER STEP NUMBER     6
 ETOT  6   7.5549156775540     -2.010E-07 1.357E+00 3.301E-05

 Pulay update with  5 previous iterations:
 mixing of old trial potential: alpha(m:m-4)=  0.967      0.661E-01 -0.333E-01 -0.113E-02  0.909E-03
 dfpt_scfcv: previous iteration took  3.36 [s]

 ITER STEP NUMBER     7
 ETOT  7   7.5549156652414     -1.231E-08 4.695E+00 6.756E-07

 Pulay update with  6 previous iterations:
 mixing of old trial potential: alpha(m:m-4)=   1.14     -0.115     -0.283E-01  0.444E-02  0.453E-03
 dfpt_scfcv: previous iteration took  3.56 [s]

 ITER STEP NUMBER     8
 ETOT  8   7.5549156649847     -2.567E-10 3.247E+00 2.999E-08

 Pulay update with  7 previous iterations:
 mixing of old trial potential: alpha(m:m-4)=  0.997      0.402E-01 -0.370E-01 -0.132E-02  0.940E-03
 dfpt_scfcv: previous iteration took  2.56 [s]

 ITER STEP NUMBER     9
 ETOT  9   7.5549156649699     -1.481E-11 4.695E+00 9.437E-10

 At SCF step    9       vres2   =  9.44E-10 < tolvrs=  1.00E-08 =>converged.

 fftdatar_write: About to write data to: /home/fgoudreault/Workspace/abisuite/abisuite/unittests/test_workflows/test_files/abinit_si/nc/phonon_dispersion_qgrid_convergence/qgrid_6_6_6/phonons_runs/ph_q11/run/output_data/odat_ph_q11_DEN1 with iomode: IO_MODE_ETSF
- Creating HDf5 file with MPI-IO support: /home/fgoudreault/Workspace/abisuite/abisuite/unittests/test_workflows/test_files/abinit_si/nc/phonon_dispersion_qgrid_convergence/qgrid_6_6_6/phonons_runs/ph_q11/run/output_data/odat_ph_q11_DEN1.nc
- Opening HDf5 file with MPI-IO support: /home/fgoudreault/Workspace/abisuite/abisuite/unittests/test_workflows/test_files/abinit_si/nc/phonon_dispersion_qgrid_convergence/qgrid_6_6_6/phonons_runs/ph_q11/run/output_data/odat_ph_q11_DEN1.nc
 IO operation completed. cpu:  0.03 [s] , wall:  0.10 [s] <<< TIME

 fftdatar_write: About to write data to: /home/fgoudreault/Workspace/abisuite/abisuite/unittests/test_workflows/test_files/abinit_si/nc/phonon_dispersion_qgrid_convergence/qgrid_6_6_6/phonons_runs/ph_q11/run/output_data/odat_ph_q11_POT1 with iomode: IO_MODE_ETSF
- Creating HDf5 file with MPI-IO support: /home/fgoudreault/Workspace/abisuite/abisuite/unittests/test_workflows/test_files/abinit_si/nc/phonon_dispersion_qgrid_convergence/qgrid_6_6_6/phonons_runs/ph_q11/run/output_data/odat_ph_q11_POT1.nc
- Opening HDf5 file with MPI-IO support: /home/fgoudreault/Workspace/abisuite/abisuite/unittests/test_workflows/test_files/abinit_si/nc/phonon_dispersion_qgrid_convergence/qgrid_6_6_6/phonons_runs/ph_q11/run/output_data/odat_ph_q11_POT1.nc
 IO operation completed. cpu:  0.03 [s] , wall:  0.04 [s] <<< TIME
- Opening HDf5 file with MPI-IO support: /home/fgoudreault/Workspace/abisuite/abisuite/unittests/test_workflows/test_files/abinit_si/nc/phonon_dispersion_qgrid_convergence/qgrid_6_6_6/phonons_runs/ph_q11/run/output_data/odat_ph_q11_POT1.nc
================================================================================

 ----iterations are completed or convergence reached----

 Mean square residual over all n,k,spin=  -13.248E-03; max=  46.951E-01
  -0.0833 -0.1667  0.0000    1  1.04828E-13 kpt; spin; max resid(k); each band:
  2.41E-15 9.53E-15 6.22E-15 8.10E-15 1.05E-13
  -0.1667 -0.0833  0.0000    1  1.59859E-05 kpt; spin; max resid(k); each band:
  1.93E-15 6.20E-15 6.75E-15 1.40E-14 1.60E-05
  -0.0833 -0.0833  0.0833    1  4.60092E-12 kpt; spin; max resid(k); each band:
  2.13E-15 8.43E-15 1.44E-14 3.93E-15 4.60E-12
  -0.0833 -0.3333  0.0000    1  2.93323E-10 kpt; spin; max resid(k); each band:
  2.70E-15 3.54E-15 6.19E-15 8.22E-15 2.93E-10
  -0.1667 -0.2500  0.0000    1  1.74857E-12 kpt; spin; max resid(k); each band:
  2.13E-15 5.34E-15 8.56E-15 7.36E-15 1.75E-12
  -0.0833 -0.2500  0.0833    1  2.15491E-08 kpt; spin; max resid(k); each band:
  5.10E-16 3.13E-15 8.30E-15 5.09E-15 2.15E-08
  -0.2500 -0.1667  0.0000    1  8.55547E-14 kpt; spin; max resid(k); each band:
  2.49E-15 5.26E-15 1.15E-14 8.12E-15 8.56E-14
  -0.1667 -0.1667  0.0833    1  3.66927E-13 kpt; spin; max resid(k); each band:
  6.40E-16 7.49E-15 3.82E-15 1.26E-14 3.67E-13
  -0.0833 -0.1667  0.1667    1  8.71648E-12 kpt; spin; max resid(k); each band:
  5.67E-16 6.03E-15 4.82E-15 7.06E-15 8.72E-12
  -0.3333 -0.0833  0.0000    1  9.02277E-14 kpt; spin; max resid(k); each band:
  2.48E-15 5.34E-15 1.02E-14 1.08E-14 9.02E-14
  -0.2500 -0.0833  0.0833    1  4.52568E-11 kpt; spin; max resid(k); each band:
  4.67E-16 6.41E-15 1.04E-14 7.73E-15 4.53E-11
  -0.1667 -0.0833  0.1667    1  5.19196E-09 kpt; spin; max resid(k); each band:
  5.27E-16 8.04E-15 7.15E-15 1.06E-14 5.19E-09
  -0.0833 -0.0833  0.2500    1  3.87695E-13 kpt; spin; max resid(k); each band:
  5.73E-16 6.58E-15 1.26E-14 5.85E-15 3.88E-13
  -0.0833  0.5000  0.0000    1  1.43726E-13 kpt; spin; max resid(k); each band:
  9.06E-16 2.37E-15 7.28E-15 4.05E-15 1.44E-13
  -0.1667 -0.4167  0.0000    1  1.31010E-12 kpt; spin; max resid(k); each band:
  7.34E-16 2.39E-15 9.68E-15 6.28E-15 1.31E-12
  -0.0833 -0.4167  0.0833    1  2.81731E-06 kpt; spin; max resid(k); each band:
  8.29E-16 1.56E-15 1.07E-14 3.95E-15 2.82E-06
  -0.2500 -0.3333  0.0000    1  4.66347E-14 kpt; spin; max resid(k); each band:
  7.71E-16 3.23E-15 7.94E-15 8.01E-15 4.66E-14
  -0.1667 -0.3333  0.0833    1  1.59465E-10 kpt; spin; max resid(k); each band:
  7.83E-16 2.23E-15 1.04E-14 4.63E-15 1.59E-10
  -0.0833 -0.3333  0.1667    1  5.35148E-11 kpt; spin; max resid(k); each band:
  6.57E-16 1.40E-15 1.09E-14 6.36E-15 5.35E-11
  -0.3333 -0.2500  0.0000    1  1.06895E-13 kpt; spin; max resid(k); each band:
  7.07E-16 4.87E-15 1.04E-14 9.92E-15 1.07E-13
  -0.2500 -0.2500  0.0833    1  9.18085E-14 kpt; spin; max resid(k); each band:
  9.33E-16 5.37E-15 4.93E-15 6.70E-15 9.18E-14
  -0.1667 -0.2500  0.1667    1  3.39736E-11 kpt; spin; max resid(k); each band:
  9.58E-16 4.10E-15 5.96E-15 6.85E-15 3.40E-11
  -0.0833 -0.2500  0.2500    1  1.58876E-08 kpt; spin; max resid(k); each band:
  6.79E-16 4.29E-15 6.01E-15 9.50E-15 1.59E-08
  -0.4167 -0.1667  0.0000    1  1.03959E-11 kpt; spin; max resid(k); each band:
  1.02E-15 4.64E-15 1.08E-14 1.29E-14 1.04E-11
  -0.3333 -0.1667  0.0833    1  7.59829E-10 kpt; spin; max resid(k); each band:
  8.73E-16 5.30E-15 1.05E-14 8.26E-15 7.60E-10
  -0.2500 -0.1667  0.1667    1  4.76980E-11 kpt; spin; max resid(k); each band:
  8.93E-16 3.68E-15 7.38E-15 9.98E-15 4.77E-11
  -0.1667 -0.1667  0.2500    1  3.85898E-12 kpt; spin; max resid(k); each band:
  1.01E-15 3.04E-15 4.84E-15 7.98E-15 3.86E-12
  -0.0833 -0.1667  0.3333    1  2.86314E-10 kpt; spin; max resid(k); each band:
  7.64E-16 2.69E-15 2.90E-15 5.58E-15 2.86E-10
   0.5000 -0.0833  0.0000    1  1.58119E-12 kpt; spin; max resid(k); each band:
  9.78E-16 2.29E-15 8.42E-15 1.77E-14 1.58E-12
  -0.4167 -0.0833  0.0833    1  6.61488E-06 kpt; spin; max resid(k); each band:
  1.06E-15 1.85E-15 1.14E-14 9.31E-15 6.61E-06
  -0.3333 -0.0833  0.1667    1  1.39131E-03 kpt; spin; max resid(k); each band:
  1.02E-15 2.05E-15 8.82E-15 9.27E-15 1.39E-03
  -0.2500 -0.0833  0.2500    1  7.16107E-06 kpt; spin; max resid(k); each band:
  7.72E-16 2.82E-15 7.92E-15 9.62E-15 7.16E-06
  -0.1667 -0.0833  0.3333    1  2.82457E-08 kpt; spin; max resid(k); each band:
  6.57E-16 2.40E-15 7.16E-15 1.13E-14 2.82E-08
  -0.0833 -0.0833  0.4167    1  9.08429E-14 kpt; spin; max resid(k); each band:
  5.74E-16 1.99E-15 4.31E-15 7.83E-15 9.08E-14
  -0.0833  0.3333  0.0000    1  1.29676E-13 kpt; spin; max resid(k); each band:
  5.98E-16 2.58E-15 6.79E-15 2.74E-15 1.30E-13
  -0.1667  0.4167  0.0000    1  2.15345E-14 kpt; spin; max resid(k); each band:
  5.46E-16 2.12E-15 7.86E-15 5.14E-15 2.15E-14
  -0.0833  0.4167  0.0833    1  8.05166E-14 kpt; spin; max resid(k); each band:
  4.68E-16 2.54E-15 1.01E-14 2.24E-15 8.05E-14
  -0.2500  0.5000  0.0000    1  3.29406E-14 kpt; spin; max resid(k); each band:
  1.11E-15 1.95E-15 9.43E-15 7.32E-15 3.29E-14
  -0.1667  0.5000  0.0833    1  1.81577E-10 kpt; spin; max resid(k); each band:
  1.10E-15 2.06E-15 1.13E-14 3.62E-15 1.82E-10
  -0.0833  0.5000  0.1667    1  3.53823E-11 kpt; spin; max resid(k); each band:
  5.39E-16 8.69E-16 1.32E-14 3.57E-15 3.54E-11
  -0.3333 -0.4167  0.0000    1  6.50877E-14 kpt; spin; max resid(k); each band:
  1.43E-15 2.93E-15 7.87E-15 8.87E-15 6.51E-14
  -0.2500 -0.4167  0.0833    1  1.07218E-13 kpt; spin; max resid(k); each band:
  9.66E-16 1.48E-15 1.07E-14 3.64E-15 1.07E-13
  -0.1667 -0.4167  0.1667    1  1.88358E-06 kpt; spin; max resid(k); each band:
  6.42E-16 1.21E-15 1.18E-14 4.69E-15 1.88E-06
  -0.0833 -0.4167  0.2500    1  5.54191E-10 kpt; spin; max resid(k); each band:
  4.89E-16 1.16E-15 1.14E-14 7.64E-15 5.54E-10
  -0.4167 -0.3333  0.0000    1  1.30864E-13 kpt; spin; max resid(k); each band:
  1.86E-15 4.22E-15 1.05E-14 1.16E-14 1.31E-13
  -0.3333 -0.3333  0.0833    1  8.99905E-14 kpt; spin; max resid(k); each band:
  1.63E-15 2.82E-15 4.77E-15 7.26E-15 9.00E-14
  -0.2500 -0.3333  0.1667    1  8.26467E-14 kpt; spin; max resid(k); each band:
  1.11E-15 2.53E-15 4.66E-15 6.87E-15 8.26E-14
  -0.1667 -0.3333  0.2500    1  9.25588E-15 kpt; spin; max resid(k); each band:
  6.73E-16 2.91E-15 5.45E-15 9.26E-15-2.00E+00
  -0.0833 -0.3333  0.3333    1  1.34337E-14 kpt; spin; max resid(k); each band:
  4.39E-16 3.14E-15 7.17E-15 1.34E-14-2.00E+00
   0.5000 -0.2500  0.0000    1  2.00902E-11 kpt; spin; max resid(k); each band:
  2.92E-15 2.76E-15 8.70E-15 1.53E-14 2.01E-11
 outwf : prtvol=0 or 1, do not print more k-points.

 MY_KPT_BANDS part of WFK written to file. completed. cpu:  0.35 [s] , wall:  0.49 [s] <<< TIME

 Thirteen components of 2nd-order total energy (hartree) are
 1,2,3: 0th-order hamiltonian combined with 1st-order wavefunctions
     kin0=   7.73409299E+01 eigvalue=  -2.40231950E+00  local=  -4.93880936E+01
 4,5,6: 1st-order hamiltonian combined with 1st and 0th-order wfs
 loc psp =  -7.20964572E+01  Hartree=   3.21200660E+01     xc=  -6.41175795E+00
 note that "loc psp" includes a xc core correction that could be resolved
 7,8,9: eventually, occupation + non-local contributions
    edocc=   2.80603668E+00     enl0=   4.12605733E+01   enl1=  -1.18554412E+02
 1-9 gives the relaxation energy (to be shifted if some occ is /=2.0)
   erelax=  -9.53254347E+01
 10,11,12 Non-relaxation  contributions : frozen-wavefunctions and Ewald
 fr.local=   5.39441845E+00 fr.nonlo=   6.73911403E+01  Ewald=   3.19985144E+01
 dfpt_prtene : non-relax=    1.047841E+02
 13,14 Frozen wf xc core corrections (1) and (2)
 frxc 1  =  -7.04808798E+00  frxc 2 =   5.14436518E+00
 Resulting in :
 2DEtotal=    0.7554915665E+01 Ha. Also 2DEtotal=    0.205579710189E+03 eV
    (2DErelax=   -9.5325434696E+01 Ha. 2DEnonrelax=    1.0288035036E+02 Ha)
    (  non-var. 2DEtotal :    7.5549156504E+00 Ha)


--------------------------------------------------------------------------------
 Perturbation wavevector (in red.coord.)   0.500000  0.333333  0.000000
 Perturbation : displacement of atom   1   along direction   2
 littlegroup_pert: only one element in the set of symmetries for this perturbation:
   1   0   0   0   1   0   0   0   1
 symatm: atom number 1 is reached starting at atom
   1
 symatm: atom number 2 is reached starting at atom
   2
 symkpt : not enough symmetry to change the number of k points.
 getmpw: optimal value of mpw= 405
- File: /home/fgoudreault/Workspace/abisuite/abisuite/unittests/test_workflows/test_files/abinit_si/nc/phonon_dispersion_qgrid_convergence/qgrid_6_6_6/phonons_runs/ph_q11/input_data/idat_ph_q11_WFK does not exist but found netcdf file with similar name.
 getmpw: optimal value of mpw= 405
- File: /home/fgoudreault/Workspace/abisuite/abisuite/unittests/test_workflows/test_files/abinit_si/nc/phonon_dispersion_qgrid_convergence/qgrid_6_6_6/phonons_runs/ph_q11/input_data/idat_ph_q11_WFK does not exist but found netcdf file with similar name.
 Initialisation of the first-order wave-functions :
  ireadwf=   0
 Initializing rhor1 from valence densities taken from pseudopotential files

 getcut: wavevector=  0.0000  0.0000  0.0000  ngfft=  24  24  24
         ecut(hartree)=     10.000   => boxcut(ratio)=   2.33905

 getcut : COMMENT -
  Note that boxcut > 2.2 ; recall that boxcut=Gcut(box)/Gcut(sphere) = 2
  is sufficient for exact treatment of convolution.
  Such a large boxcut is a waste : you could raise ecut
  e.g. ecut=   13.677837 Hartrees makes boxcut=2


 ITER STEP NUMBER     1
-ETOT  1   8.0543019358205     -8.899E+01 6.322E+00 9.493E+02

 Simple mixing update:
  residual square of the potential:    199.59850860550065
 dfpt_scfcv: previous iteration took  2.41 [s]

 ITER STEP NUMBER     2
 ETOT  2   7.4401826302742     -6.141E-01 1.232E+00 4.431E+01

 Pulay update with  1 previous iterations:
 mixing of old trial potential: alpha(m:m-4)=  0.843      0.157
 dfpt_scfcv: previous iteration took  2.61 [s]

 ITER STEP NUMBER     3
 ETOT  3   7.4136073049978     -2.658E-02 7.889E+00 8.072E-01

 Pulay update with  2 previous iterations:
 mixing of old trial potential: alpha(m:m-4)=  0.948      0.580E-01 -0.619E-02
 dfpt_scfcv: previous iteration took  2.60 [s]

 ITER STEP NUMBER     4
 ETOT  4   7.4132542362613     -3.531E-04 5.926E+00 2.516E-02

 Pulay update with  3 previous iterations:
 mixing of old trial potential: alpha(m:m-4)=   1.00      0.419E-01 -0.333E-01 -0.908E-02
 dfpt_scfcv: previous iteration took  2.83 [s]

 ITER STEP NUMBER     5
 ETOT  5   7.4132407665190     -1.347E-05 4.400E+00 3.534E-04

 Pulay update with  4 previous iterations:
 mixing of old trial potential: alpha(m:m-4)=   1.14     -0.108     -0.332E-01  0.233E-02  0.118E-02
 dfpt_scfcv: previous iteration took  2.58 [s]

 ITER STEP NUMBER     6
 ETOT  6   7.4132406063073     -1.602E-07 6.281E+00 2.134E-05

 Pulay update with  5 previous iterations:
 mixing of old trial potential: alpha(m:m-4)=  0.945      0.873E-01 -0.300E-01 -0.313E-02  0.873E-03
 dfpt_scfcv: previous iteration took  2.57 [s]

 ITER STEP NUMBER     7
 ETOT  7   7.4132405972396     -9.068E-09 7.889E+00 5.033E-07

 Pulay update with  6 previous iterations:
 mixing of old trial potential: alpha(m:m-4)=   1.13     -0.854E-01 -0.489E-01  0.586E-02  0.139E-02
 dfpt_scfcv: previous iteration took  2.64 [s]

 ITER STEP NUMBER     8
 ETOT  8   7.4132405970060     -2.336E-10 5.916E+00 1.621E-08

 Pulay update with  7 previous iterations:
 mixing of old trial potential: alpha(m:m-4)=   1.06     -0.376E-01 -0.236E-01  0.262E-03  0.406E-03
 dfpt_scfcv: previous iteration took  2.56 [s]

 ITER STEP NUMBER     9
 ETOT  9   7.4132405969962     -9.777E-12 4.399E+00 5.254E-10

 At SCF step    9       vres2   =  5.25E-10 < tolvrs=  1.00E-08 =>converged.

 fftdatar_write: About to write data to: /home/fgoudreault/Workspace/abisuite/abisuite/unittests/test_workflows/test_files/abinit_si/nc/phonon_dispersion_qgrid_convergence/qgrid_6_6_6/phonons_runs/ph_q11/run/output_data/odat_ph_q11_DEN2 with iomode: IO_MODE_ETSF
- Creating HDf5 file with MPI-IO support: /home/fgoudreault/Workspace/abisuite/abisuite/unittests/test_workflows/test_files/abinit_si/nc/phonon_dispersion_qgrid_convergence/qgrid_6_6_6/phonons_runs/ph_q11/run/output_data/odat_ph_q11_DEN2.nc
- Opening HDf5 file with MPI-IO support: /home/fgoudreault/Workspace/abisuite/abisuite/unittests/test_workflows/test_files/abinit_si/nc/phonon_dispersion_qgrid_convergence/qgrid_6_6_6/phonons_runs/ph_q11/run/output_data/odat_ph_q11_DEN2.nc
 IO operation completed. cpu:  0.03 [s] , wall:  0.05 [s] <<< TIME

 fftdatar_write: About to write data to: /home/fgoudreault/Workspace/abisuite/abisuite/unittests/test_workflows/test_files/abinit_si/nc/phonon_dispersion_qgrid_convergence/qgrid_6_6_6/phonons_runs/ph_q11/run/output_data/odat_ph_q11_POT2 with iomode: IO_MODE_ETSF
- Creating HDf5 file with MPI-IO support: /home/fgoudreault/Workspace/abisuite/abisuite/unittests/test_workflows/test_files/abinit_si/nc/phonon_dispersion_qgrid_convergence/qgrid_6_6_6/phonons_runs/ph_q11/run/output_data/odat_ph_q11_POT2.nc
- Opening HDf5 file with MPI-IO support: /home/fgoudreault/Workspace/abisuite/abisuite/unittests/test_workflows/test_files/abinit_si/nc/phonon_dispersion_qgrid_convergence/qgrid_6_6_6/phonons_runs/ph_q11/run/output_data/odat_ph_q11_POT2.nc
 IO operation completed. cpu:  0.03 [s] , wall:  0.04 [s] <<< TIME
- Opening HDf5 file with MPI-IO support: /home/fgoudreault/Workspace/abisuite/abisuite/unittests/test_workflows/test_files/abinit_si/nc/phonon_dispersion_qgrid_convergence/qgrid_6_6_6/phonons_runs/ph_q11/run/output_data/odat_ph_q11_POT2.nc
================================================================================

 ----iterations are completed or convergence reached----

 Mean square residual over all n,k,spin=  -87.794E-04; max=  43.986E-01
  -0.0833 -0.1667  0.0000    1  9.08350E-14 kpt; spin; max resid(k); each band:
  2.47E-15 5.26E-15 2.55E-15 3.53E-15 9.08E-14
  -0.1667 -0.0833  0.0000    1  1.63050E-06 kpt; spin; max resid(k); each band:
  2.00E-15 4.05E-15 2.82E-15 8.66E-15 1.63E-06
  -0.0833 -0.0833  0.0833    1  2.67655E-13 kpt; spin; max resid(k); each band:
  2.28E-15 3.93E-15 7.76E-15 3.91E-15 2.68E-13
  -0.0833 -0.3333  0.0000    1  5.00459E-11 kpt; spin; max resid(k); each band:
  5.92E-16 1.85E-15 7.79E-15 4.87E-15 5.00E-11
  -0.1667 -0.2500  0.0000    1  7.30468E-12 kpt; spin; max resid(k); each band:
  6.19E-16 2.02E-15 4.23E-15 3.39E-15 7.30E-12
  -0.0833 -0.2500  0.0833    1  1.42638E-08 kpt; spin; max resid(k); each band:
  6.03E-16 1.32E-15 3.93E-15 4.09E-15 1.43E-08
  -0.2500 -0.1667  0.0000    1  4.07512E-14 kpt; spin; max resid(k); each band:
  2.10E-15 2.45E-15 6.50E-15 2.83E-15 4.08E-14
  -0.1667 -0.1667  0.0833    1  1.17603E-13 kpt; spin; max resid(k); each band:
  2.78E-15 3.37E-15 3.11E-15 4.42E-15 1.18E-13
  -0.0833 -0.1667  0.1667    1  3.44612E-11 kpt; spin; max resid(k); each band:
  3.66E-15 2.22E-15 2.28E-15 4.06E-15 3.45E-11
  -0.3333 -0.0833  0.0000    1  1.00615E-13 kpt; spin; max resid(k); each band:
  2.07E-15 2.66E-15 3.36E-15 7.28E-15 1.01E-13
  -0.2500 -0.0833  0.0833    1  1.04583E-12 kpt; spin; max resid(k); each band:
  2.04E-15 2.52E-15 5.89E-15 4.69E-15 1.05E-12
  -0.1667 -0.0833  0.1667    1  7.98579E-09 kpt; spin; max resid(k); each band:
  2.12E-15 3.18E-15 4.58E-15 4.92E-15 7.99E-09
  -0.0833 -0.0833  0.2500    1  4.14695E-13 kpt; spin; max resid(k); each band:
  4.59E-16 3.20E-15 5.14E-15 3.54E-15 4.15E-13
  -0.0833  0.5000  0.0000    1  6.86855E-14 kpt; spin; max resid(k); each band:
  1.63E-15 2.37E-15 5.10E-15 8.79E-15 6.87E-14
  -0.1667 -0.4167  0.0000    1  1.66357E-12 kpt; spin; max resid(k); each band:
  1.44E-15 2.27E-15 4.94E-15 7.73E-15 1.66E-12
  -0.0833 -0.4167  0.0833    1  4.14730E-06 kpt; spin; max resid(k); each band:
  9.35E-16 2.48E-15 5.53E-15 4.98E-15 4.15E-06
  -0.2500 -0.3333  0.0000    1  7.66461E-14 kpt; spin; max resid(k); each band:
  8.61E-16 1.31E-15 4.31E-15 4.38E-15 7.66E-14
  -0.1667 -0.3333  0.0833    1  1.01793E-10 kpt; spin; max resid(k); each band:
  9.17E-16 1.35E-15 5.28E-15 3.88E-15 1.02E-10
  -0.0833 -0.3333  0.1667    1  2.09591E-11 kpt; spin; max resid(k); each band:
  1.05E-15 1.09E-15 5.09E-15 3.29E-15 2.10E-11
  -0.3333 -0.2500  0.0000    1  7.41749E-14 kpt; spin; max resid(k); each band:
  7.09E-16 2.31E-15 3.86E-15 3.56E-15 7.42E-14
  -0.2500 -0.2500  0.0833    1  1.45100E-13 kpt; spin; max resid(k); each band:
  1.16E-15 1.60E-15 3.20E-15 4.23E-15 1.45E-13
  -0.1667 -0.2500  0.1667    1  1.71944E-11 kpt; spin; max resid(k); each band:
  1.11E-15 1.52E-15 4.06E-15 3.86E-15 1.72E-11
  -0.0833 -0.2500  0.2500    1  5.34891E-08 kpt; spin; max resid(k); each band:
  1.11E-15 1.50E-15 4.12E-15 4.94E-15 5.35E-08
  -0.4167 -0.1667  0.0000    1  2.15121E-11 kpt; spin; max resid(k); each band:
  4.85E-16 2.53E-15 7.19E-15 3.75E-15 2.15E-11
  -0.3333 -0.1667  0.0833    1  7.25408E-11 kpt; spin; max resid(k); each band:
  6.05E-16 2.35E-15 5.71E-15 3.82E-15 7.25E-11
  -0.2500 -0.1667  0.1667    1  1.28462E-09 kpt; spin; max resid(k); each band:
  1.48E-15 2.08E-15 5.01E-15 3.50E-15 1.28E-09
  -0.1667 -0.1667  0.2500    1  1.66667E-12 kpt; spin; max resid(k); each band:
  1.13E-15 2.50E-15 3.25E-15 4.81E-15 1.67E-12
  -0.0833 -0.1667  0.3333    1  7.18151E-10 kpt; spin; max resid(k); each band:
  1.03E-15 2.35E-15 2.56E-15 3.75E-15 7.18E-10
   0.5000 -0.0833  0.0000    1  5.08542E-12 kpt; spin; max resid(k); each band:
  3.14E-16 2.31E-15 4.03E-15 3.46E-15 5.09E-12
  -0.4167 -0.0833  0.0833    1  5.96679E-06 kpt; spin; max resid(k); each band:
  4.82E-16 1.99E-15 5.25E-15 4.19E-15 5.97E-06
  -0.3333 -0.0833  0.1667    1  4.24472E-05 kpt; spin; max resid(k); each band:
  4.63E-16 1.51E-15 5.63E-15 5.53E-15 4.24E-05
  -0.2500 -0.0833  0.2500    1  4.21054E-06 kpt; spin; max resid(k); each band:
  4.82E-16 1.92E-15 5.16E-15 3.75E-15 4.21E-06
  -0.1667 -0.0833  0.3333    1  5.60680E-08 kpt; spin; max resid(k); each band:
  6.25E-16 2.76E-15 5.01E-15 4.09E-15 5.61E-08
  -0.0833 -0.0833  0.4167    1  1.81513E-13 kpt; spin; max resid(k); each band:
  1.18E-15 2.81E-15 3.02E-15 5.18E-15 1.82E-13
  -0.0833  0.3333  0.0000    1  1.16741E-13 kpt; spin; max resid(k); each band:
  4.27E-16 3.74E-15 4.23E-15 5.47E-15 1.17E-13
  -0.1667  0.4167  0.0000    1  1.61785E-14 kpt; spin; max resid(k); each band:
  8.76E-16 3.52E-15 3.80E-15 6.25E-15 1.62E-14
  -0.0833  0.4167  0.0833    1  5.33301E-14 kpt; spin; max resid(k); each band:
  5.16E-16 3.83E-15 4.08E-15 6.57E-15 5.33E-14
  -0.2500  0.5000  0.0000    1  6.05465E-14 kpt; spin; max resid(k); each band:
  2.34E-15 1.89E-15 4.85E-15 6.61E-15 6.05E-14
  -0.1667  0.5000  0.0833    1  2.61628E-10 kpt; spin; max resid(k); each band:
  1.83E-15 2.82E-15 4.85E-15 6.78E-15 2.62E-10
  -0.0833  0.5000  0.1667    1  1.46930E-11 kpt; spin; max resid(k); each band:
  5.35E-16 1.88E-15 5.18E-15 3.36E-15 1.47E-11
  -0.3333 -0.4167  0.0000    1  5.90170E-14 kpt; spin; max resid(k); each band:
  1.96E-15 1.35E-15 4.54E-15 5.68E-15 5.90E-14
  -0.2500 -0.4167  0.0833    1  1.37169E-12 kpt; spin; max resid(k); each band:
  1.64E-15 9.35E-16 5.79E-15 3.66E-15 1.37E-12
  -0.1667 -0.4167  0.1667    1  1.02822E-06 kpt; spin; max resid(k); each band:
  1.15E-15 1.02E-15 6.06E-15 4.26E-15 1.03E-06
  -0.0833 -0.4167  0.2500    1  2.68335E-09 kpt; spin; max resid(k); each band:
  6.50E-16 1.17E-15 5.73E-15 5.21E-15 2.68E-09
  -0.4167 -0.3333  0.0000    1  2.36079E-13 kpt; spin; max resid(k); each band:
  2.54E-15 1.91E-15 5.55E-15 5.30E-15 2.36E-13
  -0.3333 -0.3333  0.0833    1  4.00007E-14 kpt; spin; max resid(k); each band:
  2.41E-15 1.25E-15 3.84E-15 4.64E-15 4.00E-14
  -0.2500 -0.3333  0.1667    1  9.08392E-14 kpt; spin; max resid(k); each band:
  1.80E-15 9.85E-16 3.99E-15 4.75E-15 9.08E-14
  -0.1667 -0.3333  0.2500    1  6.37713E-01 kpt; spin; max resid(k); each band:
  1.44E-15 1.08E-15 4.57E-15 6.33E-15 6.38E-01
  -0.0833 -0.3333  0.3333    1  8.70393E-15 kpt; spin; max resid(k); each band:
  1.02E-15 1.06E-15 5.55E-15 8.70E-15-2.00E+00
   0.5000 -0.2500  0.0000    1  1.75668E-11 kpt; spin; max resid(k); each band:
  9.38E-16 1.94E-15 5.61E-15 5.27E-15 1.76E-11
 outwf : prtvol=0 or 1, do not print more k-points.

 MY_KPT_BANDS part of WFK written to file. completed. cpu:  0.38 [s] , wall:  0.61 [s] <<< TIME

 Thirteen components of 2nd-order total energy (hartree) are
 1,2,3: 0th-order hamiltonian combined with 1st-order wavefunctions
     kin0=   7.68772416E+01 eigvalue=  -2.29712618E+00  local=  -4.92137381E+01
 4,5,6: 1st-order hamiltonian combined with 1st and 0th-order wfs
 loc psp =  -6.04936030E+01  Hartree=   2.65619333E+01     xc=  -6.31465520E+00
 note that "loc psp" includes a xc core correction that could be resolved
 7,8,9: eventually, occupation + non-local contributions
    edocc=   2.73424922E+00     enl0=   4.12784505E+01   enl1=  -1.18759106E+02
 1-9 gives the relaxation energy (to be shifted if some occ is /=2.0)
   erelax=  -8.96263539E+01
 10,11,12 Non-relaxation  contributions : frozen-wavefunctions and Ewald
 fr.local=   5.39441845E+00 fr.nonlo=   6.73911403E+01  Ewald=   2.61577586E+01
 dfpt_prtene : non-relax=    9.894332E+01
 13,14 Frozen wf xc core corrections (1) and (2)
 frxc 1  =  -7.04808798E+00  frxc 2 =   5.14436518E+00
 Resulting in :
 2DEtotal=    0.7413240597E+01 Ha. Also 2DEtotal=    0.201724535531E+03 eV
    (2DErelax=   -8.9626353939E+01 Ha. 2DEnonrelax=    9.7039594536E+01 Ha)
    (  non-var. 2DEtotal :    7.4132399894E+00 Ha)


--------------------------------------------------------------------------------
 Perturbation wavevector (in red.coord.)   0.500000  0.333333  0.000000
 Perturbation : displacement of atom   1   along direction   3
 littlegroup_pert: only one element in the set of symmetries for this perturbation:
   1   0   0   0   1   0   0   0   1
 symatm: atom number 1 is reached starting at atom
   1
 symatm: atom number 2 is reached starting at atom
   2
 symkpt : not enough symmetry to change the number of k points.
 getmpw: optimal value of mpw= 405
- File: /home/fgoudreault/Workspace/abisuite/abisuite/unittests/test_workflows/test_files/abinit_si/nc/phonon_dispersion_qgrid_convergence/qgrid_6_6_6/phonons_runs/ph_q11/input_data/idat_ph_q11_WFK does not exist but found netcdf file with similar name.
 getmpw: optimal value of mpw= 405
- File: /home/fgoudreault/Workspace/abisuite/abisuite/unittests/test_workflows/test_files/abinit_si/nc/phonon_dispersion_qgrid_convergence/qgrid_6_6_6/phonons_runs/ph_q11/input_data/idat_ph_q11_WFK does not exist but found netcdf file with similar name.
 Initialisation of the first-order wave-functions :
  ireadwf=   0
 Initializing rhor1 from valence densities taken from pseudopotential files

 getcut: wavevector=  0.0000  0.0000  0.0000  ngfft=  24  24  24
         ecut(hartree)=     10.000   => boxcut(ratio)=   2.33905

 getcut : COMMENT -
  Note that boxcut > 2.2 ; recall that boxcut=Gcut(box)/Gcut(sphere) = 2
  is sufficient for exact treatment of convolution.
  Such a large boxcut is a waste : you could raise ecut
  e.g. ecut=   13.677837 Hartrees makes boxcut=2


 ITER STEP NUMBER     1
-ETOT  1   7.0354282512650     -8.219E+01 5.244E+00 6.616E+02

 Simple mixing update:
  residual square of the potential:    200.78871931363537
 dfpt_scfcv: previous iteration took  2.44 [s]

 ITER STEP NUMBER     2
 ETOT  2   6.4395024504470     -5.959E-01 6.813E-01 1.231E+01

 Pulay update with  1 previous iterations:
 mixing of old trial potential: alpha(m:m-4)=  0.882      0.118
 dfpt_scfcv: previous iteration took  2.58 [s]

 ITER STEP NUMBER     3
 ETOT  3   6.4264130977300     -1.309E-02 5.394E+00 2.320E-01

 Pulay update with  2 previous iterations:
 mixing of old trial potential: alpha(m:m-4)=   1.15     -0.120     -0.327E-01
 dfpt_scfcv: previous iteration took  2.58 [s]

 ITER STEP NUMBER     4
 ETOT  4   6.4262673565681     -1.457E-04 9.156E-01 1.489E-03

 Pulay update with  3 previous iterations:
 mixing of old trial potential: alpha(m:m-4)=   1.18     -0.196      0.827E-02  0.393E-02
 dfpt_scfcv: previous iteration took  2.58 [s]

 ITER STEP NUMBER     5
 ETOT  5   6.4262665066507     -8.499E-07 5.371E+00 2.593E-05

 Pulay update with  4 previous iterations:
 mixing of old trial potential: alpha(m:m-4)=   1.07     -0.685E-01 -0.403E-02  0.986E-03  0.615E-04
 dfpt_scfcv: previous iteration took  2.48 [s]

 ITER STEP NUMBER     6
 ETOT  6   6.4262664897252     -1.693E-08 1.112E+00 2.203E-07

 Pulay update with  5 previous iterations:
 mixing of old trial potential: alpha(m:m-4)=   1.17     -0.169     -0.104E-02  0.227E-02 -0.202E-03
 dfpt_scfcv: previous iteration took  2.92 [s]

 ITER STEP NUMBER     7
 ETOT  7   6.4262664895749     -1.503E-10 5.371E+00 4.852E-09

 At SCF step    7       vres2   =  4.85E-09 < tolvrs=  1.00E-08 =>converged.

 fftdatar_write: About to write data to: /home/fgoudreault/Workspace/abisuite/abisuite/unittests/test_workflows/test_files/abinit_si/nc/phonon_dispersion_qgrid_convergence/qgrid_6_6_6/phonons_runs/ph_q11/run/output_data/odat_ph_q11_DEN3 with iomode: IO_MODE_ETSF
- Creating HDf5 file with MPI-IO support: /home/fgoudreault/Workspace/abisuite/abisuite/unittests/test_workflows/test_files/abinit_si/nc/phonon_dispersion_qgrid_convergence/qgrid_6_6_6/phonons_runs/ph_q11/run/output_data/odat_ph_q11_DEN3.nc
- Opening HDf5 file with MPI-IO support: /home/fgoudreault/Workspace/abisuite/abisuite/unittests/test_workflows/test_files/abinit_si/nc/phonon_dispersion_qgrid_convergence/qgrid_6_6_6/phonons_runs/ph_q11/run/output_data/odat_ph_q11_DEN3.nc
 IO operation completed. cpu:  0.04 [s] , wall:  0.05 [s] <<< TIME

 fftdatar_write: About to write data to: /home/fgoudreault/Workspace/abisuite/abisuite/unittests/test_workflows/test_files/abinit_si/nc/phonon_dispersion_qgrid_convergence/qgrid_6_6_6/phonons_runs/ph_q11/run/output_data/odat_ph_q11_POT3 with iomode: IO_MODE_ETSF
- Creating HDf5 file with MPI-IO support: /home/fgoudreault/Workspace/abisuite/abisuite/unittests/test_workflows/test_files/abinit_si/nc/phonon_dispersion_qgrid_convergence/qgrid_6_6_6/phonons_runs/ph_q11/run/output_data/odat_ph_q11_POT3.nc
- Opening HDf5 file with MPI-IO support: /home/fgoudreault/Workspace/abisuite/abisuite/unittests/test_workflows/test_files/abinit_si/nc/phonon_dispersion_qgrid_convergence/qgrid_6_6_6/phonons_runs/ph_q11/run/output_data/odat_ph_q11_POT3.nc
 IO operation completed. cpu:  0.04 [s] , wall:  0.05 [s] <<< TIME
- Opening HDf5 file with MPI-IO support: /home/fgoudreault/Workspace/abisuite/abisuite/unittests/test_workflows/test_files/abinit_si/nc/phonon_dispersion_qgrid_convergence/qgrid_6_6_6/phonons_runs/ph_q11/run/output_data/odat_ph_q11_POT3.nc
================================================================================

 ----iterations are completed or convergence reached----

 Mean square residual over all n,k,spin=  -47.542E-04; max=  53.714E-01
  -0.0833 -0.1667  0.0000    1  8.25677E-13 kpt; spin; max resid(k); each band:
  4.61E-14 6.21E-14 2.33E-13 3.11E-14 8.26E-13
  -0.1667 -0.0833  0.0000    1  1.42392E-10 kpt; spin; max resid(k); each band:
  4.45E-14 5.13E-14 3.72E-13 7.18E-14 1.42E-10
  -0.0833 -0.0833  0.0833    1  3.69069E-10 kpt; spin; max resid(k); each band:
  1.11E-13 6.13E-14 8.09E-14 1.88E-13 3.69E-10
  -0.0833 -0.3333  0.0000    1  1.11277E-09 kpt; spin; max resid(k); each band:
  3.86E-14 3.15E-14 1.94E-13 6.68E-14 1.11E-09
  -0.1667 -0.2500  0.0000    1  2.31709E-12 kpt; spin; max resid(k); each band:
  5.57E-14 4.16E-14 4.94E-14 2.80E-13 2.32E-12
  -0.0833 -0.2500  0.0833    1  1.38495E-07 kpt; spin; max resid(k); each band:
  6.43E-14 3.65E-14 1.11E-13 1.06E-13 1.38E-07
  -0.2500 -0.1667  0.0000    1  1.89553E-13 kpt; spin; max resid(k); each band:
  8.35E-14 4.24E-14 1.18E-13 1.90E-13 1.50E-13
  -0.1667 -0.1667  0.0833    1  7.03150E-11 kpt; spin; max resid(k); each band:
  2.20E-14 3.37E-14 2.05E-13 1.03E-13 7.03E-11
  -0.0833 -0.1667  0.1667    1  2.43192E-09 kpt; spin; max resid(k); each band:
  2.62E-14 3.77E-14 1.07E-13 9.28E-14 2.43E-09
  -0.3333 -0.0833  0.0000    1  5.30855E-13 kpt; spin; max resid(k); each band:
  7.39E-14 4.90E-14 1.42E-13 7.14E-14 5.31E-13
  -0.2500 -0.0833  0.0833    1  5.45090E-09 kpt; spin; max resid(k); each band:
  2.97E-14 4.30E-14 9.44E-14 1.17E-13 5.45E-09
  -0.1667 -0.0833  0.1667    1  1.94608E-07 kpt; spin; max resid(k); each band:
  3.79E-14 3.72E-14 1.09E-13 1.42E-13 1.95E-07
  -0.0833 -0.0833  0.2500    1  2.77590E-10 kpt; spin; max resid(k); each band:
  6.61E-14 1.03E-13 8.51E-14 1.08E-13 2.78E-10
  -0.0833  0.5000  0.0000    1  2.43617E-12 kpt; spin; max resid(k); each band:
  2.81E-14 4.91E-14 4.65E-14 6.56E-14 2.44E-12
  -0.1667 -0.4167  0.0000    1  7.06414E-11 kpt; spin; max resid(k); each band:
  4.31E-14 2.32E-14 5.54E-14 1.25E-13 7.06E-11
  -0.0833 -0.4167  0.0833    1  1.16766E-05 kpt; spin; max resid(k); each band:
  2.35E-14 1.03E-13 5.21E-14 7.85E-14 1.17E-05
  -0.2500 -0.3333  0.0000    1  2.26013E-12 kpt; spin; max resid(k); each band:
  3.96E-14 2.79E-14 5.97E-14 1.31E-13 2.26E-12
  -0.1667 -0.3333  0.0833    1  2.63808E-08 kpt; spin; max resid(k); each band:
  3.32E-14 2.03E-14 5.75E-14 8.63E-14 2.64E-08
  -0.0833 -0.3333  0.1667    1  1.16113E-08 kpt; spin; max resid(k); each band:
  2.44E-14 1.08E-13 4.15E-14 6.03E-14 1.16E-08
  -0.3333 -0.2500  0.0000    1  6.77394E-13 kpt; spin; max resid(k); each band:
  5.42E-14 2.73E-14 1.41E-13 2.01E-13 6.77E-13
  -0.2500 -0.2500  0.0833    1  1.63481E-11 kpt; spin; max resid(k); each band:
  2.81E-14 2.20E-14 1.48E-13 8.64E-14 1.63E-11
  -0.1667 -0.2500  0.1667    1  2.86364E-09 kpt; spin; max resid(k); each band:
  7.35E-14 2.15E-14 5.45E-14 7.41E-14 2.86E-09
  -0.0833 -0.2500  0.2500    1  3.52693E-06 kpt; spin; max resid(k); each band:
  7.68E-14 1.09E-13 3.72E-14 7.64E-14 3.53E-06
  -0.4167 -0.1667  0.0000    1  3.67632E-12 kpt; spin; max resid(k); each band:
  1.39E-14 4.76E-14 9.43E-14 1.15E-13 3.68E-12
  -0.3333 -0.1667  0.0833    1  1.90657E-08 kpt; spin; max resid(k); each band:
  3.45E-14 3.19E-14 8.71E-14 1.71E-13 1.91E-08
  -0.2500 -0.1667  0.1667    1  2.22616E-08 kpt; spin; max resid(k); each band:
  2.23E-14 2.87E-14 1.22E-13 1.43E-13 2.23E-08
  -0.1667 -0.1667  0.2500    1  3.62701E-10 kpt; spin; max resid(k); each band:
  8.27E-14 1.08E-13 6.28E-14 1.10E-13 3.63E-10
  -0.0833 -0.1667  0.3333    1  2.52013E-08 kpt; spin; max resid(k); each band:
  2.42E-14 1.04E-13 7.98E-14 5.49E-14 2.52E-08
   0.5000 -0.0833  0.0000    1  2.49728E-10 kpt; spin; max resid(k); each band:
  1.01E-14 1.53E-13 6.94E-14 7.62E-14 2.50E-10
  -0.4167 -0.0833  0.0833    1  2.27066E-05 kpt; spin; max resid(k); each band:
  3.18E-14 1.32E-13 1.50E-13 1.14E-13 2.27E-05
  -0.3333 -0.0833  0.1667    1  9.97613E-04 kpt; spin; max resid(k); each band:
  7.65E-14 3.74E-14 6.13E-14 1.13E-13 9.98E-04
  -0.2500 -0.0833  0.2500    1  2.93563E-05 kpt; spin; max resid(k); each band:
  7.05E-14 9.01E-14 8.10E-14 1.02E-13 2.94E-05
  -0.1667 -0.0833  0.3333    1  6.17423E-07 kpt; spin; max resid(k); each band:
  8.14E-14 8.98E-14 5.69E-14 1.18E-13 6.17E-07
  -0.0833 -0.0833  0.4167    1  1.39920E-11 kpt; spin; max resid(k); each band:
  6.85E-14 1.04E-13 6.26E-14 7.61E-14 1.40E-11
  -0.0833  0.3333  0.0000    1  7.15331E-14 kpt; spin; max resid(k); each band:
  1.99E-14 4.51E-14 4.72E-14 3.60E-14 7.15E-14
  -0.1667  0.4167  0.0000    1  1.90854E-13 kpt; spin; max resid(k); each band:
  3.23E-14 1.29E-13 1.61E-13 5.37E-14 1.91E-13
  -0.0833  0.4167  0.0833    1  2.51506E-12 kpt; spin; max resid(k); each band:
  2.10E-14 1.08E-13 1.90E-13 4.61E-14 2.52E-12
  -0.2500  0.5000  0.0000    1  4.61550E-13 kpt; spin; max resid(k); each band:
  4.30E-14 1.46E-14 1.38E-13 7.55E-14 4.62E-13
  -0.1667  0.5000  0.0833    1  1.39447E-08 kpt; spin; max resid(k); each band:
  4.16E-14 2.89E-14 1.38E-13 8.69E-14 1.39E-08
  -0.0833  0.5000  0.1667    1  2.96684E-09 kpt; spin; max resid(k); each band:
  4.08E-14 1.14E-13 4.66E-14 6.16E-14 2.97E-09
  -0.3333 -0.4167  0.0000    1  1.01434E-12 kpt; spin; max resid(k); each band:
  5.55E-14 2.56E-14 6.28E-14 9.07E-14 1.01E-12
  -0.2500 -0.4167  0.0833    1  3.51431E-11 kpt; spin; max resid(k); each band:
  8.45E-14 1.21E-14 1.44E-13 6.62E-14 3.51E-11
  -0.1667 -0.4167  0.1667    1  4.48427E-05 kpt; spin; max resid(k); each band:
  7.50E-14 8.22E-14 4.49E-14 6.65E-14 4.48E-05
  -0.0833 -0.4167  0.2500    1  1.26817E-07 kpt; spin; max resid(k); each band:
  2.19E-14 9.88E-14 5.12E-14 7.93E-14 1.27E-07
  -0.4167 -0.3333  0.0000    1  2.03051E-11 kpt; spin; max resid(k); each band:
  6.29E-14 2.15E-14 1.14E-13 1.40E-13 2.03E-11
  -0.3333 -0.3333  0.0833    1  5.58932E-12 kpt; spin; max resid(k); each band:
  3.49E-14 1.76E-14 7.08E-14 7.96E-14 5.59E-12
  -0.2500 -0.3333  0.1667    1  2.19624E-11 kpt; spin; max resid(k); each band:
  2.44E-14 2.23E-14 4.80E-14 7.38E-14 2.20E-11
  -0.1667 -0.3333  0.2500    1  6.81982E-02 kpt; spin; max resid(k); each band:
  2.47E-14 2.32E-14 4.58E-14 8.32E-14 6.82E-02
  -0.0833 -0.3333  0.3333    1  1.23994E-01 kpt; spin; max resid(k); each band:
  1.81E-14 2.03E-14 5.44E-14 1.15E-13 1.24E-01
   0.5000 -0.2500  0.0000    1  5.05708E-09 kpt; spin; max resid(k); each band:
  4.94E-14 2.85E-14 9.87E-14 1.35E-13 5.06E-09
 outwf : prtvol=0 or 1, do not print more k-points.

 MY_KPT_BANDS part of WFK written to file. completed. cpu:  0.41 [s] , wall:  0.59 [s] <<< TIME

 Thirteen components of 2nd-order total energy (hartree) are
 1,2,3: 0th-order hamiltonian combined with 1st-order wavefunctions
     kin0=   7.61381022E+01 eigvalue=  -2.14518313E+00  local=  -4.82320373E+01
 4,5,6: 1st-order hamiltonian combined with 1st and 0th-order wfs
 loc psp =  -4.74583147E+01  Hartree=   2.02735465E+01     xc=  -6.38112246E+00
 note that "loc psp" includes a xc core correction that could be resolved
 7,8,9: eventually, occupation + non-local contributions
    edocc=   2.64389567E+00     enl0=   4.04973261E+01   enl1=  -1.18130742E+02
 1-9 gives the relaxation energy (to be shifted if some occ is /=2.0)
   erelax=  -8.27945294E+01
 10,11,12 Non-relaxation  contributions : frozen-wavefunctions and Ewald
 fr.local=   5.39441845E+00 fr.nonlo=   6.73911403E+01  Ewald=   1.83389600E+01
 dfpt_prtene : non-relax=    9.112452E+01
 13,14 Frozen wf xc core corrections (1) and (2)
 frxc 1  =  -7.04808798E+00  frxc 2 =   5.14436518E+00
 Resulting in :
 2DEtotal=    0.6426266490E+01 Ha. Also 2DEtotal=    0.174867604234E+03 eV
    (2DErelax=   -8.2794529443E+01 Ha. 2DEnonrelax=    8.9220795933E+01 Ha)
    (  non-var. 2DEtotal :    6.4262673971E+00 Ha)

================================================================================

 ---- first-order wavefunction calculations are completed ----


 ==> Compute Derivative Database <==
- Creating HDf5 file with MPI-IO support: /home/fgoudreault/Workspace/abisuite/abisuite/unittests/test_workflows/test_files/abinit_si/nc/phonon_dispersion_qgrid_convergence/qgrid_6_6_6/phonons_runs/ph_q11/run/output_data/odat_ph_q11_DDB.nc
 
 phonon wavelength (reduced coordinates) , norm, and energies in hartree
  0.50 0.33 0.00 1.00
  6.267997710E-04  8.251891910E-04  1.553862350E-03  1.894553289E-03  2.106935005E-03
  2.152457264E-03

 Zero Point Motion energy (sum of freqs/2)=  4.579898435E-03
  efmasval_free_array : enter 

== END DATASET(S) ==============================================================
================================================================================
  
 -outvars: echo values of variables after computation  --------
 
 These variables are accessible in NetCDF format (/home/fgoudreault/Workspace/abisuite/abisuite/unittests/test_workflows/test_files/abinit_si/nc/phonon_dispersion_qgrid_convergence/qgrid_6_6_6/phonons_runs/ph_q11/run/output_data/odat_ph_q11_OUT.nc)

            acell      7.2078778121E+00  7.2078778121E+00  7.2078778121E+00 Bohr
              amu      2.80855000E+01
           diemac      1.20000000E+01
             ecut      1.00000000E+01 Hartree
           etotal      6.4262664896E+00
            fcart      0.0000000000E+00  0.0000000000E+00  0.0000000000E+00
                       0.0000000000E+00  0.0000000000E+00  0.0000000000E+00
-          fftalg         112
           irdwfk           1
              ixc       -1012
              kpt     -8.33333333E-02 -1.66666667E-01  0.00000000E+00
                      -1.66666667E-01 -8.33333333E-02  0.00000000E+00
                      -8.33333333E-02 -8.33333333E-02  8.33333333E-02
                      -8.33333333E-02 -3.33333333E-01  0.00000000E+00
                      -1.66666667E-01 -2.50000000E-01  0.00000000E+00
                      -8.33333333E-02 -2.50000000E-01  8.33333333E-02
                      -2.50000000E-01 -1.66666667E-01  0.00000000E+00
                      -1.66666667E-01 -1.66666667E-01  8.33333333E-02
                      -8.33333333E-02 -1.66666667E-01  1.66666667E-01
                      -3.33333333E-01 -8.33333333E-02  0.00000000E+00
                      -2.50000000E-01 -8.33333333E-02  8.33333333E-02
                      -1.66666667E-01 -8.33333333E-02  1.66666667E-01
                      -8.33333333E-02 -8.33333333E-02  2.50000000E-01
                      -8.33333333E-02  5.00000000E-01  0.00000000E+00
                      -1.66666667E-01 -4.16666667E-01  0.00000000E+00
                      -8.33333333E-02 -4.16666667E-01  8.33333333E-02
                      -2.50000000E-01 -3.33333333E-01  0.00000000E+00
                      -1.66666667E-01 -3.33333333E-01  8.33333333E-02
                      -8.33333333E-02 -3.33333333E-01  1.66666667E-01
                      -3.33333333E-01 -2.50000000E-01  0.00000000E+00
                      -2.50000000E-01 -2.50000000E-01  8.33333333E-02
                      -1.66666667E-01 -2.50000000E-01  1.66666667E-01
                      -8.33333333E-02 -2.50000000E-01  2.50000000E-01
                      -4.16666667E-01 -1.66666667E-01  0.00000000E+00
                      -3.33333333E-01 -1.66666667E-01  8.33333333E-02
                      -2.50000000E-01 -1.66666667E-01  1.66666667E-01
                      -1.66666667E-01 -1.66666667E-01  2.50000000E-01
                      -8.33333333E-02 -1.66666667E-01  3.33333333E-01
                       5.00000000E-01 -8.33333333E-02  0.00000000E+00
                      -4.16666667E-01 -8.33333333E-02  8.33333333E-02
                      -3.33333333E-01 -8.33333333E-02  1.66666667E-01
                      -2.50000000E-01 -8.33333333E-02  2.50000000E-01
                      -1.66666667E-01 -8.33333333E-02  3.33333333E-01
                      -8.33333333E-02 -8.33333333E-02  4.16666667E-01
                      -8.33333333E-02  3.33333333E-01  0.00000000E+00
                      -1.66666667E-01  4.16666667E-01  0.00000000E+00
                      -8.33333333E-02  4.16666667E-01  8.33333333E-02
                      -2.50000000E-01  5.00000000E-01  0.00000000E+00
                      -1.66666667E-01  5.00000000E-01  8.33333333E-02
                      -8.33333333E-02  5.00000000E-01  1.66666667E-01
                      -3.33333333E-01 -4.16666667E-01  0.00000000E+00
                      -2.50000000E-01 -4.16666667E-01  8.33333333E-02
                      -1.66666667E-01 -4.16666667E-01  1.66666667E-01
                      -8.33333333E-02 -4.16666667E-01  2.50000000E-01
                      -4.16666667E-01 -3.33333333E-01  0.00000000E+00
                      -3.33333333E-01 -3.33333333E-01  8.33333333E-02
                      -2.50000000E-01 -3.33333333E-01  1.66666667E-01
                      -1.66666667E-01 -3.33333333E-01  2.50000000E-01
                      -8.33333333E-02 -3.33333333E-01  3.33333333E-01
                       5.00000000E-01 -2.50000000E-01  0.00000000E+00
                       outvar_i_n : Printing only first  50 k-points.
           kptopt           3
         kptrlatt        6   -6    6     -6    6    6     -6   -6    6
          kptrlen      6.11608713E+01
P           mkmem         217
P          mkqmem         217
P          mk1mem         217
            natom           2
            nband           5
            ngfft          24      24      24
             nkpt         864
             nqpt           1
            nstep          25
             nsym          48
           ntypat           1
              occ      2.000000  2.000000  2.000000  2.000000  0.000000
        optdriver           1
              qpt      5.00000000E-01  3.33333333E-01  0.00000000E+00
          rfatpol           1       2
            rfdir           1       1       1
           rfphon           1
            rprim      0.0000000000E+00  7.0710678119E-01  7.0710678119E-01
                       7.0710678119E-01  0.0000000000E+00  7.0710678119E-01
                       7.0710678119E-01  7.0710678119E-01  0.0000000000E+00
           shiftk      5.00000000E-01  5.00000000E-01  5.00000000E-01
          spgroup         227
           strten      0.0000000000E+00  0.0000000000E+00  0.0000000000E+00
                       0.0000000000E+00  0.0000000000E+00  0.0000000000E+00
           symrel      1  0  0   0  1  0   0  0  1      -1  0  0   0 -1  0   0  0 -1
                       0 -1  1   0 -1  0   1 -1  0       0  1 -1   0  1  0  -1  1  0
                      -1  0  0  -1  0  1  -1  1  0       1  0  0   1  0 -1   1 -1  0
                       0  1 -1   1  0 -1   0  0 -1       0 -1  1  -1  0  1   0  0  1
                      -1  0  0  -1  1  0  -1  0  1       1  0  0   1 -1  0   1  0 -1
                       0 -1  1   1 -1  0   0 -1  0       0  1 -1  -1  1  0   0  1  0
                       1  0  0   0  0  1   0  1  0      -1  0  0   0  0 -1   0 -1  0
                       0  1 -1   0  0 -1   1  0 -1       0 -1  1   0  0  1  -1  0  1
                      -1  0  1  -1  1  0  -1  0  0       1  0 -1   1 -1  0   1  0  0
                       0 -1  0   1 -1  0   0 -1  1       0  1  0  -1  1  0   0  1 -1
                       1  0 -1   0  0 -1   0  1 -1      -1  0  1   0  0  1   0 -1  1
                       0  1  0   0  0  1   1  0  0       0 -1  0   0  0 -1  -1  0  0
                       1  0 -1   0  1 -1   0  0 -1      -1  0  1   0 -1  1   0  0  1
                       0 -1  0   0 -1  1   1 -1  0       0  1  0   0  1 -1  -1  1  0
                      -1  0  1  -1  0  0  -1  1  0       1  0 -1   1  0  0   1 -1  0
                       0  1  0   1  0  0   0  0  1       0 -1  0  -1  0  0   0  0 -1
                       0  0 -1   0  1 -1   1  0 -1       0  0  1   0 -1  1  -1  0  1
                       1 -1  0   0 -1  1   0 -1  0      -1  1  0   0  1 -1   0  1  0
                       0  0  1   1  0  0   0  1  0       0  0 -1  -1  0  0   0 -1  0
                      -1  1  0  -1  0  0  -1  0  1       1 -1  0   1  0  0   1  0 -1
                       0  0  1   0  1  0   1  0  0       0  0 -1   0 -1  0  -1  0  0
                       1 -1  0   0 -1  0   0 -1  1      -1  1  0   0  1  0   0  1 -1
                       0  0 -1   1  0 -1   0  1 -1       0  0  1  -1  0  1   0 -1  1
                      -1  1  0  -1  0  1  -1  0  0       1 -1  0   1  0 -1   1  0  0
            tnons      0.0000000  0.0000000  0.0000000     0.2500000  0.2500000  0.2500000
                       0.0000000  0.0000000  0.0000000     0.2500000  0.2500000  0.2500000
                       0.0000000  0.0000000  0.0000000     0.2500000  0.2500000  0.2500000
                       0.0000000  0.0000000  0.0000000     0.2500000  0.2500000  0.2500000
                       0.0000000  0.0000000  0.0000000     0.2500000  0.2500000  0.2500000
                       0.0000000  0.0000000  0.0000000     0.2500000  0.2500000  0.2500000
                       0.0000000  0.0000000  0.0000000     0.2500000  0.2500000  0.2500000
                       0.0000000  0.0000000  0.0000000     0.2500000  0.2500000  0.2500000
                       0.0000000  0.0000000  0.0000000     0.2500000  0.2500000  0.2500000
                       0.0000000  0.0000000  0.0000000     0.2500000  0.2500000  0.2500000
                       0.0000000  0.0000000  0.0000000     0.2500000  0.2500000  0.2500000
                       0.0000000  0.0000000  0.0000000     0.2500000  0.2500000  0.2500000
                       0.0000000  0.0000000  0.0000000     0.2500000  0.2500000  0.2500000
                       0.0000000  0.0000000  0.0000000     0.2500000  0.2500000  0.2500000
                       0.0000000  0.0000000  0.0000000     0.2500000  0.2500000  0.2500000
                       0.0000000  0.0000000  0.0000000     0.2500000  0.2500000  0.2500000
                       0.0000000  0.0000000  0.0000000     0.2500000  0.2500000  0.2500000
                       0.0000000  0.0000000  0.0000000     0.2500000  0.2500000  0.2500000
                       0.0000000  0.0000000  0.0000000     0.2500000  0.2500000  0.2500000
                       0.0000000  0.0000000  0.0000000     0.2500000  0.2500000  0.2500000
                       0.0000000  0.0000000  0.0000000     0.2500000  0.2500000  0.2500000
                       0.0000000  0.0000000  0.0000000     0.2500000  0.2500000  0.2500000
                       0.0000000  0.0000000  0.0000000     0.2500000  0.2500000  0.2500000
                       0.0000000  0.0000000  0.0000000     0.2500000  0.2500000  0.2500000
           tolvrs      1.00000000E-08
            typat      1  1
              wtk        0.00116    0.00116    0.00116    0.00116    0.00116    0.00116
                         0.00116    0.00116    0.00116    0.00116    0.00116    0.00116
                         0.00116    0.00116    0.00116    0.00116    0.00116    0.00116
                         0.00116    0.00116    0.00116    0.00116    0.00116    0.00116
                         0.00116    0.00116    0.00116    0.00116    0.00116    0.00116
                         0.00116    0.00116    0.00116    0.00116    0.00116    0.00116
                         0.00116    0.00116    0.00116    0.00116    0.00116    0.00116
                         0.00116    0.00116    0.00116    0.00116    0.00116    0.00116
                         0.00116    0.00116
                       outvars : Printing only first  50 k-points.
           xangst      0.0000000000E+00  0.0000000000E+00  0.0000000000E+00
                       1.3485391323E+00  1.3485391323E+00  1.3485391323E+00
            xcart      0.0000000000E+00  0.0000000000E+00  0.0000000000E+00
                       2.5483696395E+00  2.5483696395E+00  2.5483696395E+00
             xred      0.0000000000E+00  0.0000000000E+00  0.0000000000E+00
                       2.5000000000E-01  2.5000000000E-01  2.5000000000E-01
            znucl       14.00000

================================================================================
  

================================================================================

 Suggested references for the acknowledgment of ABINIT usage.

 The users of ABINIT have little formal obligations with respect to the ABINIT group
 (those specified in the GNU General Public License, http://www.gnu.org/copyleft/gpl.txt).
 However, it is common practice in the scientific literature,
 to acknowledge the efforts of people that have made the research possible.
 In this spirit, please find below suggested citations of work written by ABINIT developers,
 corresponding to implementations inside of ABINIT that you have used in the present run.
 Note also that it will be of great value to readers of publications presenting these results,
 to read papers enabling them to understand the theoretical formalism and details
 of the ABINIT implementation.
 For information on why they are suggested, see also https://docs.abinit.org/theory/acknowledgments.
-
- [1] Specification of an extensible and portable file format for electronic structure and crystallographic data
- X. Gonze, C.-O. Almbladh, A. Cucca, D. Caliste, C. Freysoldt, M. Marques, V. Olevano, Y. Pouillon, M.J. Verstraete,
- Comput. Material Science 43, 1056 (2008).
- Comment: to be cited in case the ETSF_IO file format is used, i.e. iomode=3.
- DOI and bibtex: see https://docs.abinit.org/theory/bibliography/#gonze2008
-
- [2] Libxc: A library of exchange and correlation functionals for density functional theory.
- M.A.L. Marques, M.J.T. Oliveira, T. Burnus, Computer Physics Communications 183, 2227 (2012).
- Comment: to be cited when LibXC is used (negative value of ixc)
- Strong suggestion to cite this paper.
- DOI and bibtex: see https://docs.abinit.org/theory/bibliography/#marques2012
-
- [3] The Abinit project: Impact, environment and recent developments.
- Computer Phys. Comm. 248, 107042 (2020).
- X.Gonze, B. Amadon, G. Antonius, F.Arnardi, L.Baguet, J.-M.Beuken,
- J.Bieder, F.Bottin, J.Bouchet, E.Bousquet, N.Brouwer, F.Bruneval,
- G.Brunin, T.Cavignac, J.-B. Charraud, Wei Chen, M.Cote, S.Cottenier,
- J.Denier, G.Geneste, Ph.Ghosez, M.Giantomassi, Y.Gillet, O.Gingras,
- D.R.Hamann, G.Hautier, Xu He, N.Helbig, N.Holzwarth, Y.Jia, F.Jollet,
- W.Lafargue-Dit-Hauret, K.Lejaeghere, M.A.L.Marques, A.Martin, C.Martins,
- H.P.C. Miranda, F.Naccarato, K. Persson, G.Petretto, V.Planes, Y.Pouillon,
- S.Prokhorenko, F.Ricci, G.-M.Rignanese, A.H.Romero, M.M.Schmitt, M.Torrent,
- M.J.van Setten, B.Van Troeye, M.J.Verstraete, G.Zerah and J.W.Zwanzig
- Comment: the fifth generic paper describing the ABINIT project.
- Note that a version of this paper, that is not formatted for Computer Phys. Comm. 
- is available at https://www.abinit.org/sites/default/files/ABINIT20.pdf .
- The licence allows the authors to put it on the Web.
- DOI and bibtex: see https://docs.abinit.org/theory/bibliography/#gonze2020
-
- [4] First-principles responses of solids to atomic displacements and homogeneous electric fields:,
- implementation of a conjugate-gradient algorithm. X. Gonze, Phys. Rev. B55, 10337 (1997).
- Comment: Non-vanishing rfphon and/or rfelfd, in the norm-conserving case.
- DOI and bibtex: see https://docs.abinit.org/theory/bibliography/#gonze1997
-
- [5] Dynamical matrices, Born effective charges, dielectric permittivity tensors, and ,
- interatomic force constants from density-functional perturbation theory,
- X. Gonze and C. Lee, Phys. Rev. B55, 10355 (1997).
- Comment: Non-vanishing rfphon and/or rfelfd, in the norm-conserving case.
- DOI and bibtex: see https://docs.abinit.org/theory/bibliography/#gonze1997a
-
- [6] Optimized norm-conserving Vanderbilt pseudopotentials.
- D.R. Hamann, Phys. Rev. B 88, 085117 (2013).
- Comment: Some pseudopotential generated using the ONCVPSP code were used.
- DOI and bibtex: see https://docs.abinit.org/theory/bibliography/#hamann2013
-
- [7] ABINIT: Overview, and focus on selected capabilities
- J. Chem. Phys. 152, 124102 (2020).
- A. Romero, D.C. Allan, B. Amadon, G. Antonius, T. Applencourt, L.Baguet,
- J.Bieder, F.Bottin, J.Bouchet, E.Bousquet, F.Bruneval,
- G.Brunin, D.Caliste, M.Cote,
- J.Denier, C. Dreyer, Ph.Ghosez, M.Giantomassi, Y.Gillet, O.Gingras,
- D.R.Hamann, G.Hautier, F.Jollet, G. Jomard,
- A.Martin, 
- H.P.C. Miranda, F.Naccarato, G.Petretto, N.A. Pike, V.Planes,
- S.Prokhorenko, T. Rangel, F.Ricci, G.-M.Rignanese, M.Royo, M.Stengel, M.Torrent,
- M.J.van Setten, B.Van Troeye, M.J.Verstraete, J.Wiktor, J.W.Zwanziger, and X.Gonze.
- Comment: a global overview of ABINIT, with focus on selected capabilities .
- Note that a version of this paper, that is not formatted for J. Chem. Phys 
- is available at https://www.abinit.org/sites/default/files/ABINIT20_JPC.pdf .
- The licence allows the authors to put it on the Web.
- DOI and bibtex: see https://docs.abinit.org/theory/bibliography/#romero2020
-
- [8] Recent developments in the ABINIT software package.
- Computer Phys. Comm. 205, 106 (2016).
- X.Gonze, F.Jollet, F.Abreu Araujo, D.Adams, B.Amadon, T.Applencourt,
- C.Audouze, J.-M.Beuken, J.Bieder, A.Bokhanchuk, E.Bousquet, F.Bruneval
- D.Caliste, M.Cote, F.Dahm, F.Da Pieve, M.Delaveau, M.Di Gennaro,
- B.Dorado, C.Espejo, G.Geneste, L.Genovese, A.Gerossier, M.Giantomassi,
- Y.Gillet, D.R.Hamann, L.He, G.Jomard, J.Laflamme Janssen, S.Le Roux,
- A.Levitt, A.Lherbier, F.Liu, I.Lukacevic, A.Martin, C.Martins,
- M.J.T.Oliveira, S.Ponce, Y.Pouillon, T.Rangel, G.-M.Rignanese,
- A.H.Romero, B.Rousseau, O.Rubel, A.A.Shukri, M.Stankovski, M.Torrent,
- M.J.Van Setten, B.Van Troeye, M.J.Verstraete, D.Waroquier, J.Wiktor,
- B.Xu, A.Zhou, J.W.Zwanziger.
- Comment: the fourth generic paper describing the ABINIT project.
- Note that a version of this paper, that is not formatted for Computer Phys. Comm. 
- is available at https://www.abinit.org/sites/default/files/ABINIT16.pdf .
- The licence allows the authors to put it on the Web.
- DOI and bibtex: see https://docs.abinit.org/theory/bibliography/#gonze2016
 Proc.   0 individual time (sec): cpu=         75.0  wall=         75.5

 Calculation completed.
.Delivered   0 WARNINGs and   6 COMMENTs to log file.

--- !FinalSummary
program: abinit
version: 9.5.1
start_datetime: Thu Jul 01 14:49:04 2021
end_datetime: Thu Jul 01 14:50:19 2021
overall_cpu_time:         300.1
overall_wall_time:         302.1
exit_requested_by_user: no 
timelimit: 0
pseudos: 
    Si  : 9cf3649cb539efbe8c67e8db9d375af0
usepaw: 0
mpi_procs: 4
omp_threads: 1
num_warnings: 0
num_comments: 6
...
