Invalid MIT-MAGIC-COOKIE-1 key[fgoudreault-XPS-13-9370:117107] pmix_mca_base_component_repository_open: unable to open mca_pnet_tcp: perhaps a missing symbol, or compiled for a different version of OpenPMIx (ignored)
[fgoudreault-XPS-13-9370:117107] pmix_mca_base_component_repository_open: unable to open mca_pnet_test: perhaps a missing symbol, or compiled for a different version of OpenPMIx (ignored)
Note: The following floating-point exceptions are signalling: IEEE_UNDERFLOW_FLAG IEEE_DENORMAL
Note: The following floating-point exceptions are signalling: IEEE_UNDERFLOW_FLAG IEEE_DENORMAL
Note: The following floating-point exceptions are signalling: IEEE_UNDERFLOW_FLAG IEEE_DENORMAL
Note: The following floating-point exceptions are signalling: IEEE_UNDERFLOW_FLAG IEEE_DENORMAL
