{
    "name": "ProjetEditor",
    "rootNamespace": "",
    "references": [
        "GUID:90add67a49c65af4ca7e04a2f6ec58db",
        "GUID:d8b63aba1907145bea998dd612889d6b",
        "GUID:2665a8d13d1b3f18800f46e256720795"
    ],
    "includePlatforms": [
        "Editor"
    ],
    "excludePlatforms": [],
    "allowUnsafeCode": true,
    "overrideReferences": false,
    "precompiledReferences": [],
    "autoReferenced": true,
    "defineConstraints": [],
    "versionDefines": [],
    "noEngineReferences": false
}