{
	"lessons": [
		{
			"slug": "2011",
			"introduction": [
				"Before you can work with the examples in Module 201, you must set up a JavaScript development environment. Node.js is the development environment for JavaScript.",
				"When Node.js is installed, you'll be able to run the PPBL 2023 Front End Starter on your computer. This front-end starter is a Next.js project that will allow you jump into the next few lessons."
			],
			"links": [
				{
					"url": "https://nodejs.dev/en/",
					"linkText": "Node.js"
				},
				{
					"url": "https://nodejs.dev/en/learn/an-introduction-to-the-npm-package-manager/",
					"linkText": "Learn about Node Package Manager (npm)"
				},
				{
					"url": "https://yarnpkg.com/getting-started",
					"linkText": "Yarn Package Manager"
				},
				{
					"url": "https://nextjs.org/",
					"linkText": "Next.js"
				}
			],
			"videoHeading": "This lesson was demonstrated at Live Coding on 2023-04-12:",
			"youtubeId": "pvVO_UVzadM",
			"successComponent": false,
			"success": {
				"criteria": "",
				"text": ""
			},
			"assignmentComponent": true,
			"markdownComponent": false
		},
		{
			"slug": "2012",
			"introduction": [
				"The Mesh CardanoWallet button is on the right-hand side of of the navigation bar at the top of this application. If you completed the previous modules, you've seen how it works.",
				"In this lesson, you'll see how to add this component to a project.",
				"We hope that this example shows you how efficient it can be to work within the React development ecosystem.",
				"Join in at Live Coding for a demo of the steps below."
			],
			"links": [
				{
					"url": "https://meshjs.dev/",
					"linkText": "MeshJS"
				},
				{
					"url": "https://meshjs.dev/react/ui-components#connectWallet",
					"linkText": "Mesh: CardanoWallet component"
				}
			],
			"videoHeading": "This lesson was demonstrated at Live Coding on 2023-04-12:",
			"youtubeId": "pvVO_UVzadM",
			"successComponent": false,
			"success": {
				"criteria": "",
				"text": ""
			},
			"assignmentComponent": true,
			"markdownComponent": false
		},
		{
			"slug": "2013",
			"introduction": [
				"Now that you know how to connect a browser wallet to a React application, we can start to build a more dynamic app.",
				"In the examples below, you will see how to update the page to show if a wallet is connected, and if it holds a certain token.",
				"Along the way, we will look at how React components work.",
				"Join in at Live Coding for a demo of the steps below."
			],
			"links": [
				{
					"url": "",
					"linkText": "Mesh Browser Wallet"
				}
			],
			"videoHeading": "This lesson was demonstrated at Live Coding on 2023-04-13:",
			"youtubeId": "hueJLsF_xeY",
			"successComponent": false,
			"success": {
				"criteria": "",
				"text": ""
			},
			"assignmentComponent": true,
			"markdownComponent": false
		},
		{
			"slug": "2014",
			"introduction": [
				"In the next set of examples, we explore some of the examples in Mastery Assignment 102.1.",
				"We will use a set of tools to write a query to the Cardano blockchain, and then we will show the results in our app.",
				"Join in at Live Coding for a demo of the steps below."
			],
			"links": [
				{
					"url": "https://github.com/input-output-hk/cardano-graphql",
					"linkText": "Cardano GraphQL from IOHK"
				},
				{
					"url": "https://input-output-hk.github.io/cardano-graphql/",
					"linkText": "Visual Documentation"
				},
				{
					"url": "https://gitlab.com/gimbalabs/dandelion/kustomize-dandelion",
					"linkText": "Dandelion GitLab"
				},
				{
					"url": "https://d.graphql-api.iohk-preprod.dandelion.link/",
					"linkText": "Dandelion GraphQL Preprod"
				},
				{
					"url": "https://www.koios.rest/",
					"linkText": "Koios"
				},
				{
					"url": "https://meshjs.dev/providers/koios",
					"linkText": "MeshJS KoiosProvider"
				}
			],
			"videoHeading": "This lesson was demonstrated at Live Coding on 2023-07-20:",
			"youtubeId": "aI-xgJu01Ow",
			"successComponent": false,
			"success": {
				"criteria": "",
				"text": ""
			},
			"assignmentComponent": true,
			"markdownComponent": false
		},
		{
			"slug": "2015",
			"introduction": [
				"The PPBL 2023 Playground is a fork of the PPBL 2023 Front End Starter project. Everyone is invited to contribute a page to the PPBL 2023 Playground.",
				"If you create a demo that you would like to share, you can submit a merge request to the PPBL 2023 Playground repository.",
				"In upcoming mastery assignments, you will follow the steps outlined here."
			],
			"links": [
				{
					"url": "https://gitlab.com/gimbalabs/ppbl-2023/ppbl-2023-playground",
					"linkText": "PPBL 2023 Playground repository on GitLab"
				}
			],
			"videoHeading": "Need help? Drop by a Live Coding session!",
			"youtubeId": "",
			"successComponent": false,
			"success": {
				"criteria": "",
				"text": ""
			},
			"assignmentComponent": true,
			"markdownComponent": false
		}
	]
}
