{
    "constructor": 0,
    "fields": [
        {
            "bytes": "65295d6feacfc33fe029f51785770d92373e82cde28c3cd8c55a3cd1"
        },
        {
            "bytes": "8bdf956671694356e11a669fedf30759f373568dd25f4b510bcd5901"
        },
        {
            "int": 5000000
        },
        {
            "int": 400
        },
        {
            "int": 1666788293270
        }
    ]
}
