{
    "definitions": {
        "GYAddress": {
            "description": "An address, serialised as CBOR.",
            "example": "00e1cbb80db89e292269aeb93ec15eb963dda5176b66949fe1c2a6a38d1b930e9f7add78a174a21000e989ff551366dcd127028cb2aa39f616",
            "format": "cbor hex",
            "maxLength": 114,
            "minLength": 114,
            "type": "string"
        },
        "GYTxOutRef": {
            "example": "4293386fef391299c9886dc0ef3e8676cbdbc2c9f2773507f1f838e00043a189#1",
            "format": "hex",
            "pattern": "[0-9a-fA-F]{64}#\"d+",
            "type": "string"
        },
        "GuessParams": {
            "properties": {
                "gpChangeAddr": {
                    "$ref": "#/definitions/GYAddress"
                },
                "gpCollateral": {
                    "example": "8282582004ffecdf5f3ced5c5c788833415bcbef26e3e21290fcebcf8216327e21569e420082583900e1cbb80db89e292269aeb93ec15eb963dda5176b66949fe1c2a6a38d1b930e9f7add78a174a21000e989ff551366dcd127028cb2aa39f6161a004c4b40",
                    "format": "cbor hex",
                    "pattern": "[0-9a-fA-F]+",
                    "type": "string"
                },
                "gpGuessStr": {
                    "type": "string"
                },
                "gpUsedAddrs": {
                    "items": {
                        "$ref": "#/definitions/GYAddress"
                    },
                    "type": "array"
                }
            },
            "required": [
                "gpUsedAddrs",
                "gpChangeAddr",
                "gpGuessStr"
            ],
            "type": "object"
        },
        "MintToGuessParams": {
            "properties": {
                "mtgpChangeAddr": {
                    "$ref": "#/definitions/GYAddress"
                },
                "mtgpCollateral": {
                    "example": "8282582004ffecdf5f3ced5c5c788833415bcbef26e3e21290fcebcf8216327e21569e420082583900e1cbb80db89e292269aeb93ec15eb963dda5176b66949fe1c2a6a38d1b930e9f7add78a174a21000e989ff551366dcd127028cb2aa39f6161a004c4b40",
                    "format": "cbor hex",
                    "pattern": "[0-9a-fA-F]+",
                    "type": "string"
                },
                "mtgpMintAmount": {
                    "type": "integer"
                },
                "mtgpSecret": {
                    "type": "string"
                },
                "mtgpUsedAddrs": {
                    "items": {
                        "$ref": "#/definitions/GYAddress"
                    },
                    "type": "array"
                }
            },
            "required": [
                "mtgpUsedAddrs",
                "mtgpChangeAddr",
                "mtgpSecret",
                "mtgpMintAmount"
            ],
            "type": "object"
        },
        "UnsignedTxResponse": {
            "properties": {
                "urspTxBodyHex": {
                    "type": "string"
                },
                "urspTxFee": {
                    "type": "integer"
                },
                "urspUtxoRef": {
                    "$ref": "#/definitions/GYTxOutRef"
                }
            },
            "required": [
                "urspTxBodyHex"
            ],
            "type": "object"
        }
    },
    "info": {
        "title": "",
        "version": ""
    },
    "paths": {
        "/txBuild/guess": {
            "post": {
                "consumes": [
                    "application/json;charset=utf-8"
                ],
                "parameters": [
                    {
                        "in": "body",
                        "name": "body",
                        "required": true,
                        "schema": {
                            "$ref": "#/definitions/GuessParams"
                        }
                    }
                ],
                "produces": [
                    "application/json;charset=utf-8"
                ],
                "responses": {
                    "200": {
                        "description": "",
                        "schema": {
                            "$ref": "#/definitions/UnsignedTxResponse"
                        }
                    },
                    "400": {
                        "description": "Invalid `body`"
                    }
                }
            }
        },
        "/txBuild/mintToGuess": {
            "post": {
                "consumes": [
                    "application/json;charset=utf-8"
                ],
                "parameters": [
                    {
                        "in": "body",
                        "name": "body",
                        "required": true,
                        "schema": {
                            "$ref": "#/definitions/MintToGuessParams"
                        }
                    }
                ],
                "produces": [
                    "application/json;charset=utf-8"
                ],
                "responses": {
                    "200": {
                        "description": "",
                        "schema": {
                            "$ref": "#/definitions/UnsignedTxResponse"
                        }
                    },
                    "400": {
                        "description": "Invalid `body`"
                    }
                }
            }
        }
    },
    "swagger": "2.0"
}