{
    "childrenHasChildren": [
      {
        "label": "Dework PBL",
        "children": [
          {
            "label": "101",
            "subLabel": "Why Dework?",
            "href": "/modules/101/slts"
          },
          {
            "label": "201",
            "subLabel": "How to use Dework?",
            "href": "/modules/201/slts"
          },
          {
            "label": "301",
            "subLabel": "How to use Dework Effectively?",
            "href": "/modules/301/slts"
          }
        ]
      }
    ]
  }
