ID	Sample_or_Control	year_	yearsex	author	sex_observed	UR	LL	LR	UL	latit	longit	nestID	caught_time	capture_pair_Osex	cp_Osex_sameDay	cp_Osex_not_sDay	sex	capture_pair_Osex	DayTime	caught_date	diff_time	DeltaDiff_time	PairsDiffTime	CaputrePairNum	NestPairNumber	SumPair	PairDouble	EPY	EPYNest
X.2731_45031	True Sample	2019	2019M	AP	M	M	G	R	DB,W	71.323485	-156.674119	R308_19	01.06.19 14:36	CP01	CP02	CP02	M	CP02	14:36:00	01. Jun	-9	0	FALSE	1	2	3	7	Unknow	Yes
X.2731_45032	True Sample	2019	2019F	AP	F	M	G	W	O,DB	71.323485	-156.674119	R308_19	01.06.19 14:38	CP02	NA	CP01	F	CP01	14:38:00	01. Jun	-9	0	FALSE	2	2	4	7	Yes	Yes
X.2701_70816	True Sample	2019	2019F	JK	F	M	G	DB	DB,DB	71.324874	-156.626706	R318_19	01.06.19 17:18	CP02	CP02	CP02	F	CP02	17:18:00	01. Jun	-6	NA	NA	2	1	3	3	Unknow	Unknow
X.2731_45036	True Sample	2019	2019F	FS	F	M	G	DB,DB	O	71.323391	-156.673842	R211_19	02.06.19 09:14	CP03	CP04	CP04	F	CP04	09:14:00	02. Jun	-9	0	FALSE	1	2	3	7	Unknow	Unknow
X.2731_45037	True Sample	2019	2019M	FS	M	M	G	DB,Y	DB	71.323873	-156.672104	R211_19	02.06.19 09:45	CP04	NA	CP01	M	CP03	09:45:00	02. Jun	-9	0	FALSE	2	2	4	7	Unknow	Unknow
X.2731_45042	True Sample	2019	2019M	FS	M	M	G	G,O	R	71.323472	-156.632353	R322_19	02.06.19 17:28	CP04	CP04	CP04	M	CP04	17:28:00	02. Jun	-18	NA	NA	2	1	3	3	Unknow	Unknow
X.2731_45045	True Sample	2019	2019M	AP	M	M	G	Y,W	DB	71.323536	-156.629889	R401_19	03.06.19 15:00	CP05	NA	CP03	M	CP05	15:00:00	03. Jun	-5	0	FALSE	1	2	3	6	Unknow	Unknow
X.2731_45046	True Sample	2019	2019F	AP	F	M	G	G,O	DB	71.323994	-156.630579	R401_19	03.06.19 15:29	CP06	NA	CP05	F	CP06	15:29:00	03. Jun	-5	0	FALSE	1	2	3	6	Unknow	Unknow
X.2731_45050	True Sample	2019	2019F	FS	F	M	G	O,W	Y	71.323689	-156.642542	R201_19	04.06.19 14:04	CP07	CP07	CP03	F	CP07	14:04:00	04. Jun	-4	NA	NA	2	1	3	3	Unknow	Unknow
X.2731_45051	True Sample	2019	2019M	FS	M	M	G	Y,R	DB	71.323737	-156.629249	R307_19	04.06.19 15:08	CP07	CP07	CP05	M	CP07	15:08:00	04. Jun	-3	NA	NA	2	1	3	3	Unknow	Unknow
X.2731_45053	True Sample	2019	2019F	FS	F	M	G	W,O	R	71.323387	-156.628259	R306_19	04.06.19 15:43	CP08	NA	CP06	F	CP08	15:43:00	04. Jun	-3	8	TRUE	1	2	3	7	Unknow	Unknow
X.2731_45054	True Sample	2019	2019M	AP	M	M	G	G,Y	DB	71.32414	-156.640209	R212_19	05.06.19 09:52	CP09	CP09	CP06	M	CP09	09:52:00	05. Jun	-7	0	FALSE	2	2	4	8	Unknow	Yes
X.2731_45055	True Sample	2019	2019F	AP	F	M	G	R,G	R	71.324335	-156.639584	R212_19	05.06.19 10:10	CP10	CP10	CP07	F	CP10	10:10:00	05. Jun	-7	0	FALSE	2	2	4	8	Yes	Yes
X.2731_45056	True Sample	2019	2019M	AP	M	M	G	DB,G	DB	71.322986	-156.639862	R303_19	05.06.19 10:34	CP09	CP10	CP07	M	CP10	10:34:00	05. Jun	-4	4	TRUE	2	2	4	8	Unknow	Unknow
X.2701_70901	True Sample	2019	2019F	BK	F	M	G	DB,Y	R	71.32437	-156.641275	R206_19	05.06.19 10:35	CP10	CP09	CP08	F	CP09	10:35:00	05. Jun	-4	-4	TRUE	2	2	4	8	Yes	Yes
X.2701_70902	True Sample	2019	2019F	BK	F	M	G	DB,W	R	71.322871	-156.637687	R601_19	05.06.19 11:07	CP11	CP11	CP09	F	CP11	11:07:00	05. Jun	-3	0	FALSE	1	2	3	7	Unknow	Unknow
X.2701_70903	True Sample	2019	2019M	BK	M	M	G	W,R	R	71.322651	-156.636673	R601_19	05.06.19 11:27	CP12	NA	CP08	M	CP12	11:27:00	05. Jun	-3	0	FALSE	2	2	4	7	Unknow	Unknow
X.2731_45058	True Sample	2019	2019M	AP	M	M	G	O,Y	G	71.32399	-156.636555	R205_19	05.06.19 11:36	CP12	CP11	CP09	M	CP11	11:36:00	05. Jun	-3	4	TRUE	2	2	4	8	Unknow	Unknow
X.2701_70904	True Sample	2019	2019M	MV	M	M	G	W	DB,W	71.323604	-156.670934	R903_19	06.06.19 09:24	CP13	CP13	CP10	M	CP13	09:24:00	06. Jun	-7	0	FALSE	2	2	4	8	Unknow	Unknow
X.2701_70905	True Sample	2019	2019F	MV	F	M	G	Y,G	O	71.323043	-156.672349	R605_19	06.06.19 09:55	CP13	CP13	CP10	F	CP13	09:55:00	06. Jun	-10	-1	TRUE	2	2	4	8	Unknow	Unknow
X.2701_70907	True Sample	2019	2019M	MV	M	M	G	O,DB	G	71.322641	-156.675836	R202_19	06.06.19 14:15	CP14	CP14	CP11	M	CP14	14:15:00	06. Jun	-3	NA	NA	2	1	3	3	Unknow	Unknow
X.2701_70829	True Sample	2019	2019M	JK	M	M	G	W,R	O	71.323305	-156.67929	R404_19	06.06.19 14:22	CP14	CP15	CP12	M	CP15	14:22:00	06. Jun	-8	NA	NA	2	1	3	3	Unknow	Unknow
X.2731_45059	True Sample	2019	2019F	FS	F	M	G	G,R	Y	71.322618	-156.675513	R903_19	06.06.19 14:37	CP15	CP14	CP11	F	CP14	14:37:00	06. Jun	-7	0	FALSE	2	2	4	8	Unknow	Unknow
X.2701_70908	True Sample	2019	2019F	MV	F	M	G	O,R	W	71.323862	-156.672958	R801_19	06.06.19 17:57	CP15	CP15	CP12	F	CP15	17:57:00	06. Jun	-6	NA	NA	2	1	3	3	Unknow	Unknow
X.2701_70830	True Sample	2019	2019M	JK	M	M	G	O,O	DB	71.323822	-156.671572	R217_19	07.06.19 10:21	CP16	CP16	CP13	M	CP16	10:21:00	07. Jun	-8	NA	NA	2	1	3	3	Unknow	Unknow
X.2701_70831	True Sample	2019	2019M	JK	M	M	G	O,R	Y	71.323228	-156.670765	R409_19	07.06.19 10:53	CP16	CP16	CP14	M	CP16	10:53:00	07. Jun	-10	NA	NA	2	1	3	3	Unknow	Unknow
X.2731_45062	True Sample	2019	2019M	AP	M	M	G	O,DB	Y	71.322942	-156.670565	R605_19	07.06.19 10:55	CP17	CP17	CP15	M	CP17	10:55:00	07. Jun	-9	-1	TRUE	2	2	4	8	Unknow	Unknow
X.2701_70909	True Sample	2019	2019M	MV	M	M	G	W,O	Y	71.323355	-156.64063	R102_19	07.06.19 16:45	CP17	CP17	CP16	M	CP17	16:45:00	07. Jun	-10	NA	NA	2	1	3	3	Unknow	Unknow
X.2731_45103	True Sample	2019	2019M	KB	M	M	G	O,G	DB	71.322884	-156.637184	R405_19	07.06.19 17:31	CP18	CP18	CP17	M	CP18	17:31:00	07. Jun	-2	NA	NA	2	1	3	3	Unknow	Unknow
X.2731_45105	True Sample	2019	2019F	KB	F	M	G	R,O	DB	71.323299	-156.629633	R204_19	07.06.19 18:22	CP18	CP18	CP13	F	CP18	18:22:00	07. Jun	-3	NA	NA	2	1	3	3	Unknow	Unknow
X.2731_45106	True Sample	2019	2019M	KB	M	M	G	DB,O	Y	71.32513	-156.630609	R325_19	08.06.19 09:35	CP19	CP19	NA	M	CP19	09:35:00	08. Jun	-8	NA	NA	2	1	3	3	Unknow	Unknow
X.2701_70832	True Sample	2019	2019M	JK	M	M	G	R,DB	R	71.322777	-156.670576	R503_19	08.06.19 09:41	CP19	CP20	NA	M	CP20	09:41:00	08. Jun	-7	0	FALSE	2	2	4	8	Unknow	Unknow
X.2731_45063	True Sample	2019	2019F	FS	F	M	G	R,W	R	71.322777	-156.670576	R503_19	08.06.19 09:41	CP20	CP19	CP14	F	CP19	09:41:00	08. Jun	-7	0	FALSE	2	2	4	8	Unknow	Unknow
X.2701_70914	True Sample	2019	2019M	MV	M	M	G	W,W	G	71.324038	-156.631921	R220_19	08.06.19 10:48	CP20	CP21	NA	M	CP21	10:48:00	08. Jun	-7	-9	TRUE	2	2	4	8	Unknow	Yes
X.2731_45109	True Sample	2019	2019F	KB	F	M	G	R,G	W	71.324038	-156.631921	R220_19	08.06.19 11:00	CP21	CP20	CP15	F	CP20	11:00:00	08. Jun	2	-9	TRUE	2	2	4	8	Yes	Yes
X.2701_70916	True Sample	2019	2019F	MV	F	M	G	DB,G	R	71.322523	-156.629532	R215_19	08.06.19 11:34	CP21	CP21	CP16	F	CP21	11:34:00	08. Jun	-2	2	TRUE	2	2	4	8	Unknow	Yes
X.2701_70834	True Sample	2019	2019F	JK	F	M	G	G,G	O	71.321642	-156.639564	R224_19	08.06.19 12:41	CP22	CP22	CP17	F	CP22	12:41:00	08. Jun	-7	0	FALSE	2	2	4	8	Unknow	Unknow
X.2731_45065	True Sample	2019	2019M	FS	M	M	G	O,R	R	71.321642	-156.639564	R224_19	08.06.19 12:41	CP23	CP23	NA	M	CP23	12:41:00	08. Jun	-7	0	FALSE	2	2	4	8	Unknow	Unknow
X.2731_45066	True Sample	2019	2019M	FS	M	M	G	DB,W	Y	71.321642	-156.639564	R233_19	08.06.19 12:41	CP22	CP22	NA	M	CP22	12:41:00	08. Jun	-8	NA	NA	2	1	3	3	Unknow	Unknow
X.2731_45068	True Sample	2019	2019M	FS	M	M	G	Y,G	W	71.32157	-156.637177	R1101_19	08.06.19 14:20	CP23	CP23	NA	M	CP23	14:20:00	08. Jun	-8	NA	NA	2	1	3	3	Unknow	Unknow
X.2731_45112	True Sample	2019	2019M	KB	M	M	G	G,R	O	71.324311	-156.632215	R901_19	08.06.19 14:33	CP24	CP24	CP72	M	CP24	14:33:00	08. Jun	2	NA	NA	2	1	3	3	Unknow	Unknow
X.2731_45113	True Sample	2019	2019M	KB	M	M	G	DB,G	G	71.324966	-156.62909	R223_19	08.06.19 14:45	CP25	CP25	NA	M	CP25	14:45:00	08. Jun	-11	NA	NA	2	1	3	3	Unknow	Unknow
X.2731_45069	True Sample	2019	2019F	FS	F	M	G	Y,G	R	71.322242	-156.635412	R314_19	08.06.19 15:06	CP24	CP24	CP72	F	CP24	15:06:00	08. Jun	-7	0	FALSE	2	2	4	8	Unknow	Unknow
X.2701_70837	True Sample	2019	2019M	JK	M	M	G	R,O	G	71.322242	-156.635412	R314_19	08.06.19 15:08	CP25	CP25	CP71	M	CP25	15:08:00	08. Jun	-7	0	FALSE	2	2	4	8	Unknow	Unknow
X.2701_70925	True Sample	2019	2019F	MV	F	M	G	Y,O	DB	71.323867	-156.627657	R205_19	09.06.19 12:25	CP26	CP26	CP70	F	CP26	12:25:00	09. Jun	1	4	TRUE	2	2	4	8	Unknow	Unknow
X.2701_70926	True Sample	2019	2019F	MV	F	M	G	G,W	G	71.322266	-156.635692	R317_19	09.06.19 13:54	CP26	CP27	CP69	F	CP27	13:54:00	09. Jun	-8	0	FALSE	2	2	4	8	Unknow	Unknow
X.2731_45114	True Sample	2019	2019M	KB	M	M	G	W,G	G	71.322266	-156.635692	R317_19	09.06.19 13:59	CP27	CP26	CP70	M	CP26	13:59:00	09. Jun	-8	0	FALSE	2	2	4	8	Unknow	Unknow
X.2731_45070	True Sample	2019	2019F	AP	F	M	G	Y,DB	O	71.32471	-156.64163	R213_19	09.06.19 14:33	CP27	CP28	CP71	F	CP28	14:33:00	09. Jun	-6	0	FALSE	2	2	4	8	Unknow	Unknow
X.2731_45071	True Sample	2019	2019M	JK	M	M	G	O,DB	DB	71.32471	-156.64163	R213_19	09.06.19 14:33	CP28	CP27	CP69	M	CP27	14:33:00	09. Jun	-6	0	FALSE	2	2	4	8	Unknow	Unknow
X.2731_45072	True Sample	2019	2019M	AP	M	M	G	W,G	R	71.32471	-156.64163	R206_19	09.06.19 15:00	CP28	CP28	CP68	M	CP28	15:00:00	09. Jun	0	-4	TRUE	2	2	4	8	Yes	Yes
X.2731_45073	True Sample	2019	2019M	JK	M	M	G	O,Y	W	71.323132	-156.645267	R604_19	09.06.19 15:43	CP29	CP29	CP67	M	CP29	15:43:00	09. Jun	-4	0	FALSE	1	2	3	7	Yes	Yes
X.2731_45074	True Sample	2019	2019F	AP	F	M	G	Y,R	G	71.323132	-156.645267	R604_19	09.06.19 15:43	CP30	NA	CP68	F	CP30	15:43:00	09. Jun	-4	0	FALSE	2	2	4	7	Unknow	Yes
X.2701_70928	True Sample	2019	2019F	MV	F	M	G	R,DB	G	71.322858	-156.637508	R303_19	09.06.19 16:21	CP30	CP29	CP67	F	CP29	16:21:00	09. Jun	0	4	TRUE	2	2	4	8	Unknow	Unknow
X.2731_45076	True Sample	2019	2019F	FS	F	M	G	Y,R	W	71.322814	-156.664487	R603_19	10.06.19 09:22	CP31	CP31	CP66	F	CP31	09:22:00	10. Jun	-3	0	FALSE	2	2	4	8	Unknow	Unknow
X.2731_45077	True Sample	2019	2019M	FS	M	M	G	Y,Y	O	71.322814	-156.664487	R603_19	10.06.19 09:22	CP32	CP32	CP65	M	CP32	09:22:00	10. Jun	-3	0	FALSE	2	2	4	8	Unknow	Unknow
X.2701_70931	True Sample	2019	2019M	MV	M	M	G	DB,Y	Y	71.322505	-156.676925	R219_19	10.06.19 09:32	CP31	CP31	CP66	M	CP31	09:32:00	10. Jun	-6	0	FALSE	2	2	4	8	Unknow	Unknow
X.2731_45116	True Sample	2019	2019F	KB	F	M	G	O,G	Y	71.322505	-156.676925	R219_19	10.06.19 09:32	CP32	CP32	CP65	F	CP32	09:32:00	10. Jun	-6	0	FALSE	2	2	4	8	Unknow	Unknow
X.2701_70838	True Sample	2019	2019M	EK	M	M	G	DB,Y	W	71.321409	-156.657128	R215_19	10.06.19 09:45	CP33	CP33	CP64	M	CP33	09:45:00	10. Jun	0	2	TRUE	2	2	4	8	Yes	Yes
X.2701_70932	True Sample	2019	2019M	MV	M	M	G	DB,W	DB	71.322423	-156.675985	R226_19	10.06.19 09:50	CP33	CP34	CP63	M	CP34	09:50:00	10. Jun	-7	NA	NA	2	1	3	3	Unknow	Unknow
X.2701_70933	True Sample	2019	2019F	MV	F	M	G	O,R	DB	71.322739	-156.67742	R410_19	10.06.19 10:05	CP34	CP33	CP64	F	CP33	10:05:00	10. Jun	-5	NA	NA	2	1	3	3	Unknow	Unknow
X.2701_70839	True Sample	2019	2019F	JK	F	M	G	W,DB	Y	71.323534	-156.646693	R231_19	10.06.19 10:51	CP34	CP34	CP63	F	CP34	10:51:00	10. Jun	-5	0	FALSE	2	2	4	8	Unknow	Unknow
X.2701_70840	True Sample	2019	2019M	JK	M	M	G	G,W	R	71.323534	-156.646693	R231_19	10.06.19 10:51	CP35	CP35	CP62	M	CP35	10:51:00	10. Jun	-5	0	FALSE	2	2	4	8	Unknow	Unknow
X.2731_45080	True Sample	2019	2019F	FS	F	M	G	R,G	G	71.321321	-156.658506	R225_19	10.06.19 11:10	CP35	CP35	CP62	F	CP35	11:10:00	10. Jun	-5	0	FALSE	2	2	4	8	Unknow	Unknow
X.2701_70935	True Sample	2019	2019F	MV	F	M	G	O,R	O	71.321908	-156.674284	R320_19	10.06.19 11:12	CP36	CP36	CP61	F	CP36	11:12:00	10. Jun	1	8	TRUE	2	2	4	8	Unknow	Yes
X.2701_70936	True Sample	2019	2019F	MV	F	M	G	Y,W	O	71.32228	-156.672015	R408_19	10.06.19 11:21	CP36	CP37	CP60	F	CP37	11:21:00	10. Jun	-4	-8	TRUE	2	2	4	8	Unknow	Unknow
X.2731_45120	True Sample	2019	2019M	KB	M	M	G	R,DB	O	71.322346	-156.672393	REPH475_19	10.06.19 11:33	CP37	CP36	CP61	M	CP36	11:33:00	10. Jun	-7	0	FALSE	2	2	4	8	Unknow	Unknow
X.2731_45081	True Sample	2019	2019M	FS	M	M	G	G,Y	R	71.321546	-156.656637	R225_19	10.06.19 11:35	CP37	CP37	CP60	M	CP37	11:35:00	10. Jun	-5	0	FALSE	2	2	4	8	Unknow	Unknow
X.2701_70937	True Sample	2019	2019F	MV	F	M	G	W,W	Y	71.322346	-156.672393	REPH475_19	10.06.19 11:36	CP38	CP38	CP59	F	CP38	11:36:00	10. Jun	-7	0	FALSE	2	2	4	8	Unknow	Unknow
X.2731_45082	True Sample	2019	2019M	FS	M	M	G	W,Y	G	71.321306	-156.657008	R207_19	10.06.19 12:03	CP38	CP38	CP59	M	CP38	12:03:00	10. Jun	-1	0	FALSE	2	2	4	8	Unknow	Unknow
X.2731_45121	True Sample	2019	2019F	KB	F	M	G	R,R	R	71.321306	-156.657008	R207_19	10.06.19 12:03	CP39	CP39	CP58	F	CP39	12:03:00	10. Jun	-1	0	FALSE	2	2	4	8	Unknow	Unknow
X.2731_45122	True Sample	2019	2019M	KB	M	M	G	O,O	W	71.321623	-156.650619	R227_19	10.06.19 13:26	CP39	CP39	CP58	M	CP39	13:26:00	10. Jun	-6	0	FALSE	2	2	4	8	Unknow	Unknow
X.2731_45123	True Sample	2019	2019F	KB	F	M	G	R,Y	R	71.321623	-156.650619	R227_19	10.06.19 13:26	CP40	CP40	CP57	F	CP40	13:26:00	10. Jun	-6	0	FALSE	2	2	4	8	Unknow	Unknow
X.2731_45124	True Sample	2019	2019M	KB	M	M	G	DB,Y	O	71.32181	-156.65168	R209_19	10.06.19 13:37	CP40	CP40	CP57	M	CP40	13:37:00	10. Jun	-2	0	FALSE	2	2	4	7	Unknow	Unknow
X.2731_45125	True Sample	2019	2019F	KB	F	M	G	W,DB	O	71.32181	-156.65168	R209_19	10.06.19 13:37	CP41	NA	CP55	F	CP41	13:37:00	10. Jun	-2	0	FALSE	1	2	3	7	Unknow	Unknow
X.2701_70938	True Sample	2019	2019M	MV	M	M	G	R,R	G	71.321929	-156.661876	R320_19	11.06.19 16:03	CP42	CP42	CP56	M	CP42	16:03:00	11. Jun	-7	8	TRUE	2	2	4	8	Yes	Yes
X.2701_70940	True Sample	2019	2019F	MV	F	M	G	W,O	W	71.322382	-156.646947	R611_19	11.06.19 17:30	CP42	CP42	CP56	F	CP42	17:30:00	11. Jun	-12	0	FALSE	2	2	4	7	Unknow	Unknow
X.2701_70941	True Sample	2019	2019M	MV	M	M	G	Y,R	Y	71.322382	-156.646947	R611_19	11.06.19 18:00	CP43	NA	CP55	M	CP43	18:00:00	11. Jun	-12	0	FALSE	1	2	3	7	Unknow	Unknow
X.2701_70942	True Sample	2019	2019F	MV	F	M	G	Y,DB	G	71.323421	-156.661753	R218_19	12.06.19 09:20	CP44	CP45	CP53	F	CP45	09:20:00	12. Jun	1	0	FALSE	2	2	4	8	Unknow	Unknow
X.2731_45126	True Sample	2019	2019M	KB	M	M	G	G,G	G	71.323421	-156.661753	R218_19	12.06.19 09:25	CP45	CP44	CP54	M	CP44	09:25:00	12. Jun	1	0	FALSE	2	2	4	8	Unknow	Unknow
X.2701_70943	True Sample	2019	2019F	MV	F	M	G	Y,Y	W	71.321817	-156.663512	R910_19	12.06.19 09:46	CP44	CP44	CP54	F	CP44	09:46:00	12. Jun	-5	0	FALSE	2	2	4	8	Unknow	Unknow
X.2731_45127	True Sample	2019	2019M	KB	M	M	G	G,O	G	71.321956	-156.658005	R234_19	12.06.19 10:00	CP45	CP45	CP53	M	CP45	10:00:00	12. Jun	-5	NA	NA	2	1	3	3	Unknow	Unknow
X.2701_70944	True Sample	2019	2019M	MV	M	M	G	Y,W	G	71.321817	-156.663512	R910_19	12.06.19 10:12	CP46	CP46	CP52	M	CP46	10:12:00	12. Jun	-5	0	FALSE	2	2	4	8	Unknow	Unknow
X.2731_45086	True Sample	2019	2019M	AP	M	M	G	O,G	G	71.324206	-156.66458	R214_19	12.06.19 10:28	CP46	CP47	CP51	M	CP47	10:28:00	12. Jun	-2	-6	TRUE	2	2	4	8	Unknow	Unknow
X.2731_45087	True Sample	2019	2019F	AP	F	M	G	G,Y	Y	71.324206	-156.66458	R602_19	12.06.19 10:56	CP47	CP46	CP52	F	CP46	10:56:00	12. Jun	0	-3	TRUE	2	2	4	8	Unknow	Unknow
X.2701_70947	True Sample	2019	2019M	MV	M	M	G	DB,DB	R	71.322933	-156.648001	R911_19	12.06.19 11:29	CP48	CP48	CP50	M	CP48	11:29:00	12. Jun	-8	NA	NA	2	1	3	3	Unknow	Unknow
X.2731_45088	True Sample	2019	2019F	AP	F	M	G	DB,R	DB	71.324206	-156.66458	R309_19	12.06.19 11:36	CP47	CP47	CP51	F	CP47	11:36:00	12. Jun	0	0	FALSE	2	2	4	8	Unknow	Unknow
X.2731_45089	True Sample	2019	2019M	AP	M	M	G	W,Y	R	71.324206	-156.66458	R309_19	12.06.19 11:36	CP48	CP49	CP49	M	CP49	11:36:00	12. Jun	0	0	FALSE	2	2	4	8	Unknow	Unknow
X.2701_70846	True Sample	2019	2019M	JK	M	M	G	O,G	O	71.325427	-156.633169	R301_19	12.06.19 13:24	CP49	CP50	CP48	M	CP50	13:24:00	12. Jun	7	NA	NA	2	1	3	3	Unknow	Unknow
X.2731_45090	True Sample	2019	2019F	AP	F	M	G	O,Y	DB	71.324206	-156.66458	R305_19	12.06.19 14:11	CP49	CP48	CP50	F	CP48	14:11:00	12. Jun	-1	NA	NA	2	1	3	3	Yes	Yes
X.2731_45091	True Sample	2019	2019M	AP	M	M	G	O,Y	R	71.324206	-156.66458	R229_19	12.06.19 14:11	CP50	CP51	CP47	M	CP51	14:11:00	12. Jun	-1	7	TRUE	2	2	4	8	Unknow	Unknow
X.2731_45131	True Sample	2019	2019F	KB	F	M	G	Y,Y	R	71.321221	-156.639989	R221_19	12.06.19 14:25	CP50	CP49	CP49	F	CP49	14:25:00	12. Jun	-3	NA	NA	2	1	3	3	Yes	Yes
X.2701_70951	True Sample	2019	2019F	MV	F	M	G	R,W	G	71.322863	-156.637666	R904_19	12.06.19 15:15	CP51	CP50	CP48	F	CP50	15:15:00	12. Jun	-3	NA	NA	2	1	3	3	Unknow	Unknow
X.2701_70952	True Sample	2019	2019M	MV	M	M	G	Y,O	O	71.322517	-156.637284	R306_19	12.06.19 15:43	CP52	CP52	CP46	M	CP52	15:43:00	12. Jun	5	8	TRUE	2	2	4	7	Unknow	Unknow
X.2731_45094	True Sample	2019	2019F	AP	F	M	G	O,W	DB	71.324206	-156.66458	R407_19	12.06.19 16:02	CP51	CP51	CP47	F	CP51	16:02:00	12. Jun	-3	0	FALSE	2	2	4	8	Unknow	Unknow
X.2731_45095	True Sample	2019	2019M	AP	M	M	G	DB,O	DB	71.324206	-156.66458	R407_19	12.06.19 16:21	CP52	CP52	CP45	M	CP52	16:21:00	12. Jun	-3	0	FALSE	2	2	4	8	Unknow	Unknow
X.2731_45097	True Sample	2019	2019F	FS	F	M	G	R,O	W	71.311906	-156.658334	R310_19	13.06.19 17:58	CP53	NA	CP46	F	CP53	17:58:00	Jun 13	0	NA	NA	1	1	2	2	Unknow	Unknow
X.2731_45098	True Sample	2019	2019F	AP	F	M	G	W,W	O	71.321835	-156.655633	R229_19	14.06.19 09:47	CP54	CP54	CP45	F	CP54	09:47:00	Jun 14	-8	7	TRUE	2	2	4	8	Unknow	Unknow
X.2731_45099	True Sample	2019	2019F	AP	F	M	G	W,G	Y	71.319532	-156.650449	R802_19	14.06.19 11:07	CP54	CP54	CP44	F	CP54	11:07:00	Jun 14	-1	1	TRUE	2	2	4	8	Unknow	Unknow
X.2701_70969	True Sample	2019	2019M	MV	M	M	G	O,P	R	71.313724	-156.654643	R312_19	14.06.19 11:52	CP55	CP55	CP44	M	CP55	11:52:00	Jun 14	-3	0	FALSE	2	2	4	8	Unknow	Unknow
X.2731_45136	True Sample	2019	2019F	KB	F	M	G	G,P	Y	71.313724	-156.654643	R312_19	14.06.19 11:52	CP56	CP56	CP43	F	CP56	11:52:00	Jun 14	-3	0	FALSE	2	2	4	8	Unknow	Unknow
X.2731_45137	True Sample	2019	2019F	KB	F	M	G	P,O	DB	71.313623	-156.656055	R703_19	14.06.19 13:20	CP55	CP55	CP42	F	CP55	13:20:00	Jun 14	-6	0	FALSE	2	2	4	8	Unknow	Unknow
X.2731_45138	True Sample	2019	2019M	KB	M	M	G	P,Y	P	71.313623	-156.656055	R703_19	14.06.19 13:20	CP56	CP56	CP43	M	CP56	13:20:00	Jun 14	-6	0	FALSE	2	2	4	8	Unknow	Unknow
X.2701_70970	True Sample	2019	2019F	MV	F	M	G	Y,P	W	71.313702	-156.654759	R905_19	14.06.19 13:34	CP57	CP57	CP41	F	CP57	13:34:00	Jun 14	1	0	FALSE	2	2	4	8	Unknow	Unknow
X.2731_45139	True Sample	2019	2019M	KB	M	M	G	P,P	R	71.313702	-156.654759	R905_19	14.06.19 13:34	CP58	CP58	CP42	M	CP58	13:34:00	Jun 14	1	0	FALSE	2	2	4	8	Unknow	Unknow
X.2701_70971	True Sample	2019	2019M	MV	M	M	G	Y,P	O	71.314033	-156.656254	R907_19	14.06.19 14:15	CP57	CP57	CP41	M	CP57	14:15:00	Jun 14	-5	-8	TRUE	2	2	4	8	Unknow	Unknow
X.2731_45140	True Sample	2019	2019F	KB	F	M	G	R,W	P	71.314033	-156.656254	R907_19	14.06.19 14:15	CP58	CP58	CP40	F	CP58	14:15:00	Jun 14	3	-8	TRUE	2	2	4	8	Unknow	Unknow
X.2731_45100	True Sample	2019	2019F	AP	F	M	G	W,G	W	71.321438	-156.636659	R316_19	14.06.19 15:16	CP59	CP59	CP39	F	CP59	15:16:00	Jun 14	-1	0	FALSE	2	2	4	8	Unknow	Unknow
X.2731_45201	True Sample	2019	2019M	AP	M	M	G	R	O,O	71.321438	-156.636659	R316_19	14.06.19 15:16	CP60	CP60	CP40	M	CP60	15:16:00	Jun 14	-1	0	FALSE	2	2	4	8	Unknow	Unknow
X.2731_45202	True Sample	2019	2019M	AP	M	M	G	O	W,DB	71.32165	-156.636902	R706_19	14.06.19 15:39	CP59	CP59	CP39	M	CP59	15:39:00	Jun 14	1	0	FALSE	2	2	4	8	Unknow	Unknow
X.2731_45203	True Sample	2019	2019F	AP	F	M	G	DB	W,O	71.32165	-156.636902	R706_19	14.06.19 15:39	CP61	CP61	CP38	F	CP61	15:39:00	Jun 14	1	0	FALSE	2	2	4	8	Unknow	Unknow
X.2701_70974	True Sample	2019	2019F	MV	F	M	G	P,DB	DB	71.321845	-156.655145	R411_19	14.06.19 17:24	CP60	CP60	CP37	F	CP60	17:24:00	Jun 14	0	0	FALSE	2	2	4	8	Unknow	Unknow
X.2701_70975	True Sample	2019	2019M	MV	M	M	G	P,R	W	71.321845	-156.655145	R411_19	14.06.19 17:24	CP61	CP61	CP38	M	CP61	17:24:00	Jun 14	0	0	FALSE	2	2	4	8	Unknow	Unknow
X.2701_70847	True Sample	2019	2019M	JK	M	M	G	Y,W	W	71.321544	-156.670175	R504_19	15.06.19 10:36	CP62	CP62	NA	M	CP62	10:36:00	Jun 15	-3	0	FALSE	2	2	4	8	Unknow	Unknow
X.2701_70848	True Sample	2019	2019F	JK	F	M	G	O,DB	O	71.321544	-156.670175	R504_19	15.06.19 10:36	CP63	CP63	CP36	F	CP63	10:36:00	Jun 15	-3	0	FALSE	2	2	4	8	Unknow	Unknow
X.2701_70976	True Sample	2019	2019M	MV	M	M	G	P,R	Y	71.318673	-156.652708	R802_19	15.06.19 10:47	CP62	CP64	CP37	M	CP64	10:47:00	Jun 15	0	1	TRUE	2	2	4	8	Unknow	Unknow
X.2731_45141	True Sample	2019	2019M	AC	M	M	G	G,DB	P	71.316599	-156.64911	R602_19	15.06.19 10:57	CP63	CP63	CP36	M	CP63	10:57:00	Jun 15	3	-3	TRUE	2	2	4	8	Unknow	Unknow
X.2701_70979	True Sample	2019	2019F	MV	F	M	G	DB,P	P	71.317612	-156.654742	R608_19	15.06.19 11:53	CP64	CP62	CP34	F	CP62	11:53:00	Jun 15	-1	0	FALSE	2	2	4	8	Unknow	Unknow
X.2731_45144	True Sample	2019	2019F	AC	F	M	G	P,W	O	71.321305	-156.636036	R208_19	15.06.19 14:43	CP64	CP64	CP35	F	CP64	14:43:00	Jun 15	1	0	FALSE	2	2	4	8	Unknow	Unknow
X.2701_70982	True Sample	2019	2019M	MV	M	M	G	G,R	G	71.314286	-156.656298	R608_19	15.06.19 15:32	CP65	CP65	CP35	M	CP65	15:32:00	Jun 15	-1	0	FALSE	2	2	4	8	Unknow	Unknow
X.2701_70852	True Sample	2019	2019M	JK	M	M	G	W,W	W	71.320709	-156.636531	R208_19	15.06.19 17:30	CP66	CP66	CP34	M	CP66	17:30:00	Jun 15	1	0	FALSE	2	2	4	8	Unknow	Unknow
X.2701_70853	True Sample	2019	2019F	JK	F	M	G	DB,W	O	71.320742	-156.642033	R914_19	15.06.19 18:13	CP65	CP65	CP33	F	CP65	18:13:00	Jun 15	-8	0	FALSE	2	2	4	8	Unknow	Unknow
X.2701_70854	True Sample	2019	2019M	EK	M	M	G	Y,R	R	71.320742	-156.642033	R914_19	15.06.19 18:13	CP66	CP66	NA	M	CP66	18:13:00	Jun 15	-8	0	FALSE	2	2	4	8	Unknow	Unknow
X.2701_70983	True Sample	2019	2019M	MV	M	M	G	W,P	W	71.320517	-156.635275	R403_19	16.06.19 12:06	CP67	NA	NA	M	CP67	12:06:00	Jun 16	3	NA	NA	1	1	2	2	Unknow	Unknow
X.2701_70984	True Sample	2019	2019F	MV	F	M	G	DB,O	P	71.318167	-156.647382	R607_19	16.06.19 15:40	CP68	CP68	CP32	F	CP68	15:40:00	Jun 16	-1	-4	TRUE	2	2	4	8	Unknow	Unknow
X.2731_45145	True Sample	2019	2019M	AC	M	M	G	W,P	P	71.312998	-156.661533	R216_19	16.06.19 16:13	CP68	CP68	CP33	M	CP68	16:13:00	Jun 16	4	NA	NA	2	1	3	3	Unknow	Unknow
X.2731_45214	True Sample	2019	2019F	AP	F	M	G	DB,G	P	71.314781	-156.65489	R609_19	17.06.19 11:33	CP69	CP69	CP31	F	CP69	11:33:00	Jun 17	-1	0	FALSE	2	2	4	8	Unknow	Unknow
X.2731_45215	True Sample	2019	2019M	AP	M	M	G	P,R	P	71.314781	-156.65489	R609_19	17.06.19 11:33	CP70	CP70	CP32	M	CP70	11:33:00	Jun 17	-1	0	FALSE	2	2	4	8	Unknow	Unknow
X.2731_45216	True Sample	2019	2019M	AP	M	M	G	Y,P	R	71.312138	-156.662899	R912_19	17.06.19 13:58	CP69	CP69	CP31	M	CP69	13:58:00	Jun 17	-2	0	FALSE	2	2	4	8	Unknow	Unknow
X.2731_45217	True Sample	2019	2019F	AP	F	M	G	P,O	G	71.312138	-156.662899	R912_19	17.06.19 13:58	CP70	CP70	CP30	F	CP70	13:58:00	Jun 17	-2	0	FALSE	2	2	4	8	Unknow	Unknow
X.2731_45218	True Sample	2019	2019F	AP	F	M	G	P,DB	G	71.3114	-156.661203	R908_19	17.06.19 14:53	CP71	CP71	CP29	F	CP71	14:53:00	Jun 17	-1	NA	NA	2	1	3	3	Unknow	Unknow
X.2701_70985	True Sample	2019	2019M	MV	M	M	G	O,R	P	71.31759	-156.64573	R906_19	17.06.19 15:26	CP71	CP71	CP30	M	CP71	15:26:00	Jun 17	1	0	FALSE	2	2	4	7	Unknow	Unknow
X.2701_70986	True Sample	2019	2019F	MV	F	M	G	W,Y	P	71.31759	-156.64573	R906_19	17.06.19 15:26	CP72	NA	CP28	F	CP72	15:26:00	Jun 17	1	0	FALSE	1	2	3	7	Unknow	Unknow
X.2731_45222	True Sample	2019	2019M	FS	M	M	G	P,DB	O	71.325497	-156.633317	R606_19	18.06.19 12:00	CP73	NA	CP29	M	CP73	12:00:00	Jun 18	7	NA	NA	1	1	2	2	Yes	Yes
X.2731_45147	True Sample	2019	2019F	AC	F	M	G	P,G	P	71.3194	-156.646133	R214_19	18.06.19 14:22	CP74	CP74	CP27	F	CP74	14:22:00	Jun 18	4	-6	TRUE	2	2	4	8	Unknow	Unknow
X.2701_70988	True Sample	2019	2019M	MV	M	M	G	G,O	P	71.321193	-156.664338	R408_19	18.06.19 16:50	CP74	CP74	CP28	M	CP74	16:50:00	Jun 18	4	-8	TRUE	2	2	4	8	Unknow	Unknow
X.2731_45223	True Sample	2019	2019M	AP	M	M	G	P,R	R	71.322203	-156.629411	R315_19	19.06.19 14:03	CP75	CP75	NA	M	CP75	14:03:00	Jun 19	5	NA	NA	2	1	3	3	Unknow	Unknow
X.2731_45224	True Sample	2019	2019M	AP	M	M	G	W,P	O	71.321459	-156.637139	R702_19	19.06.19 14:36	CP75	NA	NA	M	CP76	14:36:00	Jun 19	8	NA	NA	2	1	3	3	Unknow	Unknow
X.2731_45225	True Sample	2019	2019F	AP	F	M	G	P,O	Y	71.319397	-156.640314	R412_19	19.06.19 15:30	CP76	CP75	CP26	F	CP75	15:30:00	Jun 19	-3	NA	NA	1	1	2	2	Unknow	Unknow
X.2731_45150	True Sample	2019	2019M	AC	M	M	G	G,P	P	71.317244	-156.646756	R607_19	20.06.19 11:56	CP77	CP78	CP27	M	CP78	11:56:00	Jun 20	3	-4	TRUE	2	2	4	8	Unknow	Unknow
X.2701_70992	True Sample	2019	2019M	MV	M	M	G	W,G	P	71.325889	-156.643993	R612_19	20.06.19 14:07	CP77	CP77	CP26	M	CP77	14:07:00	Jun 20	-1	0	FALSE	2	2	4	8	Unknow	Unknow
X.2701_70993	True Sample	2019	2019F	MV	F	M	G	G,P	W	71.325889	-156.643993	R612_19	20.06.19 14:07	CP78	CP78	CP25	F	CP78	14:07:00	Jun 20	-1	0	FALSE	2	2	4	8	Unknow	Unknow
X.2731_45229	True Sample	2019	2019F	FS	F	M	G	G,P	G	71.31277	-156.659806	R909_19	20.06.19 14:19	CP78	CP77	CP24	F	CP77	14:19:00	Jun 20	7	NA	NA	2	1	3	3	Yes	Yes
X.2731_45230	True Sample	2019	2019F	AP	F	M	G	O,Y	P	71.32246	-156.637829	R705_19	21.06.19 10:28	CP79	CP79	CP23	F	CP79	10:28:00	Jun 21	0	0	FALSE	2	2	4	8	Unknow	Unknow
X.2731_45231	True Sample	2019	2019M	AP	M	M	G	DB,Y	P	71.32246	-156.637829	R705_19	21.06.19 10:28	CP80	CP80	CP25	M	CP80	10:28:00	Jun 21	0	0	FALSE	2	2	4	8	Unknow	Unknow
X.2731_45232	True Sample	2019	2019M	AP	M	M	G	Y,W	P	71.32825	-156.641975	R915_19	21.06.19 12:29	CP79	CP79	CP24	M	CP79	12:29:00	Jun 21	6	NA	NA	2	1	3	3	Unknow	Unknow
X.2731_45234	True Sample	2019	2019M	AP	M	M	G	O,P	G	71.328309	-156.642308	R610_19	21.06.19 14:54	CP80	CP80	CP23	M	CP80	14:54:00	Jun 21	3	NA	NA	2	1	3	3	Unknow	Unknow
X.2731_45237	True Sample	2019	2019F	FS	F	M	G	R,R	P	71.322846	-156.6302	R413_19	22.06.19 10:50	CP81	NA	CP22	F	CP81	10:50:00	Jun 22	0	0	FALSE	1	2	3	6	Unknow	Unknow
X.2731_45238	True Sample	2019	2019M	FS	M	M	G	R,P	G	71.322846	-156.6302	R413_19	22.06.19 10:50	CP82	NA	CP21	M	CP82	10:50:00	Jun 22	0	0	FALSE	1	2	3	6	Unknow	Unknow
X.2731_45151	True Sample	2019	2019M	KB	M	M	G	W,O	P	71.321639	-156.665923	R228_19	23.06.19 09:53	CP83	NA	CP22	M	CP83	09:53:00	Jun 23	1	0	FALSE	2	2	4	8	Unknow	Yes
X.2731_45152	True Sample	2019	2019F	KB	F	M	G	P,R	DB	71.321038	-156.667057	R228_19	23.06.19 10:10	CP84	CP84	CP21	F	CP84	10:10:00	Jun 23	1	0	FALSE	2	2	4	8	Yes	Yes
X.2731_45153	True Sample	2019	2019M	KB	M	M	G	R,DB	P	71.315618	-156.651304	R1002_19	23.06.19 14:49	CP83	CP85	CP20	M	CP85	14:49:00	Jun 23	10	NA	NA	2	1	3	3	Unknow	Unknow
X.2731_45240	True Sample	2019	2019M	AP	M	M	G	P,P	W	71.323919	-156.6285	R230_19	23.06.19 15:39	CP84	CP84	CP19	M	CP84	15:39:00	Jun 23	-6	0	FALSE	2	2	4	7	Unknow	Unknow
X.2731_45241	True Sample	2019	2019F	AP	F	M	G	W,DB	P	71.323919	-156.6285	R230_19	23.06.19 15:39	CP85	CP85	CP20	F	CP85	15:39:00	Jun 23	-6	0	FALSE	1	2	3	7	Unknow	Unknow
X.2701_70999	True Sample	2019	2019F	MV	F	M	G	P,W	DB	71.312963	-156.662331	R505_19	25.06.19 14:49	CP86	CP86	CP18	F	CP86	14:49:00	Jun 25	2	NA	NA	2	1	3	3	Unknow	Unknow
X.2701_71000	True Sample	2019	2019F	MV	F	M	G	DB,W	P	71.319177	-156.63855	R1003_19	25.06.19 15:39	CP86	NA	CP19	F	CP87	15:39:00	Jun 25	-1	0	FALSE	2	2	4	7	Unknow	Unknow
X.2731_45301	True Sample	2019	2019M	MV	M	M	G	P,Y	G	71.319177	-156.63855	R1003_19	25.06.19 15:39	CP87	CP86	CP18	M	CP86	15:39:00	Jun 25	-1	0	FALSE	1	2	3	7	Unknow	Unknow
X.neg1	Control	2019	NA	NA	NA	NA	NA	NA	NA	NA	NA	NA	NA	NA	NA	NA	NA	NA	NA	NA	NA	NA	NA	NA	4	4	NA	Unknow	Unknow
X.neg2	Control	2019	NA	NA	NA	NA	NA	NA	NA	NA	NA	NA	NA	NA	NA	NA	NA	NA	NA	NA	NA	NA	NA	NA	4	4	NA	Unknow	Unknow
X.neg3	Control	2019	NA	NA	NA	NA	NA	NA	NA	NA	NA	NA	NA	NA	NA	NA	NA	NA	NA	NA	NA	NA	NA	NA	4	4	NA	Unknow	Unknow
X.neg4	Control	2019	NA	NA	NA	NA	NA	NA	NA	NA	NA	NA	NA	NA	NA	NA	NA	NA	NA	NA	NA	NA	NA	NA	4	4	NA	Unknow	Unknow
