nome;telefone;email;credito;emprestado;cpf;peso;altura;cnpj;inscricao;ano
Carlos;41 3434-3434;carlos@email.com;5000.0;4000.0;12345678;70.0;170.0;;;
Amazon;41 5555-3434;amazon@email.com;;;;3453545;343343;2001
