{
  "applications": ["matrix"],
  "changelogDate": "20231024132252",
  "documentation": "@author Geucimar\\n@version 1.0\\n@created 19-out-2023 16:48:38",
  "entityTableName": "modalidade",
  "fields": [
    {
      "fieldName": "id",
      "fieldType": "String"
    },
    {
      "fieldName": "nome",
      "fieldType": "String"
    }
  ],
  "name": "Modalidade",
  "relationships": [],
  "searchEngine": "no"
}
