<?xml version="1.0" encoding="utf-8"?>
<!-- Generator: Adobe Illustrator 16.0.0, SVG Export Plug-In . SVG Version: 6.00 Build 0)  -->
<!DOCTYPE svg PUBLIC "-//W3C//DTD SVG 1.1//EN" "http://www.w3.org/Graphics/SVG/1.1/DTD/svg11.dtd">
<svg version="1.1" id="Layer_1" focusable="false" xmlns="http://www.w3.org/2000/svg" xmlns:xlink="http://www.w3.org/1999/xlink"
	 x="0px" y="0px" width="841.89px" height="595.281px" viewBox="0 0 841.89 595.281" enable-background="new 0 0 841.89 595.281"
	 xml:space="preserve">
<path fill="#AD2323" d="M409.202,297.756c-5.813-18.603-5.697-54.528-2.326-54.528C416.643,243.228,415.713,286.13,409.202,297.756z
	 M407.226,352.634c-8.953,23.484-20.114,50.342-33.02,72.898c21.276-8.139,45.344-19.998,73.131-25.463
	C432.572,388.91,418.387,372.865,407.226,352.634L407.226,352.634z M297.819,497.734c0,0.93,15.347-6.279,40.577-46.74
	C330.606,458.32,304.563,479.48,297.819,497.734z M486.054,186.025h158.121v381.352c0,15.463-12.441,27.904-27.904,27.904H225.619
	c-15.463,0-27.904-12.441-27.904-27.904V27.904C197.715,12.44,210.155,0,225.619,0H458.15v158.121
	C458.15,173.468,470.707,186.025,486.054,186.025z M476.751,385.769c-23.252-14.184-38.715-33.717-49.645-62.551
	c5.232-21.51,13.486-54.18,7.209-74.642c-5.465-34.182-49.297-30.811-55.576-7.906c-5.813,21.277-0.465,51.273,9.417,89.525
	c-13.487,32.09-33.368,75.107-47.436,99.756c-0.116,0-0.116,0.115-0.233,0.115c-31.508,16.162-85.571,51.738-63.365,79.061
	c6.511,8.023,18.603,11.627,24.997,11.627c20.812,0,41.507-20.928,71.039-71.852c29.997-9.883,62.9-22.207,91.85-26.975
	c25.23,13.721,54.762,22.672,74.41,22.672c33.949,0,36.275-37.205,22.904-50.459C546.164,378.328,499.191,382.863,476.751,385.769z
	 M636.037,122.079L522.095,8.139C516.865,2.907,509.771,0,502.332,0h-6.977v148.82h148.82v-7.092
	C644.175,134.403,641.269,127.311,636.037,122.079z M549.884,418.906c4.766-3.141-2.908-13.836-49.762-10.465
	C543.255,426.812,549.884,418.906,549.884,418.906z"/>
</svg>
