D:\GitLab\MinhasAulas\2018\Corporativos\ModuloPessoas\src\test\java\br\edu\up\app\AppPessoasUnitTests.java
D:\GitLab\MinhasAulas\2018\Corporativos\ModuloPessoas\src\test\java\br\edu\up\app\WsPessoasUnitTests.java
D:\GitLab\MinhasAulas\2018\Corporativos\ModuloPessoas\src\test\java\br\edu\up\app\WsClienteUnitTests.java
