^C:\TEMP\EXEMPLOS\REVISAOAVALIACAO\TELAS\PROPERTIES\RESOURCES.RESX|C:\TEMP\EXEMPLOS\REVISAOAVALIACAO\TELAS\TELADEDETALHES.RESX|C:\TEMP\EXEMPLOS\REVISAOAVALIACAO\TELAS\TELADELISTAGEM.RESX
C:\TEMP\EXEMPLOS\REVISAOAVALIACAO\TELAS\OBJ\X86\DEBUG\TELAS.PROPERTIES.RESOURCES.RESOURCES
C:\TEMP\EXEMPLOS\REVISAOAVALIACAO\TELAS\OBJ\X86\DEBUG\TELAS.TELADEDETALHES.RESOURCES
C:\TEMP\EXEMPLOS\REVISAOAVALIACAO\TELAS\OBJ\X86\DEBUG\TELAS.TELADELISTAGEM.RESOURCES
