^E:\UP\C#\EXERCICIOS\EXERCICIO_MEDIAS\EXERCICIO_MEDIAS\FORM1.RESX|E:\UP\C#\EXERCICIOS\EXERCICIO_MEDIAS\EXERCICIO_MEDIAS\PROPERTIES\RESOURCES.RESX
E:\UP\C#\EXERCICIOS\EXERCICIO_MEDIAS\EXERCICIO_MEDIAS\OBJ\DEBUG\EXERCICIO_MEDIAS.FRMMEDIAS.RESOURCES
E:\UP\C#\EXERCICIOS\EXERCICIO_MEDIAS\EXERCICIO_MEDIAS\OBJ\DEBUG\EXERCICIO_MEDIAS.PROPERTIES.RESOURCES.RESOURCES
