^E:\UP\C#\EXERCICIOS\EXERCICIO_MEDIAS\EXERCICIO_MEDIAS\PROPERTIES\RESOURCES.RESX
C:\WINDOWS\MICROSOFT.NET\FRAMEWORK\V2.0.50727\CONFIG\SECURITY.CONFIG
^E:\UP\C#\EXERCICIOS\EXERCICIO_MEDIAS\EXERCICIO_MEDIAS\FORM1.RESX
C:\WINDOWS\MICROSOFT.NET\FRAMEWORK\V2.0.50727\CONFIG\SECURITY.CONFIG
