81680000000892834332014022899201484102680001
81610000005670634332014022899201484083422010
81620000006198734332014031099201489053692000
81600000002355034332014022899201489047850000
81670000000569034332014022899201484068371001
81660000000713134332014022899201487006523000
81680000011440534332014022899201489036357027
81690000000346334332014022899201484079214004
81680000019436234332014022899201484082690012
81620000001752934332014022899201484078904021
81620000003813134332014022899201484079376027
81640000000662234332014022899201489053077000
81670000000363634332014022899201484085133013
81650000005275634332014022804303133002172062
81610000000488634332014022804404201303341410
81610000000694034332014022899201484093347025
81660000001020834332014022899201484085830008
81640000000851934332014031099201489053092001
81640000000828634332014022899201484093094025
81620000000839034332014022899201489039975000
81600000000390134332014022899201484089207007
81670000006639334332014022899201489036370008
81680000000341334332014031099201489053054001
81610000001072134332014022899201489054515011
81690000000624734332014022899201484083542014
81630000001440034332014022899201484078771021
81650000003704634332014031099201491016808000
81690000002254934332014031099201489038002001
81670000000610534332014022804303132212665572
81610000007242134332014022899201489045246000
81640000000249934332014022899201435008281000
81640000001298034332014022804303125212665572
81650000002477234332014022899201484085697008
81620000000733534332014022899201484062855001
81610000000790734332014022899201484092105017
81660000004778534332014022804303128005446672
81650000001012434332014022899201484089323007
81610000010514134332014022899201489033173000
81610000000817634332014022899201484087081003
81620000011685634332014022899201489032689000