(footprint "TO-50-3_ShortPad-NoHole_Housing" (version 20221018) (generator pcbnew)
  (layer "F.Cu")
  (descr "TO-50-3 Macro T Package Style M236")
  (tags "TO-50-3 Macro T Package Style M236")
  (attr smd)
  (fp_text reference "REF**" (at -0.425 -6.4) (layer "F.SilkS")
      (effects (font (size 1 1) (thickness 0.15)))
    (tstamp c2ba8876-5cc8-4831-972b-6cfb4197ca03)
  )
  (fp_text value "TO-50-3_ShortPad-NoHole_Housing" (at 16 0.375) (layer "F.Fab")
      (effects (font (size 1 1) (thickness 0.15)))
    (tstamp 7e777621-d721-40fb-9ef1-7d5ffaaae8eb)
  )
  (fp_text user "${REFERENCE}" (at -0.4 -2.6) (layer "F.Fab")
      (effects (font (size 1 1) (thickness 0.15)))
    (tstamp ee01af15-a450-4bfc-8b4a-a5a2c73f76dc)
  )
  (fp_circle (center -0.4 -2.6) (end -0.4 -5.3)
    (stroke (width 0.12) (type solid)) (fill none) (layer "F.SilkS") (tstamp 90c0cf8d-f4a7-4e7d-90e1-af3b47ef57c6))
  (fp_line (start -8 -1.4) (end -8 -3.8)
    (stroke (width 0.05) (type solid)) (layer "F.CrtYd") (tstamp a8923f0c-cf88-4ecb-b365-278cdd5b5335))
  (fp_line (start -8 -1.4) (end -3.6 -1.4)
    (stroke (width 0.05) (type solid)) (layer "F.CrtYd") (tstamp dedf75fb-e175-4d33-ad5f-bae41a029ab9))
  (fp_line (start -3.6 -3.8) (end -8 -3.8)
    (stroke (width 0.05) (type solid)) (layer "F.CrtYd") (tstamp d2134f20-3eac-4aeb-9a2e-541025455df5))
  (fp_line (start -3.6 -3.8) (end -1.6 -5.8)
    (stroke (width 0.05) (type solid)) (layer "F.CrtYd") (tstamp ba6a8a52-a754-4956-825e-31da91842e21))
  (fp_line (start -1.6 -5.8) (end 0.8 -5.8)
    (stroke (width 0.05) (type solid)) (layer "F.CrtYd") (tstamp 603aad75-40bf-4ee7-ab64-c6184ef7b9c9))
  (fp_line (start -1.6 0.6) (end -3.6 -1.4)
    (stroke (width 0.05) (type solid)) (layer "F.CrtYd") (tstamp 01e6e25d-a508-47b2-ba9e-8a2b550ed1b2))
  (fp_line (start -1.6 5.2) (end -1.6 0.6)
    (stroke (width 0.05) (type solid)) (layer "F.CrtYd") (tstamp 8ccc787f-7bcf-427d-9b0a-91a5a2e81b52))
  (fp_line (start 0.8 -5.8) (end 2.8 -3.8)
    (stroke (width 0.05) (type solid)) (layer "F.CrtYd") (tstamp 59ee94bb-3d77-48ba-b2f6-9dbb79f8d04b))
  (fp_line (start 0.8 0.6) (end 0.8 5.2)
    (stroke (width 0.05) (type solid)) (layer "F.CrtYd") (tstamp 5cf8f23c-5538-4e05-92a5-c4151970e758))
  (fp_line (start 0.8 5.2) (end -1.6 5.2)
    (stroke (width 0.05) (type solid)) (layer "F.CrtYd") (tstamp 0334c383-e704-4c16-b977-8ce62a5a2f19))
  (fp_line (start 2.8 -3.8) (end 8.8 -3.8)
    (stroke (width 0.05) (type solid)) (layer "F.CrtYd") (tstamp 668acd48-1de7-4a31-a5b0-933d145a59cc))
  (fp_line (start 2.8 -1.4) (end 0.8 0.6)
    (stroke (width 0.05) (type solid)) (layer "F.CrtYd") (tstamp a194b5a4-c389-4cf2-9632-819f7e544d65))
  (fp_line (start 8.8 -3.8) (end 8.8 -1.4)
    (stroke (width 0.05) (type solid)) (layer "F.CrtYd") (tstamp d1dc05b8-713a-4299-991c-d4f4eff35eab))
  (fp_line (start 8.8 -1.4) (end 2.8 -1.4)
    (stroke (width 0.05) (type solid)) (layer "F.CrtYd") (tstamp 49f4e08b-4270-42af-959d-d2e16e93b710))
  (fp_circle (center -0.4 -2.6) (end -0.35 -5.15)
    (stroke (width 0.1) (type solid)) (fill none) (layer "F.Fab") (tstamp 98df1516-fc2a-4c95-8305-e9b43079c907))
  (pad "1" smd rect (at -5.6 -2.6 270) (size 1.5 4) (layers "F.Cu" "F.Paste" "F.Mask") (tstamp 296ce116-ace4-4f3b-850f-1ab3d88c8098))
  (pad "2" smd rect (at -0.4 2.6 270) (size 4 1.5) (layers "F.Cu" "F.Paste" "F.Mask") (tstamp 4cd4dc44-06a9-4b4b-ae92-3a8737150e47))
  (pad "3" smd rect (at 5.6 -2.6 270) (size 1.5 5.5) (layers "F.Cu" "F.Paste" "F.Mask") (tstamp 984ef5ff-5587-4380-8600-bbbfb8f800f6))
  (model "${KICAD6_3DMODEL_DIR}/Package_TO_SOT_SMD.3dshapes/TO-50-3_ShortPad-NoHole_Housing.wrl"
    (offset (xyz 0 0 0))
    (scale (xyz 1 1 1))
    (rotate (xyz 0 0 0))
  )
)
