(footprint WLCSP-8_1.551x2.284mm_P0.5mm (version 20221018) (generator kicad-footprint-generator)
  (layer F.Cu)
  (descr "WLCSP-8, 1.551x2.284mm, 8 Ball, 2x4 Layout, 0.5mm Pitch, https://www.adestotech.com/wp-content/uploads/AT25SL321_112.pdf#page=75")
  (tags "CSP 8 0.5")
  (attr smd)
  (fp_text reference REF** (at 0 -2.142) (layer F.SilkS)
    (effects (font (size 1 1) (thickness 0.15)))
  )
  (fp_text value WLCSP-8_1.551x2.284mm_P0.5mm (at 0 2.142) (layer F.Fab)
    (effects (font (size 1 1) (thickness 0.15)))
  )
  (fp_line (start 0.7755 1.142) (end -0.7755 1.142)
    (stroke (width 0.1) (type solid)) (layer F.Fab))
  (fp_line (start -0.7755 1.142) (end -0.7755 -0.75425)
    (stroke (width 0.1) (type solid)) (layer F.Fab))
  (fp_line (start -0.7755 -0.75425) (end -0.38775 -1.142)
    (stroke (width 0.1) (type solid)) (layer F.Fab))
  (fp_line (start -0.38775 -1.142) (end 0.7755 -1.142)
    (stroke (width 0.1) (type solid)) (layer F.Fab))
  (fp_line (start 0.7755 -1.142) (end 0.7755 1.142)
    (stroke (width 0.1) (type solid)) (layer F.Fab))
  (fp_line (start -1.78 -2.15) (end -1.78 2.15)
    (stroke (width 0.05) (type solid)) (layer F.CrtYd))
  (fp_line (start -1.78 2.15) (end 1.78 2.15)
    (stroke (width 0.05) (type solid)) (layer F.CrtYd))
  (fp_line (start 1.78 2.15) (end 1.78 -2.15)
    (stroke (width 0.05) (type solid)) (layer F.CrtYd))
  (fp_line (start 1.78 -2.15) (end -1.78 -2.15)
    (stroke (width 0.05) (type solid)) (layer F.CrtYd))
  (fp_line (start -0.49775 -1.252) (end 0.8855 -1.252)
    (stroke (width 0.12) (type solid)) (layer F.SilkS))
  (fp_line (start 0.8855 -1.252) (end 0.8855 1.252)
    (stroke (width 0.12) (type solid)) (layer F.SilkS))
  (fp_line (start 0.8855 1.252) (end -0.8855 1.252)
    (stroke (width 0.12) (type solid)) (layer F.SilkS))
  (fp_line (start -0.8855 1.252) (end -0.8855 -0.86425)
    (stroke (width 0.12) (type solid)) (layer F.SilkS))
  (pad A1 smd circle (at -0.25 -0.75) (size 0.2 0.2) (property pad_prop_bga) (layers F.Cu F.Mask F.Paste))
  (pad A2 smd circle (at 0.25 -0.75) (size 0.2 0.2) (property pad_prop_bga) (layers F.Cu F.Mask F.Paste))
  (pad B1 smd circle (at -0.25 -0.25) (size 0.2 0.2) (property pad_prop_bga) (layers F.Cu F.Mask F.Paste))
  (pad B2 smd circle (at 0.25 -0.25) (size 0.2 0.2) (property pad_prop_bga) (layers F.Cu F.Mask F.Paste))
  (pad C1 smd circle (at -0.25 0.25) (size 0.2 0.2) (property pad_prop_bga) (layers F.Cu F.Mask F.Paste))
  (pad C2 smd circle (at 0.25 0.25) (size 0.2 0.2) (property pad_prop_bga) (layers F.Cu F.Mask F.Paste))
  (pad D1 smd circle (at -0.25 0.75) (size 0.2 0.2) (property pad_prop_bga) (layers F.Cu F.Mask F.Paste))
  (pad D2 smd circle (at 0.25 0.75) (size 0.2 0.2) (property pad_prop_bga) (layers F.Cu F.Mask F.Paste))
  (fp_poly (pts (xy -0.8855 -1.252) (xy -1.3855 -1.252) (xy -0.8855 -1.752) (xy -0.8855 -1.252))
    (stroke (width 0.12) (type solid)) (fill solid) (layer F.SilkS))
  (fp_text user ${REFERENCE} (at 0 0 -90) (layer F.Fab)
    (effects (font (size 0.53 0.53) (thickness 0.0795)))
  )
  (model ${KICAD7_3DMODEL_DIR}/Package_CSP.3dshapes/WLCSP-8_1.551x2.284mm_P0.5mm.wrl
    (offset (xyz 0 0 0))
    (scale (xyz 1 1 1))
    (rotate (xyz 0 0 0))
  )
)
