(footprint "MLPQ-16-1EP_4x4mm_P0.65mm_EP2.8x2.8mm" (version 20221018) (generator pcbnew)
  (layer "F.Cu")
  (descr "Micro Leadframe Package, 16 pin with exposed pad")
  (tags "MLPQ- 0.65")
  (attr smd)
  (fp_text reference "REF**" (at 0 -3.4) (layer "F.SilkS")
      (effects (font (size 1 1) (thickness 0.15)))
    (tstamp 82b6fd57-4029-44bc-b192-3f11ec084294)
  )
  (fp_text value "MLPQ-16-1EP_4x4mm_P0.65mm_EP2.8x2.8mm" (at 0 3.4) (layer "F.Fab")
      (effects (font (size 1 1) (thickness 0.15)))
    (tstamp a0bce58e-cc79-439d-b67a-92d03fdc49e6)
  )
  (fp_text user "${REFERENCE}" (at 0 0) (layer "F.Fab")
      (effects (font (size 1 1) (thickness 0.15)))
    (tstamp a9451bd6-cea8-4602-80b3-62c489167b7b)
  )
  (fp_line (start -2.175 -2.175) (end -1.375 -2.175)
    (stroke (width 0.15) (type solid)) (layer "F.SilkS") (tstamp bb75ca43-becb-42d1-b522-baad4287d795))
  (fp_line (start -2.175 2.175) (end -2.175 1.375)
    (stroke (width 0.15) (type solid)) (layer "F.SilkS") (tstamp 46a9d294-7ff5-41b9-8e7a-4e8b6ac12990))
  (fp_line (start -2.175 2.175) (end -1.375 2.175)
    (stroke (width 0.15) (type solid)) (layer "F.SilkS") (tstamp d5aaf442-8342-483a-a736-728d0b9c43a7))
  (fp_line (start 2.175 -2.175) (end 1.375 -2.175)
    (stroke (width 0.15) (type solid)) (layer "F.SilkS") (tstamp 9775fc86-89f5-4461-9bab-be9e4b7445ce))
  (fp_line (start 2.175 -2.175) (end 2.175 -1.375)
    (stroke (width 0.15) (type solid)) (layer "F.SilkS") (tstamp f3054fb9-a7e2-4f27-a672-e0c04afe8d2c))
  (fp_line (start 2.175 2.175) (end 1.375 2.175)
    (stroke (width 0.15) (type solid)) (layer "F.SilkS") (tstamp cc69772c-4efc-487c-8ac9-b5d9e56f6429))
  (fp_line (start 2.175 2.175) (end 2.175 1.375)
    (stroke (width 0.15) (type solid)) (layer "F.SilkS") (tstamp 41c3c801-fd93-402d-81f8-ecccf23cd0c8))
  (fp_line (start -2.65 -2.65) (end -2.65 2.65)
    (stroke (width 0.05) (type solid)) (layer "F.CrtYd") (tstamp 9b2fa0d6-6f58-4e54-91fe-2dd293111dc0))
  (fp_line (start -2.65 -2.65) (end 2.65 -2.65)
    (stroke (width 0.05) (type solid)) (layer "F.CrtYd") (tstamp fb138213-b014-400d-8638-2d900af68357))
  (fp_line (start -2.65 2.65) (end 2.65 2.65)
    (stroke (width 0.05) (type solid)) (layer "F.CrtYd") (tstamp 8f5f6c07-0ca8-4e98-b969-0e7ce6300ba6))
  (fp_line (start 2.65 -2.65) (end 2.65 2.65)
    (stroke (width 0.05) (type solid)) (layer "F.CrtYd") (tstamp da6c7ee9-a8f3-436b-ad9c-4ab76feb6217))
  (fp_line (start -2 -1) (end -1 -2)
    (stroke (width 0.15) (type solid)) (layer "F.Fab") (tstamp 1f34c33a-e158-4a99-be09-e17503e06cd9))
  (fp_line (start -2 2) (end -2 -1)
    (stroke (width 0.15) (type solid)) (layer "F.Fab") (tstamp 387ecc1f-51be-478e-826a-52f0f3e29789))
  (fp_line (start -1 -2) (end 2 -2)
    (stroke (width 0.15) (type solid)) (layer "F.Fab") (tstamp 4924dbf2-195d-4c50-a976-274fbad976a7))
  (fp_line (start 2 -2) (end 2 2)
    (stroke (width 0.15) (type solid)) (layer "F.Fab") (tstamp f56e7c84-16f7-4e70-b528-9fffde26a09f))
  (fp_line (start 2 2) (end -2 2)
    (stroke (width 0.15) (type solid)) (layer "F.Fab") (tstamp 5bd47909-c112-4d85-bd0d-f6550ee77700))
  (pad "" smd rect (at -0.7 -0.7) (size 1.13 1.13) (layers "F.Paste") (tstamp 1812790a-e348-4cdb-a4b2-b1b061e427d9))
  (pad "" smd rect (at -0.7 0.7) (size 1.13 1.13) (layers "F.Paste") (tstamp 58c303c1-f224-47a7-88ba-4f18690d73f4))
  (pad "" smd rect (at 0.7 -0.7) (size 1.13 1.13) (layers "F.Paste") (tstamp c2a88540-88c1-49a2-bf2b-926dab7980d2))
  (pad "" smd rect (at 0.7 0.7) (size 1.13 1.13) (layers "F.Paste") (tstamp 22dc17ef-3b38-4a8f-aabb-7f6402f4fa96))
  (pad "1" smd oval (at -2 -0.975) (size 0.8 0.35) (layers "F.Cu" "F.Paste" "F.Mask") (tstamp 8fb60911-eadf-4690-ba4c-228a05503081))
  (pad "2" smd oval (at -2 -0.325) (size 0.8 0.35) (layers "F.Cu" "F.Paste" "F.Mask") (tstamp 14caddd7-0f4b-4057-8b61-1ace60c849a0))
  (pad "3" smd oval (at -2 0.325) (size 0.8 0.35) (layers "F.Cu" "F.Paste" "F.Mask") (tstamp c9f17f75-c77b-4c34-ac8c-6b9e09cfd2ca))
  (pad "4" smd oval (at -2 0.975) (size 0.8 0.35) (layers "F.Cu" "F.Paste" "F.Mask") (tstamp 7084a095-400b-4f21-a374-bcc1d4b42bf5))
  (pad "5" smd oval (at -0.975 2 90) (size 0.8 0.35) (layers "F.Cu" "F.Paste" "F.Mask") (tstamp 9e47fefe-f0cd-4815-8453-951b3f5b1d93))
  (pad "6" smd oval (at -0.325 2 90) (size 0.8 0.35) (layers "F.Cu" "F.Paste" "F.Mask") (tstamp 5bf5741a-243f-4d7a-9e37-a9852c502cef))
  (pad "7" smd oval (at 0.325 2 90) (size 0.8 0.35) (layers "F.Cu" "F.Paste" "F.Mask") (tstamp eda6eb16-930a-4206-8999-fc9aa2be68a4))
  (pad "8" smd oval (at 0.975 2 90) (size 0.8 0.35) (layers "F.Cu" "F.Paste" "F.Mask") (tstamp 273aac94-cc87-49f6-9f5e-7b05e7de41a4))
  (pad "9" smd oval (at 2 0.975) (size 0.8 0.35) (layers "F.Cu" "F.Paste" "F.Mask") (tstamp 3fe8458b-0b15-4ba8-8f54-87d6e193a249))
  (pad "10" smd oval (at 2 0.325) (size 0.8 0.35) (layers "F.Cu" "F.Paste" "F.Mask") (tstamp 34597688-4f89-4c60-8ba7-b0d8cf9c6db0))
  (pad "11" smd oval (at 2 -0.325) (size 0.8 0.35) (layers "F.Cu" "F.Paste" "F.Mask") (tstamp 20b8662b-ddeb-40d3-a116-bb27f06016aa))
  (pad "12" smd oval (at 2 -0.975) (size 0.8 0.35) (layers "F.Cu" "F.Paste" "F.Mask") (tstamp 8e6069e0-8b49-4256-a151-cd6504f0dd5e))
  (pad "13" smd oval (at 0.975 -2 90) (size 0.8 0.35) (layers "F.Cu" "F.Paste" "F.Mask") (tstamp 7ab277a1-28ab-4184-a781-32682ab78c46))
  (pad "14" smd oval (at 0.325 -2 90) (size 0.8 0.35) (layers "F.Cu" "F.Paste" "F.Mask") (tstamp c8798c69-df9b-40f4-a51b-7c1221fbb584))
  (pad "15" smd oval (at -0.325 -2 90) (size 0.8 0.35) (layers "F.Cu" "F.Paste" "F.Mask") (tstamp bbc78dd0-14a2-4067-b92d-49427fe7bd2a))
  (pad "16" smd oval (at -0.975 -2 90) (size 0.8 0.35) (layers "F.Cu" "F.Paste" "F.Mask") (tstamp fc2e55bd-337a-48bb-833a-8f7f5b7505a9))
  (pad "17" smd rect (at 0 0) (size 2.8 2.8) (layers "F.Cu" "F.Mask") (tstamp 3c78de1f-8589-4925-9e63-68fb268e3c9f))
  (model "${KICAD6_3DMODEL_DIR}/Package_DFN_QFN.3dshapes/MLPQ-16-1EP_4x4mm_P0.65mm_EP2.8x2.8mm.wrl"
    (offset (xyz 0 0 0))
    (scale (xyz 1 1 1))
    (rotate (xyz 0 0 0))
  )
)
