(footprint "SuperSOT-3" (version 20221018) (generator pcbnew)
  (layer "F.Cu")
  (descr "3-pin SuperSOT package https://www.fairchildsemi.com/package-drawings/MA/MA03B.pdf")
  (tags "SuperSOT-3 SSOT-3")
  (attr smd)
  (fp_text reference "REF**" (at 0 -2.35) (layer "F.SilkS")
      (effects (font (size 1 1) (thickness 0.15)))
    (tstamp 12609056-05d0-4b09-9dc3-9bbe91e4bef5)
  )
  (fp_text value "SuperSOT-3" (at 0 2.4) (layer "F.Fab")
      (effects (font (size 1 1) (thickness 0.15)))
    (tstamp 9ff90981-ba86-42d7-84fa-4fb8aca8728d)
  )
  (fp_text user "${REFERENCE}" (at 0 0 90) (layer "F.Fab")
      (effects (font (size 0.5 0.5) (thickness 0.075)))
    (tstamp 65f2f008-94fd-4785-ace1-6865c970c400)
  )
  (fp_line (start -1.75 -1.6) (end 0.85 -1.6)
    (stroke (width 0.12) (type solid)) (layer "F.SilkS") (tstamp ae67a823-6d56-4a7c-b450-e77754db60de))
  (fp_line (start 0.85 -1.6) (end 0.85 -0.65)
    (stroke (width 0.12) (type solid)) (layer "F.SilkS") (tstamp ac96dd6a-9fa8-4053-aacd-568443fc4aa4))
  (fp_line (start 0.85 0.65) (end 0.85 1.45)
    (stroke (width 0.12) (type solid)) (layer "F.SilkS") (tstamp 6920e7d6-33b8-4a52-b3bd-37a3e80778b6))
  (fp_line (start -2.05 -1.7) (end -2.05 1.7)
    (stroke (width 0.05) (type solid)) (layer "F.CrtYd") (tstamp 29c8434a-cce8-4311-a20b-5597d6b2b047))
  (fp_line (start -2.05 -1.7) (end 2.05 -1.7)
    (stroke (width 0.05) (type solid)) (layer "F.CrtYd") (tstamp 6aadb2e8-431e-47f7-a5a6-4f956613a7c3))
  (fp_line (start 2.05 1.7) (end -2.05 1.7)
    (stroke (width 0.05) (type solid)) (layer "F.CrtYd") (tstamp 1a7000f0-06dd-4bbf-8f14-1b3b02773dd3))
  (fp_line (start 2.05 1.7) (end 2.05 -1.7)
    (stroke (width 0.05) (type solid)) (layer "F.CrtYd") (tstamp 32f10b65-5d52-4268-b159-77e6f0d2ed2d))
  (fp_line (start -0.7 -0.9) (end -0.15 -1.45)
    (stroke (width 0.12) (type solid)) (layer "F.Fab") (tstamp e15a0edf-94d7-4ea7-905d-354d25e49726))
  (fp_line (start -0.7 1.45) (end -0.7 -0.9)
    (stroke (width 0.12) (type solid)) (layer "F.Fab") (tstamp 856009c4-5261-4cee-9df0-07898a30bd26))
  (fp_line (start -0.15 -1.45) (end 0.7 -1.45)
    (stroke (width 0.12) (type solid)) (layer "F.Fab") (tstamp 5204f737-fb9e-49eb-acc0-b1c9378fc3ec))
  (fp_line (start 0.7 -1.45) (end 0.7 1.45)
    (stroke (width 0.12) (type solid)) (layer "F.Fab") (tstamp c939f2ae-a18f-44e2-93de-97d82888277e))
  (fp_line (start 0.7 1.45) (end -0.7 1.45)
    (stroke (width 0.12) (type solid)) (layer "F.Fab") (tstamp 7021aa8f-483c-471c-84e8-d1d4485de013))
  (pad "1" smd rect (at -1.1 -0.95) (size 1.4 1) (layers "F.Cu" "F.Paste" "F.Mask") (tstamp 3927c6f5-0eca-45ca-8a40-dfa1e0683beb))
  (pad "2" smd rect (at -1.1 0.95) (size 1.4 1) (layers "F.Cu" "F.Paste" "F.Mask") (tstamp ccd9d57c-4452-4eae-982f-c8d8070c027e))
  (pad "3" smd rect (at 1.1 0) (size 1.4 1) (layers "F.Cu" "F.Paste" "F.Mask") (tstamp c7a17a1c-8104-43bc-bba4-76757383ecd8))
  (model "${KICAD6_3DMODEL_DIR}/Package_TO_SOT_SMD.3dshapes/SuperSOT-3.wrl"
    (offset (xyz 0 0 0))
    (scale (xyz 1 1 1))
    (rotate (xyz 0 0 0))
  )
)
