(footprint "DFN-16-1EP_3x4mm_P0.45mm_EP1.7x3.3mm" (version 20221018) (generator pcbnew)
  (layer "F.Cu")
  (descr "DE Package; 16-Lead Plastic DFN (4mm x 3mm) (see Linear Technology DFN_16_05-08-1732.pdf)")
  (tags "DFN 0.45")
  (attr smd)
  (fp_text reference "REF**" (at 0 -3.05) (layer "F.SilkS")
      (effects (font (size 1 1) (thickness 0.15)))
    (tstamp 2fe4ba6c-c4cb-494e-bc55-0231897844e6)
  )
  (fp_text value "DFN-16-1EP_3x4mm_P0.45mm_EP1.7x3.3mm" (at 0 3.05) (layer "F.Fab")
      (effects (font (size 1 1) (thickness 0.15)))
    (tstamp 31920608-0d2a-40e7-aa18-d2e268c245b7)
  )
  (fp_text user "${REFERENCE}" (at 0 0) (layer "F.Fab")
      (effects (font (size 0.7 0.7) (thickness 0.105)))
    (tstamp 9b89e42a-076c-468e-8565-34175808d8a5)
  )
  (fp_line (start -1.5 2.125) (end 1.5 2.125)
    (stroke (width 0.15) (type solid)) (layer "F.SilkS") (tstamp fad6cfd1-3d36-4396-93bd-c91c1689be52))
  (fp_line (start 0 -2.125) (end 1.5 -2.125)
    (stroke (width 0.15) (type solid)) (layer "F.SilkS") (tstamp 269fcb84-af13-4ff3-88dd-2e704ae7cbcc))
  (fp_line (start -2.05 -2.3) (end -2.05 2.3)
    (stroke (width 0.05) (type solid)) (layer "F.CrtYd") (tstamp 98d9dd02-f545-4c35-a7d4-909679634456))
  (fp_line (start -2.05 -2.3) (end 2.05 -2.3)
    (stroke (width 0.05) (type solid)) (layer "F.CrtYd") (tstamp f066a298-7176-4bb5-8cbd-c3eb69301bed))
  (fp_line (start -2.05 2.3) (end 2.05 2.3)
    (stroke (width 0.05) (type solid)) (layer "F.CrtYd") (tstamp b9caa727-48e9-4c26-bd07-1d202ac584d4))
  (fp_line (start 2.05 -2.3) (end 2.05 2.3)
    (stroke (width 0.05) (type solid)) (layer "F.CrtYd") (tstamp 8987e7ab-5b80-4ab7-aabb-31700982abe9))
  (fp_line (start -1.5 -1) (end -0.5 -2)
    (stroke (width 0.15) (type solid)) (layer "F.Fab") (tstamp bf30091f-31b1-491c-90e6-b4afd50ae806))
  (fp_line (start -1.5 2) (end -1.5 -1)
    (stroke (width 0.15) (type solid)) (layer "F.Fab") (tstamp 2b7d281e-5bff-45d2-9cfb-af95e6f1dc62))
  (fp_line (start -0.5 -2) (end 1.5 -2)
    (stroke (width 0.15) (type solid)) (layer "F.Fab") (tstamp c2560e07-1e4f-4719-8412-9639513ccfff))
  (fp_line (start 1.5 -2) (end 1.5 2)
    (stroke (width 0.15) (type solid)) (layer "F.Fab") (tstamp 289140d9-9446-4d23-aa3f-15fad995dcd1))
  (fp_line (start 1.5 2) (end -1.5 2)
    (stroke (width 0.15) (type solid)) (layer "F.Fab") (tstamp 78bee3c5-9f69-4199-b316-e0d9ae158903))
  (pad "" smd rect (at -0.425 -1.2375) (size 0.685 0.67) (layers "F.Paste") (tstamp df989842-a740-481b-890f-57f5398b6b92))
  (pad "" smd rect (at -0.425 -0.4125) (size 0.685 0.67) (layers "F.Paste") (tstamp 2c4050b9-f6a2-4b8f-9645-34a2e2f69664))
  (pad "" smd rect (at -0.425 0.4125) (size 0.685 0.67) (layers "F.Paste") (tstamp d5dfaabd-c42f-4862-8fba-00400e1cdf10))
  (pad "" smd rect (at -0.425 1.2375) (size 0.685 0.67) (layers "F.Paste") (tstamp 8571bd45-c42a-4153-8d4a-1403f99bbab8))
  (pad "" smd rect (at 0.425 -1.2375) (size 0.685 0.67) (layers "F.Paste") (tstamp 1b815886-b979-469b-b1e0-20d9287525c3))
  (pad "" smd rect (at 0.425 -0.4125) (size 0.685 0.67) (layers "F.Paste") (tstamp 2a0f9036-54f7-423f-a29c-d52a13da71a9))
  (pad "" smd rect (at 0.425 0.4125) (size 0.685 0.67) (layers "F.Paste") (tstamp 4be3eab3-a7b0-41b0-b6c7-1b3bb19e4fad))
  (pad "" smd rect (at 0.425 1.2375) (size 0.685 0.67) (layers "F.Paste") (tstamp eaf283d0-7677-43b0-ba8a-8ab077dfead3))
  (pad "1" smd rect (at -1.45 -1.575) (size 0.7 0.25) (layers "F.Cu" "F.Paste" "F.Mask") (tstamp bf13ea90-421b-466b-8bde-b47d069e3b3b))
  (pad "2" smd rect (at -1.45 -1.125) (size 0.7 0.25) (layers "F.Cu" "F.Paste" "F.Mask") (tstamp 39849c96-51ef-49f8-bc7e-4d343bb8886f))
  (pad "3" smd rect (at -1.45 -0.675) (size 0.7 0.25) (layers "F.Cu" "F.Paste" "F.Mask") (tstamp 67370c8f-bf4e-4806-8428-baeeef1cd4be))
  (pad "4" smd rect (at -1.45 -0.225) (size 0.7 0.25) (layers "F.Cu" "F.Paste" "F.Mask") (tstamp b665fa6b-5a17-4427-8721-934d8a088d17))
  (pad "5" smd rect (at -1.45 0.225) (size 0.7 0.25) (layers "F.Cu" "F.Paste" "F.Mask") (tstamp b2a76cb4-0030-4bbe-a315-4bb5bb3233a3))
  (pad "6" smd rect (at -1.45 0.675) (size 0.7 0.25) (layers "F.Cu" "F.Paste" "F.Mask") (tstamp c51dcbf4-ba18-41e6-92ae-7b0b5b82273f))
  (pad "7" smd rect (at -1.45 1.125) (size 0.7 0.25) (layers "F.Cu" "F.Paste" "F.Mask") (tstamp 4a4b617e-c8b9-4738-9536-9a59f98407ae))
  (pad "8" smd rect (at -1.45 1.575) (size 0.7 0.25) (layers "F.Cu" "F.Paste" "F.Mask") (tstamp 458e0056-b841-47e3-8f3b-0a1855d28130))
  (pad "9" smd rect (at 1.45 1.575) (size 0.7 0.25) (layers "F.Cu" "F.Paste" "F.Mask") (tstamp a9c86bd2-ebcd-4813-bee9-2745113500ce))
  (pad "10" smd rect (at 1.45 1.125) (size 0.7 0.25) (layers "F.Cu" "F.Paste" "F.Mask") (tstamp ee87d1b9-6b78-4b91-bf21-481e0a343716))
  (pad "11" smd rect (at 1.45 0.675) (size 0.7 0.25) (layers "F.Cu" "F.Paste" "F.Mask") (tstamp f03d7de5-c11d-4ca6-b9ad-3afc2ac7374b))
  (pad "12" smd rect (at 1.45 0.225) (size 0.7 0.25) (layers "F.Cu" "F.Paste" "F.Mask") (tstamp 54e61703-7754-42e8-afe6-07d27c50ad83))
  (pad "13" smd rect (at 1.45 -0.225) (size 0.7 0.25) (layers "F.Cu" "F.Paste" "F.Mask") (tstamp 98bf6e6a-4ac5-4050-aa36-f14c0616d32f))
  (pad "14" smd rect (at 1.45 -0.675) (size 0.7 0.25) (layers "F.Cu" "F.Paste" "F.Mask") (tstamp 748d7c8f-13fb-4234-98c5-baa296f6acef))
  (pad "15" smd rect (at 1.45 -1.125) (size 0.7 0.25) (layers "F.Cu" "F.Paste" "F.Mask") (tstamp 56d1b012-28ce-4e66-a0f7-273e6a7e5e05))
  (pad "16" smd rect (at 1.45 -1.575) (size 0.7 0.25) (layers "F.Cu" "F.Paste" "F.Mask") (tstamp 9cb225e8-c529-4c39-bbe8-4cb697696781))
  (pad "17" smd rect (at 0 0) (size 1.7 3.3) (layers "F.Cu" "F.Mask") (tstamp 19d6a1f3-17d8-4dbc-ae3c-732925d9b78d))
  (model "${KICAD6_3DMODEL_DIR}/Package_DFN_QFN.3dshapes/DFN-16-1EP_3x4mm_P0.45mm_EP1.7x3.3mm.wrl"
    (offset (xyz 0 0 0))
    (scale (xyz 1 1 1))
    (rotate (xyz 0 0 0))
  )
)
