(footprint "TSOP-II-32_21.0x10.2mm_P1.27mm" (version 20221018) (generator pcbnew)
  (layer "F.Cu")
  (descr "32-lead plastic TSOP; Type II")
  (tags "TSOP-II 32")
  (attr smd)
  (fp_text reference "REF**" (at -4.35 -11.25) (layer "F.SilkS")
      (effects (font (size 1 1) (thickness 0.15)))
    (tstamp 83363bd9-c702-47af-8aee-b06eb7219fa4)
  )
  (fp_text value "TSOP-II-32_21.0x10.2mm_P1.27mm" (at 0.1 11.7) (layer "F.Fab")
      (effects (font (size 1 1) (thickness 0.15)))
    (tstamp dab2bf82-a70d-40c3-8a8f-101457326653)
  )
  (fp_text user "${REFERENCE}" (at 0 0) (layer "F.Fab")
      (effects (font (size 0.8 0.8) (thickness 0.15)))
    (tstamp fbc7063e-d6e3-41c0-ab81-09adee86b501)
  )
  (fp_line (start -6.6 10.4) (end 6.6 10.4)
    (stroke (width 0.12) (type solid)) (layer "F.SilkS") (tstamp f7fa7982-4803-496c-ace2-05dd2e703349))
  (fp_line (start -4.6 -10.4) (end -4.6 -10.2)
    (stroke (width 0.12) (type solid)) (layer "F.SilkS") (tstamp bf8328f1-28e1-4aaf-ba6b-65ca0cf0d72d))
  (fp_line (start -4.6 -10.4) (end 6.6 -10.4)
    (stroke (width 0.12) (type solid)) (layer "F.SilkS") (tstamp e1e09f99-c26c-4009-aaf8-c1cc93b52ea8))
  (fp_line (start -4.6 -10.2) (end -6.6 -10.2)
    (stroke (width 0.12) (type solid)) (layer "F.SilkS") (tstamp 06584047-dec6-4f2d-98e3-e2730e42b2dc))
  (fp_line (start -6.7 -10.5) (end -6.7 10.5)
    (stroke (width 0.05) (type solid)) (layer "F.CrtYd") (tstamp 1299fe6f-4deb-4bdf-aabf-d1947497ef2d))
  (fp_line (start -6.7 -10.5) (end 6.7 -10.5)
    (stroke (width 0.05) (type solid)) (layer "F.CrtYd") (tstamp abe8ec09-c655-4ffe-97de-0b29a3c87ae4))
  (fp_line (start -6.7 10.5) (end 6.7 10.5)
    (stroke (width 0.05) (type solid)) (layer "F.CrtYd") (tstamp 6b2818a4-e0e2-406c-bebf-c450e4596f16))
  (fp_line (start 6.7 -10.5) (end 6.7 10.5)
    (stroke (width 0.05) (type solid)) (layer "F.CrtYd") (tstamp d7219e8a-396c-40c4-aa4b-4f4f0ab1c180))
  (fp_line (start -5.05 -9.2) (end -4.05 -10.2)
    (stroke (width 0.1) (type solid)) (layer "F.Fab") (tstamp e90c675c-5f14-4941-9294-cdd663da6ce1))
  (fp_line (start -5.05 10.2) (end -5.05 -9.2)
    (stroke (width 0.1) (type solid)) (layer "F.Fab") (tstamp f52c2179-d447-4693-ac14-93cd093c1cc1))
  (fp_line (start -4.05 -10.2) (end 5.05 -10.2)
    (stroke (width 0.1) (type solid)) (layer "F.Fab") (tstamp c7debfbf-3d4d-4739-9723-64d81ccd917a))
  (fp_line (start 5.05 -10.2) (end 5.05 10.2)
    (stroke (width 0.1) (type solid)) (layer "F.Fab") (tstamp f9bfdcd1-f0c0-4ed8-942e-0d3354acbf60))
  (fp_line (start 5.05 10.2) (end -5.05 10.2)
    (stroke (width 0.1) (type solid)) (layer "F.Fab") (tstamp 4a575e66-5ddf-4687-a9ae-0517a8c55f81))
  (pad "1" smd rect (at -5.6 -9.525) (size 1.6 0.6) (layers "F.Cu" "F.Paste" "F.Mask") (tstamp 6f24dd6c-abf8-472e-87d6-258005b573e2))
  (pad "2" smd rect (at -5.6 -8.255) (size 1.6 0.6) (layers "F.Cu" "F.Paste" "F.Mask") (tstamp b0686424-13d7-4ba2-b705-af5e5be69ba5))
  (pad "3" smd rect (at -5.6 -6.985) (size 1.6 0.6) (layers "F.Cu" "F.Paste" "F.Mask") (tstamp de73bd29-02d5-4196-a327-0502ccae87c6))
  (pad "4" smd rect (at -5.6 -5.715) (size 1.6 0.6) (layers "F.Cu" "F.Paste" "F.Mask") (tstamp 2911daae-9ba8-4dab-ac3e-36ca0b4ea301))
  (pad "5" smd rect (at -5.6 -4.445) (size 1.6 0.6) (layers "F.Cu" "F.Paste" "F.Mask") (tstamp c0433316-9f61-454e-a58a-b2ec2c6cc00b))
  (pad "6" smd rect (at -5.6 -3.175) (size 1.6 0.6) (layers "F.Cu" "F.Paste" "F.Mask") (tstamp 466034c1-785d-460a-b9e8-4ea1f45c7d23))
  (pad "7" smd rect (at -5.6 -1.905) (size 1.6 0.6) (layers "F.Cu" "F.Paste" "F.Mask") (tstamp 18776d01-b95f-4fd0-88f6-7768de6bb4b1))
  (pad "8" smd rect (at -5.6 -0.625) (size 1.6 0.6) (layers "F.Cu" "F.Paste" "F.Mask") (tstamp afe91466-31cd-4e7b-a54e-5c51a7f97947))
  (pad "9" smd rect (at -5.6 0.625) (size 1.6 0.6) (layers "F.Cu" "F.Paste" "F.Mask") (tstamp 6b10c897-aa81-42a4-9467-900fc529bc4d))
  (pad "10" smd rect (at -5.6 1.905) (size 1.6 0.6) (layers "F.Cu" "F.Paste" "F.Mask") (tstamp a3736066-a37a-4e25-9766-a68d81ae5e56))
  (pad "11" smd rect (at -5.6 3.175) (size 1.6 0.6) (layers "F.Cu" "F.Paste" "F.Mask") (tstamp 87f1be6e-7ae9-4bd3-95dd-16d5e194f8dd))
  (pad "12" smd rect (at -5.6 4.445) (size 1.6 0.6) (layers "F.Cu" "F.Paste" "F.Mask") (tstamp e3915395-4dc8-4eac-8224-4db491ce8f58))
  (pad "13" smd rect (at -5.6 5.715) (size 1.6 0.6) (layers "F.Cu" "F.Paste" "F.Mask") (tstamp 93d1cb68-63d9-48b2-bca2-8dcfbd8ca194))
  (pad "14" smd rect (at -5.6 6.985) (size 1.6 0.6) (layers "F.Cu" "F.Paste" "F.Mask") (tstamp 6dd770d1-6247-4318-b072-f42254511f47))
  (pad "15" smd rect (at -5.6 8.255) (size 1.6 0.6) (layers "F.Cu" "F.Paste" "F.Mask") (tstamp a7596d6e-6a7a-4e4d-8a64-5c9bcc449e18))
  (pad "16" smd rect (at -5.6 9.525) (size 1.6 0.6) (layers "F.Cu" "F.Paste" "F.Mask") (tstamp 60b29aae-59db-49d4-a67d-1c0bbebe55c4))
  (pad "17" smd rect (at 5.6 9.525) (size 1.6 0.6) (layers "F.Cu" "F.Paste" "F.Mask") (tstamp 55924c7e-a44f-439d-b446-50613afa337f))
  (pad "18" smd rect (at 5.6 8.255) (size 1.6 0.6) (layers "F.Cu" "F.Paste" "F.Mask") (tstamp e7e780ec-f013-4dd1-87e2-bfbcc812b738))
  (pad "19" smd rect (at 5.6 6.985) (size 1.6 0.6) (layers "F.Cu" "F.Paste" "F.Mask") (tstamp c970d5d7-d3fc-4545-bf04-69401409960e))
  (pad "20" smd rect (at 5.6 5.715) (size 1.6 0.6) (layers "F.Cu" "F.Paste" "F.Mask") (tstamp e05df651-3e38-4ed3-9e54-1f57f95ba0b9))
  (pad "21" smd rect (at 5.6 4.445) (size 1.6 0.6) (layers "F.Cu" "F.Paste" "F.Mask") (tstamp f2dae1ce-15d4-4077-ba02-59aedeeb36b0))
  (pad "22" smd rect (at 5.6 3.175) (size 1.6 0.6) (layers "F.Cu" "F.Paste" "F.Mask") (tstamp e4ebc95e-e045-4e1e-bdfb-35acd790da15))
  (pad "23" smd rect (at 5.6 1.905) (size 1.6 0.6) (layers "F.Cu" "F.Paste" "F.Mask") (tstamp ebd556ab-87b5-4ce0-b98d-fb7a07d5ca71))
  (pad "24" smd rect (at 5.6 0.625) (size 1.6 0.6) (layers "F.Cu" "F.Paste" "F.Mask") (tstamp 930cf938-dc5e-4186-9ed6-2206b4147ab3))
  (pad "25" smd rect (at 5.6 -0.625) (size 1.6 0.6) (layers "F.Cu" "F.Paste" "F.Mask") (tstamp 474ea668-4b72-48f1-b126-fb8e18ab37d6))
  (pad "26" smd rect (at 5.6 -1.905) (size 1.6 0.6) (layers "F.Cu" "F.Paste" "F.Mask") (tstamp 75e6c2ff-6233-4fae-a53e-a7856cffab91))
  (pad "27" smd rect (at 5.6 -3.175) (size 1.6 0.6) (layers "F.Cu" "F.Paste" "F.Mask") (tstamp 92d18d44-af20-423c-a410-718916052fba))
  (pad "28" smd rect (at 5.6 -4.445) (size 1.6 0.6) (layers "F.Cu" "F.Paste" "F.Mask") (tstamp 0f5ddb60-a293-4927-a391-7458e57e3b1e))
  (pad "29" smd rect (at 5.6 -5.715) (size 1.6 0.6) (layers "F.Cu" "F.Paste" "F.Mask") (tstamp fb05aff8-fcda-475e-b861-a9146aae8ef3))
  (pad "30" smd rect (at 5.6 -6.985) (size 1.6 0.6) (layers "F.Cu" "F.Paste" "F.Mask") (tstamp b81ae2d2-4027-4402-b1f5-6465f6d28a22))
  (pad "31" smd rect (at 5.6 -8.255) (size 1.6 0.6) (layers "F.Cu" "F.Paste" "F.Mask") (tstamp c8bf22e1-e679-4913-9b80-055332fc3716))
  (pad "32" smd rect (at 5.6 -9.525) (size 1.6 0.6) (layers "F.Cu" "F.Paste" "F.Mask") (tstamp b3ea79fb-4718-4091-9929-8fe05ced700c))
  (model "${KICAD6_3DMODEL_DIR}/Package_SO.3dshapes/TSOP-II-32_21.0x10.2mm_P1.27mm.wrl"
    (offset (xyz 0 0 0))
    (scale (xyz 1 1 1))
    (rotate (xyz 0 0 0))
  )
)
