(footprint "SOT-89-5" (version 20221018) (generator pcbnew)
  (layer "F.Cu")
  (descr "SOT-89-5, http://www.e-devices.ricoh.co.jp/en/products/product_power/pkg/sot-89-5.pdf")
  (tags "SOT-89-5")
  (attr smd)
  (fp_text reference "REF**" (at 0 -3.5) (layer "F.SilkS")
      (effects (font (size 1 1) (thickness 0.15)))
    (tstamp 0b40975a-8e6d-4fbb-ba4e-aa3b8b012e7a)
  )
  (fp_text value "SOT-89-5" (at 0 3.5) (layer "F.Fab")
      (effects (font (size 1 1) (thickness 0.15)))
    (tstamp c039e212-9b00-4799-be53-b86a46f81597)
  )
  (fp_text user "${REFERENCE}" (at 0.5 0 90) (layer "F.Fab")
      (effects (font (size 1 1) (thickness 0.15)))
    (tstamp f1dc42a3-14d5-4bf6-90ca-4a01d6d96beb)
  )
  (fp_line (start -2.54 -2.03) (end -1.36 -2.03)
    (stroke (width 0.12) (type solid)) (layer "F.SilkS") (tstamp fed0fabc-b5a0-45ea-94e4-c01618d37720))
  (fp_line (start -1.36 -2.36) (end -1.36 -2.03)
    (stroke (width 0.12) (type solid)) (layer "F.SilkS") (tstamp 5cf23929-2188-4bdf-9044-dc94769239fb))
  (fp_line (start -1.36 -2.36) (end 1.36 -2.36)
    (stroke (width 0.12) (type solid)) (layer "F.SilkS") (tstamp 7a0fd815-9127-4bc5-8df1-673999518fbf))
  (fp_line (start -1.36 2.36) (end -1.36 2.03)
    (stroke (width 0.12) (type solid)) (layer "F.SilkS") (tstamp 9c2eabb4-f1a7-4323-ae64-29f5901d48ea))
  (fp_line (start 1.36 -2.36) (end 1.36 -2.03)
    (stroke (width 0.12) (type solid)) (layer "F.SilkS") (tstamp ebbde955-e0f9-4855-b231-cb1d6c122226))
  (fp_line (start 1.36 2.03) (end 1.36 2.36)
    (stroke (width 0.12) (type solid)) (layer "F.SilkS") (tstamp 0b30c8ee-9d8b-4260-94a5-b87dc662c664))
  (fp_line (start 1.36 2.36) (end -1.36 2.36)
    (stroke (width 0.12) (type solid)) (layer "F.SilkS") (tstamp 2195ca96-11cb-42c3-af7f-230100c35ff9))
  (fp_line (start -2.85 2.5) (end -2.85 -2.5)
    (stroke (width 0.05) (type solid)) (layer "F.CrtYd") (tstamp 1bd057e6-d83f-4b42-bf5e-afa8d43b0434))
  (fp_line (start -2.85 2.5) (end 2.85 2.5)
    (stroke (width 0.05) (type solid)) (layer "F.CrtYd") (tstamp 7f0c2265-6836-4b0d-8e67-9de69b061152))
  (fp_line (start 2.85 -2.5) (end -2.85 -2.5)
    (stroke (width 0.05) (type solid)) (layer "F.CrtYd") (tstamp e5cfd2d4-6ab6-40b5-bcad-a5b007996416))
  (fp_line (start 2.85 -2.5) (end 2.85 2.5)
    (stroke (width 0.05) (type solid)) (layer "F.CrtYd") (tstamp bab3db34-0113-4535-870d-bfae90054553))
  (fp_line (start -1.25 -1.25) (end -0.25 -2.25)
    (stroke (width 0.1) (type solid)) (layer "F.Fab") (tstamp 12927971-f12b-4cd6-8e53-bc1e2030406a))
  (fp_line (start -1.25 2.25) (end -1.25 -1.25)
    (stroke (width 0.1) (type solid)) (layer "F.Fab") (tstamp 4e82b791-eaa2-4ab8-8823-f1929e612699))
  (fp_line (start -0.25 -2.25) (end 1.25 -2.25)
    (stroke (width 0.1) (type solid)) (layer "F.Fab") (tstamp 25196279-cf82-4dc1-8c22-6e2c52495be2))
  (fp_line (start 1.25 -2.25) (end 1.25 2.25)
    (stroke (width 0.1) (type solid)) (layer "F.Fab") (tstamp 92ca5664-4bef-490b-80cb-92458073c01a))
  (fp_line (start 1.25 2.25) (end -1.25 2.25)
    (stroke (width 0.1) (type solid)) (layer "F.Fab") (tstamp 249464eb-399c-470a-bdd7-1e72ad8fa87b))
  (pad "1" smd rect (at -1.85 -1.5) (size 1.5 0.7) (layers "F.Cu" "F.Paste" "F.Mask") (tstamp e4e0869e-0959-4efe-8a1d-057480487b87))
  (pad "2" smd custom (at 0 0) (size 0.8 2) (layers "F.Cu" "F.Paste" "F.Mask")
    (zone_connect 2) (thermal_bridge_angle 45)
    (options (clearance outline) (anchor rect))
    (primitives
      (gr_poly
        (pts
          (xy 0.9 -0.5)
          (xy 2.6 -0.5)
          (xy 2.6 0.5)
          (xy 0.9 0.5)
          (xy 0.4 1)
          (xy -0.4 1)
          (xy -0.9 0.5)
          (xy -2.6 0.5)
          (xy -2.6 -0.5)
          (xy -0.9 -0.5)
          (xy -0.4 -1)
          (xy 0.4 -1)
        )
        (width 0) (fill yes))
    ) (tstamp a79244d5-f4a4-45bb-872f-f016347c804f))
  (pad "3" smd rect (at -1.85 1.5) (size 1.5 0.7) (layers "F.Cu" "F.Paste" "F.Mask") (tstamp 6d4b224c-1ee7-4238-99df-7fbf6960f19d))
  (pad "4" smd rect (at 1.85 1.5) (size 1.5 0.7) (layers "F.Cu" "F.Paste" "F.Mask") (tstamp a82d6b38-4b2c-4d78-8303-ed639de52e24))
  (pad "5" smd rect (at 1.85 -1.5) (size 1.5 0.7) (layers "F.Cu" "F.Paste" "F.Mask") (tstamp c6a18651-78f9-43bc-bd65-9a4d089866c6))
  (model "${KICAD6_3DMODEL_DIR}/Package_TO_SOT_SMD.3dshapes/SOT-89-5.wrl"
    (offset (xyz 0 0 0))
    (scale (xyz 1 1 1))
    (rotate (xyz 0 0 0))
  )
)
