(footprint "Mini-Circuits_DL805" (version 20221018) (generator pcbnew)
  (layer "F.Cu")
  (descr "https://ww2.minicircuits.com/case_style/DL805.pdf")
  (tags "RF Switch")
  (attr smd)
  (fp_text reference "REF**" (at 0 -2.907) (layer "F.SilkS")
      (effects (font (size 1 1) (thickness 0.15)))
    (tstamp 690d3e6f-6c34-47a3-a6b8-ef0919974bce)
  )
  (fp_text value "Mini-Circuits_DL805" (at 0 3.23) (layer "F.Fab")
      (effects (font (size 1 1) (thickness 0.15)))
    (tstamp 80ecadd7-0496-4a7e-b39a-0313b6d5cb21)
  )
  (fp_text user "${REFERENCE}" (at 0 0 -90) (layer "F.Fab")
      (effects (font (size 0.5 0.5) (thickness 0.075)))
    (tstamp 07c71efd-1056-4bac-8986-f1170a1d8e26)
  )
  (fp_line (start -1.9 -1.9) (end -1.375 -1.9)
    (stroke (width 0.12) (type solid)) (layer "F.SilkS") (tstamp 0a5c8f2f-8985-4a78-90df-ad9a3b280834))
  (fp_line (start -1.9 -1.375) (end -1.9 -1.9)
    (stroke (width 0.12) (type solid)) (layer "F.SilkS") (tstamp 23bafd94-f591-439f-9fd2-96e890f8a071))
  (fp_line (start -1.75 -1.75) (end -1.75 -1.375)
    (stroke (width 0.12) (type solid)) (layer "F.SilkS") (tstamp 4de2e141-e145-4afc-8892-18832b53f9f2))
  (fp_line (start -1.75 1.75) (end -1.75 1.375)
    (stroke (width 0.12) (type solid)) (layer "F.SilkS") (tstamp e2e1d1af-0b31-4e92-9378-a9d271c88434))
  (fp_line (start -0.5 -1.75) (end -1.75 -1.75)
    (stroke (width 0.12) (type solid)) (layer "F.SilkS") (tstamp e32730a0-d7e3-49d7-9e98-25d931cb9acc))
  (fp_line (start -0.5 1.75) (end -1.75 1.75)
    (stroke (width 0.12) (type solid)) (layer "F.SilkS") (tstamp fc86074d-c8ab-4eeb-95bc-6ddbf4ffb695))
  (fp_line (start 0.5 -1.75) (end 1.75 -1.75)
    (stroke (width 0.12) (type solid)) (layer "F.SilkS") (tstamp 23a9eb4b-6c5e-4aa0-8daa-af767634ddf5))
  (fp_line (start 1.75 -1.75) (end 1.75 -1.375)
    (stroke (width 0.12) (type solid)) (layer "F.SilkS") (tstamp 384fabba-889b-45e4-8825-b0197d712f72))
  (fp_line (start 1.75 1.375) (end 1.75 1.75)
    (stroke (width 0.12) (type solid)) (layer "F.SilkS") (tstamp 27bae47d-9177-41f9-93e3-2f8d78881add))
  (fp_line (start 1.75 1.75) (end 0.5 1.75)
    (stroke (width 0.12) (type solid)) (layer "F.SilkS") (tstamp dbf81fdb-cd13-4a24-8013-6b4972a8175b))
  (fp_line (start -2.26 -2.26) (end -2.26 2.26)
    (stroke (width 0.05) (type solid)) (layer "F.CrtYd") (tstamp 120f7ebb-13a7-489d-879d-4c041816f1d1))
  (fp_line (start -2.26 2.26) (end 2.26 2.26)
    (stroke (width 0.05) (type solid)) (layer "F.CrtYd") (tstamp e57056ae-7e73-40b9-accb-fabdedcb6fcb))
  (fp_line (start 2.26 -2.26) (end -2.26 -2.26)
    (stroke (width 0.05) (type solid)) (layer "F.CrtYd") (tstamp e3e21433-caf2-4286-ab17-8d74cac644dd))
  (fp_line (start 2.26 2.26) (end 2.26 -2.26)
    (stroke (width 0.05) (type solid)) (layer "F.CrtYd") (tstamp 35878c5e-1b0e-4d34-8a5e-8ec834a72943))
  (fp_line (start -1.625 -0.875) (end -0.875 -1.625)
    (stroke (width 0.1) (type solid)) (layer "F.Fab") (tstamp 4ecccc70-d8c9-4116-8fbb-b70f7632f70a))
  (fp_line (start -1.625 1.625) (end -1.625 -0.875)
    (stroke (width 0.1) (type solid)) (layer "F.Fab") (tstamp c271e709-8cca-4e07-99ff-e94077a92dde))
  (fp_line (start -0.875 -1.625) (end 1.625 -1.625)
    (stroke (width 0.1) (type solid)) (layer "F.Fab") (tstamp 62875a60-0b62-4cdf-8418-88e8671529b6))
  (fp_line (start 1.625 -1.625) (end 1.625 1.625)
    (stroke (width 0.1) (type solid)) (layer "F.Fab") (tstamp 5cf16e41-2e56-4da2-9d1e-67929513f395))
  (fp_line (start 1.625 1.625) (end -1.625 1.625)
    (stroke (width 0.1) (type solid)) (layer "F.Fab") (tstamp 65f95555-ba62-40c6-ab3d-0bc33cb25709))
  (pad "1" smd rect (at -1.625 -0.99 270) (size 0.33 0.76) (layers "F.Cu" "F.Paste" "F.Mask") (tstamp b1576d1a-220a-4e30-9aad-ebbb81bda175))
  (pad "2" smd rect (at -1.625 -0.33 270) (size 0.33 0.76) (layers "F.Cu" "F.Paste" "F.Mask") (tstamp ed4be8c6-c538-47cd-ad4e-471c645a9fb9))
  (pad "3" smd rect (at -1.625 0.33 270) (size 0.33 0.76) (layers "F.Cu" "F.Paste" "F.Mask") (tstamp 8da4333b-e144-41f8-bc77-3ebaea71417f))
  (pad "4" smd rect (at -1.625 0.99 270) (size 0.33 0.76) (layers "F.Cu" "F.Paste" "F.Mask") (tstamp 7d88d267-649f-4e71-893b-c2786438a979))
  (pad "5" smd rect (at 1.625 0.99 270) (size 0.33 0.76) (layers "F.Cu" "F.Paste" "F.Mask") (tstamp c8e077b2-d9b8-4d44-989e-4cf2493f80a7))
  (pad "6" smd rect (at 1.625 0.33 270) (size 0.33 0.76) (layers "F.Cu" "F.Paste" "F.Mask") (tstamp 755be3b0-bb74-46fc-9337-fb2709145093))
  (pad "7" smd rect (at 1.625 -0.33 270) (size 0.33 0.76) (layers "F.Cu" "F.Paste" "F.Mask") (tstamp 9c1eff07-77f8-4dd2-ae42-76f96ac3ef49))
  (pad "8" smd rect (at 1.625 -0.99 270) (size 0.33 0.76) (layers "F.Cu" "F.Paste" "F.Mask") (tstamp d188bf7f-2d4f-4454-9115-78b63d63b6e6))
  (pad "9" smd rect (at 0 -1.535 270) (size 0.94 0.51) (layers "F.Cu" "F.Paste" "F.Mask") (tstamp 92cc64ef-41d2-4f8c-849c-ae1b29360a90))
  (pad "9" smd rect (at 0 0 270) (size 2.13 1.22) (layers "F.Cu" "F.Paste" "F.Mask") (tstamp d27afd86-39fd-4db8-a2c9-15253a315ac7))
  (pad "9" smd rect (at 0 1.535 270) (size 0.94 0.51) (layers "F.Cu" "F.Paste" "F.Mask") (tstamp faebe79b-d6e1-4e9f-b478-58c37e4ad71b))
  (model "${KICAD6_3DMODEL_DIR}/Package_DFN_QFN.3dshapes/Mini-Circuits_DL805.wrl"
    (offset (xyz 0 0 0))
    (scale (xyz 1 1 1))
    (rotate (xyz 0 0 0))
  )
)
