(footprint "Infineon_PG-TISON-8-5" (version 20221018) (generator pcbnew)
  (layer "F.Cu")
  (descr "Infineon, PG-TISON-8-5, 8x8x1.1mm, 1mm Pitch, https://www.infineon.com/cms/en/product/packages/PG-TISON/PG-TISON-8-5/")
  (tags "tison")
  (attr smd)
  (fp_text reference "REF**" (at 0 -5.5) (layer "F.SilkS")
      (effects (font (size 1 1) (thickness 0.15)))
    (tstamp b28aab49-c1c5-4ea4-b843-21f97063b565)
  )
  (fp_text value "Infineon_PG-TISON-8-5" (at 0 5.5) (layer "F.Fab")
      (effects (font (size 1 1) (thickness 0.15)))
    (tstamp 086ec7d0-7911-4bb4-a4e4-741749e50120)
  )
  (fp_text user "${REFERENCE}" (at 0 0) (layer "F.Fab")
      (effects (font (size 1 1) (thickness 0.15)))
    (tstamp 52ad68d0-8fa2-4a09-9a61-143a95155d8d)
  )
  (fp_line (start 0.82 -4.11) (end 0 -4.11)
    (stroke (width 0.12) (type solid)) (layer "F.SilkS") (tstamp e54e9a7f-6c99-4d76-a607-baea9c5d666e))
  (fp_line (start 0.82 4.11) (end -4 4.11)
    (stroke (width 0.12) (type solid)) (layer "F.SilkS") (tstamp 6f6290a4-27ba-45a7-8ec2-a8ccbdedd534))
  (fp_line (start -4.7 -4.75) (end 4.75 -4.75)
    (stroke (width 0.05) (type solid)) (layer "F.CrtYd") (tstamp e0d0e10f-3ba9-442d-8ccb-ecb4b43d5d24))
  (fp_line (start -4.7 4.75) (end -4.7 -4.75)
    (stroke (width 0.05) (type solid)) (layer "F.CrtYd") (tstamp 0df392fe-647f-4d0c-b9f0-e6e963893863))
  (fp_line (start 4.75 -4.75) (end 4.75 4.75)
    (stroke (width 0.05) (type solid)) (layer "F.CrtYd") (tstamp f92f81c7-51b3-44da-9fcb-9bede3766371))
  (fp_line (start 4.75 4.75) (end -4.7 4.75)
    (stroke (width 0.05) (type solid)) (layer "F.CrtYd") (tstamp c772ed70-141c-459f-b493-18f82362c680))
  (fp_line (start -4 -3) (end -4 4)
    (stroke (width 0.1) (type solid)) (layer "F.Fab") (tstamp 787c5ddb-6285-44a2-b311-6832fff8e33f))
  (fp_line (start -3 -4) (end -4 -3)
    (stroke (width 0.1) (type solid)) (layer "F.Fab") (tstamp 1fd4ecbd-afd5-4fed-8a11-f957654f0800))
  (fp_line (start -3 -4) (end 4 -4)
    (stroke (width 0.1) (type solid)) (layer "F.Fab") (tstamp d803bcf5-6e91-4fe5-9beb-87886b7959dc))
  (fp_line (start 4 -4) (end 4 4)
    (stroke (width 0.1) (type solid)) (layer "F.Fab") (tstamp 96db6586-1cd0-4411-8a8a-35ba37d71ae3))
  (fp_line (start 4 4) (end -4 4)
    (stroke (width 0.1) (type solid)) (layer "F.Fab") (tstamp f008f362-a76f-40ab-807e-e6235d3f2cc5))
  (pad "" smd rect (at -3.8 -3.5) (size 1.2 0.3) (layers "F.Paste") (tstamp 52a821df-2671-48a4-a7ff-47f1408fb9ec))
  (pad "" smd rect (at -3.8 -2.5) (size 1.2 0.3) (layers "F.Paste") (tstamp 23b79d2e-a68a-4eba-8675-8b43337eb8a2))
  (pad "" smd rect (at -3.8 -2.5) (size 1.2 0.3) (layers "F.Paste") (tstamp a9c3be8c-4d18-470a-a782-16a40e2ba4d1))
  (pad "" smd rect (at -3.8 -1.5) (size 1.2 0.3) (layers "F.Paste") (tstamp b94d0470-cef2-47ab-8a6b-4800a7d93cab))
  (pad "" smd rect (at -3.8 -0.5) (size 1.2 0.3) (layers "F.Paste") (tstamp 0877de6b-8894-4b1d-8882-1393d27ef681))
  (pad "" smd rect (at -3.8 0.5) (size 1.2 0.3) (layers "F.Paste") (tstamp 42f86ab4-583a-48e4-8d90-5d81079f35f8))
  (pad "" smd rect (at -3.8 1.5) (size 1.2 0.3) (layers "F.Paste") (tstamp 14fcd967-f934-4ab2-8d83-722d4bda7915))
  (pad "" smd rect (at -3.8 2.5) (size 1.2 0.3) (layers "F.Paste") (tstamp 78594552-74b5-4d45-bcce-7ffe9ce8180b))
  (pad "" smd rect (at -3.8 3.5) (size 1.2 0.3) (layers "F.Paste") (tstamp f65efc62-5633-4ce5-8eee-16181c575f6a))
  (pad "" smd rect (at -3.49 -3) (size 0.5 0.4) (layers "F.Paste") (tstamp 0df2753b-65de-4010-91cd-cf6a9ba18f5a))
  (pad "" smd rect (at -3.49 3) (size 0.5 0.4) (layers "F.Paste") (tstamp c4037219-1aac-47a5-8023-f6cacd634129))
  (pad "" smd rect (at 1.561 -3.6375) (size 0.7 1.225) (layers "F.Paste") (tstamp 7f038f9a-d794-43fe-9fa8-b41261c724bc))
  (pad "" smd rect (at 1.561 -1.425) (size 0.7 1.6) (layers "F.Paste") (tstamp 193f399d-7d4f-44cc-af32-28f56dd41f40))
  (pad "" smd rect (at 1.561 0.4025) (size 0.7 0.455) (layers "F.Paste") (tstamp 51c4fb52-132c-426a-90b2-f7c971de7f7c))
  (pad "" smd rect (at 1.561 1.9025) (size 0.7 0.545) (layers "F.Paste") (tstamp 5938e0b2-6569-4533-81ed-686f16399b38))
  (pad "" smd rect (at 1.561 3.6125) (size 0.7 1.275) (layers "F.Paste") (tstamp aa156051-50db-4316-ac32-9ff2e859bc70))
  (pad "" smd rect (at 2.3795 2.915) (size 0.537 2.57) (layers "F.Paste") (tstamp 6037e1e2-2b1f-4d05-a626-d8deb978c216))
  (pad "" smd rect (at 2.586 -2.94) (size 0.95 2.62) (layers "F.Paste") (tstamp 2725c73a-cb6a-4f66-bba0-5b16fafc5dc8))
  (pad "" smd rect (at 3.2795 -0.375) (size 0.863 0.5) (layers "F.Paste") (tstamp e1219896-044d-477d-9f7d-e929e4356635))
  (pad "" smd rect (at 3.2795 1.425) (size 0.863 1.5) (layers "F.Paste") (tstamp 90fea20c-929f-4471-ac9e-ee5f07624414))
  (pad "" smd rect (at 3.2795 3.6125) (size 0.863 1.275) (layers "F.Paste") (tstamp 50032097-b753-424f-89b4-2b274e408171))
  (pad "" smd rect (at 3.486 -3.6375) (size 0.45 1.225) (layers "F.Paste") (tstamp 67fcf3bb-5819-479a-8873-36939ae67188))
  (pad "" smd rect (at 3.486 -1.9275) (size 0.45 0.595) (layers "F.Paste") (tstamp 688c6253-e35f-4667-b60b-3435869a1eff))
  (pad "" smd rect (at 4.111 -2.94) (size 0.4 2.62) (layers "F.Paste") (tstamp efb95272-e11f-4c78-b06c-26826fa9699c))
  (pad "" smd rect (at 4.111 0.4025) (size 0.4 2.055) (layers "F.Paste") (tstamp 1b8e26fc-69dd-47ec-91ba-4e320e5414c0))
  (pad "" smd rect (at 4.111 2.915) (size 0.4 2.57) (layers "F.Paste") (tstamp 8bc39ad4-ee1b-41b2-a7bc-5c34cae7165e))
  (pad "1" smd custom (at -3.47 -3) (size 0.66 1.4) (layers "F.Cu" "F.Mask")
    (zone_connect 2) (thermal_bridge_angle 45)
    (options (clearance outline) (anchor rect))
    (primitives
      (gr_poly
        (pts
          (xy 0.33 0.7)
          (xy -0.98 0.7)
          (xy -0.98 0.3)
          (xy -0.33 0.3)
          (xy -0.33 -0.3)
          (xy -0.98 -0.3)
          (xy -0.98 -0.7)
          (xy 0.33 -0.7)
        )
        (width 0) (fill yes))
    ) (tstamp 59d5e578-23ab-468a-a896-98e1045d563b))
  (pad "2" smd rect (at -3.8 -1.5) (size 1.3 0.4) (layers "F.Cu" "F.Mask") (tstamp 6ad557ef-382b-48ea-a3f5-f81a3a857ab4))
  (pad "3" smd rect (at -3.8 -0.5) (size 1.3 0.4) (layers "F.Cu" "F.Mask") (tstamp e36fb2c3-f4c7-4768-9a8e-34086728baf4))
  (pad "4" smd rect (at -3.8 0.5) (size 1.3 0.4) (layers "F.Cu" "F.Mask") (tstamp cb829a7c-e238-480c-b197-c7fd66b2480e))
  (pad "5" smd rect (at -3.8 1.5) (size 1.3 0.4) (layers "F.Cu" "F.Mask") (tstamp 952c5d78-dd00-46ea-81cf-86850c869969))
  (pad "6" smd custom (at -3.47 3) (size 0.66 1.4) (layers "F.Cu" "F.Mask")
    (zone_connect 2) (thermal_bridge_angle 45)
    (options (clearance outline) (anchor rect))
    (primitives
      (gr_poly
        (pts
          (xy 0.33 0.7)
          (xy -0.98 0.7)
          (xy -0.98 0.3)
          (xy -0.33 0.3)
          (xy -0.33 -0.3)
          (xy -0.98 -0.3)
          (xy -0.98 -0.7)
          (xy 0.33 -0.7)
        )
        (width 0) (fill yes))
    ) (tstamp c5851bcd-540c-4ec1-bfee-b14c35976cca))
  (pad "7" smd custom (at 2.75 2.965) (size 3.5 3.07) (layers "F.Cu" "F.Mask")
    (zone_connect 2) (thermal_bridge_angle 45)
    (options (clearance outline) (anchor rect))
    (primitives
      (gr_poly
        (pts
          (xy 1.75 -1.535)
          (xy -0.125 -1.535)
          (xy -0.125 -3.595)
          (xy 0.075 -3.795)
          (xy 1.75 -3.795)
        )
        (width 0) (fill yes))
      (gr_circle (center 0.075 -3.595) (end 0.275 -3.595) (width 0) (fill yes))
    ) (tstamp 3c077c23-4cde-4521-85cd-ed4613f161ac))
  (pad "8" smd custom (at 2.75 -2.965) (size 3.5 3.07) (layers "F.Cu" "F.Mask")
    (zone_connect 2) (thermal_bridge_angle 45)
    (options (clearance outline) (anchor rect))
    (primitives
      (gr_poly
        (pts
          (xy -0.625 3.595)
          (xy -0.825 3.795)
          (xy -1.75 3.795)
          (xy -1.75 1.535)
          (xy -0.625 1.535)
        )
        (width 0) (fill yes))
      (gr_circle (center -0.825 3.595) (end -0.625 3.595) (width 0) (fill yes))
    ) (tstamp 5b8895c6-08d9-4506-bf95-a5d67bb5ec9c))
  (model "${KICAD6_3DMODEL_DIR}/Package_SON.3dshapes/Infineon_PG-TISON-8-5.wrl"
    (offset (xyz 0 0 0))
    (scale (xyz 1 1 1))
    (rotate (xyz 0 0 0))
  )
)
