(footprint "WLCSP-20_1.994x1.94mm_Layout4x5_P0.4mm" (version 20221018) (generator pcbnew)
  (layer "F.Cu")
  (descr "WLCSP-20, https://www.nxp.com/docs/en/package-information/98ASA00539D.pdf")
  (tags "WLCSP-20")
  (attr smd)
  (fp_text reference "REF**" (at 0 -2.94) (layer "F.SilkS")
      (effects (font (size 1 1) (thickness 0.15)))
    (tstamp f35a1827-1883-4cbe-ad61-eff07305d3e7)
  )
  (fp_text value "WLCSP-20_1.994x1.94mm_Layout4x5_P0.4mm" (at 0 3.28) (layer "F.Fab")
      (effects (font (size 1 1) (thickness 0.15)))
    (tstamp 7aa3623a-6d29-4fc3-a7ef-d5ac74bfa597)
  )
  (fp_text user "${REFERENCE}" (at 0 0) (layer "F.Fab")
      (effects (font (size 0.25 0.25) (thickness 0.05)))
    (tstamp 00d54a29-83ab-4805-bb5c-ee63550da1e2)
  )
  (fp_line (start -1.25 -1.25) (end -1.25 -0.8)
    (stroke (width 0.1) (type solid)) (layer "F.SilkS") (tstamp e14856e4-db04-4b55-a631-d59dfc45b002))
  (fp_line (start -1.07 1.1) (end -1.07 -1.1)
    (stroke (width 0.1) (type solid)) (layer "F.SilkS") (tstamp 4da86b63-d821-485e-91dc-c144f96770f2))
  (fp_line (start -0.6 -1.25) (end -1.25 -1.25)
    (stroke (width 0.1) (type solid)) (layer "F.SilkS") (tstamp 2af61b84-b581-4c4a-a949-818bff7a8903))
  (fp_line (start 1.07 -1.1) (end -1.07 -1.1)
    (stroke (width 0.1) (type solid)) (layer "F.SilkS") (tstamp c17aeeab-5d30-4ab1-902d-994410a737e0))
  (fp_line (start 1.07 1.1) (end -1.07 1.1)
    (stroke (width 0.1) (type solid)) (layer "F.SilkS") (tstamp 9d502368-28b3-49c1-acdd-c51f81c02e28))
  (fp_line (start 1.07 1.1) (end 1.07 -1.1)
    (stroke (width 0.1) (type solid)) (layer "F.SilkS") (tstamp be08340b-2817-44d3-8d12-f773eb9a7b99))
  (fp_line (start -2.07 2.1) (end -2.07 -2.1)
    (stroke (width 0.05) (type solid)) (layer "F.CrtYd") (tstamp bd3bd19b-3c01-4a17-b67e-41abe9fea7aa))
  (fp_line (start 2.07 -2.1) (end -2.07 -2.1)
    (stroke (width 0.05) (type solid)) (layer "F.CrtYd") (tstamp 78f841be-8c55-43e4-b95d-66e5ea3a1165))
  (fp_line (start 2.07 2.1) (end -2.07 2.1)
    (stroke (width 0.05) (type solid)) (layer "F.CrtYd") (tstamp 1c07b97b-4416-4e79-b0c1-d44ea26f5566))
  (fp_line (start 2.07 2.1) (end 2.07 -2.1)
    (stroke (width 0.05) (type solid)) (layer "F.CrtYd") (tstamp 2c157888-8ca7-4fd9-a6cc-1ced7ae39586))
  (fp_line (start -0.97 -0.67) (end -0.71 -1)
    (stroke (width 0.1) (type solid)) (layer "F.Fab") (tstamp c528efc8-7f56-4180-8335-cf39239c8cd0))
  (fp_line (start -0.97 0.997) (end -0.97 -0.66)
    (stroke (width 0.1) (type solid)) (layer "F.Fab") (tstamp 22f95fab-62e2-456e-8e9c-68f3a5894b2d))
  (fp_line (start -0.97 1) (end 0.97 1)
    (stroke (width 0.1) (type solid)) (layer "F.Fab") (tstamp b87886e6-578b-44b9-85b2-77b57b05ecef))
  (fp_line (start -0.7 -1) (end 0.97 -1)
    (stroke (width 0.1) (type solid)) (layer "F.Fab") (tstamp 0bc49646-680d-4e29-a401-415fda931e2d))
  (fp_line (start 0.97 0.997) (end 0.97 -0.997)
    (stroke (width 0.1) (type solid)) (layer "F.Fab") (tstamp f66a7d3c-acd9-406c-85e6-effdf8c63b12))
  (pad "A1" smd circle (at -0.6 -0.8) (size 0.258 0.258) (layers "F.Cu" "F.Paste" "F.Mask") (tstamp 3deabffd-7ccb-4ef2-8beb-0fd49342e109))
  (pad "A2" smd circle (at -0.2 -0.8) (size 0.258 0.258) (layers "F.Cu" "F.Paste" "F.Mask") (tstamp dbcde9d9-0910-424f-9e02-7a1a1eaddf70))
  (pad "A3" smd circle (at 0.2 -0.8) (size 0.258 0.258) (layers "F.Cu" "F.Paste" "F.Mask") (tstamp 1f60c15e-3c8d-4611-8cbf-edd78da7d704))
  (pad "A4" smd circle (at 0.6 -0.8) (size 0.258 0.258) (layers "F.Cu" "F.Paste" "F.Mask") (tstamp 7b3f536e-dec6-4317-8d79-5bfe29aa3825))
  (pad "B1" smd circle (at -0.6 -0.4) (size 0.258 0.258) (layers "F.Cu" "F.Paste" "F.Mask") (tstamp ff82cc87-a891-435a-ab63-78903a4df0f4))
  (pad "B2" smd circle (at -0.2 -0.4) (size 0.258 0.258) (layers "F.Cu" "F.Paste" "F.Mask") (tstamp db674b30-26dc-4c29-8276-abb4f51857c9))
  (pad "B3" smd circle (at 0.2 -0.4) (size 0.258 0.258) (layers "F.Cu" "F.Paste" "F.Mask") (tstamp 47c0708e-9391-4700-8d03-f4a69d385a0e))
  (pad "B4" smd circle (at 0.6 -0.4) (size 0.258 0.258) (layers "F.Cu" "F.Paste" "F.Mask") (tstamp 0ab8e8ab-3b03-4d34-b8fa-bf9f2f5fef53))
  (pad "C1" smd circle (at -0.6 0) (size 0.258 0.258) (layers "F.Cu" "F.Paste" "F.Mask") (tstamp 01d5710d-83a0-4bef-8129-cfcf43619bb7))
  (pad "C2" smd circle (at -0.2 0) (size 0.258 0.258) (layers "F.Cu" "F.Paste" "F.Mask") (tstamp 4f6ad169-74a0-411b-9402-33248a28305b))
  (pad "C3" smd circle (at 0.2 0) (size 0.258 0.258) (layers "F.Cu" "F.Paste" "F.Mask") (tstamp b3d4184b-553a-4a9f-b6ff-cd0e3e893830))
  (pad "C4" smd circle (at 0.6 0) (size 0.258 0.258) (layers "F.Cu" "F.Paste" "F.Mask") (tstamp 529060cd-a883-452b-ab44-28fd69a4d8c0))
  (pad "D1" smd circle (at -0.6 0.4) (size 0.258 0.258) (layers "F.Cu" "F.Paste" "F.Mask") (tstamp 10036242-180c-4957-88a3-d1361227a4a5))
  (pad "D2" smd circle (at -0.2 0.4) (size 0.258 0.258) (layers "F.Cu" "F.Paste" "F.Mask") (tstamp d9f3578a-e6ed-4c6d-bf79-322099fb8c4f))
  (pad "D3" smd circle (at 0.2 0.4) (size 0.258 0.258) (layers "F.Cu" "F.Paste" "F.Mask") (tstamp 6f1f6ad3-2ea9-4f00-b11e-dd7cf2faf543))
  (pad "D4" smd circle (at 0.6 0.4) (size 0.258 0.258) (layers "F.Cu" "F.Paste" "F.Mask") (tstamp 96afcb5b-a40d-42d5-8a15-65a006c3b913))
  (pad "E1" smd circle (at -0.6 0.8) (size 0.258 0.258) (layers "F.Cu" "F.Paste" "F.Mask") (tstamp 4bf1ad09-5483-497d-9bb5-8567f1f44513))
  (pad "E2" smd circle (at -0.2 0.8) (size 0.258 0.258) (layers "F.Cu" "F.Paste" "F.Mask") (tstamp 47220319-2f76-4d32-9849-a39f131e9d58))
  (pad "E3" smd circle (at 0.2 0.8) (size 0.258 0.258) (layers "F.Cu" "F.Paste" "F.Mask") (tstamp bfbbd3b2-ac22-474e-8e34-afbcb9422500))
  (pad "E4" smd circle (at 0.6 0.8) (size 0.258 0.258) (layers "F.Cu" "F.Paste" "F.Mask") (tstamp ddfef544-6903-4da2-bc79-5210f173549b))
  (model "${KICAD6_3DMODEL_DIR}/Package_CSP.3dshapes/WLCSP-20_1.994x1.94mm_Layout4x5_P0.4mm.wrl"
    (offset (xyz 0 0 0))
    (scale (xyz 1 1 1))
    (rotate (xyz 0 0 0))
  )
)
