(footprint "TO-263-2_TabPin1" (version 20221018) (generator pcbnew)
  (layer "F.Cu")
  (descr "TO-263 / D2PAK / DDPAK SMD package, tab to pin 1, https://www.wolfspeed.com/media/downloads/137/C3D06060G.pdf")
  (tags "D2PAK DDPAK TO-263 D2PAK-3 TO-263-3 SOT-404 diode")
  (attr smd)
  (fp_text reference "REF**" (at -1.875 -6.65) (layer "F.SilkS")
      (effects (font (size 1 1) (thickness 0.15)))
    (tstamp 8bdaf2c3-39cd-4081-b27f-5649963f4ed3)
  )
  (fp_text value "TO-263-2_TabPin1" (at -1.875 6.65) (layer "F.Fab")
      (effects (font (size 1 1) (thickness 0.15)))
    (tstamp 7f4c623c-b6b9-4354-8801-7fa93f2be18c)
  )
  (fp_text user "${REFERENCE}" (at -1.875 0) (layer "F.Fab")
      (effects (font (size 1 1) (thickness 0.15)))
    (tstamp 44945842-0858-40ca-9971-3ec9fcff85ca)
  )
  (fp_line (start -4.825 -5.2) (end -4.825 -3.39)
    (stroke (width 0.12) (type solid)) (layer "F.SilkS") (tstamp 72f98e19-de9f-4e78-9abd-4afdf1342526))
  (fp_line (start -4.825 -3.39) (end -9.95 -3.39)
    (stroke (width 0.12) (type solid)) (layer "F.SilkS") (tstamp 1064fb6b-0fe6-46f1-9105-193f8712da03))
  (fp_line (start -4.825 3.39) (end -5.925 3.39)
    (stroke (width 0.12) (type solid)) (layer "F.SilkS") (tstamp e9a88234-f977-4293-90b1-439875df2960))
  (fp_line (start -4.825 5.2) (end -4.825 3.39)
    (stroke (width 0.12) (type solid)) (layer "F.SilkS") (tstamp 5d350d2c-6b66-45cb-98dd-0dd160f9f096))
  (fp_line (start -3.325 -5.2) (end -4.825 -5.2)
    (stroke (width 0.12) (type solid)) (layer "F.SilkS") (tstamp c675624e-2bd1-41e8-93f9-8b9a70788eef))
  (fp_line (start -3.325 5.2) (end -4.825 5.2)
    (stroke (width 0.12) (type solid)) (layer "F.SilkS") (tstamp 8816f958-ee87-489a-ad1b-3cf21eb958ca))
  (fp_line (start -10.2 -5.65) (end -10.2 5.65)
    (stroke (width 0.05) (type solid)) (layer "F.CrtYd") (tstamp d7171f74-76eb-4bdd-9b9a-7466bc3472d5))
  (fp_line (start -10.2 5.65) (end 6.45 5.65)
    (stroke (width 0.05) (type solid)) (layer "F.CrtYd") (tstamp 041cb104-d797-4192-9dab-fc4ef9323b4d))
  (fp_line (start 6.45 -5.65) (end -10.2 -5.65)
    (stroke (width 0.05) (type solid)) (layer "F.CrtYd") (tstamp 0bf57346-7f0a-4562-a5f8-eee23973918f))
  (fp_line (start 6.45 5.65) (end 6.45 -5.65)
    (stroke (width 0.05) (type solid)) (layer "F.CrtYd") (tstamp fd115ccf-ea3c-4c39-8998-8064fe9fa8e5))
  (fp_line (start -9.325 -3.04) (end -9.325 -2.04)
    (stroke (width 0.1) (type solid)) (layer "F.Fab") (tstamp 9f59e122-e43e-497a-a864-7d31148bd5a1))
  (fp_line (start -9.325 -2.04) (end -4.625 -2.04)
    (stroke (width 0.1) (type solid)) (layer "F.Fab") (tstamp 5128c787-8b90-4166-b788-760d71ba6146))
  (fp_line (start -9.325 2.04) (end -9.325 3.04)
    (stroke (width 0.1) (type solid)) (layer "F.Fab") (tstamp af72faca-f09c-4c56-a14f-0a91e2985a31))
  (fp_line (start -9.325 3.04) (end -4.625 3.04)
    (stroke (width 0.1) (type solid)) (layer "F.Fab") (tstamp d8fb4abf-3ff7-4b3a-b5b4-121533e1e193))
  (fp_line (start -4.625 -4) (end -3.625 -5)
    (stroke (width 0.1) (type solid)) (layer "F.Fab") (tstamp dc4c0876-dc20-48cb-92e7-52134169b7af))
  (fp_line (start -4.625 -3.04) (end -9.325 -3.04)
    (stroke (width 0.1) (type solid)) (layer "F.Fab") (tstamp 183a7e5c-21a3-4ad0-8e69-72564b358757))
  (fp_line (start -4.625 2.04) (end -9.325 2.04)
    (stroke (width 0.1) (type solid)) (layer "F.Fab") (tstamp 6e5d2927-19ec-457c-ba05-d30592e6b163))
  (fp_line (start -4.625 5) (end -4.625 -4)
    (stroke (width 0.1) (type solid)) (layer "F.Fab") (tstamp 0844f525-337d-4f57-b415-3413e09a48fd))
  (fp_line (start -3.625 -5) (end 4.625 -5)
    (stroke (width 0.1) (type solid)) (layer "F.Fab") (tstamp 04068f11-814e-4cfb-9ef0-21bcabc294fb))
  (fp_line (start 4.625 -5) (end 4.625 5)
    (stroke (width 0.1) (type solid)) (layer "F.Fab") (tstamp 6f5fd486-32be-4881-a80c-6cbb35c7f4ab))
  (fp_line (start 4.625 -5) (end 5.625 -5)
    (stroke (width 0.1) (type solid)) (layer "F.Fab") (tstamp ca2a42b3-063a-4034-a0c7-4f2d16e824db))
  (fp_line (start 4.625 5) (end -4.625 5)
    (stroke (width 0.1) (type solid)) (layer "F.Fab") (tstamp 9c4a37a6-b463-487a-ba08-4d64595862a9))
  (fp_line (start 5.625 -5) (end 5.625 5)
    (stroke (width 0.1) (type solid)) (layer "F.Fab") (tstamp caec74d2-25ed-4fb3-b809-9a898b28190e))
  (fp_line (start 5.625 5) (end 4.625 5)
    (stroke (width 0.1) (type solid)) (layer "F.Fab") (tstamp f347953f-8f52-48dd-8a6b-2a94222f7c5c))
  (pad "" smd roundrect (at -0.925 -2.775) (size 4.55 5.25) (layers "F.Paste") (roundrect_rratio 0.05494505495) (tstamp 9c241ed7-9330-48cd-b037-417d64641075))
  (pad "" smd roundrect (at -0.925 2.775) (size 4.55 5.25) (layers "F.Paste") (roundrect_rratio 0.05494505495) (tstamp 156f71fd-d185-4682-bf8b-6a6a93ab5d33))
  (pad "" smd roundrect (at 3.925 -2.775) (size 4.55 5.25) (layers "F.Paste") (roundrect_rratio 0.05494505495) (tstamp 3ee3e3d1-229f-4387-96b4-ff1dbdde5654))
  (pad "" smd roundrect (at 3.925 2.775) (size 4.55 5.25) (layers "F.Paste") (roundrect_rratio 0.05494505495) (tstamp cf843efc-4d9d-407c-bca9-f7802a6ece92))
  (pad "1" smd roundrect (at -7.65 -2.54) (size 4.6 1.1) (layers "F.Cu" "F.Paste" "F.Mask") (roundrect_rratio 0.25) (tstamp 026bdb88-b74c-4376-9560-b16162c6c6f9))
  (pad "1" smd roundrect (at 1.5 0) (size 9.4 10.8) (layers "F.Cu" "F.Mask") (roundrect_rratio 0.02659574468) (tstamp 088eeb92-7d66-4ff2-a8f3-398d2f9ca0f3))
  (pad "2" smd roundrect (at -7.65 2.54) (size 4.6 1.1) (layers "F.Cu" "F.Paste" "F.Mask") (roundrect_rratio 0.25) (tstamp 36386a31-472a-487d-ba8a-381d335acf3b))
  (model "${KICAD6_3DMODEL_DIR}/Package_TO_SOT_SMD.3dshapes/TO-263-2.wrl"
    (offset (xyz 0 0 0))
    (scale (xyz 1 1 1))
    (rotate (xyz 0 0 0))
  )
)
