(footprint "HVSOF5" (version 20221018) (generator pcbnew)
  (layer "F.Cu")
  (descr "HVSOF5, http://rohmfs.rohm.com/en/techdata_basic/ic/package/hvsof5_1-e.pdf, http://rohmfs.rohm.com/en/products/databook/datasheet/ic/sensor/hall/bu52001gul-e.pdf")
  (tags "HVSOF5")
  (attr smd)
  (fp_text reference "REF**" (at 0 -1.8) (layer "F.SilkS")
      (effects (font (size 1 1) (thickness 0.15)))
    (tstamp 1901d879-b713-4719-864a-fdfd0bfff114)
  )
  (fp_text value "HVSOF5" (at 0 1.9) (layer "F.Fab")
      (effects (font (size 1 1) (thickness 0.15)))
    (tstamp de094bfe-73f9-4aed-91e7-68dc05fa3d09)
  )
  (fp_text user "${REFERENCE}" (at 0 0 90) (layer "F.Fab")
      (effects (font (size 0.4 0.4) (thickness 0.075)))
    (tstamp 245a6b83-49a7-4260-bc7a-5399424f38d3)
  )
  (fp_line (start -0.8 -0.91) (end 0.6 -0.91)
    (stroke (width 0.12) (type solid)) (layer "F.SilkS") (tstamp 9f1372d2-35db-4bdf-a5d2-6482ff05023e))
  (fp_line (start -0.6 0.91) (end 0.6 0.91)
    (stroke (width 0.12) (type solid)) (layer "F.SilkS") (tstamp 9435a733-639c-46b8-af87-90e2ed28d6ec))
  (fp_line (start -1.1 -1.05) (end -1.1 1.05)
    (stroke (width 0.05) (type solid)) (layer "F.CrtYd") (tstamp 59aa189c-6281-4953-80b4-95cbfebb183e))
  (fp_line (start -1.1 -1.05) (end 1.1 -1.05)
    (stroke (width 0.05) (type solid)) (layer "F.CrtYd") (tstamp da500b1a-b335-414a-b2a3-7e56a6f0d34f))
  (fp_line (start 1.1 1.05) (end -1.1 1.05)
    (stroke (width 0.05) (type solid)) (layer "F.CrtYd") (tstamp 4c37f121-74f7-4496-a159-6eecb70bde8a))
  (fp_line (start 1.1 1.05) (end 1.1 -1.05)
    (stroke (width 0.05) (type solid)) (layer "F.CrtYd") (tstamp b455a401-0314-4223-b5ed-e4105e5f0070))
  (fp_line (start -0.6 -0.5) (end -0.6 0.8)
    (stroke (width 0.1) (type solid)) (layer "F.Fab") (tstamp 0bd5db50-1d71-4564-bccf-9bba28a0ef1a))
  (fp_line (start -0.6 -0.5) (end -0.3 -0.8)
    (stroke (width 0.1) (type solid)) (layer "F.Fab") (tstamp 560f76a8-8aac-4d7e-833e-7bf8fb1d9f3b))
  (fp_line (start 0.6 -0.8) (end -0.3 -0.8)
    (stroke (width 0.1) (type solid)) (layer "F.Fab") (tstamp 100381af-7551-4293-a384-802b84d76bae))
  (fp_line (start 0.6 -0.8) (end 0.6 0.8)
    (stroke (width 0.1) (type solid)) (layer "F.Fab") (tstamp 97ee819b-adfb-447a-97ed-1cd0c7d5bb60))
  (fp_line (start 0.6 0.8) (end -0.6 0.8)
    (stroke (width 0.1) (type solid)) (layer "F.Fab") (tstamp 94b94509-c5ce-4d1a-9acc-6abcf455dedc))
  (pad "1" smd rect (at -0.675 -0.5) (size 0.35 0.25) (layers "F.Cu" "F.Paste" "F.Mask") (tstamp 91063a9e-f57a-4667-a241-0edc8e3d09ff))
  (pad "2" smd custom (at 0 0) (size 0.4 0.7) (layers "F.Cu" "F.Paste" "F.Mask")
    (zone_connect 2) (thermal_bridge_angle 45)
    (options (clearance outline) (anchor rect))
    (primitives
      (gr_poly
        (pts
          (xy 0.32 -0.125)
          (xy 0.7 -0.125)
          (xy 0.7 0.125)
          (xy 0.32 0.125)
          (xy 0.2 0.35)
          (xy -0.2 0.35)
          (xy -0.32 0.125)
          (xy -0.85 0.125)
          (xy -0.85 -0.125)
          (xy -0.32 -0.125)
          (xy -0.2 -0.35)
          (xy 0.2 -0.35)
        )
        (width 0) (fill yes))
    ) (tstamp ec13cf0b-0bc1-4f08-b2f8-56dd79644285))
  (pad "3" smd rect (at -0.675 0.5) (size 0.35 0.25) (layers "F.Cu" "F.Paste" "F.Mask") (tstamp 762531dd-2f6f-47eb-bb6f-f037c65d3f7d))
  (pad "4" smd rect (at 0.675 0.5) (size 0.35 0.25) (layers "F.Cu" "F.Paste" "F.Mask") (tstamp f4d270ee-40fa-4ce2-b177-3721437cafbc))
  (pad "5" smd rect (at 0.675 -0.5) (size 0.35 0.25) (layers "F.Cu" "F.Paste" "F.Mask") (tstamp 5b006b4e-c871-4ce7-91ca-69b9aa76d61c))
  (model "${KICAD6_3DMODEL_DIR}/Package_TO_SOT_SMD.3dshapes/HVSOF5.wrl"
    (offset (xyz 0 0 0))
    (scale (xyz 1 1 1))
    (rotate (xyz 0 0 0))
  )
)
