(footprint "TQFP-80_12x12mm_P0.5mm" (version 20221018) (generator pcbnew)
  (layer "F.Cu")
  (descr "80-Lead Plastic Thin Quad Flatpack (PT) - 12x12x1 mm Body, 2.00 mm [TQFP] (see Microchip Packaging Specification 00000049BS.pdf)")
  (tags "QFP 0.5")
  (attr smd)
  (fp_text reference "REF**" (at 0 -8.45) (layer "F.SilkS")
      (effects (font (size 1 1) (thickness 0.15)))
    (tstamp cb2d547e-e656-46f1-9439-80d271182b65)
  )
  (fp_text value "TQFP-80_12x12mm_P0.5mm" (at 0 8.45) (layer "F.Fab")
      (effects (font (size 1 1) (thickness 0.15)))
    (tstamp 9a492ed4-f964-491c-8669-556fbf2ea2d5)
  )
  (fp_text user "${REFERENCE}" (at 0 0) (layer "F.Fab")
      (effects (font (size 1 1) (thickness 0.15)))
    (tstamp 0b9283be-c8a9-4de6-886a-43fc8b51ffb1)
  )
  (fp_line (start -6.175 -6.175) (end -6.175 -5.225)
    (stroke (width 0.15) (type solid)) (layer "F.SilkS") (tstamp 9d6ca3be-d0ff-4c47-90c0-abcdedf8f0f1))
  (fp_line (start -6.175 -6.175) (end -5.125 -6.175)
    (stroke (width 0.15) (type solid)) (layer "F.SilkS") (tstamp f8cce235-d298-4fb7-9455-554b5e7ebdce))
  (fp_line (start -6.175 -5.225) (end -7.45 -5.225)
    (stroke (width 0.15) (type solid)) (layer "F.SilkS") (tstamp 5bbb22b8-e82e-44ad-9afe-a82a9cb0b30d))
  (fp_line (start -6.175 6.175) (end -6.175 5.125)
    (stroke (width 0.15) (type solid)) (layer "F.SilkS") (tstamp 6e6f176a-6242-400b-a729-06c4341da44b))
  (fp_line (start -6.175 6.175) (end -5.125 6.175)
    (stroke (width 0.15) (type solid)) (layer "F.SilkS") (tstamp 45a4250e-cce1-4003-ac0b-3bca8d814e93))
  (fp_line (start 6.175 -6.175) (end 5.125 -6.175)
    (stroke (width 0.15) (type solid)) (layer "F.SilkS") (tstamp 18de9ae2-4b93-4710-b369-eaf34ea0e415))
  (fp_line (start 6.175 -6.175) (end 6.175 -5.125)
    (stroke (width 0.15) (type solid)) (layer "F.SilkS") (tstamp b4dd482a-fbff-4cd3-a92c-b7821e71df13))
  (fp_line (start 6.175 6.175) (end 5.125 6.175)
    (stroke (width 0.15) (type solid)) (layer "F.SilkS") (tstamp e74702b1-7321-4658-af3a-14999f6cd412))
  (fp_line (start 6.175 6.175) (end 6.175 5.125)
    (stroke (width 0.15) (type solid)) (layer "F.SilkS") (tstamp 1997390d-618f-4496-8ed9-890621054701))
  (fp_line (start -7.7 -7.7) (end -7.7 7.7)
    (stroke (width 0.05) (type solid)) (layer "F.CrtYd") (tstamp ada31a43-8f71-4d08-9370-b26126e34863))
  (fp_line (start -7.7 -7.7) (end 7.7 -7.7)
    (stroke (width 0.05) (type solid)) (layer "F.CrtYd") (tstamp 0dbdc1aa-aaf7-4240-9ff6-de4980c8bbe8))
  (fp_line (start -7.7 7.7) (end 7.7 7.7)
    (stroke (width 0.05) (type solid)) (layer "F.CrtYd") (tstamp 7d66d014-6d89-475f-84d4-882024948d8c))
  (fp_line (start 7.7 -7.7) (end 7.7 7.7)
    (stroke (width 0.05) (type solid)) (layer "F.CrtYd") (tstamp 6f3353c8-123c-4088-a654-847a22d8100d))
  (fp_line (start -6 -5) (end -5 -6)
    (stroke (width 0.15) (type solid)) (layer "F.Fab") (tstamp 5dd9c570-8151-4b51-93c4-4be5feb78531))
  (fp_line (start -6 6) (end -6 -5)
    (stroke (width 0.15) (type solid)) (layer "F.Fab") (tstamp b39e22a0-5c55-46c4-a112-f9933099b12a))
  (fp_line (start -5 -6) (end 6 -6)
    (stroke (width 0.15) (type solid)) (layer "F.Fab") (tstamp 1a6a4b8c-811a-4f08-90ba-f93a524177a5))
  (fp_line (start 6 -6) (end 6 6)
    (stroke (width 0.15) (type solid)) (layer "F.Fab") (tstamp a57a17c0-5c0b-4953-a51b-08141be0e5aa))
  (fp_line (start 6 6) (end -6 6)
    (stroke (width 0.15) (type solid)) (layer "F.Fab") (tstamp 963a6b53-db78-4809-bb9f-9b70d35d6d8b))
  (pad "1" smd rect (at -6.7 -4.75) (size 1.5 0.3) (layers "F.Cu" "F.Paste" "F.Mask") (tstamp 16498562-228c-461e-bbe8-f9a2de9fbfb9))
  (pad "2" smd rect (at -6.7 -4.25) (size 1.5 0.3) (layers "F.Cu" "F.Paste" "F.Mask") (tstamp fed46e7d-78fc-4e13-906c-0a879ea9390d))
  (pad "3" smd rect (at -6.7 -3.75) (size 1.5 0.3) (layers "F.Cu" "F.Paste" "F.Mask") (tstamp 0dc360d1-9995-4f79-bcc6-a119573874e3))
  (pad "4" smd rect (at -6.7 -3.25) (size 1.5 0.3) (layers "F.Cu" "F.Paste" "F.Mask") (tstamp 02139532-eb98-4216-98d2-688cf55e3fd4))
  (pad "5" smd rect (at -6.7 -2.75) (size 1.5 0.3) (layers "F.Cu" "F.Paste" "F.Mask") (tstamp ec19c3c1-9cdf-4d0a-a23b-dc1604c78ff6))
  (pad "6" smd rect (at -6.7 -2.25) (size 1.5 0.3) (layers "F.Cu" "F.Paste" "F.Mask") (tstamp f90b894e-2be1-49cc-a59d-3354ed94aa14))
  (pad "7" smd rect (at -6.7 -1.75) (size 1.5 0.3) (layers "F.Cu" "F.Paste" "F.Mask") (tstamp 6eabdcfa-8f2b-4dc3-87dd-677b1dd0358d))
  (pad "8" smd rect (at -6.7 -1.25) (size 1.5 0.3) (layers "F.Cu" "F.Paste" "F.Mask") (tstamp d30e916c-cec0-4471-aebf-ebf6a511fc6f))
  (pad "9" smd rect (at -6.7 -0.75) (size 1.5 0.3) (layers "F.Cu" "F.Paste" "F.Mask") (tstamp a89287bc-e37e-4b80-a1d4-42579a8a671d))
  (pad "10" smd rect (at -6.7 -0.25) (size 1.5 0.3) (layers "F.Cu" "F.Paste" "F.Mask") (tstamp ac9b523e-cba8-4cfb-9794-71745776ea5e))
  (pad "11" smd rect (at -6.7 0.25) (size 1.5 0.3) (layers "F.Cu" "F.Paste" "F.Mask") (tstamp ca7e65b3-ea99-4e04-ba68-016e4e8080ac))
  (pad "12" smd rect (at -6.7 0.75) (size 1.5 0.3) (layers "F.Cu" "F.Paste" "F.Mask") (tstamp 81dfadef-5151-43aa-8730-6ffff678dc63))
  (pad "13" smd rect (at -6.7 1.25) (size 1.5 0.3) (layers "F.Cu" "F.Paste" "F.Mask") (tstamp 524505d1-16ff-41d6-af9f-f58871f5bf7e))
  (pad "14" smd rect (at -6.7 1.75) (size 1.5 0.3) (layers "F.Cu" "F.Paste" "F.Mask") (tstamp e7da3599-6552-4a48-b74b-e8f4c524800f))
  (pad "15" smd rect (at -6.7 2.25) (size 1.5 0.3) (layers "F.Cu" "F.Paste" "F.Mask") (tstamp 4fab484b-7d18-4f3a-b5bd-106b45c7e966))
  (pad "16" smd rect (at -6.7 2.75) (size 1.5 0.3) (layers "F.Cu" "F.Paste" "F.Mask") (tstamp e7bd0a4a-7d29-4278-8710-51ced415c5ee))
  (pad "17" smd rect (at -6.7 3.25) (size 1.5 0.3) (layers "F.Cu" "F.Paste" "F.Mask") (tstamp 99f0f2ee-2e89-4416-8a1c-4f576034c43b))
  (pad "18" smd rect (at -6.7 3.75) (size 1.5 0.3) (layers "F.Cu" "F.Paste" "F.Mask") (tstamp ecb077e3-ab42-48e0-a80d-c6ea50b59981))
  (pad "19" smd rect (at -6.7 4.25) (size 1.5 0.3) (layers "F.Cu" "F.Paste" "F.Mask") (tstamp 06ac3e22-4304-40a6-997e-ce91bdbc84fd))
  (pad "20" smd rect (at -6.7 4.75) (size 1.5 0.3) (layers "F.Cu" "F.Paste" "F.Mask") (tstamp 55abd88c-9364-4c97-963d-6ac07a3c3f84))
  (pad "21" smd rect (at -4.75 6.7 90) (size 1.5 0.3) (layers "F.Cu" "F.Paste" "F.Mask") (tstamp 2db2a12d-f2ca-4892-a3d3-40ed8eec319f))
  (pad "22" smd rect (at -4.25 6.7 90) (size 1.5 0.3) (layers "F.Cu" "F.Paste" "F.Mask") (tstamp f49b4359-8e73-417f-848b-66a7901fabb3))
  (pad "23" smd rect (at -3.75 6.7 90) (size 1.5 0.3) (layers "F.Cu" "F.Paste" "F.Mask") (tstamp 69d3d76d-dd0f-46dc-9a9f-66523d8fbb8f))
  (pad "24" smd rect (at -3.25 6.7 90) (size 1.5 0.3) (layers "F.Cu" "F.Paste" "F.Mask") (tstamp 5b0971fa-656a-406e-97a5-72ede680a4c1))
  (pad "25" smd rect (at -2.75 6.7 90) (size 1.5 0.3) (layers "F.Cu" "F.Paste" "F.Mask") (tstamp 86d2810c-5f00-4e83-b7dc-42f599e8cc6e))
  (pad "26" smd rect (at -2.25 6.7 90) (size 1.5 0.3) (layers "F.Cu" "F.Paste" "F.Mask") (tstamp 78fa80be-54d8-4e23-b031-245fe4819023))
  (pad "27" smd rect (at -1.75 6.7 90) (size 1.5 0.3) (layers "F.Cu" "F.Paste" "F.Mask") (tstamp a8bc4fd2-db78-4d29-9f21-dc2f8a3625f0))
  (pad "28" smd rect (at -1.25 6.7 90) (size 1.5 0.3) (layers "F.Cu" "F.Paste" "F.Mask") (tstamp d200d7d3-a207-4a9e-b9e3-63d3d8c4a252))
  (pad "29" smd rect (at -0.75 6.7 90) (size 1.5 0.3) (layers "F.Cu" "F.Paste" "F.Mask") (tstamp c4b78217-10ef-402c-a834-ad109d94eea5))
  (pad "30" smd rect (at -0.25 6.7 90) (size 1.5 0.3) (layers "F.Cu" "F.Paste" "F.Mask") (tstamp c329ccf9-d3bc-4bbe-8b71-7ce0759ecbb1))
  (pad "31" smd rect (at 0.25 6.7 90) (size 1.5 0.3) (layers "F.Cu" "F.Paste" "F.Mask") (tstamp 7c40cdc5-e41f-4c0e-ae5a-e7d47376bf51))
  (pad "32" smd rect (at 0.75 6.7 90) (size 1.5 0.3) (layers "F.Cu" "F.Paste" "F.Mask") (tstamp c6c76baa-a79e-4716-a9f4-82c858e1bd2b))
  (pad "33" smd rect (at 1.25 6.7 90) (size 1.5 0.3) (layers "F.Cu" "F.Paste" "F.Mask") (tstamp d4059218-15c0-4fd8-b078-7d7d64fa9402))
  (pad "34" smd rect (at 1.75 6.7 90) (size 1.5 0.3) (layers "F.Cu" "F.Paste" "F.Mask") (tstamp 754acedd-eca9-4126-954c-752b27de0cd7))
  (pad "35" smd rect (at 2.25 6.7 90) (size 1.5 0.3) (layers "F.Cu" "F.Paste" "F.Mask") (tstamp 4cd5c5f2-86fe-4a6c-a043-56ab42ba2b31))
  (pad "36" smd rect (at 2.75 6.7 90) (size 1.5 0.3) (layers "F.Cu" "F.Paste" "F.Mask") (tstamp 5999507b-f8f4-4a1f-870d-db993422fb7d))
  (pad "37" smd rect (at 3.25 6.7 90) (size 1.5 0.3) (layers "F.Cu" "F.Paste" "F.Mask") (tstamp fbff2ada-8a01-4e0f-9106-188912e99e9e))
  (pad "38" smd rect (at 3.75 6.7 90) (size 1.5 0.3) (layers "F.Cu" "F.Paste" "F.Mask") (tstamp 15efdf66-9554-43b9-b1db-157f081e134c))
  (pad "39" smd rect (at 4.25 6.7 90) (size 1.5 0.3) (layers "F.Cu" "F.Paste" "F.Mask") (tstamp ea16c81a-33f3-468a-95e8-726cee5f69ba))
  (pad "40" smd rect (at 4.75 6.7 90) (size 1.5 0.3) (layers "F.Cu" "F.Paste" "F.Mask") (tstamp d8955d5b-2acc-4a9b-a7d8-320f32b18c48))
  (pad "41" smd rect (at 6.7 4.75) (size 1.5 0.3) (layers "F.Cu" "F.Paste" "F.Mask") (tstamp 15e3b6c8-bf78-4d53-a9fd-5bd54f5c40c4))
  (pad "42" smd rect (at 6.7 4.25) (size 1.5 0.3) (layers "F.Cu" "F.Paste" "F.Mask") (tstamp 0155ee8c-876b-4418-9a54-f1672c433434))
  (pad "43" smd rect (at 6.7 3.75) (size 1.5 0.3) (layers "F.Cu" "F.Paste" "F.Mask") (tstamp dea994db-60a0-4ec9-8569-a0e268444140))
  (pad "44" smd rect (at 6.7 3.25) (size 1.5 0.3) (layers "F.Cu" "F.Paste" "F.Mask") (tstamp 12f2e382-734e-4350-a126-3c1d927da88d))
  (pad "45" smd rect (at 6.7 2.75) (size 1.5 0.3) (layers "F.Cu" "F.Paste" "F.Mask") (tstamp 5fc11b90-34c0-42ab-867e-6084dde850c0))
  (pad "46" smd rect (at 6.7 2.25) (size 1.5 0.3) (layers "F.Cu" "F.Paste" "F.Mask") (tstamp 84325ed5-09f9-4dce-943f-f1a0c9799d04))
  (pad "47" smd rect (at 6.7 1.75) (size 1.5 0.3) (layers "F.Cu" "F.Paste" "F.Mask") (tstamp c50da6d2-75a7-4876-a8dc-edb2a6abb0b7))
  (pad "48" smd rect (at 6.7 1.25) (size 1.5 0.3) (layers "F.Cu" "F.Paste" "F.Mask") (tstamp 8051ae07-14ca-4de7-b94a-f57c29a4b496))
  (pad "49" smd rect (at 6.7 0.75) (size 1.5 0.3) (layers "F.Cu" "F.Paste" "F.Mask") (tstamp d2d02d72-0f7b-4b56-a027-5120e4b13264))
  (pad "50" smd rect (at 6.7 0.25) (size 1.5 0.3) (layers "F.Cu" "F.Paste" "F.Mask") (tstamp cf06d05f-af51-49ae-a44a-82dca47e34a7))
  (pad "51" smd rect (at 6.7 -0.25) (size 1.5 0.3) (layers "F.Cu" "F.Paste" "F.Mask") (tstamp 36fab4b1-2c6c-4288-a0e6-373b7bff1635))
  (pad "52" smd rect (at 6.7 -0.75) (size 1.5 0.3) (layers "F.Cu" "F.Paste" "F.Mask") (tstamp 132a9ba9-775b-4168-94bf-c363bd1417b9))
  (pad "53" smd rect (at 6.7 -1.25) (size 1.5 0.3) (layers "F.Cu" "F.Paste" "F.Mask") (tstamp 1c404da2-911b-4644-b2a3-b5cd69ad46b6))
  (pad "54" smd rect (at 6.7 -1.75) (size 1.5 0.3) (layers "F.Cu" "F.Paste" "F.Mask") (tstamp 00671c44-138a-4490-abd0-1d2c58a3f676))
  (pad "55" smd rect (at 6.7 -2.25) (size 1.5 0.3) (layers "F.Cu" "F.Paste" "F.Mask") (tstamp 0d13b5a5-3b22-476a-879e-f11045c57248))
  (pad "56" smd rect (at 6.7 -2.75) (size 1.5 0.3) (layers "F.Cu" "F.Paste" "F.Mask") (tstamp dd00507d-6a11-4465-850e-dc50cc607909))
  (pad "57" smd rect (at 6.7 -3.25) (size 1.5 0.3) (layers "F.Cu" "F.Paste" "F.Mask") (tstamp 741fcd86-0b97-4a67-8c5c-27851069a430))
  (pad "58" smd rect (at 6.7 -3.75) (size 1.5 0.3) (layers "F.Cu" "F.Paste" "F.Mask") (tstamp 3b77580b-f200-486d-9ec3-c1bfe92eb24d))
  (pad "59" smd rect (at 6.7 -4.25) (size 1.5 0.3) (layers "F.Cu" "F.Paste" "F.Mask") (tstamp 0ee38036-1324-4577-bc89-40957a29b497))
  (pad "60" smd rect (at 6.7 -4.75) (size 1.5 0.3) (layers "F.Cu" "F.Paste" "F.Mask") (tstamp 86777689-d96e-4db5-82e1-4addbc144264))
  (pad "61" smd rect (at 4.75 -6.7 90) (size 1.5 0.3) (layers "F.Cu" "F.Paste" "F.Mask") (tstamp ffb30fec-4f85-463c-a6f6-b0686ca3ddd9))
  (pad "62" smd rect (at 4.25 -6.7 90) (size 1.5 0.3) (layers "F.Cu" "F.Paste" "F.Mask") (tstamp 6ae64753-254f-4839-a47a-c29dcd5651d5))
  (pad "63" smd rect (at 3.75 -6.7 90) (size 1.5 0.3) (layers "F.Cu" "F.Paste" "F.Mask") (tstamp a7ab9a76-4d93-4866-bb1f-add65b6ff649))
  (pad "64" smd rect (at 3.25 -6.7 90) (size 1.5 0.3) (layers "F.Cu" "F.Paste" "F.Mask") (tstamp 4fd97e3b-2fb1-4f90-a865-21453bb33947))
  (pad "65" smd rect (at 2.75 -6.7 90) (size 1.5 0.3) (layers "F.Cu" "F.Paste" "F.Mask") (tstamp b5bcd9e4-9bd3-4ce8-8a59-74f12834d651))
  (pad "66" smd rect (at 2.25 -6.7 90) (size 1.5 0.3) (layers "F.Cu" "F.Paste" "F.Mask") (tstamp a4f1fc3f-6a8c-424e-8ebb-cd1f69122702))
  (pad "67" smd rect (at 1.75 -6.7 90) (size 1.5 0.3) (layers "F.Cu" "F.Paste" "F.Mask") (tstamp b73db229-1dd2-4362-96f3-9c53f87bae40))
  (pad "68" smd rect (at 1.25 -6.7 90) (size 1.5 0.3) (layers "F.Cu" "F.Paste" "F.Mask") (tstamp e4c23ed9-af61-4a59-a265-757ee20823a0))
  (pad "69" smd rect (at 0.75 -6.7 90) (size 1.5 0.3) (layers "F.Cu" "F.Paste" "F.Mask") (tstamp cc5ef2ca-8d7a-4d55-98ec-1ee0cb51f280))
  (pad "70" smd rect (at 0.25 -6.7 90) (size 1.5 0.3) (layers "F.Cu" "F.Paste" "F.Mask") (tstamp 1c7886f1-f4e4-4db8-8a9d-ca2f337d0799))
  (pad "71" smd rect (at -0.25 -6.7 90) (size 1.5 0.3) (layers "F.Cu" "F.Paste" "F.Mask") (tstamp 805febd5-a81d-4029-9178-4123b03f8336))
  (pad "72" smd rect (at -0.75 -6.7 90) (size 1.5 0.3) (layers "F.Cu" "F.Paste" "F.Mask") (tstamp 977c3f3b-7cf3-4f55-8407-93a4a93a14e2))
  (pad "73" smd rect (at -1.25 -6.7 90) (size 1.5 0.3) (layers "F.Cu" "F.Paste" "F.Mask") (tstamp dba08f86-a59e-4223-9ff4-94911b8660c1))
  (pad "74" smd rect (at -1.75 -6.7 90) (size 1.5 0.3) (layers "F.Cu" "F.Paste" "F.Mask") (tstamp c3c5b21a-287f-4d02-b673-b6b1ebf6560b))
  (pad "75" smd rect (at -2.25 -6.7 90) (size 1.5 0.3) (layers "F.Cu" "F.Paste" "F.Mask") (tstamp 1423b2e8-dd1a-446b-9b2b-48b4db2d6e52))
  (pad "76" smd rect (at -2.75 -6.7 90) (size 1.5 0.3) (layers "F.Cu" "F.Paste" "F.Mask") (tstamp 5b9c25cf-94bb-4f2e-bada-23b465a31c01))
  (pad "77" smd rect (at -3.25 -6.7 90) (size 1.5 0.3) (layers "F.Cu" "F.Paste" "F.Mask") (tstamp 475d4297-06ec-4101-bff4-d7c438e2ff9e))
  (pad "78" smd rect (at -3.75 -6.7 90) (size 1.5 0.3) (layers "F.Cu" "F.Paste" "F.Mask") (tstamp dfadf589-f407-4804-b562-93fbe445972f))
  (pad "79" smd rect (at -4.25 -6.7 90) (size 1.5 0.3) (layers "F.Cu" "F.Paste" "F.Mask") (tstamp ccdf01db-edde-4c30-9d9a-fceef4c88589))
  (pad "80" smd rect (at -4.75 -6.7 90) (size 1.5 0.3) (layers "F.Cu" "F.Paste" "F.Mask") (tstamp 75a95a2d-8b08-40d6-9df6-73fe52d79a84))
  (model "${KICAD6_3DMODEL_DIR}/Package_QFP.3dshapes/TQFP-80_12x12mm_P0.5mm.wrl"
    (offset (xyz 0 0 0))
    (scale (xyz 1 1 1))
    (rotate (xyz 0 0 0))
  )
)
