(footprint "SOT-223-8" (version 20221018) (generator pcbnew)
  (layer "F.Cu")
  (descr "module CMS SOT223 8 pins, https://www.diodes.com/assets/Datasheets/ZXSBMR16PT8.pdf")
  (tags "CMS SOT")
  (attr smd)
  (fp_text reference "REF**" (at 0 -4.5) (layer "F.SilkS")
      (effects (font (size 1 1) (thickness 0.15)))
    (tstamp 92e79c47-5827-4fff-958a-bb6a25e79a70)
  )
  (fp_text value "SOT-223-8" (at 0 4.5) (layer "F.Fab")
      (effects (font (size 1 1) (thickness 0.15)))
    (tstamp 6360ce36-64b6-4e8b-8d94-d3c086d2e544)
  )
  (fp_text user "${REFERENCE}" (at 0 0 90) (layer "F.Fab")
      (effects (font (size 0.8 0.8) (thickness 0.12)))
    (tstamp c7b0a024-e598-45c0-b35f-a205f0c5a3ea)
  )
  (fp_line (start -4.8 -3) (end -2 -3)
    (stroke (width 0.12) (type solid)) (layer "F.SilkS") (tstamp 1b5bdb26-6f2c-4539-b168-eb6a1729ed09))
  (fp_line (start -2 -3.4) (end 2 -3.4)
    (stroke (width 0.12) (type solid)) (layer "F.SilkS") (tstamp e1329b24-b209-4120-9062-ce944e1931fe))
  (fp_line (start -2 -3) (end -2 -3.4)
    (stroke (width 0.12) (type solid)) (layer "F.SilkS") (tstamp 66a59b15-051c-477e-97d8-c58c02dd5e00))
  (fp_line (start -2 3.5) (end -2 3)
    (stroke (width 0.12) (type solid)) (layer "F.SilkS") (tstamp f182c524-82a1-4634-86af-d33a016e4cf9))
  (fp_line (start 2 -3.4) (end 2 -3)
    (stroke (width 0.12) (type solid)) (layer "F.SilkS") (tstamp d21e1987-c8cb-4948-bea7-696a6d877d21))
  (fp_line (start 2 3) (end 2 3.5)
    (stroke (width 0.12) (type solid)) (layer "F.SilkS") (tstamp 50816044-a97a-4fa4-96bc-5463c4713373))
  (fp_line (start 2 3.5) (end -2 3.5)
    (stroke (width 0.12) (type solid)) (layer "F.SilkS") (tstamp 88bfc94a-43a2-4839-b248-086546eaea06))
  (fp_line (start -5.05 -3.6) (end -5.05 3.6)
    (stroke (width 0.05) (type solid)) (layer "F.CrtYd") (tstamp cf1bcb6a-5054-4345-a803-0de7464828e3))
  (fp_line (start -5.05 -3.6) (end 5.05 -3.6)
    (stroke (width 0.05) (type solid)) (layer "F.CrtYd") (tstamp a7d3c6cf-bcf2-415a-8da2-f8681f7966d4))
  (fp_line (start 5.05 3.6) (end -5.05 3.6)
    (stroke (width 0.05) (type solid)) (layer "F.CrtYd") (tstamp 8f90daa0-4e7b-40b7-9d9f-558a198bd65c))
  (fp_line (start 5.05 3.6) (end 5.05 -3.6)
    (stroke (width 0.05) (type solid)) (layer "F.CrtYd") (tstamp 3bbf5008-9184-4936-b328-7f9e637963bc))
  (fp_line (start -1.85 -2.3) (end -1.85 3.35)
    (stroke (width 0.1) (type solid)) (layer "F.Fab") (tstamp a033a5bd-e1e4-487b-a265-a0e8ca4c0d83))
  (fp_line (start -1.85 -2.3) (end -0.8 -3.35)
    (stroke (width 0.1) (type solid)) (layer "F.Fab") (tstamp e7390407-c914-44f1-ae27-bab245d3471a))
  (fp_line (start -1.85 3.35) (end 1.85 3.35)
    (stroke (width 0.1) (type solid)) (layer "F.Fab") (tstamp aab7d83b-a028-4bd9-b4a2-a90b05d6b4c2))
  (fp_line (start -0.8 -3.35) (end 1.85 -3.35)
    (stroke (width 0.1) (type solid)) (layer "F.Fab") (tstamp 5d73c0d2-0682-4d6b-afcc-f942d3bedf5f))
  (fp_line (start 1.85 -3.35) (end 1.85 3.35)
    (stroke (width 0.1) (type solid)) (layer "F.Fab") (tstamp 544c11d4-40b4-4f87-978a-25d6053413ba))
  (pad "1" smd rect (at -3.4 -2.3) (size 2.8 0.95) (layers "F.Cu" "F.Paste" "F.Mask") (tstamp 612678d5-85df-40db-958b-779f82638e4f))
  (pad "2" smd rect (at -3.4 -0.76) (size 2.8 0.95) (layers "F.Cu" "F.Paste" "F.Mask") (tstamp fd76f522-9aba-4d87-b4fa-5553000ac571))
  (pad "3" smd rect (at -3.4 0.76) (size 2.8 0.95) (layers "F.Cu" "F.Paste" "F.Mask") (tstamp daa0ae3c-e445-4d5e-9df6-f0253800eb99))
  (pad "4" smd rect (at -3.4 2.3) (size 2.8 0.95) (layers "F.Cu" "F.Paste" "F.Mask") (tstamp a4cf0baf-d526-450a-8a8f-9bc1eeaadc70))
  (pad "5" smd rect (at 3.4 2.3) (size 2.8 0.95) (layers "F.Cu" "F.Paste" "F.Mask") (tstamp ed36aa17-7ea6-4115-97f7-3e3fb4af93e7))
  (pad "6" smd rect (at 3.4 0.76) (size 2.8 0.95) (layers "F.Cu" "F.Paste" "F.Mask") (tstamp 86c9728c-c612-4f7c-affb-5c713e9fdd08))
  (pad "7" smd rect (at 3.4 -0.76) (size 2.8 0.95) (layers "F.Cu" "F.Paste" "F.Mask") (tstamp 7e0209c8-af9a-404e-ad62-14ed8f7c7840))
  (pad "8" smd rect (at 3.4 -2.3) (size 2.8 0.95) (layers "F.Cu" "F.Paste" "F.Mask") (tstamp 182a1fff-507a-48bf-869c-bfd849291d49))
  (model "${KICAD6_3DMODEL_DIR}/Package_TO_SOT_SMD.3dshapes/SOT-223-8.wrl"
    (offset (xyz 0 0 0))
    (scale (xyz 1 1 1))
    (rotate (xyz 0 0 0))
  )
)
