(footprint "OnSemi_ECH8" (version 20221018) (generator pcbnew)
  (layer "F.Cu")
  (descr "On Semiconductor ECH8, https://www.onsemi.com/pub/Collateral/318BF.PDF")
  (tags "ECH8 SOT28-FL SOT-28-FL")
  (attr smd)
  (fp_text reference "REF**" (at 0 -2.5) (layer "F.SilkS")
      (effects (font (size 1 1) (thickness 0.15)))
    (tstamp 81f20ed9-b0b4-49f6-a907-0846b52067b7)
  )
  (fp_text value "OnSemi_ECH8" (at 0 2.25 180) (layer "F.Fab")
      (effects (font (size 0.5 0.5) (thickness 0.075)))
    (tstamp 5d3a43c8-c981-4837-87c2-c36d8c11ce5f)
  )
  (fp_text user "${REFERENCE}" (at 0 0 270) (layer "F.Fab")
      (effects (font (size 0.5 0.5) (thickness 0.075)))
    (tstamp c148a3ee-1b67-43d5-9a7b-31b16ef6b9dc)
  )
  (fp_line (start -1.65 -1.45) (end -1.25 -1.45)
    (stroke (width 0.1) (type solid)) (layer "F.SilkS") (tstamp f4cd6f42-3f68-4ae9-b6ee-86cca017d169))
  (fp_line (start -1.25 -1.55) (end 1.25 -1.55)
    (stroke (width 0.1) (type solid)) (layer "F.SilkS") (tstamp b99f9f3b-21e8-4f37-aec1-5731495a0122))
  (fp_line (start -1.25 -1.45) (end -1.25 -1.55)
    (stroke (width 0.1) (type solid)) (layer "F.SilkS") (tstamp 26e9526e-2230-4353-b74e-41d564400901))
  (fp_line (start -1.25 1.4) (end -1.25 1.55)
    (stroke (width 0.1) (type solid)) (layer "F.SilkS") (tstamp 5452a40a-51c2-4dac-a031-9e65b656130c))
  (fp_line (start -1.25 1.55) (end 1.25 1.55)
    (stroke (width 0.1) (type solid)) (layer "F.SilkS") (tstamp 36a69f08-b770-4b02-8bd8-bfd272d3cc8c))
  (fp_line (start 1.25 -1.55) (end 1.25 -1.45)
    (stroke (width 0.1) (type solid)) (layer "F.SilkS") (tstamp c25db2d4-1236-4875-a706-6c77e0cd2797))
  (fp_line (start 1.25 1.55) (end 1.25 1.4)
    (stroke (width 0.1) (type solid)) (layer "F.SilkS") (tstamp 133f7931-456b-44c8-bb66-943e907e3876))
  (fp_line (start -1.95 -1.7) (end -1.95 1.7)
    (stroke (width 0.05) (type solid)) (layer "F.CrtYd") (tstamp 5bde8be7-aa19-40d6-9a8a-927e54d68c5d))
  (fp_line (start -1.95 1.7) (end 1.95 1.7)
    (stroke (width 0.05) (type solid)) (layer "F.CrtYd") (tstamp 67155e5e-4edf-4faa-84e6-a4854383ca37))
  (fp_line (start 1.95 -1.7) (end -1.95 -1.7)
    (stroke (width 0.05) (type solid)) (layer "F.CrtYd") (tstamp 9b734b12-f713-440b-b6ce-db7d386a8ae0))
  (fp_line (start 1.95 1.7) (end 1.95 -1.7)
    (stroke (width 0.05) (type solid)) (layer "F.CrtYd") (tstamp 6c461187-f00c-4ea2-923c-247ac458f068))
  (fp_line (start -1.15 -0.85) (end -0.55 -1.45)
    (stroke (width 0.1) (type solid)) (layer "F.Fab") (tstamp eecaa45b-e7e2-4393-85e7-2eba54d61a2f))
  (fp_line (start -1.15 1.45) (end -1.15 -0.85)
    (stroke (width 0.1) (type solid)) (layer "F.Fab") (tstamp 26194e18-a652-46ae-a75a-6878767e3dc2))
  (fp_line (start -0.55 -1.45) (end 1.15 -1.45)
    (stroke (width 0.1) (type solid)) (layer "F.Fab") (tstamp 705cdb01-e7cc-47a3-88fa-7b3adbf0b23d))
  (fp_line (start 1.15 -1.45) (end 1.15 1.45)
    (stroke (width 0.1) (type solid)) (layer "F.Fab") (tstamp bc299007-91be-4bf8-9c0e-ac1d0f2a2ce1))
  (fp_line (start 1.15 1.45) (end -1.15 1.45)
    (stroke (width 0.1) (type solid)) (layer "F.Fab") (tstamp 5c24cce3-a85a-45fa-9416-69e86e71fb3e))
  (pad "1" smd roundrect (at -1.4 -0.975 270) (size 0.4 0.6) (layers "F.Cu" "F.Paste" "F.Mask") (roundrect_rratio 0.25) (tstamp fc3de994-3153-45ff-8eb5-0d2be74fad37))
  (pad "2" smd roundrect (at -1.4 -0.325 270) (size 0.4 0.6) (layers "F.Cu" "F.Paste" "F.Mask") (roundrect_rratio 0.25) (tstamp 5e08dedf-ff34-44ae-a217-58a08c9a6b2a))
  (pad "3" smd roundrect (at -1.4 0.325 270) (size 0.4 0.6) (layers "F.Cu" "F.Paste" "F.Mask") (roundrect_rratio 0.25) (tstamp 28a96d8f-7bf4-4186-8406-3e57d93b4d95))
  (pad "4" smd roundrect (at -1.4 0.975 270) (size 0.4 0.6) (layers "F.Cu" "F.Paste" "F.Mask") (roundrect_rratio 0.25) (tstamp c114a188-b219-4603-a8ff-d533ec7909b2))
  (pad "5" smd roundrect (at 1.4 0.975 270) (size 0.4 0.6) (layers "F.Cu" "F.Paste" "F.Mask") (roundrect_rratio 0.25) (tstamp 3ca3178a-cc18-49e0-a67a-b175e4e4617d))
  (pad "6" smd roundrect (at 1.4 0.325 270) (size 0.4 0.6) (layers "F.Cu" "F.Paste" "F.Mask") (roundrect_rratio 0.25) (tstamp 123f29cb-e9fd-4e2e-8fb8-b91c7930d8c8))
  (pad "7" smd roundrect (at 1.4 -0.325 270) (size 0.4 0.6) (layers "F.Cu" "F.Paste" "F.Mask") (roundrect_rratio 0.25) (tstamp 2751278c-2799-4be0-b198-46c80e2146af))
  (pad "8" smd roundrect (at 1.4 -0.975 270) (size 0.4 0.6) (layers "F.Cu" "F.Paste" "F.Mask") (roundrect_rratio 0.25) (tstamp a385edae-630d-4cdc-8d7e-c89980732139))
  (model "${KICAD6_3DMODEL_DIR}/Package_TO_SOT_SMD.3dshapes/OnSemi_ECH8.wrl"
    (offset (xyz 0 0 0))
    (scale (xyz 1 1 1))
    (rotate (xyz 0 0 0))
  )
)
