(footprint "SO-5_4.4x3.6mm_P1.27mm" (version 20221018) (generator pcbnew)
  (layer "F.Cu")
  (descr "5-Lead Plastic Small Outline (SO), see https://docs.broadcom.com/cs/Satellite?blobcol=urldata&blobheader=application%2Fpdf&blobheadername1=Content-Disposition&blobheadername2=Content-Type&blobheadername3=MDT-Type&blobheadervalue1=attachment%3Bfilename%3DIPD-Selection-Guide_AV00-0254EN_030617.pdf&blobheadervalue2=application%2Fx-download&blobheadervalue3=abinary%253B%2Bcharset%253DUTF-8&blobkey=id&blobnocache=true&blobtable=MungoBlobs&blobwhere=1430884105675&ssbinary=true")
  (tags "SO SOIC 1.27")
  (attr smd)
  (fp_text reference "REF**" (at 0.1 -3.265) (layer "F.SilkS")
      (effects (font (size 1 1) (thickness 0.15)))
    (tstamp b819edda-face-4000-b371-1275dc7dd6eb)
  )
  (fp_text value "SO-5_4.4x3.6mm_P1.27mm" (at 0.05 3.385) (layer "F.Fab")
      (effects (font (size 1 1) (thickness 0.15)))
    (tstamp 6be149b2-f9ad-4143-8f78-655c42237c6c)
  )
  (fp_text user "${REFERENCE}" (at 0 -0.065) (layer "F.Fab")
      (effects (font (size 1 1) (thickness 0.15)))
    (tstamp d4b71b5f-7833-43c2-bb01-bed1f8fe821e)
  )
  (fp_line (start -2.4 -2) (end 2.4 -2)
    (stroke (width 0.12) (type solid)) (layer "F.SilkS") (tstamp fccadba2-5e98-403c-bc19-f51471e5b3ec))
  (fp_line (start -2.4 -1.85) (end -4.1 -1.85)
    (stroke (width 0.12) (type solid)) (layer "F.SilkS") (tstamp a0fc0d2d-b643-4d74-b7ce-3ac9ad779836))
  (fp_line (start -2.4 -1.85) (end -2.4 -2)
    (stroke (width 0.12) (type solid)) (layer "F.SilkS") (tstamp 13b02064-f0c2-4482-a173-093ae3e952e6))
  (fp_line (start -2.4 0.65) (end -2.4 -0.65)
    (stroke (width 0.12) (type solid)) (layer "F.SilkS") (tstamp a821b2c3-fd09-4e1a-b2d3-069118062c3c))
  (fp_line (start -2.4 2) (end -2.4 1.85)
    (stroke (width 0.12) (type solid)) (layer "F.SilkS") (tstamp e29f6f3a-ae10-487c-92ea-65584646174b))
  (fp_line (start 2.4 -2) (end 2.4 -1.85)
    (stroke (width 0.12) (type solid)) (layer "F.SilkS") (tstamp 83f86047-bff1-4341-b6b0-4aafafe7a799))
  (fp_line (start 2.4 1.85) (end 2.4 2)
    (stroke (width 0.12) (type solid)) (layer "F.SilkS") (tstamp efc8ecf8-1a4f-4092-b46a-64e7ba3b36e9))
  (fp_line (start 2.4 2) (end -2.4 2)
    (stroke (width 0.12) (type solid)) (layer "F.SilkS") (tstamp 67b3bf8b-5e3f-4e74-9453-2b2362cbaddf))
  (fp_line (start -4.4 -2.05) (end -4.4 2.05)
    (stroke (width 0.05) (type solid)) (layer "F.CrtYd") (tstamp 18ec6ad3-667c-4d26-b597-6e6889523adc))
  (fp_line (start -4.4 -2.05) (end 4.4 -2.05)
    (stroke (width 0.05) (type solid)) (layer "F.CrtYd") (tstamp 512de876-f808-4a15-95c3-fa44bd48ece6))
  (fp_line (start 4.4 2.05) (end -4.4 2.05)
    (stroke (width 0.05) (type solid)) (layer "F.CrtYd") (tstamp fe232545-fcdf-4f4f-94eb-2fdd81838457))
  (fp_line (start 4.4 2.05) (end 4.4 -2.05)
    (stroke (width 0.05) (type solid)) (layer "F.CrtYd") (tstamp 1f28f9ab-03e9-4c86-8142-b2cbd127d873))
  (fp_line (start -2.2 -1) (end -1.4 -1.8)
    (stroke (width 0.12) (type solid)) (layer "F.Fab") (tstamp 2e2c8579-898e-4abe-94be-0916137e1cff))
  (fp_line (start -2.2 1.8) (end -2.2 -1)
    (stroke (width 0.12) (type solid)) (layer "F.Fab") (tstamp ccf113ed-7a99-4f91-b67c-86cab28cdb63))
  (fp_line (start -1.4 -1.8) (end 2.2 -1.8)
    (stroke (width 0.12) (type solid)) (layer "F.Fab") (tstamp 8c8c027c-58f3-481a-9a55-0aa6172f4e76))
  (fp_line (start 2.2 -1.8) (end 2.2 1.8)
    (stroke (width 0.12) (type solid)) (layer "F.Fab") (tstamp 3266234b-f428-4055-abef-f2ce331a5259))
  (fp_line (start 2.2 1.8) (end -2.2 1.8)
    (stroke (width 0.12) (type solid)) (layer "F.Fab") (tstamp 3d343e63-6b5a-47f5-8e7b-f3d19c413bc8))
  (pad "1" smd rect (at -3.15 -1.27) (size 2 0.64) (layers "F.Cu" "F.Paste" "F.Mask") (tstamp c19ec0e3-b0ac-4cf9-b2ff-585175133935))
  (pad "3" smd rect (at -3.15 1.27) (size 2 0.64) (layers "F.Cu" "F.Paste" "F.Mask") (tstamp 6b7c4a29-31a0-45bd-9cfa-bf75a530a061))
  (pad "4" smd rect (at 3.15 1.27) (size 2 0.64) (layers "F.Cu" "F.Paste" "F.Mask") (tstamp 1f10406f-a4c8-45db-ba60-9f2a36dc4b01))
  (pad "5" smd rect (at 3.15 0) (size 2 0.64) (layers "F.Cu" "F.Paste" "F.Mask") (tstamp 0e099c15-9d0b-4fbf-a3c4-7de8b7539eea))
  (pad "6" smd rect (at 3.15 -1.27) (size 2 0.64) (layers "F.Cu" "F.Paste" "F.Mask") (tstamp efa00d34-d06d-4cc2-8f03-7170a9bc8823))
  (model "${KICAD6_3DMODEL_DIR}/Package_SO.3dshapes/SO-5_4.4x3.6mm_P1.27mm.wrl"
    (offset (xyz 0 0 0))
    (scale (xyz 1 1 1))
    (rotate (xyz 0 0 0))
  )
)
