(footprint "Infineon_PQFN-44-31-5EP_7x7mm_P0.5mm" (version 20221018) (generator pcbnew)
  (layer "F.Cu")
  (descr "PQFN 44 leads, 7x7mm, 0.127mm stencil (https://www.infineon.com/dgdl/ir4302.pdf?fileId=5546d462533600a4015355d602a9181d, https://www.infineon.com/dgdl/Infineon-AN1170-AN-v05_00-EN.pdf?fileId=5546d462533600a40153559ac3e51134)")
  (tags "pqfn 44 7x7mm")
  (attr smd)
  (fp_text reference "REF**" (at 0 -4.8) (layer "F.SilkS")
      (effects (font (size 1 1) (thickness 0.15)))
    (tstamp edd91676-ed75-4492-a6e6-3da81c537f51)
  )
  (fp_text value "Infineon_PQFN-44-31-5EP_7x7mm_P0.5mm" (at 0 4.8) (layer "F.Fab")
      (effects (font (size 1 1) (thickness 0.15)))
    (tstamp a2d164c8-626c-4a30-a869-6c64ce65c23b)
  )
  (fp_text user "${REFERENCE}" (at 0 0) (layer "F.Fab")
      (effects (font (size 1 1) (thickness 0.15)))
    (tstamp 9f090538-1904-4467-9127-260666263af4)
  )
  (fp_line (start -3.62 -3.1) (end -3.8 -3.1)
    (stroke (width 0.12) (type solid)) (layer "F.SilkS") (tstamp 3ff8771b-50ce-464d-a1f6-eff2618e0773))
  (fp_line (start -3.62 -3.1) (end -3.62 -3.62)
    (stroke (width 0.12) (type solid)) (layer "F.SilkS") (tstamp b7fa3b26-8f09-4579-8c06-2144dd46e303))
  (fp_line (start -3.62 3.62) (end -3.62 3.1)
    (stroke (width 0.12) (type solid)) (layer "F.SilkS") (tstamp c50eab5a-b71c-444e-a7b8-ee1aa3bc3104))
  (fp_line (start -3.1 -3.62) (end -3.62 -3.62)
    (stroke (width 0.12) (type solid)) (layer "F.SilkS") (tstamp a73b83be-e35e-49b8-87f5-748c0f3cd244))
  (fp_line (start -3.1 3.62) (end -3.62 3.62)
    (stroke (width 0.12) (type solid)) (layer "F.SilkS") (tstamp 99072229-736e-4379-9ddf-fbf02ba48b39))
  (fp_line (start 0.1 -3.62) (end 0.4 -3.62)
    (stroke (width 0.12) (type solid)) (layer "F.SilkS") (tstamp 1dd25df8-a6ec-4f21-9f58-24f37947357c))
  (fp_line (start 0.1 3.62) (end 0.4 3.62)
    (stroke (width 0.12) (type solid)) (layer "F.SilkS") (tstamp 204a5240-4328-4b19-b79b-34084d225f70))
  (fp_line (start 3.62 -3.62) (end 3.1 -3.62)
    (stroke (width 0.12) (type solid)) (layer "F.SilkS") (tstamp 7083de1f-5844-419f-8760-afa2c9082642))
  (fp_line (start 3.62 -3.62) (end 3.62 -3.1)
    (stroke (width 0.12) (type solid)) (layer "F.SilkS") (tstamp c2cf8099-902d-41bb-8501-93a4b8d264c0))
  (fp_line (start 3.62 -1.9) (end 3.62 -1.7)
    (stroke (width 0.12) (type solid)) (layer "F.SilkS") (tstamp a8ec66c0-ba2e-415c-867b-5c01c3fcf8d1))
  (fp_line (start 3.62 1.9) (end 3.62 1.7)
    (stroke (width 0.12) (type solid)) (layer "F.SilkS") (tstamp b23347b9-de04-4f0b-92be-6987f8b85796))
  (fp_line (start 3.62 3.1) (end 3.62 3.62)
    (stroke (width 0.12) (type solid)) (layer "F.SilkS") (tstamp cc4b4d98-b709-4a60-b5fb-5a876ff38767))
  (fp_line (start 3.62 3.62) (end 3.1 3.62)
    (stroke (width 0.12) (type solid)) (layer "F.SilkS") (tstamp 7e37e74a-a5af-4613-9bd9-d43095b26b7d))
  (fp_line (start -4.05 -4.05) (end -4.05 4.05)
    (stroke (width 0.05) (type solid)) (layer "F.CrtYd") (tstamp 9d17bcc9-9651-4d49-9d94-c27348b12645))
  (fp_line (start -4.05 4.05) (end 4.05 4.05)
    (stroke (width 0.05) (type solid)) (layer "F.CrtYd") (tstamp 2933da60-5a08-4c79-aad0-356dc472f24b))
  (fp_line (start 4.05 -4.05) (end -4.05 -4.05)
    (stroke (width 0.05) (type solid)) (layer "F.CrtYd") (tstamp da824766-c726-4404-80d7-47b7388ce002))
  (fp_line (start 4.05 4.05) (end 4.05 -4.05)
    (stroke (width 0.05) (type solid)) (layer "F.CrtYd") (tstamp 91e09acd-f670-43d8-8eb6-777db07104a6))
  (fp_line (start -3.5 3.5) (end -3.5 -2.5)
    (stroke (width 0.1) (type solid)) (layer "F.Fab") (tstamp dc89bfeb-370d-431c-b38d-4af7f19034e3))
  (fp_line (start -2.5 -3.5) (end -3.5 -2.5)
    (stroke (width 0.1) (type solid)) (layer "F.Fab") (tstamp ee0ec3af-1349-4529-9fce-401f38862744))
  (fp_line (start -2.5 -3.5) (end 3.5 -3.5)
    (stroke (width 0.1) (type solid)) (layer "F.Fab") (tstamp b65bb2ce-ea06-4df1-860d-d360ba3cc22f))
  (fp_line (start 3.5 -3.5) (end 3.5 3.5)
    (stroke (width 0.1) (type solid)) (layer "F.Fab") (tstamp 0985be17-b086-4542-9041-81a61806fe3a))
  (fp_line (start 3.5 3.5) (end -3.5 3.5)
    (stroke (width 0.1) (type solid)) (layer "F.Fab") (tstamp 2f841d36-7a7f-4374-abc6-607eee4bb571))
  (pad "" smd rect (at -3.3215 -2.75) (size 0.39 0.22) (layers "F.Paste") (tstamp c7add0b5-a3ad-4b49-80cb-e02de674de39))
  (pad "" smd rect (at -3.3215 -2.25) (size 0.39 0.22) (layers "F.Paste") (tstamp cd199dee-70aa-4a07-bcae-a0481ffa1714))
  (pad "" smd rect (at -3.3215 -1.75) (size 0.39 0.22) (layers "F.Paste") (tstamp cd672ec3-1f50-4397-bcf0-581adc4e9569))
  (pad "" smd rect (at -3.3215 -1.25) (size 0.39 0.22) (layers "F.Paste") (tstamp 82da2c60-d427-44d5-a3ea-93f0c07a4a7d))
  (pad "" smd rect (at -3.3215 -0.75) (size 0.39 0.22) (layers "F.Paste") (tstamp 745432ba-16f5-47da-b468-629c92dbe608))
  (pad "" smd rect (at -3.3215 -0.25) (size 0.39 0.22) (layers "F.Paste") (tstamp 7e60c63e-a3a6-4623-87e0-732ce8269a4c))
  (pad "" smd rect (at -3.3215 0.25) (size 0.39 0.22) (layers "F.Paste") (tstamp 4f8fa8b6-4249-49f8-a0df-309ab9bd04db))
  (pad "" smd rect (at -3.3215 0.75) (size 0.39 0.22) (layers "F.Paste") (tstamp 4c0e9be4-fb23-4b49-a586-ff52cd0edef3))
  (pad "" smd rect (at -3.3215 1.25) (size 0.39 0.22) (layers "F.Paste") (tstamp 94c56464-e701-4ddc-bd6e-38a41eb7acd8))
  (pad "" smd rect (at -3.3215 1.75) (size 0.39 0.22) (layers "F.Paste") (tstamp cd9a240f-e21c-4722-8b73-f232d20cebc5))
  (pad "" smd rect (at -3.3215 2.25) (size 0.39 0.22) (layers "F.Paste") (tstamp 47af8e96-81b9-410b-9e8f-0bece432898a))
  (pad "" smd rect (at -3.3215 2.75) (size 0.39 0.22) (layers "F.Paste") (tstamp 6946a8a9-a18c-4a9c-8007-b82095158169))
  (pad "" smd rect (at -2.7465 -3.325) (size 0.22 0.39) (layers "F.Paste") (tstamp 0149b1b0-5174-49d7-921a-fe9dd0c1ec02))
  (pad "" smd rect (at -2.7465 3.325) (size 0.22 0.39) (layers "F.Paste") (tstamp 350a5e8b-e765-434b-9aca-1ac10c5df346))
  (pad "" smd rect (at -2.2465 -3.325) (size 0.22 0.39) (layers "F.Paste") (tstamp 21745902-c818-40dc-bee5-d66f43dd1efc))
  (pad "" smd rect (at -2.2465 3.325) (size 0.22 0.39) (layers "F.Paste") (tstamp 2fecf1a5-6cc5-4ce2-8777-ce93e554f673))
  (pad "" smd rect (at -2.2065 -1.76) (size 0.77 0.93) (layers "F.Paste" "F.Mask") (tstamp 74f144d1-4843-4039-b9c5-92900060e889))
  (pad "" smd rect (at -2.2065 -0.52) (size 0.77 0.93) (layers "F.Paste" "F.Mask") (tstamp 6b10a08c-16d1-4ed9-a631-fde65d55c8ed))
  (pad "" smd rect (at -2.2065 0.72) (size 0.77 0.93) (layers "F.Paste" "F.Mask") (tstamp 32f3f1f6-5f40-4492-8170-d93d84e0e95d))
  (pad "" smd rect (at -2.2065 1.96) (size 0.77 0.93) (layers "F.Paste" "F.Mask") (tstamp 552c6e9b-322e-4308-8357-1a8980edc469))
  (pad "" smd rect (at -1.7465 -3.015) (size 0.23 1.01) (layers "F.Paste") (tstamp 4dc254f5-f062-4243-a29f-f9439de511bc))
  (pad "" smd rect (at -1.7465 3.015) (size 0.23 1.01) (layers "F.Paste") (tstamp 70db2495-2971-41c8-a1e1-4f28dee7d019))
  (pad "" smd rect (at -1.2465 -3.325) (size 0.22 0.39) (layers "F.Paste") (tstamp 1432c72f-0f3e-4636-ac44-219ce7bc481f))
  (pad "" smd rect (at -1.2465 3.325) (size 0.22 0.39) (layers "F.Paste") (tstamp a82bfea7-683e-4123-827b-6d6235ca278d))
  (pad "" smd rect (at -1.1265 -1.76) (size 0.77 0.93) (layers "F.Paste" "F.Mask") (tstamp 09e2219b-54b7-4f5c-80c8-160cf10d582a))
  (pad "" smd rect (at -1.1265 -0.52) (size 0.77 0.93) (layers "F.Paste" "F.Mask") (tstamp b35b5c97-ad55-4a85-bc98-018f5bedefa6))
  (pad "" smd rect (at -1.1265 0.72) (size 0.77 0.93) (layers "F.Paste" "F.Mask") (tstamp 7027eb9a-2769-46a8-9c37-752ac0c97aed))
  (pad "" smd rect (at -1.1265 1.96) (size 0.77 0.93) (layers "F.Paste" "F.Mask") (tstamp 3ffddc44-31ae-4665-91cc-96f369e1dc33))
  (pad "" smd rect (at -0.7465 -3.325) (size 0.22 0.39) (layers "F.Paste") (tstamp 35f4c1f0-0db0-450d-bea8-da9b535bc7a3))
  (pad "" smd rect (at -0.7465 3.325) (size 0.22 0.39) (layers "F.Paste") (tstamp 8982cc8e-b48a-4cf2-96e5-f698a0d8fafe))
  (pad "" smd rect (at -0.2465 -3.28) (size 0.23 0.44) (layers "F.Paste") (tstamp 50b60d66-e2d6-4df3-905d-ae4f80023510))
  (pad "" smd rect (at -0.2465 3.28) (size 0.23 0.44) (layers "F.Paste") (tstamp cda34a8b-d60a-4710-b515-241738269682))
  (pad "" smd rect (at -0.0265 -3.07) (size 0.21 0.34) (layers "F.Paste") (tstamp 018834e9-863f-4bb2-b226-22cfcdaecbf6))
  (pad "" smd rect (at -0.0265 -2.37) (size 0.21 0.34) (layers "F.Paste") (tstamp 9d2203e3-eac4-419c-bde9-08bde48d1c76))
  (pad "" smd rect (at -0.0265 -1.67) (size 0.21 0.34) (layers "F.Paste") (tstamp 0af943af-857f-435d-a239-4a1e4aa00c47))
  (pad "" smd rect (at -0.0265 1.67) (size 0.21 0.34) (layers "F.Paste") (tstamp e124106c-1d94-4a1f-8015-82072eb2a1ec))
  (pad "" smd rect (at -0.0265 2.37) (size 0.21 0.34) (layers "F.Paste") (tstamp 8c73c823-7b74-40bb-820f-9622eb9823b3))
  (pad "" smd rect (at -0.0265 3.07) (size 0.21 0.34) (layers "F.Paste") (tstamp 1dfed662-0e33-45e2-810b-e05e5c5c8c86))
  (pad "" smd rect (at 0.4735 -0.84) (size 0.68 0.9) (layers "F.Paste" "F.Mask") (tstamp b73138ee-df29-401b-913c-f9ce4432ee14))
  (pad "" smd rect (at 0.4735 0.84) (size 0.68 0.9) (layers "F.Paste" "F.Mask") (tstamp 49487e83-784d-42ad-92f4-4bcca28b8fe0))
  (pad "" smd rect (at 0.7535 -3.325) (size 0.22 0.35) (layers "F.Paste" "F.Mask") (tstamp d6be8cf0-e7fb-4749-8439-35086c6fd867))
  (pad "" smd rect (at 0.7535 3.325) (size 0.22 0.35) (layers "F.Paste" "F.Mask") (tstamp c21ee0f3-3faa-48c6-b3b0-f0ce6ac470dd))
  (pad "" smd rect (at 0.8765 -2.515) (size 0.65 0.9) (layers "F.Paste" "F.Mask") (tstamp bcf99ca2-dad1-48f8-88dd-eba4f6a8cee1))
  (pad "" smd rect (at 0.8765 2.515) (size 0.65 0.9) (layers "F.Paste" "F.Mask") (tstamp 633adcb5-47ea-4801-9a7f-ce42012b77f1))
  (pad "" smd rect (at 1.2535 -3.325) (size 0.22 0.35) (layers "F.Paste" "F.Mask") (tstamp bc364fbd-2da2-45fc-96b7-3e80175946f6))
  (pad "" smd rect (at 1.2535 3.325) (size 0.22 0.35) (layers "F.Paste" "F.Mask") (tstamp c631318b-4d62-4261-b81c-d796b2e0c5e0))
  (pad "" smd rect (at 1.3835 -0.84) (size 0.68 0.9) (layers "F.Paste" "F.Mask") (tstamp 3bdf8cc4-ca99-4e63-9c18-44c5c453a3d3))
  (pad "" smd rect (at 1.3835 0.84) (size 0.68 0.9) (layers "F.Paste" "F.Mask") (tstamp d8b555ec-3a0f-4a17-ad2e-9e8c21349902))
  (pad "" smd rect (at 1.7535 -3.325) (size 0.22 0.35) (layers "F.Paste" "F.Mask") (tstamp 10354bc3-a11a-4aa5-94d2-a65be61e99b6))
  (pad "" smd rect (at 1.7535 3.325) (size 0.22 0.35) (layers "F.Paste" "F.Mask") (tstamp 34a2592f-9399-4bad-a346-edc697f131ff))
  (pad "" smd rect (at 1.7865 -2.515) (size 0.65 0.9) (layers "F.Paste" "F.Mask") (tstamp ef5b6253-4bc9-4a30-a02c-764d43cd7de0))
  (pad "" smd rect (at 1.7865 2.515) (size 0.65 0.9) (layers "F.Paste" "F.Mask") (tstamp 61d71751-93c6-4110-8b2a-e2f7509b7183))
  (pad "" smd rect (at 2.2535 -3.325) (size 0.22 0.35) (layers "F.Paste" "F.Mask") (tstamp 65aae9ce-84a1-48bc-88e0-865db28c2a00))
  (pad "" smd rect (at 2.2535 3.325) (size 0.22 0.35) (layers "F.Paste" "F.Mask") (tstamp eeab320a-57a2-4f2d-9c54-156c33de0c46))
  (pad "" smd rect (at 2.2935 -0.84) (size 0.68 0.9) (layers "F.Paste" "F.Mask") (tstamp 5556766d-cc74-4d62-b9b6-d9605a057286))
  (pad "" smd rect (at 2.2935 0.84) (size 0.68 0.9) (layers "F.Paste" "F.Mask") (tstamp 46865c64-3752-4857-9ac2-20d5972fa380))
  (pad "" smd rect (at 2.6965 -2.515) (size 0.65 0.9) (layers "F.Paste" "F.Mask") (tstamp d6c38924-98eb-49e6-b4ff-e2a40fd0a56b))
  (pad "" smd rect (at 2.6965 2.515) (size 0.65 0.9) (layers "F.Paste" "F.Mask") (tstamp 019b751e-9792-4fb0-8263-c52800e772b1))
  (pad "" smd rect (at 2.7535 -3.325) (size 0.22 0.35) (layers "F.Paste" "F.Mask") (tstamp f86ac731-436e-4cab-a843-3c6186c39a96))
  (pad "" smd rect (at 2.7535 3.325) (size 0.22 0.35) (layers "F.Paste" "F.Mask") (tstamp 523b340a-84e2-4d5d-b3fb-e302c2323d22))
  (pad "" smd rect (at 3.1635 -1.3) (size 0.68 0.22) (layers "F.Paste" "F.Mask") (tstamp c80750b0-c76c-4e1c-b3b7-48ff88ca9aae))
  (pad "" smd rect (at 3.1635 1.3) (size 0.68 0.22) (layers "F.Paste" "F.Mask") (tstamp 62f83476-1fdb-4070-9379-56cd3abec3ce))
  (pad "" smd rect (at 3.2835 -0.75) (size 0.44 0.22) (layers "F.Paste" "F.Mask") (tstamp 0b1c9dd3-8ffd-4278-b71d-681b88b42c8c))
  (pad "" smd rect (at 3.2835 -0.25) (size 0.44 0.22) (layers "F.Paste" "F.Mask") (tstamp fcbb7192-0470-4943-83a0-e49cf792bfb9))
  (pad "" smd rect (at 3.2835 0.25) (size 0.44 0.22) (layers "F.Paste" "F.Mask") (tstamp e8becee6-6eb7-4012-b9cf-65956a2eb6b8))
  (pad "" smd rect (at 3.2835 0.75) (size 0.44 0.22) (layers "F.Paste" "F.Mask") (tstamp ffe9efc8-ed99-4a88-a67a-fdd2b5b66d10))
  (pad "" smd rect (at 3.3635 -2.75) (size 0.28 0.22) (layers "F.Paste" "F.Mask") (tstamp af520a1a-240a-42cf-aa93-e713d917e1fe))
  (pad "" smd rect (at 3.3635 -2.25) (size 0.28 0.22) (layers "F.Paste" "F.Mask") (tstamp 1ab55f02-0830-4ab8-a06a-cf74bfcd8b27))
  (pad "" smd rect (at 3.3635 2.25) (size 0.28 0.22) (layers "F.Paste" "F.Mask") (tstamp 27cef10d-4b3d-4a51-89c2-431142e497b2))
  (pad "" smd rect (at 3.3635 2.75) (size 0.28 0.22) (layers "F.Paste" "F.Mask") (tstamp f234846d-30e8-4fea-b856-74d525eac7d8))
  (pad "1" smd rect (at -3.4465 -2.75) (size 0.7 0.25) (layers "F.Cu" "F.Mask") (tstamp 3e8fae98-7b80-415e-b661-20eed0f25f18))
  (pad "2" smd rect (at -3.4465 -2.25) (size 0.7 0.25) (layers "F.Cu" "F.Mask") (tstamp 5a28bf4b-e325-446f-885e-34f595785e2f))
  (pad "3" smd rect (at -3.4465 -1.75) (size 0.7 0.25) (layers "F.Cu" "F.Mask") (tstamp b3a5f5d6-b516-436f-b628-73e3d7c60309))
  (pad "4" smd rect (at -3.4465 -1.25) (size 0.7 0.25) (layers "F.Cu" "F.Mask") (tstamp df1a4b2c-a996-444d-ae77-e3abe3f9027f))
  (pad "5" smd rect (at -3.4465 -0.75) (size 0.7 0.25) (layers "F.Cu" "F.Mask") (tstamp 964bf148-c75b-42be-9aed-0f4cbe5d6da5))
  (pad "6" smd rect (at -3.4465 -0.25) (size 0.7 0.25) (layers "F.Cu" "F.Mask") (tstamp 0a307394-7fcd-4df0-8b15-a43476cb3502))
  (pad "7" smd rect (at -3.4465 0.25) (size 0.7 0.25) (layers "F.Cu" "F.Mask") (tstamp aa105244-3829-4864-b5e4-e8c40c0b3f7e))
  (pad "8" smd rect (at -3.4465 0.75) (size 0.7 0.25) (layers "F.Cu" "F.Mask") (tstamp fc803119-a621-4e16-9a77-3bdff62e4931))
  (pad "9" smd rect (at -3.4465 1.25) (size 0.7 0.25) (layers "F.Cu" "F.Mask") (tstamp 0c6937aa-1ca2-4aaa-84e4-49192b619f98))
  (pad "10" smd rect (at -3.4465 1.75) (size 0.7 0.25) (layers "F.Cu" "F.Mask") (tstamp 1213281c-3dba-48e8-bf8c-92c0326c2891))
  (pad "11" smd rect (at -3.4465 2.25) (size 0.7 0.25) (layers "F.Cu" "F.Mask") (tstamp f343b2df-3a20-4fe5-b309-ee09a2d675ea))
  (pad "12" smd rect (at -3.4465 2.75) (size 0.7 0.25) (layers "F.Cu" "F.Mask") (tstamp a20f26a8-1933-432b-a051-bccded9d2632))
  (pad "13" smd rect (at -2.7465 3.45) (size 0.25 0.7) (layers "F.Cu" "F.Mask") (tstamp db28eaa6-e4f7-4dfa-899d-52d828d6f706))
  (pad "14" smd rect (at -2.2465 3.45) (size 0.25 0.7) (layers "F.Cu" "F.Mask") (tstamp 8ba73dff-4395-4bf9-8fdc-737c1c6547be))
  (pad "16" smd rect (at -1.2465 3.45) (size 0.25 0.7) (layers "F.Cu" "F.Mask") (tstamp 4bfcd461-3998-4f1d-9167-aa056b27efec))
  (pad "17" smd rect (at -0.7465 3.45) (size 0.25 0.7) (layers "F.Cu" "F.Mask") (tstamp dab2b330-86b8-4f61-b5f9-1b149cf5df4a))
  (pad "19" smd rect (at 0.7535 3.4775) (size 0.25 0.645) (layers "F.Cu" "F.Mask") (tstamp 9ed82edf-5eb4-41af-8b81-57a4b437de50))
  (pad "19" smd rect (at 1.2535 3.4775) (size 0.25 0.645) (layers "F.Cu" "F.Mask") (tstamp 661791b5-3c1a-46b1-a484-91a8e8c0eed2))
  (pad "19" smd rect (at 1.7535 3.4775) (size 0.25 0.645) (layers "F.Cu" "F.Mask") (tstamp e8a1c58e-664e-442a-8d63-c0d9297f2d33))
  (pad "19" smd rect (at 1.7835 2.52) (size 2.72 1.27) (layers "F.Cu" "F.Mask") (tstamp 3d856ffd-7f9f-473b-81fc-2e073a5f61e3))
  (pad "19" smd rect (at 2.2535 3.4775) (size 0.25 0.645) (layers "F.Cu" "F.Mask") (tstamp 3a0d057d-2f22-4513-9290-2bdf2722af59))
  (pad "19" smd rect (at 2.7535 3.4775) (size 0.25 0.645) (layers "F.Cu" "F.Mask") (tstamp 4d7766ed-631d-493b-b6a9-ee0460e6db29))
  (pad "19" smd rect (at 3.4685 2.25) (size 0.65 0.25) (layers "F.Cu" "F.Mask") (tstamp b850c978-db14-41e1-8474-826c038e95e8))
  (pad "19" smd rect (at 3.4685 2.75) (size 0.65 0.25) (layers "F.Cu" "F.Mask") (tstamp 97f33e30-addc-4089-812b-38943e5993f3))
  (pad "20" smd rect (at -0.2465 3.425) (size 0.25 0.75) (layers "F.Cu" "F.Mask") (tstamp 77594335-4553-4a70-ab8a-e6f1073535bc))
  (pad "20" smd rect (at -0.0265 2.26) (size 0.25 1.98) (layers "F.Cu" "F.Mask") (tstamp 35f63ecb-7478-4433-b5cc-f82393980699))
  (pad "20" smd rect (at 1.3835 0.84) (size 2.72 1.27) (layers "F.Cu" "F.Mask") (tstamp e075369c-7307-48c1-859c-c223f897b1fd))
  (pad "20" smd rect (at 3.2685 1.3) (size 1.05 0.35) (layers "F.Cu" "F.Mask") (tstamp e098bc5d-f338-4813-a7d0-6b44c991025e))
  (pad "21" smd rect (at 3.1435 0.5) (size 0.2 0.75) (layers "F.Cu" "F.Mask") (tstamp 1e22be63-1803-4482-837f-4922dfbce9a3))
  (pad "21" smd rect (at 3.5185 0.25) (size 0.55 0.25) (layers "F.Cu" "F.Mask") (tstamp 7c5e2c16-ef4e-45b0-95dd-6c25dbf05e9f))
  (pad "21" smd rect (at 3.5185 0.75) (size 0.55 0.25) (layers "F.Cu" "F.Mask") (tstamp 97c900d6-ff1a-4507-a535-ae8c65fa1e7c))
  (pad "22" smd rect (at 3.1435 -0.5) (size 0.2 0.75) (layers "F.Cu" "F.Mask") (tstamp 3ad2b97e-26dc-478a-b9e7-b9ee25f26336))
  (pad "22" smd rect (at 3.5185 -0.75) (size 0.55 0.25) (layers "F.Cu" "F.Mask") (tstamp bf0eb84c-d686-4c6d-b7bf-a44417ca335b))
  (pad "22" smd rect (at 3.5185 -0.25) (size 0.55 0.25) (layers "F.Cu" "F.Mask") (tstamp 1f03acb9-fb64-45a5-b954-229b82e93e49))
  (pad "23" smd rect (at -0.2465 -3.425) (size 0.25 0.75) (layers "F.Cu" "F.Mask") (tstamp 36d8299a-701d-4c6f-a795-7a395d77833a))
  (pad "23" smd rect (at -0.0265 -2.26) (size 0.25 1.98) (layers "F.Cu" "F.Mask") (tstamp a0df7eeb-e57e-4ca8-b4f0-0893aa508219))
  (pad "23" smd rect (at 1.3835 -0.84) (size 2.72 1.27) (layers "F.Cu" "F.Mask") (tstamp 759b3472-8fa5-43be-9eff-a422a538f125))
  (pad "23" smd rect (at 3.2685 -1.3) (size 1.05 0.35) (layers "F.Cu" "F.Mask") (tstamp acf8588a-6b3d-4dd8-8ab8-729de824ecb2))
  (pad "24" smd rect (at 0.7535 -3.4775) (size 0.25 0.645) (layers "F.Cu" "F.Mask") (tstamp 9d12910e-b65f-47dc-b8b8-9670bc692db9))
  (pad "24" smd rect (at 1.2535 -3.4775) (size 0.25 0.645) (layers "F.Cu" "F.Mask") (tstamp 0ea4859d-e1c9-41bf-8f50-47fca1d61671))
  (pad "24" smd rect (at 1.7535 -3.4775) (size 0.25 0.645) (layers "F.Cu" "F.Mask") (tstamp 03bdeeb2-e1bb-406f-9294-3e28fac563ff))
  (pad "24" smd rect (at 1.7865 -2.52) (size 2.72 1.27) (layers "F.Cu" "F.Mask") (tstamp 4aa7c21e-5032-4b66-8bdb-eb538fe915db))
  (pad "24" smd rect (at 2.2535 -3.4775) (size 0.25 0.645) (layers "F.Cu" "F.Mask") (tstamp 16ca88b6-4973-4ea9-a19a-dffd86323d2c))
  (pad "24" smd rect (at 2.7535 -3.4775) (size 0.25 0.645) (layers "F.Cu" "F.Mask") (tstamp 6f18f022-4307-4426-9e16-6c07bf94ee63))
  (pad "24" smd rect (at 3.4715 -2.75) (size 0.65 0.25) (layers "F.Cu" "F.Mask") (tstamp 6ef79488-7ed5-4efe-ba17-897da752c985))
  (pad "24" smd rect (at 3.4715 -2.25) (size 0.65 0.25) (layers "F.Cu" "F.Mask") (tstamp 8f775b1e-2575-477d-8f94-9ebaef3c87ce))
  (pad "26" smd rect (at -0.7465 -3.45) (size 0.25 0.7) (layers "F.Cu" "F.Mask") (tstamp cfbbe1b8-0327-4dd6-88ba-507b7f73cd3b))
  (pad "27" smd rect (at -1.2465 -3.45) (size 0.25 0.7) (layers "F.Cu" "F.Mask") (tstamp 211407d4-3f0d-4a8c-8a95-42e25a1ae5d4))
  (pad "29" smd rect (at -2.2465 -3.45) (size 0.25 0.7) (layers "F.Cu" "F.Mask") (tstamp c3d75ea6-cc12-4a66-ad84-fdcfdf0868cc))
  (pad "30" smd rect (at -2.7465 -3.45) (size 0.25 0.7) (layers "F.Cu" "F.Mask") (tstamp df94eaae-3f7f-418a-a86c-d24dacd7e08e))
  (pad "31" smd rect (at -2.5465 -2.29 45) (size 0.283 0.282843) (layers "F.Cu" "F.Mask") (tstamp 16cd0850-9f26-4b09-88ab-3a3521177027))
  (pad "31" smd rect (at -1.7465 -3.145) (size 0.25 1.31) (layers "F.Cu" "F.Mask") (tstamp 283d3139-d9f5-4512-b414-93d3ee1347fc))
  (pad "31" smd rect (at -1.7465 3.145) (size 0.25 1.31) (layers "F.Cu" "F.Mask") (tstamp 3ebb3d4e-807b-472f-bfc1-612cfebf4c83))
  (pad "31" smd rect (at -1.6665 0.1) (size 2.16 4.78) (layers "F.Cu" "F.Mask") (tstamp e7bf5ddc-abb0-4b7f-b429-8ea5dbb53b1a))
  (pad "31" smd rect (at -1.5665 -2.39) (size 1.96 0.2) (layers "F.Cu" "F.Mask") (tstamp d1611ae5-37ab-4c27-87a2-c8ead1b9b864))
  (model "${KICAD6_3DMODEL_DIR}/Package_DFN_QFN.3dshapes/Infineon_PQFN-44-31-5EP_7x7mm_P0.5mm.wrl"
    (offset (xyz 0 0 0))
    (scale (xyz 1 1 1))
    (rotate (xyz 0 0 0))
  )
)
