(footprint "UQFN-16-1EP_3x3mm_P0.5mm_EP1.75x1.75mm" (version 20221018) (generator pcbnew)
  (layer "F.Cu")
  (descr "16-Lead Ultra Thin Quad Flat, No Lead Package (UC) - 3x3x0.5 mm Body [UQFN]; (see Microchip Packaging Specification 00000049BS.pdf)")
  (tags "QFN 0.5")
  (attr smd)
  (fp_text reference "REF**" (at 0 -2.9) (layer "F.SilkS")
      (effects (font (size 1 1) (thickness 0.15)))
    (tstamp 24ba95c0-893b-4d75-9b90-af1695d304e7)
  )
  (fp_text value "UQFN-16-1EP_3x3mm_P0.5mm_EP1.75x1.75mm" (at 0 2.9) (layer "F.Fab")
      (effects (font (size 1 1) (thickness 0.15)))
    (tstamp 8b12b06a-2ebb-4d45-b563-882019cbfe85)
  )
  (fp_text user "${REFERENCE}" (at 0 0) (layer "F.Fab")
      (effects (font (size 0.7 0.7) (thickness 0.105)))
    (tstamp ec0dc3b8-7251-41d5-a748-0914daa622ce)
  )
  (fp_line (start -1.65 -1.65) (end -1.125 -1.65)
    (stroke (width 0.15) (type solid)) (layer "F.SilkS") (tstamp 444aeeca-3bc0-4694-92d4-ea48dc6d7596))
  (fp_line (start -1.65 1.65) (end -1.65 1.125)
    (stroke (width 0.15) (type solid)) (layer "F.SilkS") (tstamp d7b4056c-e75f-4dbe-a129-a60287bbcdf8))
  (fp_line (start -1.65 1.65) (end -1.125 1.65)
    (stroke (width 0.15) (type solid)) (layer "F.SilkS") (tstamp 54291597-ea51-4144-b4b0-388dead719e3))
  (fp_line (start 1.65 -1.65) (end 1.125 -1.65)
    (stroke (width 0.15) (type solid)) (layer "F.SilkS") (tstamp 04df415d-cc21-47a2-9557-3cdcc7825fba))
  (fp_line (start 1.65 -1.65) (end 1.65 -1.125)
    (stroke (width 0.15) (type solid)) (layer "F.SilkS") (tstamp 4a612c03-7cb8-4f00-ae91-d726b788a695))
  (fp_line (start 1.65 1.65) (end 1.125 1.65)
    (stroke (width 0.15) (type solid)) (layer "F.SilkS") (tstamp fbde9add-8a3a-4a33-a420-5f8f23a6fe79))
  (fp_line (start 1.65 1.65) (end 1.65 1.125)
    (stroke (width 0.15) (type solid)) (layer "F.SilkS") (tstamp 0c760b33-bcf6-484b-b4ed-38c5260be501))
  (fp_line (start -2.15 -2.15) (end -2.15 2.15)
    (stroke (width 0.05) (type solid)) (layer "F.CrtYd") (tstamp dd9b061a-2485-4958-9fb4-9b28227b7f73))
  (fp_line (start -2.15 -2.15) (end 2.15 -2.15)
    (stroke (width 0.05) (type solid)) (layer "F.CrtYd") (tstamp d3053b32-4de2-4d3c-bf95-bcb95a5c93cb))
  (fp_line (start -2.15 2.15) (end 2.15 2.15)
    (stroke (width 0.05) (type solid)) (layer "F.CrtYd") (tstamp d9dc3a60-5703-4055-acfe-8b50730f9412))
  (fp_line (start 2.15 -2.15) (end 2.15 2.15)
    (stroke (width 0.05) (type solid)) (layer "F.CrtYd") (tstamp e12e5609-d281-42ad-b367-7d3bd23d8e51))
  (fp_line (start -1.5 -0.5) (end -0.5 -1.5)
    (stroke (width 0.15) (type solid)) (layer "F.Fab") (tstamp c3948902-da91-4c4a-8532-e26d8edbcbd7))
  (fp_line (start -1.5 1.5) (end -1.5 -0.5)
    (stroke (width 0.15) (type solid)) (layer "F.Fab") (tstamp db799306-4c1d-4045-b988-5253c7a51652))
  (fp_line (start -0.5 -1.5) (end 1.5 -1.5)
    (stroke (width 0.15) (type solid)) (layer "F.Fab") (tstamp 4cbc88d5-0963-4697-b22a-ec04b1130681))
  (fp_line (start 1.5 -1.5) (end 1.5 1.5)
    (stroke (width 0.15) (type solid)) (layer "F.Fab") (tstamp 91c70e27-4a1f-494d-a147-ec3b7f6610ee))
  (fp_line (start 1.5 1.5) (end -1.5 1.5)
    (stroke (width 0.15) (type solid)) (layer "F.Fab") (tstamp 9eaad664-68d6-461c-bfff-e10d0692c86a))
  (pad "" smd rect (at -0.4375 -0.4375) (size 0.7 0.7) (layers "F.Paste") (tstamp 306987bc-8ace-4bd7-8ae8-9dcdc3b49adc))
  (pad "" smd rect (at -0.4375 0.4375) (size 0.7 0.7) (layers "F.Paste") (tstamp 6ac9d59f-6718-422f-9c83-6e044e383021))
  (pad "" smd rect (at 0.4375 -0.4375) (size 0.7 0.7) (layers "F.Paste") (tstamp 7eb7e942-15b5-4a9c-91d8-e419f8a9fc5c))
  (pad "" smd rect (at 0.4375 0.4375) (size 0.7 0.7) (layers "F.Paste") (tstamp 4a6c9ef6-6c01-48d8-8184-7b05a5f25f0e))
  (pad "1" smd oval (at -1.5 -0.75) (size 0.8 0.3) (layers "F.Cu" "F.Paste" "F.Mask") (tstamp 1c6191af-9d5e-4ca2-b846-6c28e0d1cf2d))
  (pad "2" smd oval (at -1.5 -0.25) (size 0.8 0.3) (layers "F.Cu" "F.Paste" "F.Mask") (tstamp 32f1d654-3ece-4204-ab42-de6c3447d494))
  (pad "3" smd oval (at -1.5 0.25) (size 0.8 0.3) (layers "F.Cu" "F.Paste" "F.Mask") (tstamp 2076099b-a30a-4f42-81d3-78f61e49aca1))
  (pad "4" smd oval (at -1.5 0.75) (size 0.8 0.3) (layers "F.Cu" "F.Paste" "F.Mask") (tstamp 23f54e8f-2ce5-4701-be48-ca059cf1590f))
  (pad "5" smd oval (at -0.75 1.5 90) (size 0.8 0.3) (layers "F.Cu" "F.Paste" "F.Mask") (tstamp 2b8f9b1c-42be-4fa2-8383-c30d6bebc70d))
  (pad "6" smd oval (at -0.25 1.5 90) (size 0.8 0.3) (layers "F.Cu" "F.Paste" "F.Mask") (tstamp d28e14e5-4902-4abf-85a0-eebeb75c4b60))
  (pad "7" smd oval (at 0.25 1.5 90) (size 0.8 0.3) (layers "F.Cu" "F.Paste" "F.Mask") (tstamp a691b798-a459-4068-8c2d-7ee11e8a1e02))
  (pad "8" smd oval (at 0.75 1.5 90) (size 0.8 0.3) (layers "F.Cu" "F.Paste" "F.Mask") (tstamp 7686f976-7827-435d-a0fd-4e9aa2b2c9d0))
  (pad "9" smd oval (at 1.5 0.75) (size 0.8 0.3) (layers "F.Cu" "F.Paste" "F.Mask") (tstamp 1b827b03-3b4b-4201-92f2-20ce25912cc0))
  (pad "10" smd oval (at 1.5 0.25) (size 0.8 0.3) (layers "F.Cu" "F.Paste" "F.Mask") (tstamp 7d8fd4c5-87aa-4701-8281-163ec92713b2))
  (pad "11" smd oval (at 1.5 -0.25) (size 0.8 0.3) (layers "F.Cu" "F.Paste" "F.Mask") (tstamp b59d9219-42a9-4464-bde6-44d05adf4b71))
  (pad "12" smd oval (at 1.5 -0.75) (size 0.8 0.3) (layers "F.Cu" "F.Paste" "F.Mask") (tstamp 24fcfb44-79aa-4c63-afb4-8b63cafcd932))
  (pad "13" smd oval (at 0.75 -1.5 90) (size 0.8 0.3) (layers "F.Cu" "F.Paste" "F.Mask") (tstamp 3336998b-38f9-4b18-867e-4bc21370ae45))
  (pad "14" smd oval (at 0.25 -1.5 90) (size 0.8 0.3) (layers "F.Cu" "F.Paste" "F.Mask") (tstamp fa249be3-6213-4abc-b9df-ee4cfd542c2c))
  (pad "15" smd oval (at -0.25 -1.5 90) (size 0.8 0.3) (layers "F.Cu" "F.Paste" "F.Mask") (tstamp cadf24d7-f93e-46c9-97f2-29ecf5e9d210))
  (pad "16" smd oval (at -0.75 -1.5 90) (size 0.8 0.3) (layers "F.Cu" "F.Paste" "F.Mask") (tstamp 916231df-110b-4960-ac34-c22325c2995e))
  (pad "17" smd rect (at 0 0) (size 1.75 1.75) (layers "F.Cu" "F.Mask") (tstamp 1f1dfed8-8874-495c-ad48-64d3b1037c66))
  (model "${KICAD6_3DMODEL_DIR}/Package_DFN_QFN.3dshapes/UQFN-16-1EP_3x3mm_P0.5mm_EP1.75x1.75mm.wrl"
    (offset (xyz 0 0 0))
    (scale (xyz 1 1 1))
    (rotate (xyz 0 0 0))
  )
)
