(footprint "WDFN-6-2EP_4.0x2.6mm_P0.65mm" (version 20221018) (generator pcbnew)
  (layer "F.Cu")
  (descr "WDFN, 6 pin, 4.0x2.6, 0.65P; Two exposed pads, (https://www.onsemi.com/pub/Collateral/511BZ.PDF)")
  (tags "DFN 0.65P dual flag")
  (attr smd)
  (fp_text reference "REF**" (at 0 -2.3) (layer "F.SilkS")
      (effects (font (size 1 1) (thickness 0.15)))
    (tstamp 866d76fa-7dde-4536-af03-9d15f900a091)
  )
  (fp_text value "WDFN-6-2EP_4.0x2.6mm_P0.65mm" (at 0 2.5) (layer "F.Fab")
      (effects (font (size 1 1) (thickness 0.15)))
    (tstamp d08e2fb2-01df-468b-8753-a1656b8824bd)
  )
  (fp_text user "${REFERENCE}" (at 0 0) (layer "F.Fab")
      (effects (font (size 0.8 0.8) (thickness 0.12)))
    (tstamp 4275d24d-a27b-46f1-a576-959c739a06cd)
  )
  (fp_line (start -2 1.42) (end 2 1.42)
    (stroke (width 0.12) (type solid)) (layer "F.SilkS") (tstamp e1e5eba4-adad-4f3f-b8f1-2f101816150c))
  (fp_line (start 2 -1.42) (end 0 -1.42)
    (stroke (width 0.12) (type solid)) (layer "F.SilkS") (tstamp da1efef5-3c80-4643-a0a8-f2c7d27ff9f8))
  (fp_line (start -2.35 -1.55) (end -2.35 1.55)
    (stroke (width 0.05) (type solid)) (layer "F.CrtYd") (tstamp 8d7fc66d-0265-468f-9121-59273dc31c10))
  (fp_line (start -2.35 1.55) (end 2.35 1.55)
    (stroke (width 0.05) (type solid)) (layer "F.CrtYd") (tstamp 7571cf70-a1ae-4315-b8a9-f31d7c2e7767))
  (fp_line (start 2.35 -1.55) (end -2.35 -1.55)
    (stroke (width 0.05) (type solid)) (layer "F.CrtYd") (tstamp 3446d634-7769-4e7d-a928-2b48f101bec9))
  (fp_line (start 2.35 1.55) (end 2.35 -1.55)
    (stroke (width 0.05) (type solid)) (layer "F.CrtYd") (tstamp 3b452198-eec9-4e94-ae17-f13f67a0f100))
  (fp_line (start -2 -0.65) (end -2 1.3)
    (stroke (width 0.1) (type solid)) (layer "F.Fab") (tstamp e9de9621-24dd-4e05-abce-2f05aed6651a))
  (fp_line (start -2 -0.65) (end -1.35 -1.3)
    (stroke (width 0.1) (type solid)) (layer "F.Fab") (tstamp 542dec88-4197-408f-995e-21cb0a02b46f))
  (fp_line (start -2 1.3) (end 2 1.3)
    (stroke (width 0.1) (type solid)) (layer "F.Fab") (tstamp 59b5d13b-e8fc-46cd-8072-bb9e1cd591b8))
  (fp_line (start 2 -1.3) (end -1.35 -1.3)
    (stroke (width 0.1) (type solid)) (layer "F.Fab") (tstamp dd741403-ecf7-4bff-9f0c-849967cebed2))
  (fp_line (start 2 1.3) (end 2 -1.3)
    (stroke (width 0.1) (type solid)) (layer "F.Fab") (tstamp 83dc9464-a014-49f4-92f3-71a957dea762))
  (pad "1" smd rect (at -1.9 -0.65 270) (size 0.4 0.4) (layers "F.Cu" "F.Paste" "F.Mask") (tstamp 1ff8325f-0841-48fa-8fb7-e921e492cef4))
  (pad "2" smd rect (at -1.9 0 270) (size 0.4 0.4) (layers "F.Cu" "F.Paste" "F.Mask") (tstamp 51f299d6-c87a-4cd1-ba03-95fbc1bcf2e5))
  (pad "3" smd rect (at -1.9 0.65 270) (size 0.4 0.4) (layers "F.Cu" "F.Paste" "F.Mask") (tstamp eb0a2498-0143-4b3a-89bb-e92d2da7ccfa))
  (pad "4" smd rect (at 1.9 0.65 270) (size 0.4 0.4) (layers "F.Cu" "F.Paste" "F.Mask") (tstamp 42a9e89e-120b-4814-824f-a26439a5789a))
  (pad "5" smd rect (at 1.9 0 270) (size 0.4 0.4) (layers "F.Cu" "F.Paste" "F.Mask") (tstamp 7c905a45-00c1-4700-9bef-5f6537653f2f))
  (pad "6" smd rect (at 1.9 -0.65 270) (size 0.4 0.4) (layers "F.Cu" "F.Paste" "F.Mask") (tstamp 208711d1-d50e-4db8-9fd0-fce0d92de157))
  (pad "7" smd rect (at 0 -0.438 270) (size 1.415 2.5) (layers "F.Cu" "F.Paste" "F.Mask") (tstamp 901e2ba2-84d6-422d-b239-bf3762520004))
  (pad "8" smd rect (at 0 0.838 270) (size 0.615 2.5) (layers "F.Cu" "F.Paste" "F.Mask") (tstamp f8bd11e3-0842-4af6-b4ae-0c72b7ecf29e))
  (model "${KICAD6_3DMODEL_DIR}/Package_DFN_QFN.3dshapes/WDFN-6-2EP_4.0x2.6mm_P0.65mm.wrl"
    (offset (xyz 0 0 0))
    (scale (xyz 1 1 1))
    (rotate (xyz 0 0 0))
  )
)
