(footprint "Maxim_WLP-12" (version 20221018) (generator pcbnew)
  (layer "F.Cu")
  (descr "Maxim_WLP-12 W121B2+1 http://pdfserv.maximintegrated.com/package_dwgs/21-0009.PDF")
  (tags "Maxim_WLP-12")
  (attr smd)
  (fp_text reference "REF**" (at 0 -2.5) (layer "F.SilkS")
      (effects (font (size 1 1) (thickness 0.15)))
    (tstamp ed9ea363-5ced-4809-85e7-a38bb813fbeb)
  )
  (fp_text value "Maxim_WLP-12" (at 0.75 2.5) (layer "F.Fab")
      (effects (font (size 1 1) (thickness 0.15)))
    (tstamp 00ca8b36-6b60-4d77-86f7-dd45b5cfcaaf)
  )
  (fp_text user "${REFERENCE}" (at 0 0) (layer "F.Fab")
      (effects (font (size 0.4 0.4) (thickness 0.04)))
    (tstamp 1272f7cf-7f6f-488d-a05e-b0f956734b4c)
  )
  (fp_line (start -1.3 -1.1) (end -1.3 -0.1)
    (stroke (width 0.1) (type solid)) (layer "F.SilkS") (tstamp 421f099c-fd00-4c65-845e-9958f42fef93))
  (fp_line (start -1.3 -1.1) (end -0.3 -1.1)
    (stroke (width 0.1) (type solid)) (layer "F.SilkS") (tstamp f5f790ff-312b-4de3-a6ad-bb7d74dab635))
  (fp_line (start -1.1 -0.9) (end -1.1 0.9)
    (stroke (width 0.1) (type solid)) (layer "F.SilkS") (tstamp f385f6ab-4275-47d2-a4a1-83814d57c304))
  (fp_line (start -1.1 -0.9) (end 1.1 -0.9)
    (stroke (width 0.1) (type solid)) (layer "F.SilkS") (tstamp 6dda67a5-31c4-495f-b1a9-4d051eaa23bb))
  (fp_line (start 1.1 0.9) (end -1.1 0.9)
    (stroke (width 0.1) (type solid)) (layer "F.SilkS") (tstamp 4b7a4207-3213-40a1-ad7e-6cbd4b6eb898))
  (fp_line (start 1.1 0.9) (end 1.1 -0.9)
    (stroke (width 0.1) (type solid)) (layer "F.SilkS") (tstamp 70effc31-99aa-45c7-ba21-af3817b46187))
  (fp_line (start -2.02 -1.78) (end 2.02 -1.78)
    (stroke (width 0.05) (type solid)) (layer "F.CrtYd") (tstamp a4d8e220-c80c-4858-99e3-c638dfa4881c))
  (fp_line (start -2.02 1.78) (end -2.02 -1.78)
    (stroke (width 0.05) (type solid)) (layer "F.CrtYd") (tstamp 081ad320-4feb-436c-adbb-1a62cea2649c))
  (fp_line (start -2.02 1.78) (end 2.02 1.78)
    (stroke (width 0.05) (type solid)) (layer "F.CrtYd") (tstamp bf0da8cb-84a7-42b9-8962-340c3b259042))
  (fp_line (start 2.02 -1.78) (end 2.02 1.78)
    (stroke (width 0.05) (type solid)) (layer "F.CrtYd") (tstamp 4d88e3a5-6a61-4c0f-be0f-3b240e60551e))
  (fp_line (start -1.02 0.78) (end -1.02 -0.54)
    (stroke (width 0.1) (type solid)) (layer "F.Fab") (tstamp 435a5b1d-1b87-461b-9e1b-ed293bdec85a))
  (fp_line (start -1.02 0.78) (end 1.02 0.78)
    (stroke (width 0.1) (type solid)) (layer "F.Fab") (tstamp 670831d2-033c-4b27-854c-d1024cfac392))
  (fp_line (start -0.75 -0.78) (end -1.02 -0.54)
    (stroke (width 0.1) (type solid)) (layer "F.Fab") (tstamp 3dc453c6-bdaa-491d-815e-e48f13babd9f))
  (fp_line (start 1.02 -0.78) (end -0.75 -0.78)
    (stroke (width 0.1) (type solid)) (layer "F.Fab") (tstamp 3fe23c9a-04f7-4569-9b58-e1615dcc0331))
  (fp_line (start 1.02 -0.78) (end 1.02 0.78)
    (stroke (width 0.1) (type solid)) (layer "F.Fab") (tstamp 53ecdebf-58d4-42cc-b33c-8625380bd7bc))
  (pad "A1" smd circle (at -0.75 -0.5 90) (size 0.3 0.3) (layers "F.Cu" "F.Paste" "F.Mask") (tstamp d2ebe5be-19bb-4d88-b47c-3bbfbc54794b))
  (pad "A2" smd circle (at -0.25 -0.5 90) (size 0.3 0.3) (layers "F.Cu" "F.Paste" "F.Mask") (tstamp 967003cf-9288-4226-b1d2-fea09499b381))
  (pad "A3" smd circle (at 0.25 -0.5 90) (size 0.3 0.3) (layers "F.Cu" "F.Paste" "F.Mask") (tstamp 302e467e-41fe-4285-b525-a63bf38570e5))
  (pad "A4" smd circle (at 0.75 -0.5 90) (size 0.3 0.3) (layers "F.Cu" "F.Paste" "F.Mask") (tstamp 8a3c588a-4c3e-43e3-af14-54f5ac11fa11))
  (pad "B1" smd circle (at -0.75 0 90) (size 0.3 0.3) (layers "F.Cu" "F.Paste" "F.Mask") (tstamp 0e578664-0f99-4c01-b8a7-a3028fdc0352))
  (pad "B2" smd circle (at -0.25 0 90) (size 0.3 0.3) (layers "F.Cu" "F.Paste" "F.Mask") (tstamp 63db4297-420a-4497-9edc-0ba7d395b4fd))
  (pad "B3" smd circle (at 0.25 0 90) (size 0.3 0.3) (layers "F.Cu" "F.Paste" "F.Mask") (tstamp 1a3690ec-6baa-4418-9a8c-824d4a7dd309))
  (pad "B4" smd circle (at 0.75 0 90) (size 0.3 0.3) (layers "F.Cu" "F.Paste" "F.Mask") (tstamp a2676893-679d-41f7-9e40-c48b059a6d2f))
  (pad "C1" smd circle (at -0.75 0.5 90) (size 0.3 0.3) (layers "F.Cu" "F.Paste" "F.Mask") (tstamp d9bd4ea1-5124-4b6f-9e43-e2f16d949f4e))
  (pad "C2" smd circle (at -0.25 0.5 90) (size 0.3 0.3) (layers "F.Cu" "F.Paste" "F.Mask") (tstamp bb3493fe-646d-4b37-ac70-805c2ee7ef54))
  (pad "C3" smd circle (at 0.25 0.5 90) (size 0.3 0.3) (layers "F.Cu" "F.Paste" "F.Mask") (tstamp 845f0f2f-13ab-4296-bb72-fc1750a00f83))
  (pad "C4" smd circle (at 0.75 0.5 90) (size 0.3 0.3) (layers "F.Cu" "F.Paste" "F.Mask") (tstamp 04c33dc9-f33e-4dd3-ae14-cba5a2c83256))
  (model "${KICAD6_3DMODEL_DIR}/Package_BGA.3dshapes/Maxim_WLP-12.wrl"
    (offset (xyz 0 0 0))
    (scale (xyz 1 1 1))
    (rotate (xyz 0 0 0))
  )
)
