(footprint "NXP_HTSSOP-28-1EP_4.4x9.7mm_P0.65mm_EP2.2x3.4mm_ThermalVias" (version 20221018) (generator pcbnew)
  (layer "F.Cu")
  (descr "HTSSOP, 28 Pin (https://www.nxp.com/docs/en/package-information/SOT1172-3.pdf)")
  (tags "HTSSOP SO")
  (attr smd)
  (fp_text reference "REF**" (at 0 -5.8) (layer "F.SilkS")
      (effects (font (size 1 1) (thickness 0.15)))
    (tstamp 9b4ea65d-3c25-4725-8a86-3a622ea0f561)
  )
  (fp_text value "NXP_HTSSOP-28-1EP_4.4x9.7mm_P0.65mm_EP2.2x3.4mm_ThermalVias" (at 0 5.8) (layer "F.Fab")
      (effects (font (size 1 1) (thickness 0.15)))
    (tstamp 44c1aabb-292c-4606-9169-544b381b4d2c)
  )
  (fp_text user "${REFERENCE}" (at 0 0) (layer "F.Fab")
      (effects (font (size 1 1) (thickness 0.15)))
    (tstamp ecf3a0d3-6875-4fd1-9993-98cac0f6e30e)
  )
  (fp_line (start -2.31 -4.96) (end -2.31 -4.84)
    (stroke (width 0.12) (type solid)) (layer "F.SilkS") (tstamp 16f76f60-9fc1-4638-a767-ac2a1f4aecb6))
  (fp_line (start -2.31 -4.84) (end -3.65 -4.84)
    (stroke (width 0.12) (type solid)) (layer "F.SilkS") (tstamp d4051ef9-3790-4fa9-a64e-05a62ba4df92))
  (fp_line (start -2.31 4.96) (end -2.31 4.81)
    (stroke (width 0.12) (type solid)) (layer "F.SilkS") (tstamp 81a01c90-648b-4b6d-9713-650c0b75e3b4))
  (fp_line (start 0 -4.96) (end -2.31 -4.96)
    (stroke (width 0.12) (type solid)) (layer "F.SilkS") (tstamp 90a8b56e-29f8-4ab5-b605-b3d55a9f15a3))
  (fp_line (start 0 -4.96) (end 2.31 -4.96)
    (stroke (width 0.12) (type solid)) (layer "F.SilkS") (tstamp e30d766f-95e8-4394-9e1f-0cf2dd66c388))
  (fp_line (start 0 4.96) (end -2.31 4.96)
    (stroke (width 0.12) (type solid)) (layer "F.SilkS") (tstamp 73168006-d797-428f-92f1-3f0cf6013fcb))
  (fp_line (start 0 4.96) (end 2.31 4.96)
    (stroke (width 0.12) (type solid)) (layer "F.SilkS") (tstamp d941fa69-3a39-488d-928d-9b692585b1e2))
  (fp_line (start 2.31 -4.81) (end 2.31 -4.96)
    (stroke (width 0.12) (type solid)) (layer "F.SilkS") (tstamp f45430cb-73c7-4a43-accf-f405327554ca))
  (fp_line (start 2.31 4.96) (end 2.31 4.81)
    (stroke (width 0.12) (type solid)) (layer "F.SilkS") (tstamp 6f681847-6136-4a76-b0b7-0b8e01955e75))
  (fp_line (start -3.98 -5.15) (end -3.98 5.15)
    (stroke (width 0.05) (type solid)) (layer "F.CrtYd") (tstamp a7e4efe8-2707-4c98-ac8b-0fb026ece46a))
  (fp_line (start -3.98 5.15) (end 3.98 5.15)
    (stroke (width 0.05) (type solid)) (layer "F.CrtYd") (tstamp 077c36d1-251b-4fb1-9e9d-b459221dd707))
  (fp_line (start 3.98 -5.15) (end -3.98 -5.15)
    (stroke (width 0.05) (type solid)) (layer "F.CrtYd") (tstamp 39dbe780-1c08-4edd-8bc0-c8cda107ec63))
  (fp_line (start 3.98 5.15) (end 3.98 -5.15)
    (stroke (width 0.05) (type solid)) (layer "F.CrtYd") (tstamp 456847da-18ae-4821-a224-68e03e1739a5))
  (fp_line (start -2.2 -3.85) (end -1.2 -4.85)
    (stroke (width 0.1) (type solid)) (layer "F.Fab") (tstamp c6aa14c0-bc21-45b2-a4bf-dfdf0b36b3bd))
  (fp_line (start -2.2 4.85) (end -2.2 -3.85)
    (stroke (width 0.1) (type solid)) (layer "F.Fab") (tstamp 726be881-f776-47c4-bb87-5385341fd3ea))
  (fp_line (start -1.2 -4.85) (end 2.2 -4.85)
    (stroke (width 0.1) (type solid)) (layer "F.Fab") (tstamp f8654ea5-733f-46ab-88ae-813991a39487))
  (fp_line (start 2.2 -4.85) (end 2.2 4.85)
    (stroke (width 0.1) (type solid)) (layer "F.Fab") (tstamp 46a79ee1-26f5-4130-9178-27d0de941276))
  (fp_line (start 2.2 4.85) (end -2.2 4.85)
    (stroke (width 0.1) (type solid)) (layer "F.Fab") (tstamp b6dc9e41-216d-4bdc-9554-133e253f4696))
  (pad "" smd roundrect (at -0.7 -1.23) (size 0.6 0.7) (layers "F.Paste") (roundrect_rratio 0.25) (tstamp 28c94ece-a528-4153-b99a-c45899632e25))
  (pad "" smd roundrect (at -0.7 -0.41) (size 0.6 0.7) (layers "F.Paste") (roundrect_rratio 0.25) (tstamp 1d74517f-9637-4843-b00a-d25d9cb8cf01))
  (pad "" smd roundrect (at -0.7 0.41) (size 0.6 0.7) (layers "F.Paste") (roundrect_rratio 0.25) (tstamp 38020209-b011-4117-8850-b81bcfa4eb4d))
  (pad "" smd roundrect (at -0.7 1.23) (size 0.6 0.7) (layers "F.Paste") (roundrect_rratio 0.25) (tstamp bc8b6bab-746e-439a-bfec-0d9b79704c02))
  (pad "" smd roundrect (at 0 -1.23) (size 0.6 0.7) (layers "F.Paste") (roundrect_rratio 0.25) (tstamp 4aeb657e-de48-4265-b9ef-a37760f4e8db))
  (pad "" smd roundrect (at 0 -0.41) (size 0.6 0.7) (layers "F.Paste") (roundrect_rratio 0.25) (tstamp 63f8e629-d85d-4f6a-8303-a271f2405586))
  (pad "" smd roundrect (at 0 0.41) (size 0.6 0.7) (layers "F.Paste") (roundrect_rratio 0.25) (tstamp 2800f63b-c2fe-474a-a995-c7f1ed460780))
  (pad "" smd roundrect (at 0 1.23) (size 0.6 0.7) (layers "F.Paste") (roundrect_rratio 0.25) (tstamp 8152bc26-7068-466b-a91f-38fe97c06a28))
  (pad "" smd roundrect (at 0.7 -1.23) (size 0.6 0.7) (layers "F.Paste") (roundrect_rratio 0.25) (tstamp 611a6b90-fba8-4f31-a41a-56cff4ba3539))
  (pad "" smd roundrect (at 0.7 -0.41) (size 0.6 0.7) (layers "F.Paste") (roundrect_rratio 0.25) (tstamp 067c7b1b-804f-4e94-ab50-3a6bee231b70))
  (pad "" smd roundrect (at 0.7 0.41) (size 0.6 0.7) (layers "F.Paste") (roundrect_rratio 0.25) (tstamp 45d6a912-6bc2-4886-8f6c-5d5f4483d758))
  (pad "" smd roundrect (at 0.7 1.23) (size 0.6 0.7) (layers "F.Paste") (roundrect_rratio 0.25) (tstamp 24c07993-0ac3-4015-be76-55f086f436c6))
  (pad "1" smd roundrect (at -3.05 -4.325) (size 1.35 0.6) (layers "F.Cu" "F.Paste" "F.Mask") (roundrect_rratio 0.1666666667) (tstamp e25e78da-840d-4f4a-98ca-76b28dc394b8))
  (pad "2" smd roundrect (at -3.05 -3.575) (size 1.35 0.4) (layers "F.Cu" "F.Paste" "F.Mask") (roundrect_rratio 0.25) (tstamp df01d564-174e-45e9-98cf-533e3ea5262e))
  (pad "3" smd roundrect (at -3.05 -2.925) (size 1.35 0.4) (layers "F.Cu" "F.Paste" "F.Mask") (roundrect_rratio 0.25) (tstamp 0c8f9eb4-3e18-4274-8419-5f2fb6ce4d0e))
  (pad "4" smd roundrect (at -3.05 -2.275) (size 1.35 0.4) (layers "F.Cu" "F.Paste" "F.Mask") (roundrect_rratio 0.25) (tstamp 834de683-6db3-4611-a400-f4055d343405))
  (pad "5" smd roundrect (at -3.05 -1.625) (size 1.35 0.4) (layers "F.Cu" "F.Paste" "F.Mask") (roundrect_rratio 0.25) (tstamp 6f1dc816-c885-4246-a0f5-24bcf33aae2f))
  (pad "6" smd roundrect (at -3.05 -0.975) (size 1.35 0.4) (layers "F.Cu" "F.Paste" "F.Mask") (roundrect_rratio 0.25) (tstamp 6d200cc3-2c49-43c6-932f-98fe026c8d26))
  (pad "7" smd roundrect (at -3.05 -0.325) (size 1.35 0.4) (layers "F.Cu" "F.Paste" "F.Mask") (roundrect_rratio 0.25) (tstamp b72c5cd5-d6e9-4baf-ba40-10171ab70a26))
  (pad "8" smd roundrect (at -3.05 0.325) (size 1.35 0.4) (layers "F.Cu" "F.Paste" "F.Mask") (roundrect_rratio 0.25) (tstamp e4eb47e4-f0ac-49a1-88e2-dec8a2fa7550))
  (pad "9" smd roundrect (at -3.05 0.975) (size 1.35 0.4) (layers "F.Cu" "F.Paste" "F.Mask") (roundrect_rratio 0.25) (tstamp 7f1b976c-f9de-4eee-a58e-073e4dab59fd))
  (pad "10" smd roundrect (at -3.05 1.625) (size 1.35 0.4) (layers "F.Cu" "F.Paste" "F.Mask") (roundrect_rratio 0.25) (tstamp 13dcc576-2572-4df3-859b-a8e8ff06d009))
  (pad "11" smd roundrect (at -3.05 2.275) (size 1.35 0.4) (layers "F.Cu" "F.Paste" "F.Mask") (roundrect_rratio 0.25) (tstamp ab4686d2-bddd-454f-98b5-0c41375b0ab9))
  (pad "12" smd roundrect (at -3.05 2.925) (size 1.35 0.4) (layers "F.Cu" "F.Paste" "F.Mask") (roundrect_rratio 0.25) (tstamp ea1173ef-f461-4ccd-b153-f8dcf46316c0))
  (pad "13" smd roundrect (at -3.05 3.575) (size 1.35 0.4) (layers "F.Cu" "F.Paste" "F.Mask") (roundrect_rratio 0.25) (tstamp 45497af1-4757-43b2-a631-f4aa81f86636))
  (pad "14" smd roundrect (at -3.05 4.325) (size 1.35 0.6) (layers "F.Cu" "F.Paste" "F.Mask") (roundrect_rratio 0.1666666667) (tstamp c1555c69-338e-4e67-b685-ed210c658ded))
  (pad "15" smd roundrect (at 3.05 4.325) (size 1.35 0.6) (layers "F.Cu" "F.Paste" "F.Mask") (roundrect_rratio 0.1666666667) (tstamp ea388bf1-1dbc-4537-9728-eec73b2a841c))
  (pad "16" smd roundrect (at 3.05 3.575) (size 1.35 0.4) (layers "F.Cu" "F.Paste" "F.Mask") (roundrect_rratio 0.25) (tstamp fa56338d-378a-4184-9314-1eb8665b54c2))
  (pad "17" smd roundrect (at 3.05 2.925) (size 1.35 0.4) (layers "F.Cu" "F.Paste" "F.Mask") (roundrect_rratio 0.25) (tstamp 2a73f9e7-7b0b-44d6-b7be-307578d65e29))
  (pad "18" smd roundrect (at 3.05 2.275) (size 1.35 0.4) (layers "F.Cu" "F.Paste" "F.Mask") (roundrect_rratio 0.25) (tstamp 2c3ec964-e897-413e-988d-737d2442a7fc))
  (pad "19" smd roundrect (at 3.05 1.625) (size 1.35 0.4) (layers "F.Cu" "F.Paste" "F.Mask") (roundrect_rratio 0.25) (tstamp 5d15bb5d-3fc2-4b8e-b485-6a69879b5900))
  (pad "20" smd roundrect (at 3.05 0.975) (size 1.35 0.4) (layers "F.Cu" "F.Paste" "F.Mask") (roundrect_rratio 0.25) (tstamp 7441762f-f8ea-4323-baee-3f82ecd58823))
  (pad "21" smd roundrect (at 3.05 0.325) (size 1.35 0.4) (layers "F.Cu" "F.Paste" "F.Mask") (roundrect_rratio 0.25) (tstamp ee2d6db8-5a3b-45ff-bcc1-0ae61cca0434))
  (pad "22" smd roundrect (at 3.05 -0.325) (size 1.35 0.4) (layers "F.Cu" "F.Paste" "F.Mask") (roundrect_rratio 0.25) (tstamp d6d2cfa6-da56-4e90-baa1-d2b777f337a1))
  (pad "23" smd roundrect (at 3.05 -0.975) (size 1.35 0.4) (layers "F.Cu" "F.Paste" "F.Mask") (roundrect_rratio 0.25) (tstamp a9d0b244-e225-40bf-9d22-9c088901f2d1))
  (pad "24" smd roundrect (at 3.05 -1.625) (size 1.35 0.4) (layers "F.Cu" "F.Paste" "F.Mask") (roundrect_rratio 0.25) (tstamp 966ef1f4-a573-4c6c-bbf5-d20718bb5568))
  (pad "25" smd roundrect (at 3.05 -2.275) (size 1.35 0.4) (layers "F.Cu" "F.Paste" "F.Mask") (roundrect_rratio 0.25) (tstamp 92ddfeb9-b668-415c-adb1-f045c19ecbb3))
  (pad "26" smd roundrect (at 3.05 -2.925) (size 1.35 0.4) (layers "F.Cu" "F.Paste" "F.Mask") (roundrect_rratio 0.25) (tstamp d0fe7f2d-d922-4ddf-b523-f95999abf28a))
  (pad "27" smd roundrect (at 3.05 -3.575) (size 1.35 0.4) (layers "F.Cu" "F.Paste" "F.Mask") (roundrect_rratio 0.25) (tstamp 374fb318-8df0-4bfe-b822-b6389df1a2f6))
  (pad "28" smd roundrect (at 3.05 -4.325) (size 1.35 0.6) (layers "F.Cu" "F.Paste" "F.Mask") (roundrect_rratio 0.1666666667) (tstamp 8e1e8a78-5262-4e01-b305-ec4f391c0071))
  (pad "29" thru_hole circle (at -0.8 -1.4) (size 0.6 0.6) (drill 0.3) (layers "*.Cu") (tstamp 4fe4980f-21d2-4069-b90c-cc0b72ea26d8))
  (pad "29" thru_hole circle (at -0.8 -0.47) (size 0.6 0.6) (drill 0.3) (layers "*.Cu") (tstamp a8be37e4-729d-4a0f-8c33-657f6818871e))
  (pad "29" thru_hole circle (at -0.8 0.47) (size 0.6 0.6) (drill 0.3) (layers "*.Cu") (tstamp ef817c17-e74e-4b39-a44a-66889a915800))
  (pad "29" thru_hole circle (at -0.8 1.4) (size 0.6 0.6) (drill 0.3) (layers "*.Cu") (tstamp fac8d3d7-02d9-48d6-883b-06d5dff96ba5))
  (pad "29" smd rect (at 0 0) (size 2.2 3.4) (layers "F.Cu" "F.Mask") (tstamp 446f8f70-d180-4d53-bc8f-c22854df685e))
  (pad "29" smd rect (at 0 0) (size 2.2 3.4) (layers "B.Cu") (tstamp 762629a7-af3e-4351-8692-6e570bdd7127))
  (pad "29" thru_hole circle (at 0.8 -1.4) (size 0.6 0.6) (drill 0.3) (layers "*.Cu") (tstamp fcce7017-feb4-4bc3-a995-31bbe8292d68))
  (pad "29" thru_hole circle (at 0.8 -0.47) (size 0.6 0.6) (drill 0.3) (layers "*.Cu") (tstamp 3e1fba60-5ff3-40de-a1b5-f3de0ed90b9d))
  (pad "29" thru_hole circle (at 0.8 0.47) (size 0.6 0.6) (drill 0.3) (layers "*.Cu") (tstamp 5daf2314-1e20-447b-a0b8-936a559ef5fe))
  (pad "29" thru_hole circle (at 0.8 1.4) (size 0.6 0.6) (drill 0.3) (layers "*.Cu") (tstamp 6f70cad8-b730-4b7d-961d-599280562ab1))
  (model "${KICAD7_3DMODEL_DIR}/Package_SO.3dshapes/NXP_HTSSOP-28-1EP_4.4x9.7mm_P0.65mm_EP2.2x3.4mm.wrl"
    (offset (xyz 0 0 0))
    (scale (xyz 1 1 1))
    (rotate (xyz 0 0 0))
  )
)
