(footprint "TO-252-4" (version 20221018) (generator pcbnew)
  (layer "F.Cu")
  (descr "TO-252/DPAK SMD package, http://www.infineon.com/cms/en/product/packages/PG-TO252/PG-TO252-5-11/")
  (tags "DPAK TO-252 DPAK-5 TO-252-5")
  (attr smd)
  (fp_text reference "REF**" (at 0 -4.5) (layer "F.SilkS")
      (effects (font (size 1 1) (thickness 0.15)))
    (tstamp 085b50eb-7965-43f5-8c94-c484c57a3fca)
  )
  (fp_text value "TO-252-4" (at 0 4.5) (layer "F.Fab")
      (effects (font (size 1 1) (thickness 0.15)))
    (tstamp 50cc6eff-9505-45bb-a285-36cfa5a5faf1)
  )
  (fp_text user "${REFERENCE}" (at 0 0) (layer "F.Fab")
      (effects (font (size 1 1) (thickness 0.15)))
    (tstamp 2565e4ef-88f9-4b10-8d93-82fa1a6879c3)
  )
  (fp_line (start -3.31 -3.45) (end -3.31 -2.98)
    (stroke (width 0.12) (type solid)) (layer "F.SilkS") (tstamp 87f26c5b-cabe-4042-b640-2470b1b5c6e3))
  (fp_line (start -3.31 -2.98) (end -6.14 -2.98)
    (stroke (width 0.12) (type solid)) (layer "F.SilkS") (tstamp dcba449a-1566-4b43-8b15-7e7c162cddf4))
  (fp_line (start -3.31 2.98) (end -4.41 2.98)
    (stroke (width 0.12) (type solid)) (layer "F.SilkS") (tstamp cecb6bd0-efaf-4ac0-9b15-2b84ccba0b5b))
  (fp_line (start -3.31 3.45) (end -3.31 2.98)
    (stroke (width 0.12) (type solid)) (layer "F.SilkS") (tstamp 27e62e4b-008f-4d15-a4a4-6775f4799c24))
  (fp_line (start 3.11 -3.45) (end -3.31 -3.45)
    (stroke (width 0.12) (type solid)) (layer "F.SilkS") (tstamp dd2c3b56-9dec-450b-9e4c-2c345d297791))
  (fp_line (start 3.11 3.45) (end -3.31 3.45)
    (stroke (width 0.12) (type solid)) (layer "F.SilkS") (tstamp fc02391a-8921-41f6-8638-f9ce1eab34dd))
  (fp_line (start -6.39 -3.5) (end -6.39 3.5)
    (stroke (width 0.05) (type solid)) (layer "F.CrtYd") (tstamp 4c1a7c3c-b3c9-48bb-b4ea-6e62a9758ab2))
  (fp_line (start -6.39 3.5) (end 4.71 3.5)
    (stroke (width 0.05) (type solid)) (layer "F.CrtYd") (tstamp 538a627c-7d1a-419e-9e2e-9868e2148b90))
  (fp_line (start 4.71 -3.5) (end -6.39 -3.5)
    (stroke (width 0.05) (type solid)) (layer "F.CrtYd") (tstamp 57cbcd15-e53d-4d8c-bf8d-7fdaec9b9112))
  (fp_line (start 4.71 3.5) (end 4.71 -3.5)
    (stroke (width 0.05) (type solid)) (layer "F.CrtYd") (tstamp ed5c8593-63d4-4c5d-9095-5e2bdd841dae))
  (fp_line (start -5.81 -2.58) (end -5.81 -1.98)
    (stroke (width 0.1) (type solid)) (layer "F.Fab") (tstamp c316d3ee-396f-4841-b3a9-7042d5f96fcb))
  (fp_line (start -5.81 -1.98) (end -3.11 -1.98)
    (stroke (width 0.1) (type solid)) (layer "F.Fab") (tstamp f41a336e-9cd3-4ce9-9164-00e0f753b180))
  (fp_line (start -5.81 -1.44) (end -5.81 -0.84)
    (stroke (width 0.1) (type solid)) (layer "F.Fab") (tstamp 8a7038f9-5256-40d7-81dc-a4dc6828956d))
  (fp_line (start -5.81 -0.84) (end -3.11 -0.84)
    (stroke (width 0.1) (type solid)) (layer "F.Fab") (tstamp a725da0d-a5cd-4058-b1e3-edbc432e43d6))
  (fp_line (start -5.81 0.84) (end -5.81 1.44)
    (stroke (width 0.1) (type solid)) (layer "F.Fab") (tstamp 8a0a3299-f192-4a2a-aea0-ad7c2824c108))
  (fp_line (start -5.81 1.44) (end -3.11 1.44)
    (stroke (width 0.1) (type solid)) (layer "F.Fab") (tstamp 6d582e47-2025-45b4-ac89-dd25d55090cc))
  (fp_line (start -5.81 1.98) (end -5.81 2.58)
    (stroke (width 0.1) (type solid)) (layer "F.Fab") (tstamp 81115a45-983b-4a8d-ab2a-3b3a588e63c4))
  (fp_line (start -5.81 2.58) (end -3.11 2.58)
    (stroke (width 0.1) (type solid)) (layer "F.Fab") (tstamp b8a75b75-5c55-46f4-a2d9-70f4fb9bfe09))
  (fp_line (start -3.11 -2.25) (end -2.11 -3.25)
    (stroke (width 0.1) (type solid)) (layer "F.Fab") (tstamp dd44f207-49b7-42df-97e1-75e71b45aeb1))
  (fp_line (start -3.11 -1.44) (end -5.81 -1.44)
    (stroke (width 0.1) (type solid)) (layer "F.Fab") (tstamp c424b342-53d0-467d-9ff5-e02b8b4308ea))
  (fp_line (start -3.11 0.84) (end -5.81 0.84)
    (stroke (width 0.1) (type solid)) (layer "F.Fab") (tstamp b8031a51-67b0-45f6-befa-6bee1d0c370e))
  (fp_line (start -3.11 1.98) (end -5.81 1.98)
    (stroke (width 0.1) (type solid)) (layer "F.Fab") (tstamp f1ddf0a5-d90b-4967-b746-1b2cdac84d23))
  (fp_line (start -3.11 3.25) (end -3.11 -2.25)
    (stroke (width 0.1) (type solid)) (layer "F.Fab") (tstamp 48cf1815-2213-4cbb-954d-e1baa8618e65))
  (fp_line (start -2.78 -2.58) (end -5.81 -2.58)
    (stroke (width 0.1) (type solid)) (layer "F.Fab") (tstamp 198158f5-6502-4b4c-a678-05ac3c38e5a8))
  (fp_line (start -2.11 -3.25) (end 3.11 -3.25)
    (stroke (width 0.1) (type solid)) (layer "F.Fab") (tstamp abe49b24-205a-47d0-ac57-c297acc4a144))
  (fp_line (start 3.11 -3.25) (end 3.11 3.25)
    (stroke (width 0.1) (type solid)) (layer "F.Fab") (tstamp a5d1f6be-e6e6-44df-9805-cc4c021d0320))
  (fp_line (start 3.11 -2.7) (end 4.11 -2.7)
    (stroke (width 0.1) (type solid)) (layer "F.Fab") (tstamp 395dd6a6-2674-4666-b792-501a6dd70b3b))
  (fp_line (start 3.11 3.25) (end -3.11 3.25)
    (stroke (width 0.1) (type solid)) (layer "F.Fab") (tstamp 06bf9f85-a1cf-4f56-a4cb-20f8f7eb3235))
  (fp_line (start 4.11 -2.7) (end 4.11 2.7)
    (stroke (width 0.1) (type solid)) (layer "F.Fab") (tstamp af434549-2ddf-4f8e-9dab-d15b86c83879))
  (fp_line (start 4.11 2.7) (end 3.11 2.7)
    (stroke (width 0.1) (type solid)) (layer "F.Fab") (tstamp 69282b50-f559-4875-a4d1-424f45d51fd4))
  (pad "1" smd roundrect (at -5.04 -2.28) (size 2.2 0.8) (layers "F.Cu" "F.Paste" "F.Mask") (roundrect_rratio 0.25) (tstamp aefaab7d-49d5-4826-97d5-e9cc52d6fc51))
  (pad "2" smd roundrect (at -5.04 -1.14) (size 2.2 0.8) (layers "F.Cu" "F.Paste" "F.Mask") (roundrect_rratio 0.25) (tstamp d7f8afeb-8df9-4ada-806d-9bb0016380b2))
  (pad "3" smd roundrect (at -0.415 -1.525) (size 3.05 2.75) (layers "F.Cu" "F.Paste") (roundrect_rratio 0.090909) (tstamp 24a4d343-4544-49c4-ad74-2b2967a3d5dd))
  (pad "3" smd roundrect (at -0.415 1.525) (size 3.05 2.75) (layers "F.Cu" "F.Paste") (roundrect_rratio 0.090909) (tstamp 68f78e16-fb10-4e58-b865-302638496415))
  (pad "3" smd roundrect (at 1.26 0) (size 6.4 5.8) (layers "F.Cu" "F.Mask") (roundrect_rratio 0.043103) (tstamp dc682336-e857-4dad-a69c-2cbb6511ad2a))
  (pad "3" smd roundrect (at 2.935 -1.525) (size 3.05 2.75) (layers "F.Cu" "F.Paste") (roundrect_rratio 0.090909) (tstamp 86384d05-a972-49b5-baca-27c7a4ff92de))
  (pad "3" smd roundrect (at 2.935 1.525) (size 3.05 2.75) (layers "F.Cu" "F.Paste") (roundrect_rratio 0.090909) (tstamp fe5035cb-7ef3-4b01-88ac-62a601e22156))
  (pad "4" smd roundrect (at -5.04 1.14) (size 2.2 0.8) (layers "F.Cu" "F.Paste" "F.Mask") (roundrect_rratio 0.25) (tstamp bd7b860e-0117-4d12-9c50-6fdf0998cdd2))
  (pad "5" smd roundrect (at -5.04 2.28) (size 2.2 0.8) (layers "F.Cu" "F.Paste" "F.Mask") (roundrect_rratio 0.25) (tstamp b4cd1c1d-91f8-4b64-b6f1-76d5141b7694))
  (model "${KICAD6_3DMODEL_DIR}/Package_TO_SOT_SMD.3dshapes/TO-252-4.wrl"
    (offset (xyz 0 0 0))
    (scale (xyz 1 1 1))
    (rotate (xyz 0 0 0))
  )
)
