(footprint "WSON-14-1EP_4.0x4.0mm_P0.5mm_EP2.6x2.6mm" (version 20221018) (generator pcbnew)
  (layer "F.Cu")
  (descr "14-Lead Plastic Dual Flat, No Lead Package - 4.0x4.0x0.8 mm Body [WSON], http://www.ti.com/lit/ml/mpds421/mpds421.pdf")
  (tags "NHL014B")
  (attr smd)
  (fp_text reference "REF**" (at 0.027363 -3.153276) (layer "F.SilkS")
      (effects (font (size 1 1) (thickness 0.15)))
    (tstamp b5dc0a0a-5394-4405-ae38-58f2354c64bb)
  )
  (fp_text value "WSON-14-1EP_4.0x4.0mm_P0.5mm_EP2.6x2.6mm" (at 0 4) (layer "F.Fab")
      (effects (font (size 1 1) (thickness 0.15)))
    (tstamp cb8b486d-576f-405e-b38c-a50da5c53366)
  )
  (fp_text user "${REFERENCE}" (at 0.05 0.025) (layer "F.Fab")
      (effects (font (size 0.5 0.5) (thickness 0.05)))
    (tstamp 6abdd3c4-0d93-4531-84aa-f3cd2d899504)
  )
  (fp_line (start -2.425 -1.875) (end -2.125 -1.875)
    (stroke (width 0.1) (type solid)) (layer "F.SilkS") (tstamp 47d6fb91-64d6-400a-afa8-71293f759205))
  (fp_line (start -2.125 -2.125) (end -2.125 -1.875)
    (stroke (width 0.1) (type solid)) (layer "F.SilkS") (tstamp e6a5990c-f210-4bb1-95ff-7c299951d17f))
  (fp_line (start -2.125 2.125) (end -2.125 1.75)
    (stroke (width 0.1) (type solid)) (layer "F.SilkS") (tstamp 606548c0-7c28-459a-bc15-d22b7c517547))
  (fp_line (start 2.125 -2.125) (end -2.125 -2.125)
    (stroke (width 0.1) (type solid)) (layer "F.SilkS") (tstamp ebb8d909-726e-4426-82f8-bd38f8cd9ff1))
  (fp_line (start 2.125 -2.125) (end 2.125 -1.825)
    (stroke (width 0.1) (type solid)) (layer "F.SilkS") (tstamp 7f677782-873b-42d0-8f36-e9c72597cc01))
  (fp_line (start 2.125 1.75) (end 2.125 2.125)
    (stroke (width 0.1) (type solid)) (layer "F.SilkS") (tstamp 3ce27d02-95d1-4f44-bff9-6b2d28695b0a))
  (fp_line (start 2.125 2.125) (end -2.1 2.125)
    (stroke (width 0.1) (type solid)) (layer "F.SilkS") (tstamp 75006f44-c8eb-4713-bbdb-078cc7c81edc))
  (fp_line (start -2.45 -2.25) (end 2.45 -2.25)
    (stroke (width 0.05) (type solid)) (layer "F.CrtYd") (tstamp 5d79f206-3a15-4d5a-aada-7620aecce2fc))
  (fp_line (start -2.45 2.25) (end -2.45 -2.25)
    (stroke (width 0.05) (type solid)) (layer "F.CrtYd") (tstamp 07002e4c-27b7-4907-95b1-d69e8b8214f9))
  (fp_line (start 2.45 -2.25) (end 2.45 2.25)
    (stroke (width 0.05) (type solid)) (layer "F.CrtYd") (tstamp d75ee2bd-5d4c-493f-8b7e-24da780eab0b))
  (fp_line (start 2.45 2.25) (end -2.44 2.25)
    (stroke (width 0.05) (type solid)) (layer "F.CrtYd") (tstamp eb175d6d-b3a7-40f6-a1c1-1c5619fa4fb6))
  (fp_line (start -2 -1.5) (end -2 2)
    (stroke (width 0.1) (type solid)) (layer "F.Fab") (tstamp ed13b205-896f-4927-8318-bd89b164b4e9))
  (fp_line (start -2 -1.5) (end -1.5 -2)
    (stroke (width 0.1) (type solid)) (layer "F.Fab") (tstamp b3ded626-6a17-41bb-93f5-d3453124af2f))
  (fp_line (start -2 2) (end 2 2)
    (stroke (width 0.1) (type solid)) (layer "F.Fab") (tstamp 992a0b93-1fd1-4602-a32e-4906dd9d680a))
  (fp_line (start 2 -2) (end -1.5 -2)
    (stroke (width 0.1) (type solid)) (layer "F.Fab") (tstamp 5e5ca221-e674-498d-875e-68d1c26a5f11))
  (fp_line (start 2 2) (end 2 -2)
    (stroke (width 0.1) (type solid)) (layer "F.Fab") (tstamp cf49f964-b594-40d8-949e-82ede143ba31))
  (pad "" smd rect (at -0.65 -0.65 270) (size 1.05 1.05) (layers "F.Paste") (tstamp b0baf5ac-30a1-4cb4-b20a-900570ef1bb4))
  (pad "" smd rect (at -0.65 0.65 270) (size 1.05 1.05) (layers "F.Paste") (tstamp 3c37a068-9f46-47ba-ab47-5fa058d5f634))
  (pad "" smd rect (at 0.65 -0.65 270) (size 1.05 1.05) (layers "F.Paste") (tstamp 776a1b36-cedc-4344-8604-d846edb79abe))
  (pad "" smd rect (at 0.65 0.65 270) (size 1.05 1.05) (layers "F.Paste") (tstamp 6581f2ff-5e27-479a-a636-8c74d9cdaa23))
  (pad "1" smd rect (at -1.9 -1.5 270) (size 0.25 0.6) (layers "F.Cu" "F.Paste" "F.Mask") (tstamp 5691c0f8-0ab2-4401-8d91-9c2e6a66f7cc))
  (pad "2" smd rect (at -1.9 -1 270) (size 0.25 0.6) (layers "F.Cu" "F.Paste" "F.Mask") (tstamp 243ce414-fcb0-4e17-b02e-776ca3a56cdf))
  (pad "3" smd rect (at -1.9 -0.5 270) (size 0.25 0.6) (layers "F.Cu" "F.Paste" "F.Mask") (tstamp 6ef5a9b5-318c-4bda-9d40-999fc821d9a7))
  (pad "4" smd rect (at -1.9 0 270) (size 0.25 0.6) (layers "F.Cu" "F.Paste" "F.Mask") (tstamp 03dbb5ab-0f23-40cd-9b2a-79ff03798fdb))
  (pad "5" smd rect (at -1.9 0.5 270) (size 0.25 0.6) (layers "F.Cu" "F.Paste" "F.Mask") (tstamp cd8c94c1-49cd-4b06-80af-2c773e18d922))
  (pad "6" smd rect (at -1.9 1 270) (size 0.25 0.6) (layers "F.Cu" "F.Paste" "F.Mask") (tstamp 6d57d206-f667-4df9-a957-207facbf99dc))
  (pad "7" smd rect (at -1.9 1.5 270) (size 0.25 0.6) (layers "F.Cu" "F.Paste" "F.Mask") (tstamp 0c094ad9-8a7d-49f0-8712-11c523a78065))
  (pad "8" smd rect (at 1.9 1.5 270) (size 0.25 0.6) (layers "F.Cu" "F.Paste" "F.Mask") (tstamp 9af3b5dd-475d-4748-a4e0-a33e4f1d9264))
  (pad "9" smd rect (at 1.9 1 270) (size 0.25 0.6) (layers "F.Cu" "F.Paste" "F.Mask") (tstamp ca8e6e59-ef1c-4fc9-b3c6-fef2cbaff167))
  (pad "10" smd rect (at 1.9 0.5 270) (size 0.25 0.6) (layers "F.Cu" "F.Paste" "F.Mask") (tstamp 596a4456-17a9-42f5-84c7-23a23b5710ff))
  (pad "11" smd rect (at 1.9 0 270) (size 0.25 0.6) (layers "F.Cu" "F.Paste" "F.Mask") (tstamp 2caac269-5d15-4e61-a1eb-52ed28e71082))
  (pad "12" smd rect (at 1.9 -0.5 270) (size 0.25 0.6) (layers "F.Cu" "F.Paste" "F.Mask") (tstamp 13bbefac-afae-4434-86ee-be3c32341dbd))
  (pad "13" smd rect (at 1.9 -1 270) (size 0.25 0.6) (layers "F.Cu" "F.Paste" "F.Mask") (tstamp 83754905-8113-404b-9b3b-1ea5dc08339d))
  (pad "14" smd rect (at 1.9 -1.5 270) (size 0.25 0.6) (layers "F.Cu" "F.Paste" "F.Mask") (tstamp 78674359-0aed-47a7-a3a5-78b8e53d1f2e))
  (pad "15" smd rect (at 0.025 0 270) (size 2.6 2.6) (layers "F.Cu" "F.Mask") (tstamp 063a1e13-9b28-4b54-a0aa-3791bde3cb3f))
  (model "${KICAD6_3DMODEL_DIR}/Package_SON.3dshapes/WSON-14-1EP_4.0x4.0mm_P0.5mm_EP2.6x2.6mm.wrl"
    (offset (xyz 0 0 0))
    (scale (xyz 1 1 1))
    (rotate (xyz 0 0 0))
  )
)
