{
  "kind": "collectionType",
  "collectionName": "questions",
  "info": {
    "name": "question"
  },
  "options": {
    "increments": true,
    "timestamps": true
  },
  "attributes": {
    "name": {
      "type": "string",
      "required": true
    },
    "questiontext": {
      "type": "richtext",
      "required": true
    },
    "qtype": {
      "type": "enumeration",
      "enum": [
        "essay",
        "description"
      ]
    },
    "quiz": {
      "via": "questions",
      "model": "quiz"
    }
  }
}
