{
  "kind": "collectionType",
  "collectionName": "pages",
  "info": {
    "name": "page"
  },
  "options": {
    "increments": true,
    "timestamps": true
  },
  "attributes": {
    "pageName": {
      "type": "string",
      "required": true
    },
    "pageContent": {
      "type": "richtext",
      "required": true
    },
    "modules": {
      "via": "page",
      "collection": "module"
    }
  }
}
