{
  "kind": "collectionType",
  "collectionName": "sections",
  "info": {
    "name": "section"
  },
  "options": {
    "increments": true,
    "timestamps": true
  },
  "attributes": {
    "name": {
      "type": "string",
      "required": true,
      "unique": true
    },
    "accessible": {
      "type": "boolean",
      "default": true
    },
    "image": {
      "model": "file",
      "via": "related",
      "allowedTypes": [
        "images"
      ],
      "plugin": "upload",
      "required": false
    },
    "video": {
      "model": "file",
      "via": "related",
      "allowedTypes": [
        "videos"
      ],
      "plugin": "upload",
      "required": false
    },
    "courses": {
      "via": "sections",
      "collection": "course",
      "dominant": true
    },
    "modules": {
      "collection": "module",
      "via": "section"
    }
  }
}
