id,submitter_id,image_id,identifier,title,description,dataset_size,ftp_site,upload_status,excelfile,excelfile_md5,publication_date,modification_date,publisher_id,token,fairnuse,curator_id,manuscript_id,handing_editor
5,345,5,100039,Genomic data of the Puerto Rican Parrot (<em>Amazona vittata</em>) from a locally funded project. ,"These data represent the first assembly of a genome sequence for a critically endangered parrot (<em>Amazona vittata</em>) endemic to the United States, and also the first genome of a species from the diverse and ecologically important genus <em>Amazona</em> native to South America and the Caribbean. One sample has been selected from the non-reproductive female at Rio Abajo Breeding Facility in Puerto Rico (IACUC#201109.1), and sequenced on Illumina HiSeq platform with both fragment and paired-end sequencing approaches, resulting in a total of 42,479,499,706 bases. We predicted a total coverage depth of 26.89X of the parrot’s genome: 17.08X coverage for the short fragment reads, and 9.8X coverage for the mate pairs. The sequencing was initiated with the construction of two genome libraries: a short fragment library (~300 bp inserts) for sequencing the majority of the genome, and a long fragment library (~2.5 Kb inserts) to generate scaffolds to be used to order and assemble contigs derived from the short fragment library. The Illumina paired-end and mate-pairs reads were assembled together with Ray (<a href=""http://denovoassembler.sourceforge.net"">http://denovoassembler.sourceforge.net</a>), with the k-mer defined iteratively. In total, given that the genome size is predicted to be 1.58Gb, with the total scaffold length of 1,184, 594,388 bp, the overall coverage of the genome is around 76%, a value that might be slightly overestimated given that some of the scaffolds may be overlapping but could not be assembled. Filtering followed by assembly resulted in 259,423 contigs (N50=6,983 bp, longest = 75,003 bp), which was further combined into 148,255 scaffolds (N50 = 19,470, longest = 206,462 bp). The database contains all of the contigs, scaffolds, corresponding assembly parameters, and the annotations for the known repeats and coding sequences. The assembled scaffolds allow basic genomic annotation and comparative analyses with other available avian whole-genome sequences.",4294967296,ftp://climb.genomics.cn/pub/10.5524/100001_101000/100039/,Published,GigaDBSubmissionForm_Parrot.xls,1586ed77abdec5b9f839be0f5d61f357,2012-09-11,2012-09-14,1,,,,,
210,345,222,100002,Genomic data from Adelie penguin (Pygoscelis adeliae).,"The Adelie penguin (Pygoscelis adeliae) is an iconic penguin of moderate stature and a tuxedo of black and white feathers. The penguins are only found in the Antarctic region and surrounding islands. Being very sensitive to climate change, and due to changes in their behavior based on minor shifts in climate, they are often used as a barometer of the Antarctic. 
With its status as one of the adorable and cuddly flightless birds of Antarctica, they serve as an example for conservation, and as a result they are now categorised at low risk for endangerment. The sequence of the penguin can be of use in understanding the genetic underpinnings of its evolutionary traits and adaptation to its extreme environment; its unique system of feathers; its prowess as a diver; and its sensitivity to climate change. We hope that this genome data will further our understanding of one of the most remarkable creatures to waddle the planet Earth.
We sequenced the genome of an adult male from Inexpressible Island, Ross Sea, Antartica (provided by David Lambert) to a depth of approximately 60X with short reads from a series of libraries with various insert sizes (200bp- 20kb). The assembled scaffolds of high quality sequences total 1.23 Gb, with the contig and scaffold N50 values of 19 kb and 5 mb respectively. We identified 15,270 protein-coding genes with a mean length of 21.3 kb.",1073741824,ftp://climb.genomics.cn/pub/10.5524/100001_101000/100002,Published,,,2016-05-09,,1,,,,,
211,345,223,100003,Genome data from foxtail millet (Setaria italica).,"Foxtail millet (Setaria italica) (2n=18), is an annual grass grown both as cereal crop (grain production) and as forage food. It is primarily grown in temperate, subtropical and tropical areas. With approximately 6,000 varieties, millet is one member of the Panicoideae (grasses subfamily), which includes maize (Zea mays), sorghum (Sorghum bicolor), and sugar cane (Saccharum officinarum). It is a nutritious dietary staple, containing starch, proteins, and a number of vitamins and minerals, such as calcium, iron, and sodium. It feeds nearly one-third of the world population with main daily-calories intake, and is especially prevalent in dry climates or soil-poor regions that are not suited for the cultivation of many other crops. Millet is self-pollinating, has a short lifecycle, is small in stature, and has a small genome size; all of these useful attributes make it an invaluable functional genomics model system, and an excellent reference genome to aid in the sequencing of other larger grasses genomes.",314572800,ftp://climb.genomics.cn/pub/10.5524/100001_101000/100003,Published,,,2011-11-12,,1,,,,,
212,345,224,100004,Data and software to accompany the paper: Applying compressed sensing to genome-wide association studies.,"The aim of a genome-wide association study (GWAS) is to isolate DNA markers for variants affecting phenotypes of interest. Linear regression is employed for this purpose, and in recent years a signal-processing paradigm known as compressed sensing (CS) has coalesced around a particular class of regression techniques. CS is not a method in its own right, but rather a body of theory regarding signal recovery when the number of predictor variables (i.e., genotyped markers) exceeds the sample size. The paper shows the applicability of compressed sensing (CS) theory to genome-wide association studies (GWAS), where the purpose is to ﬁnd trait-associated tagging markers (genetic variants). Analysis scripts are contained in the compressed CS file. Mock data and scripts are found in the compressed GD file. The example scripts found in the CS repository require the GD files to be unpacked in a separate folder. Please look at accompanying readme pdfs for both repositories and annotations in the example scripts before using.",209715200,ftp://climb.genomics.cn/pub/10.5524/100001_101000/100004,Published,,,2016-05-11,,1,,,,,
213,345,225,100142,"Supporting scripts and data for ""Investigation into the annotation of protocol sequencing steps in the Sequence Read Archive"".","The workflow for the production of high-throughput sequencing data from nucleic acid samples is complex. There are a series of protocol steps to be followed in the preparation of samples for next-generation sequencing. The quantification of bias in a number of protocol steps, namely DNA fractionation, blunting, phosphorylation, adapter ligation and library enrichment, remains to be determined. We examined the experimental metadata of the public repository Sequence Read Archive (SRA) in order to ascertain the level of annotation of important sequencing steps in submissions to the database.",524288000,https://s3.ap-northeast-1.wasabisys.com/gigadb-datasets/dev/pub/10.5524/100001_101000/100142,Published,,,2015-05-11,,1,,,,,
2335,345,2077,100925,"Supporting data for ""Chromosome-level genome assemblies of <i>C. argus</i> and <i>C. maculata</i> and comparative analysis of their temperature adaptability""","<i>Channa argus</i> and <i>Channa maculata</i> are the main cultured species of the family Channidae. The relationship between them is close enough that they can mate, however their temperature adaptability is quite different. <br>In this study, we sequenced and assembled the whole genomes of <i>C. argus</i> and <i>C. maculata</i> for the first time and obtained chromosome-level genome assemblies of 630.39 and 618.82 Mb, respectively. Contig N50 was 13.20 and 21.73 Mb, scaffold N50 was 27.66 and 28.37 Mb, with 28,054 and 24,115 coding genes annotated for <i>C. argus</i> and <i>C. maculata</i>, respectively. <i>C. argus</i> and <i>C. maculata</i> have 24 and 21 chromosomes, respectively. Three pairs of chromosomes in <i>C. argus</i> correspond to three chromosomes in <i>C. maculata</i>, suggesting three chromosomal fusion events in <i>C. maculata</i>. Comparative analysis of their gene families showed that some immune-related genes were unique or expandable to <i>C. maculata</i>, such as genes related to herpes simplex infection. The transcriptome differences related to temperature adaptation revealed that the brain and liver of <i>C. argus</i> rapidly produced more DEGs than <i>C. maculata</i>. The genes in the FoxO signalling pathway were significantly enriched in <i>C. argus</i> during the cooling process (P < 0.05), and the expression of three transcription factor genes in this pathway was significantly different between <i>C. argus</i> and <i>C. maculata</i> (P< 0.01). <br><i>C. maculata</i> may have higher resistance to certain diseases, while <i>C. argus</i> has a faster and stronger response to low-temperature stress, and thus has better adaptability to a low-temperature environment. This study provides a high-quality genome research platform for follow-up studies of Channidae, and provides important clues for the differences in the low-temperature adaptation of fish.",1073741824,"https://s3.ap-northeast-1.wasabisys.com/gigadb-datasets/live/pub/10.5524/100001_101000/100925/",Published,"100925newversion.xls","39839b0d4b6b80594edef0f8df9f6c2e","2021-09-01",,"1","17CDR2kVz8iGQqon",,,"GIGA-D-21-00172",