Place,Name,Sex,BirthYear,Age,State,Equipment,Division,BodyweightKg,WeightClassKg,Squat1Kg,Squat2Kg,Squat3Kg,Best3SquatKg,Bench1Kg,Bench2Kg,Bench3Kg,Best3BenchKg,Deadlift1Kg,Deadlift2Kg,Deadlift3Kg,Best3DeadliftKg,TotalKg,Event,BirthDate
DQ,Chloe Darby,F,2007,16,IA,Raw,J16-17,64.6,67.5,-102.5,-102.5,-102.5,,47.5,50,-52.5,50,107.5,-112.5,-112.5,107.5,,SBD,
1,Kendra Hoversten,F,2005,17,IA,Raw,J16-17,81.2,82.5,97.5,105,-112.5,105,67.5,-72.5,-72.5,67.5,137.5,-145,-147.5,137.5,310,SBD,
1,Hope Faley,F,2003,20,IA,Raw,J20-23,59.7,60,60,70,75,75,40,47.5,-52.5,47.5,90,100,-110,100,222.5,SBD,
1,Kinzi Vanwyk,F,1999,23,IA,Raw,J20-23,86.2,90,125,135,137.5,137.5,65,72.5,-77.5,72.5,137.5,150,162.5,162.5,372.5,SBD,
1,Rageana Davidson,F,1983,40,IA,Raw,M40-44,58.2,60,-105,107.5,120,120,57.5,60,-65,60,110,120,130,130,310,SBD,
1,Tonya Kehoe,F,1969,54,IA,Raw,M50-54,104.9,110,67.5,75,82.5,82.5,47.5,52.5,57.5,57.5,75,85,97.5,97.5,237.5,SBD,
1,Miranda Good,F,1992,30,IA,Raw,Open,59,60,122.5,130,-137.5,130,60,62.5,-65,62.5,147.5,155,160,160,352.5,SBD,
1,Courtney Hanson,F,1981,42,IA,Raw,Open,65,67.5,122.5,132.5,-142.5,132.5,70,75,-77.5,75,150,160,170,170,377.5,SBD,
1,Jeanette Pfrimmer,F,1987,35,IA,Raw,Open,72.3,75,-117.5,117.5,-127.5,117.5,62.5,-65,-65,62.5,142.5,150,157.5,157.5,337.5,SBD,
2,Megan Beckler,F,1998,25,IA,Raw,Open,71.7,75,77.5,85,92.5,92.5,52.5,-57.5,-57.5,52.5,102.5,107.5,115,115,260,SBD,
1,Alexandra Kaas,F,1990,32,IA,Raw,Open,82.1,82.5,110,-117.5,-120,110,62.5,67.5,72.5,72.5,130,-140,-140,130,312.5,SBD,
1,Kinzi Vanwyk,F,1999,23,IA,Raw,Open,86.2,90,125,135,137.5,137.5,65,72.5,-77.5,72.5,137.5,150,162.5,162.5,372.5,SBD,
1,Chelsi Birchmier,F,1990,33,IA,Raw,Open,97.8,100,130,-135,145,145,80,90,-95,90,160,170,182.5,182.5,417.5,SBD,
1,Kelsea Graham,F,1994,28,IA,Raw,Open,125.1,140,65,-70,70,70,45,-50,-50,45,102.5,110,-117.5,110,225,SBD,
1,Laura Schiltz,F,1986,37,IA,Raw,S35-39,66.3,67.5,110,117.5,122.5,122.5,72.5,75,-77.5,75,137.5,145,152.5,152.5,350,SBD,
2,Laccey Crimmins,F,1984,38,IA,Raw,S35-39,67.4,67.5,85,90,95,95,45,50,-55,50,92.5,102.5,110,110,255,SBD,
1,Jeanette Pfrimmer,F,1987,35,IA,Raw,S35-39,72.3,75,-117.5,117.5,-127.5,117.5,62.5,-65,-65,62.5,142.5,150,157.5,157.5,337.5,SBD,
1,Angela Strang,F,1987,36,IA,Raw,S35-39,110,110,90,100,107.5,107.5,52.5,57.5,-62.5,57.5,132.5,142.5,-150,142.5,307.5,SBD,
1,Chloe Darby,F,2007,16,IA,Raw,Open,64.6,67.5,,,,,47.5,50,-52.5,50,107.5,-112.5,-112.5,107.5,157.5,BD,
1,Ryan Stein,M,2005,17,IA,Raw,J16-17,85.1,90,115,125,135,135,72.5,75,82.5,82.5,137.5,145,155,155,372.5,SBD,
1,Michael Smith #29,M,2005,17,IA,Raw,J16-17,94.3,100,230,245,260,260,110,120,-127.5,120,230,240,-257.5,240,620,SBD,
1,Brandon Lampe,M,2004,18,IA,Raw,J18-19,89.1,90,-210,210,-220,210,127.5,-130,-130,127.5,220,225,-230,225,562.5,SBD,
2,Oscar Silva,M,2003,19,IA,Raw,J18-19,88.2,90,170,180,-185,180,90,95,-100,95,-170,180,190,190,465,SBD,
1,Jaydan Hazelbaker,M,2003,19,IA,Raw,J18-19,96.7,100,205,-212.5,-215,205,115,120,-127.5,120,207.5,215,222.5,222.5,547.5,SBD,
1,Samuel Bandstra,M,2002,20,IA,Raw,J20-23,81,82.5,182.5,202.5,210,210,110,-125,125,125,-182.5,185,-192.5,185,520,SBD,
1,Lucas Jacobson,M,2000,22,IA,Raw,J20-23,90,90,170,177.5,-190,177.5,-130,130,-132.5,130,215,-220,,215,522.5,SBD,
1,Noah Bandstra,M,2000,22,IA,Raw,J20-23,94.1,100,227.5,-242.5,242.5,242.5,142.5,152.5,-160,152.5,227.5,240,245,245,640,SBD,
1,Cedrick Cavan,M,1999,24,IA,Raw,Open,73.8,75,162.5,167.5,180,180,107.5,115,120,120,217.5,232.5,250,250,550,SBD,
1,Collin Lauchner,M,1992,31,IA,Raw,Open,87.7,90,152.5,155,157.5,157.5,110,112.5,115,115,175,180,187.5,187.5,460,SBD,
1,Michael Funk,M,1990,32,IA,Raw,Open,94.3,100,190,200,-207.5,200,112.5,-120,-120,112.5,247.5,-255,-255,247.5,560,SBD,
2,Will Van Soelen,M,1996,26,IA,Raw,Open,95.8,100,182.5,190,-200,190,132.5,140,145,145,212.5,220,-232.5,220,555,SBD,
1,Lincoln Rozeboom,M,1994,29,IA,Raw,Open,104.2,110,250,-260,-260,250,127.5,132.5,-135,132.5,260,-272.5,-272.5,260,642.5,SBD,
2,Humberto Aguirre,M,1991,31,IA,Raw,Open,102.7,110,190,192.5,197.5,197.5,110,117.5,-125,117.5,207.5,215,-230,215,530,SBD,
1,Tyler Ernst,M,1990,33,MO,Raw,Open,130.2,140,255,267.5,275,275,172.5,-182.5,-182.5,172.5,292.5,305,-310,305,752.5,SBD,
1,Jess Pfrimmer,M,1979,43,IA,Raw,M40-44,108.5,110,,,,,-142.5,142.5,-147.5,142.5,,,,,142.5,B,
1,Jess Pfrimmer,M,1979,43,IA,Raw,Open,108.5,110,,,,,-142.5,142.5,-147.5,142.5,,,,,142.5,B,
1,Devin Vonbone,M,1999,24,IA,Raw,Open,84,90,,,,,,,,,177.5,190,195,195,195,D,
1,Eric Sellers,M,1991,31,IA,Wraps,Open,107.5,110,247.5,265,-277.5,265,152.5,-160,-160,152.5,285,300,-310,300,717.5,SBD,
