/home/gicuadasanu/Desktop/PAD2/FrstDBMicroservice/src/main/java/com/spring/frst_db_microservice/controller/EmployeeController.java
/home/gicuadasanu/Desktop/PAD2/FrstDBMicroservice/src/main/java/com/spring/frst_db_microservice/models/Employee.java
/home/gicuadasanu/Desktop/PAD2/FrstDBMicroservice/src/main/java/com/spring/frst_db_microservice/FrstDBMicroserviceApplication.java
/home/gicuadasanu/Desktop/PAD2/FrstDBMicroservice/src/main/java/com/spring/frst_db_microservice/service/EmployeeService.java
/home/gicuadasanu/Desktop/PAD2/FrstDBMicroservice/src/main/java/com/spring/frst_db_microservice/exception/NoContentException.java
/home/gicuadasanu/Desktop/PAD2/FrstDBMicroservice/src/main/java/com/spring/frst_db_microservice/repository/EmployeeMongoRepository.java
