------------- Processor 0 Exiting: Called CmiAbort ------------
Reason: FATAL ERROR: can't read "argv": no such variable
    while executing
"lindex $argv 0"
    invoked from within
"set name    [lindex $argv 0]"
    (file "simulate_implicit.conf" line 41)

Charm++ fatal error:
FATAL ERROR: can't read "argv": no such variable
    while executing
"lindex $argv 0"
    invoked from within
"set name    [lindex $argv 0]"
    (file "simulate_implicit.conf" line 41)

/var/spool/pbs/mom_priv/jobs/2251546.hpc-head-n1.unitn.it.SC: line 17: 39787 Aborted                 (core dumped) $NAMD_EXE +p32--tclmain $NAMD_CONF $WORK_DIR/rec_r 6250000 25 1 > $LOG_FILE
