------------- Processor 0 Exiting: Called CmiAbort ------------
Reason: FATAL ERROR: Unknown command-line option +devices

Charm++ fatal error:
FATAL ERROR: Unknown command-line option +devices

/var/spool/pbs/mom_priv/jobs/2240521.hpc-head-n1.unitn.it.SC: line 17: 69440 Aborted                 (core dumped) $NAMD_EXE +p72 +setcpuaffinity +devices 0 --tclmain $NAMD_CONF $WORK_DIR/rec_r 1 100 1 > $LOG_FILE
