{
    "input_dir" : "../data/data_raw-1306b",
    "output_dir": "../data/data-1306b",
    "capacity_1":1.175678466192713e-09,
    "capacity_2":1.0351905272571166e-09,
    "offset_1": -0.011380103326612902,
    "offset_2": -0.023587134576612902,
    "R_1":502.13,
    "R_2":502.35,
    "probes" : [1,2],
    "columns1":[0,1,3],
    "columns2":[0,2,3],
    "params": {
        "zones":[-55,-15,30],
        "bins":[100,200],
        "ampl_scheda":7.41,
        "ampl_res":2,
        "n_fit_iter":50,
        "W_em": 60,
        "P": 2.56e-4,
        "x":10
        },

    "fits": [
        {
            "id":"160613029",
            "I_B": 550,
            "P": 2.55e-4
        },
        {
            "id":"160613030",
            "I_B": 560,
            "P": 2.55e-4
        },
        {
            "id":"160613031",
            "I_B": 570,
            "P": 2.55e-4
        },
        {
            "id":"160613032",
            "I_B": 580
        },
        {
            "id":"160613033",
            "I_B": 585
        },
        {
            "id":"160613034",
            "I_B": 590
        },
        {
            "id":"160613035",
            "I_B": 595
        },
        {
            "id":"160613036",
            "I_B": 600
        },
        {
            "id":"160613037",
            "I_B": 605
        },
        {
            "id":"160613038",
            "I_B": 610
        },
        {
            "id":"160613039",
            "I_B": 615
        },
        {
            "id":"160613040",
            "I_B": 620
        },
        {
            "id":"160613041",
            "I_B": 625
        },
        {
            "id":"160613042",
            "I_B": 630
        },
        {
            "id":"160613043",
            "I_B": 635
        },
        {
            "id":"160613044",
            "I_B": 640
        },
        {
            "id":"160613045",
            "I_B": 645
        },
        {
            "id":"160613046",
            "I_B": 650
        },
        {
            "id":"160613047",
            "I_B": 655
        },
        {
            "id":"160613048",
            "I_B": 660
        }


    ]
}
