{
    "input_dir" : "../data/data_raw-0606",
    "output_dir": "../data/data-0606",
    "capacity_1":1.1753297591617044e-09,
    "capacity_2":1.0343964776353805e-09,
    "offset_1": -0.011813256048387098,
    "offset_2": -0.023449313256048387,
    "R_1":502.13,
    "R_2":502.35,
    "probes" : [1,2],
    "columns1":[0,1,3],
    "columns2":[0,2,3],
    "params": {
        "zones":[-55,-15,30],
        "bins":[100,200],
        "ampl_scheda":7.41,
        "ampl_res":2,
        "n_fit_iter":50,
        "P":1.57e-4,
        "W_em": 60,
        "x": 8.6
        },

    "fits": [
        {
            "id":"160606105",
            "I_B": 550
        },
        {
            "id":"160606106",
            "I_B": 560
        },
        {
            "id":"160606107",
            "I_B": 570
        },
        {
            "id":"160606108",
            "I_B": 580
        },
        {
            "id":"160606109",
            "I_B": 590
        },
        {
            "id":"160606110",
            "I_B": 600
        },
        {
            "id":"160606111",
            "I_B": 610
        },
        {
            "id":"160606112",
            "I_B": 620
        },
        {
            "id":"160606113",
            "I_B": 630
        },
        {
            "id":"160606114",
            "I_B": 640
        },
        {
            "id":"160606115",
            "I_B": 650
        },
        {
            "id":"160606116",
            "I_B": 660
        }
    ]
}
