-2.0      0.016957
-1.995      0.0172316
-1.99      0.0175121
-1.985      0.0177985
-1.98      0.0180911
-1.975      0.0183899
-1.97      0.0186952
-1.965      0.0190071
-1.96      0.0193258
-1.955      0.0196515
-1.95      0.0199842
-1.945      0.0203243
-1.94      0.0206718
-1.935      0.021027
-1.93      0.0213901
-1.925      0.0217612
-1.92      0.0221406
-1.915      0.0225285
-1.91      0.0229251
-1.905      0.0233305
-1.9      0.0237451
-1.895      0.024169
-1.89      0.0246025
-1.885      0.0250459
-1.88      0.0254993
-1.875      0.025963
-1.87      0.0264373
-1.865      0.0269225
-1.86      0.0274187
-1.855      0.0279263
-1.85      0.0284455
-1.845      0.0289767
-1.84      0.0295201
-1.835      0.030076
-1.83      0.0306447
-1.825      0.0312265
-1.82      0.0318217
-1.815      0.0324306
-1.81      0.0330535
-1.805      0.0336908
-1.8      0.0343428
-1.795      0.0350098
-1.79      0.0356921
-1.785      0.0363901
-1.78      0.0371041
-1.775      0.0378344
-1.77      0.0385814
-1.765      0.0393455
-1.76      0.0401269
-1.755      0.0409259
-1.75      0.041743
-1.745      0.0425785
-1.74      0.0434327
-1.735      0.0443058
-1.73      0.0451984
-1.725      0.0461106
-1.72      0.0470427
-1.715      0.0479951
-1.71      0.0489681
-1.705      0.0499619
-1.7      0.0509768
-1.695      0.052013
-1.69      0.0530708
-1.685      0.0541504
-1.68      0.055252
-1.675      0.0563756
-1.67      0.0575216
-1.665      0.0586899
-1.66      0.0598808
-1.655      0.0610941
-1.65      0.06233
-1.645      0.0635883
-1.64      0.0648692
-1.635      0.0661724
-1.63      0.0674977
-1.625      0.0688451
-1.62      0.0702142
-1.615      0.0716047
-1.61      0.0730163
-1.605      0.0744485
-1.6      0.0759009
-1.595      0.0773729
-1.59      0.0788639
-1.585      0.0803732
-1.58      0.0819001
-1.575      0.0834437
-1.57      0.0850031
-1.565      0.0865774
-1.56      0.0881656
-1.555      0.0897664
-1.55      0.0913788
-1.545      0.0930015
-1.54      0.0946332
-1.535      0.0962724
-1.53      0.0979177
-1.525      0.0995677
-1.52      0.101221
-1.515      0.102875
-1.51      0.104529
-1.505      0.106182
-1.5      0.10783
-1.495      0.109473
-1.49      0.11111
-1.485      0.112737
-1.48      0.114353
-1.475      0.115957
-1.47      0.117547
-1.465      0.119121
-1.46      0.120677
-1.455      0.122214
-1.45      0.12373
-1.445      0.125224
-1.44      0.126694
-1.435      0.128139
-1.43      0.129557
-1.425      0.130948
-1.42      0.13231
-1.415      0.133642
-1.41      0.134944
-1.405      0.136213
-1.4      0.137451
-1.395      0.138655
-1.39      0.139826
-1.385      0.140963
-1.38      0.142065
-1.375      0.143133
-1.37      0.144166
-1.365      0.145164
-1.36      0.146127
-1.355      0.147054
-1.35      0.147947
-1.345      0.148804
-1.34      0.149626
-1.335      0.150414
-1.33      0.151167
-1.325      0.151885
-1.32      0.15257
-1.315      0.153221
-1.31      0.153837
-1.305      0.154421
-1.3      0.154972
-1.295      0.15549
-1.29      0.155976
-1.285      0.15643
-1.28      0.156852
-1.275      0.157244
-1.27      0.157604
-1.265      0.157935
-1.26      0.158237
-1.255      0.15851
-1.25      0.158754
-1.245      0.158971
-1.24      0.159162
-1.235      0.159327
-1.23      0.159467
-1.225      0.159583
-1.22      0.159676
-1.215      0.159748
-1.21      0.159799
-1.205      0.159831
-1.2      0.159845
-1.195      0.159842
-1.19      0.159824
-1.185      0.159793
-1.18      0.15975
-1.175      0.159695
-1.17      0.159632
-1.165      0.159561
-1.16      0.159484
-1.155      0.159402
-1.15      0.159317
-1.145      0.15923
-1.14      0.159143
-1.135      0.159057
-1.13      0.158973
-1.125      0.158892
-1.12      0.158816
-1.115      0.158746
-1.11      0.158682
-1.105      0.158624
-1.1      0.158575
-1.095      0.158534
-1.09      0.158502
-1.085      0.158478
-1.08      0.158464
-1.075      0.158458
-1.07      0.158462
-1.065      0.158475
-1.06      0.158496
-1.055      0.158525
-1.05      0.158561
-1.045      0.158604
-1.04      0.158653
-1.035      0.158708
-1.03      0.158766
-1.025      0.158828
-1.02      0.158892
-1.015      0.158958
-1.01      0.159024
-1.005      0.159089
-1.0      0.159152
-0.995      0.159212
-0.99      0.159269
-0.985      0.15932
-0.98      0.159365
-0.975      0.159404
-0.97      0.159435
-0.965      0.159458
-0.96      0.159472
-0.955      0.159477
-0.95      0.159471
-0.945      0.159455
-0.94      0.159429
-0.935      0.159392
-0.93      0.159344
-0.925      0.159285
-0.92      0.159215
-0.915      0.159134
-0.91      0.159043
-0.905      0.158942
-0.9      0.158831
-0.895      0.15871
-0.89      0.158581
-0.885      0.158443
-0.88      0.158297
-0.875      0.158143
-0.87      0.157983
-0.865      0.157815
-0.86      0.157641
-0.855      0.157462
-0.85      0.157276
-0.845      0.157086
-0.84      0.15689
-0.835      0.156689
-0.83      0.156484
-0.825      0.156273
-0.82      0.156058
-0.815      0.155837
-0.81      0.155611
-0.805      0.15538
-0.8      0.155142
-0.795      0.154898
-0.79      0.154647
-0.785      0.154389
-0.78      0.154123
-0.775      0.153848
-0.77      0.153563
-0.765      0.153269
-0.76      0.152965
-0.755      0.152649
-0.75      0.152321
-0.745      0.151981
-0.74      0.151629
-0.735      0.151263
-0.73      0.150883
-0.725      0.15049
-0.72      0.150083
-0.715      0.149661
-0.71      0.149225
-0.705      0.148776
-0.7      0.148312
-0.695      0.147835
-0.69      0.147345
-0.685      0.146842
-0.68      0.146328
-0.675      0.145803
-0.67      0.145268
-0.665      0.144724
-0.66      0.144172
-0.655      0.143614
-0.65      0.143051
-0.645      0.142484
-0.64      0.141915
-0.635      0.141346
-0.63      0.140777
-0.625      0.14021
-0.62      0.139648
-0.615      0.139092
-0.61      0.138543
-0.605      0.138003
-0.6      0.137473
-0.595      0.136956
-0.59      0.136453
-0.585      0.135964
-0.58      0.135493
-0.575      0.135039
-0.57      0.134605
-0.565      0.134191
-0.56      0.133798
-0.555      0.133427
-0.55      0.13308
-0.545      0.132757
-0.54      0.132458
-0.535      0.132184
-0.53      0.131936
-0.525      0.131713
-0.52      0.131516
-0.515      0.131345
-0.51      0.1312
-0.505      0.131079
-0.5      0.130984
-0.495      0.130913
-0.49      0.130866
-0.485      0.130842
-0.48      0.130839
-0.475      0.130858
-0.47      0.130897
-0.465      0.130955
-0.46      0.13103
-0.455      0.131121
-0.45      0.131227
-0.445      0.131346
-0.44      0.131476
-0.435      0.131617
-0.43      0.131765
-0.425      0.13192
-0.42      0.132079
-0.415      0.132242
-0.41      0.132406
-0.405      0.132569
-0.4      0.13273
-0.395      0.132887
-0.39      0.133039
-0.385      0.133185
-0.38      0.133322
-0.375      0.133449
-0.37      0.133566
-0.365      0.13367
-0.36      0.133762
-0.355      0.13384
-0.35      0.133904
-0.345      0.133952
-0.34      0.133985
-0.335      0.134003
-0.33      0.134004
-0.325      0.13399
-0.32      0.13396
-0.315      0.133915
-0.31      0.133855
-0.305      0.133781
-0.3      0.133694
-0.295      0.133594
-0.29      0.133482
-0.285      0.13336
-0.28      0.133228
-0.275      0.133089
-0.27      0.132943
-0.265      0.132791
-0.26      0.132636
-0.255      0.132478
-0.25      0.132319
-0.245      0.132161
-0.24      0.132005
-0.235      0.131852
-0.23      0.131704
-0.225      0.131562
-0.22      0.131427
-0.215      0.131302
-0.21      0.131186
-0.205      0.131081
-0.2      0.130987
-0.195      0.130907
-0.19      0.13084
-0.185      0.130787
-0.18      0.130748
-0.175      0.130725
-0.17      0.130716
-0.165      0.130723
-0.16      0.130746
-0.155      0.130783
-0.15      0.130836
-0.145      0.130902
-0.14      0.130983
-0.135      0.131078
-0.13      0.131185
-0.125      0.131303
-0.12      0.131433
-0.115      0.131572
-0.11      0.131719
-0.105      0.131874
-0.1      0.132035
-0.095      0.132201
-0.09      0.13237
-0.085      0.13254
-0.08      0.132711
-0.075      0.132881
-0.07      0.133048
-0.065      0.133211
-0.06      0.133368
-0.055      0.133519
-0.05      0.133661
-0.045      0.133794
-0.04      0.133916
-0.035      0.134027
-0.03      0.134124
-0.025      0.134208
-0.02      0.134278
-0.015      0.134333
-0.01      0.134371
-0.005      0.134395
0.0      0.134402
0.005      0.134392
0.01      0.134367
0.015      0.134326
0.02      0.134269
0.025      0.134198
0.03      0.134112
0.035      0.134012
0.04      0.1339
0.045      0.133776
0.05      0.133641
0.055      0.133497
0.06      0.133345
0.065      0.133186
0.07      0.133022
0.075      0.132853
0.08      0.132683
0.085      0.132511
0.09      0.132339
0.095      0.13217
0.1      0.132004
0.105      0.131843
0.11      0.131688
0.115      0.131541
0.12      0.131403
0.125      0.131274
0.13      0.131156
0.135      0.131051
0.14      0.130958
0.145      0.130879
0.15      0.130814
0.155      0.130764
0.16      0.13073
0.165      0.13071
0.17      0.130707
0.175      0.130719
0.18      0.130747
0.185      0.13079
0.19      0.130848
0.195      0.13092
0.2      0.131006
0.205      0.131106
0.21      0.131217
0.215      0.13134
0.22      0.131473
0.225      0.131615
0.23      0.131765
0.235      0.131922
0.24      0.132084
0.245      0.13225
0.25      0.132418
0.255      0.132587
0.26      0.132756
0.265      0.132922
0.27      0.133085
0.275      0.133243
0.28      0.133395
0.285      0.133539
0.29      0.133674
0.295      0.133799
0.3      0.133913
0.305      0.134014
0.31      0.134102
0.315      0.134177
0.32      0.134236
0.325      0.134281
0.33      0.134309
0.335      0.134323
0.34      0.13432
0.345      0.134301
0.35      0.134267
0.355      0.134217
0.36      0.134152
0.365      0.134073
0.37      0.133981
0.375      0.133876
0.38      0.133759
0.385      0.133632
0.39      0.133495
0.395      0.13335
0.4      0.133198
0.405      0.13304
0.41      0.132879
0.415      0.132714
0.42      0.132549
0.425      0.132384
0.43      0.13222
0.435      0.13206
0.44      0.131904
0.445      0.131754
0.45      0.131611
0.455      0.131477
0.46      0.131353
0.465      0.131239
0.47      0.131137
0.475      0.131047
0.48      0.13097
0.485      0.130908
0.49      0.13086
0.495      0.130826
0.5      0.130808
0.505      0.130805
0.51      0.130818
0.515      0.130845
0.52      0.130888
0.525      0.130944
0.53      0.131015
0.535      0.1311
0.54      0.131196
0.545      0.131305
0.55      0.131425
0.555      0.131554
0.56      0.131692
0.565      0.131837
0.57      0.131989
0.575      0.132145
0.58      0.132305
0.585      0.132467
0.59      0.13263
0.595      0.132791
0.6      0.13295
0.605      0.133106
0.61      0.133256
0.615      0.1334
0.62      0.133536
0.625      0.133663
0.63      0.13378
0.635      0.133886
0.64      0.133979
0.645      0.13406
0.65      0.134126
0.655      0.134179
0.66      0.134216
0.665      0.134239
0.67      0.134246
0.675      0.134237
0.68      0.134214
0.685      0.134175
0.69      0.134122
0.695      0.134055
0.7      0.133974
0.705      0.133881
0.71      0.133776
0.715      0.13366
0.72      0.133535
0.725      0.133401
0.73      0.13326
0.735      0.133113
0.74      0.132962
0.745      0.132808
0.75      0.132652
0.755      0.132496
0.76      0.132341
0.765      0.132189
0.77      0.132041
0.775      0.131899
0.78      0.131763
0.785      0.131636
0.79      0.131518
0.795      0.13141
0.8      0.131313
0.805      0.131228
0.81      0.131157
0.815      0.131099
0.82      0.131055
0.825      0.131026
0.83      0.131011
0.835      0.131012
0.84      0.131028
0.845      0.131059
0.85      0.131104
0.855      0.131164
0.86      0.131238
0.865      0.131325
0.87      0.131424
0.875      0.131535
0.88      0.131657
0.885      0.131789
0.89      0.131929
0.895      0.132077
0.9      0.13223
0.905      0.132388
0.91      0.13255
0.915      0.132713
0.92      0.132877
0.925      0.133039
0.93      0.133198
0.935      0.133354
0.94      0.133503
0.945      0.133646
0.95      0.13378
0.955      0.133904
0.96      0.134016
0.965      0.134117
0.97      0.134204
0.975      0.134276
0.98      0.134333
0.985      0.134374
0.99      0.134398
0.995      0.134404
1.0      0.134392
1.005      0.134362
1.01      0.134314
1.015      0.134247
1.02      0.134162
1.025      0.134058
1.03      0.133935
1.035      0.133795
1.04      0.133638
1.045      0.133463
1.05      0.133272
1.055      0.133065
1.06      0.132842
1.065      0.132606
1.07      0.132355
1.075      0.132091
1.08      0.131814
1.085      0.131525
1.09      0.131225
1.095      0.130914
1.1      0.130593
1.105      0.130262
1.11      0.129921
1.115      0.129572
1.12      0.129213
1.125      0.128845
1.13      0.128468
1.135      0.128082
1.14      0.127687
1.145      0.127282
1.15      0.126867
1.155      0.126441
1.16      0.126005
1.165      0.125556
1.17      0.125095
1.175      0.12462
1.18      0.12413
1.185      0.123625
1.19      0.123104
1.195      0.122565
1.2      0.122007
1.205      0.12143
1.21      0.120832
1.215      0.120212
1.22      0.11957
1.225      0.118903
1.23      0.118212
1.235      0.117495
1.24      0.116752
1.245      0.115982
1.25      0.115184
1.255      0.114359
1.26      0.113504
1.265      0.112622
1.27      0.11171
1.275      0.11077
1.28      0.109801
1.285      0.108804
1.29      0.107779
1.295      0.106727
1.3      0.105648
1.305      0.104544
1.31      0.103415
1.315      0.102262
1.32      0.101086
1.325      0.0998886
1.33      0.0986712
1.335      0.097435
1.34      0.0961814
1.345      0.094912
1.35      0.0936282
1.355      0.0923316
1.36      0.0910238
1.365      0.0897065
1.37      0.0883811
1.375      0.0870493
1.38      0.0857128
1.385      0.0843729
1.39      0.0830313
1.395      0.0816895
1.4      0.0803489
1.405      0.0790109
1.41      0.0776769
1.415      0.0763482
1.42      0.0750259
1.425      0.0737113
1.43      0.0724055
1.435      0.0711096
1.44      0.0698244
1.445      0.0685511
1.45      0.0672902
1.455      0.0660428
1.46      0.0648095
1.465      0.0635909
1.47      0.0623877
1.475      0.0612003
1.48      0.0600293
1.485      0.0588751
1.49      0.057738
1.495      0.0566184
1.5      0.0555165
1.505      0.0544326
1.51      0.0533668
1.515      0.0523192
1.52      0.05129
1.525      0.0502792
1.53      0.0492869
1.535      0.0483129
1.54      0.0473573
1.545      0.0464201
1.55      0.0455011
1.555      0.0446001
1.56      0.0437172
1.565      0.0428521
1.57      0.0420046
1.575      0.0411745
1.58      0.0403617
1.585      0.039566
1.59      0.038787
1.595      0.0380246
1.6      0.0372786
1.605      0.0365486
1.61      0.0358344
1.615      0.0351357
1.62      0.0344524
1.625      0.033784
1.63      0.0331304
1.635      0.0324912
1.64      0.0318662
1.645      0.0312551
1.65      0.0306576
1.655      0.0300735
1.66      0.0295024
1.665      0.0289441
1.67      0.0283984
1.675      0.0278648
1.68      0.0273433
1.685      0.0268335
1.69      0.0263351
1.695      0.0258479
1.7      0.0253717
1.705      0.0249062
1.71      0.0244511
1.715      0.0240062
1.72      0.0235713
1.725      0.0231461
1.73      0.0227304
1.735      0.022324
1.74      0.0219266
1.745      0.0215381
1.75      0.0211581
1.755      0.0207867
1.76      0.0204234
1.765      0.0200681
1.77      0.0197207
1.775      0.0193809
1.78      0.0190485
1.785      0.0187234
1.79      0.0184054
1.795      0.0180943
1.8      0.0177899
1.805      0.0174921
1.81      0.0172007
1.815      0.0169156
1.82      0.0166366
1.825      0.0163636
1.83      0.0160963
1.835      0.0158347
1.84      0.0155787
1.845      0.015328
1.85      0.0150827
1.855      0.0148424
1.86      0.0146072
1.865      0.0143768
1.87      0.0141512
1.875      0.0139303
1.88      0.0137139
1.885      0.0135019
1.89      0.0132943
1.895      0.0130909
1.9      0.0128916
1.905      0.0126963
1.91      0.0125049
1.915      0.0123174
1.92      0.0121336
1.925      0.0119535
1.93      0.0117769
1.935      0.0116038
1.94      0.0114341
1.945      0.0112677
1.95      0.0111046
1.955      0.0109446
1.96      0.0107877
1.965      0.0106338
1.97      0.0104829
1.975      0.0103348
1.98      0.0101896
1.985      0.0100471
1.99      0.00990726
1.995      0.00977007
2.0      0.00963545
