{
    "input_dir" : "../data/data_raw-1006f",
    "output_dir": "../data/data-1006f",
    "capacity_1":1.1753297591617044e-09,
    "capacity_2":1.0343964776353805e-09,
    "offset_1": -0.011813256048387098,
    "offset_2": -0.023449313256048387,
    "R_1":502.13,
    "R_2":502.35,
    "probes" : [1,2],
    "columns1":[0,3,5],
    "columns2":[0,4,5],
    "params": {
        "zones":[-55,-15,30],
        "bins":[100,200],
        "ampl_scheda":7.41,
        "ampl_res":2,
        "n_fit_iter":50,
        "W_em": 60,
        "P": 3.16e-4,
        "I_B": 600
        },

    "fits": [
        {
            "id":"160610101",
            "x": 0,
            "P": 3.14e-4

        },
        {
            "id":"160610102",
            "P": 3.14e-4,
            "x": 0.5
        },
        {
            "id":"160610103",
            "P": 3.14e-4,
            "x": 1
        },
        {
            "id":"160610104",
            "P": 3.15e-4,
            "x": 1.5
        },
        {
            "id":"160610105",
            "P": 3.15e-4,
            "x": 2
        },
        {
            "id":"160610106",
            "P": 3.15e-4,
            "x": 2.5
        },
        {
            "id":"160610107",
            "P": 3.15e-4,
            "x": 3
        },
        {
            "id":"160610108",
            "P": 3.15e-4,
            "x": 3.5
        },
        {
            "id":"160610109",
            "P": 3.15e-4,
            "x": 4
        },
        {
            "id":"160610110",
            "P": 3.15e-4,
            "x": 4.5
        },
        {
            "id":"160610111",
            "P": 3.15e-4,
            "x": 5
        },
        {
            "id":"160610112",
            "P": 3.15e-4,
            "x": 5.5
        },
        {
            "id":"160610113",
            "x": 6
        },
        {
            "id":"160610114",
            "x": 6.5
        },
        {
            "id":"160610115",
            "x": 7
        },
        {
            "id":"160610116",
            "x": 7.5
        },
        {
            "id":"160610117",
            "x": 8
        },
        {
            "id":"160610118",
            "x": 8.5
        },
        {
            "id":"160610119",
            "x": 9
        },
        {
            "id":"160610120",
            "x": 9.5
        },
        {
            "id":"160610121",
            "x": 10
        }

    ]
}
