0.201,  0.4004
0.408,  0.8119
0.597,  1.1890
0.732,  1.4566
0.831,  1.6542
0.989,  1.9689
1.124,  2.2375
1.331,  2.6052
1.436,  2.8583
1.603,  3.1908
1.757,  3.4989
1.835,  3.6539
1.973,  3.9278
2.102,  4.1842
2.351,  4.6801
2.622,  5.2189
2.887,  5.7469
3.034,  6.0399
3.232,  6.4336
3.429,  6.8255
3.540,  7.0474
3.747,  7.4596
3.901,  7.7659
4.203,  8.3663
4.454,  8.8659
4.693,  9.3420
4.911,  9.7763
5.054,  10.0614
