%!PS-Adobe-3.0 EPSF-3.0
%Produced by poppler pdftops version: 0.38.0 (http://poppler.freedesktop.org)
%%Creator: TeX
%%LanguageLevel: 2
%%DocumentSuppliedResources: (atend)
%%BoundingBox: 0 0 229 229
%%HiResBoundingBox: 0 0 228.569 228.569
%%DocumentSuppliedResources: (atend)
%%EndComments
%%BeginProlog
%%BeginResource: procset xpdf 3.00 0
%%Copyright: Copyright 1996-2011 Glyph & Cog, LLC
/xpdf 75 dict def xpdf begin
% PDF special state
/pdfDictSize 15 def
/pdfSetup {
  /setpagedevice where {
    pop 2 dict begin
      /Policies 1 dict dup begin /PageSize 6 def end def
      { /Duplex true def } if
    currentdict end setpagedevice
  } {
    pop
  } ifelse
} def
/pdfSetupPaper {
  % Change paper size, but only if different from previous paper size otherwise
  % duplex fails. PLRM specifies a tolerance of 5 pts when matching paper size
  % so we use the same when checking if the size changes.
  /setpagedevice where {
    pop currentpagedevice
    /PageSize known {
      2 copy
      currentpagedevice /PageSize get aload pop
      exch 4 1 roll
      sub abs 5 gt
      3 1 roll
      sub abs 5 gt
      or
    } {
      true
    } ifelse
    {
      2 array astore
      2 dict begin
        /PageSize exch def
        /ImagingBBox null def
      currentdict end
      setpagedevice
    } {
      pop pop
    } ifelse
  } {
    pop
  } ifelse
} def
/pdfStartPage {
  pdfDictSize dict begin
  /pdfFillCS [] def
  /pdfFillXform {} def
  /pdfStrokeCS [] def
  /pdfStrokeXform {} def
  /pdfFill [0] def
  /pdfStroke [0] def
  /pdfFillOP false def
  /pdfStrokeOP false def
  /pdfLastFill false def
  /pdfLastStroke false def
  /pdfTextMat [1 0 0 1 0 0] def
  /pdfFontSize 0 def
  /pdfCharSpacing 0 def
  /pdfTextRender 0 def
  /pdfPatternCS false def
  /pdfTextRise 0 def
  /pdfWordSpacing 0 def
  /pdfHorizScaling 1 def
  /pdfTextClipPath [] def
} def
/pdfEndPage { end } def
% PDF color state
/cs { /pdfFillXform exch def dup /pdfFillCS exch def
      setcolorspace } def
/CS { /pdfStrokeXform exch def dup /pdfStrokeCS exch def
      setcolorspace } def
/sc { pdfLastFill not { pdfFillCS setcolorspace } if
      dup /pdfFill exch def aload pop pdfFillXform setcolor
     /pdfLastFill true def /pdfLastStroke false def } def
/SC { pdfLastStroke not { pdfStrokeCS setcolorspace } if
      dup /pdfStroke exch def aload pop pdfStrokeXform setcolor
     /pdfLastStroke true def /pdfLastFill false def } def
/op { /pdfFillOP exch def
      pdfLastFill { pdfFillOP setoverprint } if } def
/OP { /pdfStrokeOP exch def
      pdfLastStroke { pdfStrokeOP setoverprint } if } def
/fCol {
  pdfLastFill not {
    pdfFillCS setcolorspace
    pdfFill aload pop pdfFillXform setcolor
    pdfFillOP setoverprint
    /pdfLastFill true def /pdfLastStroke false def
  } if
} def
/sCol {
  pdfLastStroke not {
    pdfStrokeCS setcolorspace
    pdfStroke aload pop pdfStrokeXform setcolor
    pdfStrokeOP setoverprint
    /pdfLastStroke true def /pdfLastFill false def
  } if
} def
% build a font
/pdfMakeFont {
  4 3 roll findfont
  4 2 roll matrix scale makefont
  dup length dict begin
    { 1 index /FID ne { def } { pop pop } ifelse } forall
    /Encoding exch def
    currentdict
  end
  definefont pop
} def
/pdfMakeFont16 {
  exch findfont
  dup length dict begin
    { 1 index /FID ne { def } { pop pop } ifelse } forall
    /WMode exch def
    currentdict
  end
  definefont pop
} def
% graphics state operators
/q { gsave pdfDictSize dict begin } def
/Q {
  end grestore
  /pdfLastFill where {
    pop
    pdfLastFill {
      pdfFillOP setoverprint
    } {
      pdfStrokeOP setoverprint
    } ifelse
  } if
} def
/cm { concat } def
/d { setdash } def
/i { setflat } def
/j { setlinejoin } def
/J { setlinecap } def
/M { setmiterlimit } def
/w { setlinewidth } def
% path segment operators
/m { moveto } def
/l { lineto } def
/c { curveto } def
/re { 4 2 roll moveto 1 index 0 rlineto 0 exch rlineto
      neg 0 rlineto closepath } def
/h { closepath } def
% path painting operators
/S { sCol stroke } def
/Sf { fCol stroke } def
/f { fCol fill } def
/f* { fCol eofill } def
% clipping operators
/W { clip newpath } def
/W* { eoclip newpath } def
/Ws { strokepath clip newpath } def
% text state operators
/Tc { /pdfCharSpacing exch def } def
/Tf { dup /pdfFontSize exch def
      dup pdfHorizScaling mul exch matrix scale
      pdfTextMat matrix concatmatrix dup 4 0 put dup 5 0 put
      exch findfont exch makefont setfont } def
/Tr { /pdfTextRender exch def } def
/Tp { /pdfPatternCS exch def } def
/Ts { /pdfTextRise exch def } def
/Tw { /pdfWordSpacing exch def } def
/Tz { /pdfHorizScaling exch def } def
% text positioning operators
/Td { pdfTextMat transform moveto } def
/Tm { /pdfTextMat exch def } def
% text string operators
/xyshow where {
  pop
  /xyshow2 {
    dup length array
    0 2 2 index length 1 sub {
      2 index 1 index 2 copy get 3 1 roll 1 add get
      pdfTextMat dtransform
      4 2 roll 2 copy 6 5 roll put 1 add 3 1 roll dup 4 2 roll put
    } for
    exch pop
    xyshow
  } def
}{
  /xyshow2 {
    currentfont /FontType get 0 eq {
      0 2 3 index length 1 sub {
        currentpoint 4 index 3 index 2 getinterval show moveto
        2 copy get 2 index 3 2 roll 1 add get
        pdfTextMat dtransform rmoveto
      } for
    } {
      0 1 3 index length 1 sub {
        currentpoint 4 index 3 index 1 getinterval show moveto
        2 copy 2 mul get 2 index 3 2 roll 2 mul 1 add get
        pdfTextMat dtransform rmoveto
      } for
    } ifelse
    pop pop
  } def
} ifelse
/cshow where {
  pop
  /xycp {
    0 3 2 roll
    {
      pop pop currentpoint 3 2 roll
      1 string dup 0 4 3 roll put false charpath moveto
      2 copy get 2 index 2 index 1 add get
      pdfTextMat dtransform rmoveto
      2 add
    } exch cshow
    pop pop
  } def
}{
  /xycp {
    currentfont /FontType get 0 eq {
      0 2 3 index length 1 sub {
        currentpoint 4 index 3 index 2 getinterval false charpath moveto
        2 copy get 2 index 3 2 roll 1 add get
        pdfTextMat dtransform rmoveto
      } for
    } {
      0 1 3 index length 1 sub {
        currentpoint 4 index 3 index 1 getinterval false charpath moveto
        2 copy 2 mul get 2 index 3 2 roll 2 mul 1 add get
        pdfTextMat dtransform rmoveto
      } for
    } ifelse
    pop pop
  } def
} ifelse
/Tj {
  fCol
  0 pdfTextRise pdfTextMat dtransform rmoveto
  currentpoint 4 2 roll
  pdfTextRender 1 and 0 eq {
    2 copy xyshow2
  } if
  pdfTextRender 3 and dup 1 eq exch 2 eq or {
    3 index 3 index moveto
    2 copy
    currentfont /FontType get 3 eq { fCol } { sCol } ifelse
    xycp currentpoint stroke moveto
  } if
  pdfTextRender 4 and 0 ne {
    4 2 roll moveto xycp
    /pdfTextClipPath [ pdfTextClipPath aload pop
      {/moveto cvx}
      {/lineto cvx}
      {/curveto cvx}
      {/closepath cvx}
    pathforall ] def
    currentpoint newpath moveto
  } {
    pop pop pop pop
  } ifelse
  0 pdfTextRise neg pdfTextMat dtransform rmoveto
} def
/TJm { 0.001 mul pdfFontSize mul pdfHorizScaling mul neg 0
       pdfTextMat dtransform rmoveto } def
/TJmV { 0.001 mul pdfFontSize mul neg 0 exch
        pdfTextMat dtransform rmoveto } def
/Tclip { pdfTextClipPath cvx exec clip newpath
         /pdfTextClipPath [] def } def
/Tclip* { pdfTextClipPath cvx exec eoclip newpath
         /pdfTextClipPath [] def } def
% Level 2/3 image operators
/pdfImBuf 100 string def
/pdfImStr {
  2 copy exch length lt {
    2 copy get exch 1 add exch
  } {
    ()
  } ifelse
} def
/skipEOD {
  { currentfile pdfImBuf readline
    not { pop exit } if
    (%-EOD-) eq { exit } if } loop
} def
/pdfIm { image skipEOD } def
/pdfImM { fCol imagemask skipEOD } def
/pr { 2 index 2 index 3 2 roll putinterval 4 add } def
/pdfImClip {
  gsave
  0 2 4 index length 1 sub {
    dup 4 index exch 2 copy
    get 5 index div put
    1 add 3 index exch 2 copy
    get 3 index div put
  } for
  pop pop rectclip
} def
/pdfImClipEnd { grestore } def
% shading operators
/colordelta {
  false 0 1 3 index length 1 sub {
    dup 4 index exch get 3 index 3 2 roll get sub abs 0.004 gt {
      pop true
    } if
  } for
  exch pop exch pop
} def
/funcCol { func n array astore } def
/funcSH {
  dup 0 eq {
    true
  } {
    dup 6 eq {
      false
    } {
      4 index 4 index funcCol dup
      6 index 4 index funcCol dup
      3 1 roll colordelta 3 1 roll
      5 index 5 index funcCol dup
      3 1 roll colordelta 3 1 roll
      6 index 8 index funcCol dup
      3 1 roll colordelta 3 1 roll
      colordelta or or or
    } ifelse
  } ifelse
  {
    1 add
    4 index 3 index add 0.5 mul exch 4 index 3 index add 0.5 mul exch
    6 index 6 index 4 index 4 index 4 index funcSH
    2 index 6 index 6 index 4 index 4 index funcSH
    6 index 2 index 4 index 6 index 4 index funcSH
    5 3 roll 3 2 roll funcSH pop pop
  } {
    pop 3 index 2 index add 0.5 mul 3 index  2 index add 0.5 mul
    funcCol sc
    dup 4 index exch mat transform m
    3 index 3 index mat transform l
    1 index 3 index mat transform l
    mat transform l pop pop h f*
  } ifelse
} def
/axialCol {
  dup 0 lt {
    pop t0
  } {
    dup 1 gt {
      pop t1
    } {
      dt mul t0 add
    } ifelse
  } ifelse
  func n array astore
} def
/axialSH {
  dup 0 eq {
    true
  } {
    dup 8 eq {
      false
    } {
      2 index axialCol 2 index axialCol colordelta
    } ifelse
  } ifelse
  {
    1 add 3 1 roll 2 copy add 0.5 mul
    dup 4 3 roll exch 4 index axialSH
    exch 3 2 roll axialSH
  } {
    pop 2 copy add 0.5 mul
    axialCol sc
    exch dup dx mul x0 add exch dy mul y0 add
    3 2 roll dup dx mul x0 add exch dy mul y0 add
    dx abs dy abs ge {
      2 copy yMin sub dy mul dx div add yMin m
      yMax sub dy mul dx div add yMax l
      2 copy yMax sub dy mul dx div add yMax l
      yMin sub dy mul dx div add yMin l
      h f*
    } {
      exch 2 copy xMin sub dx mul dy div add xMin exch m
      xMax sub dx mul dy div add xMax exch l
      exch 2 copy xMax sub dx mul dy div add xMax exch l
      xMin sub dx mul dy div add xMin exch l
      h f*
    } ifelse
  } ifelse
} def
/radialCol {
  dup t0 lt {
    pop t0
  } {
    dup t1 gt {
      pop t1
    } if
  } ifelse
  func n array astore
} def
/radialSH {
  dup 0 eq {
    true
  } {
    dup 8 eq {
      false
    } {
      2 index dt mul t0 add radialCol
      2 index dt mul t0 add radialCol colordelta
    } ifelse
  } ifelse
  {
    1 add 3 1 roll 2 copy add 0.5 mul
    dup 4 3 roll exch 4 index radialSH
    exch 3 2 roll radialSH
  } {
    pop 2 copy add 0.5 mul dt mul t0 add
    radialCol sc
    encl {
      exch dup dx mul x0 add exch dup dy mul y0 add exch dr mul r0 add
      0 360 arc h
      dup dx mul x0 add exch dup dy mul y0 add exch dr mul r0 add
      360 0 arcn h f
    } {
      2 copy
      dup dx mul x0 add exch dup dy mul y0 add exch dr mul r0 add
      a1 a2 arcn
      dup dx mul x0 add exch dup dy mul y0 add exch dr mul r0 add
      a2 a1 arcn h
      dup dx mul x0 add exch dup dy mul y0 add exch dr mul r0 add
      a1 a2 arc
      dup dx mul x0 add exch dup dy mul y0 add exch dr mul r0 add
      a2 a1 arc h f
    } ifelse
  } ifelse
} def
end
%%EndResource
%%EndProlog
%%BeginSetup
xpdf begin
%%EndSetup
pdfStartPage
%%EndPageSetup
[] 0 d
1 i
0 j
0 J
10 M
1 w
/DeviceGray {} cs
[0] sc
/DeviceGray {} CS
[0] SC
false op
false OP
{} settransfer
0 0 228.569 228.569 re
W
q
[1 0 0 1 114.284 114.284] cm
q
/DeviceGray {} CS
[0] SC
/DeviceGray {} cs
[0] sc
0.3985 w
q
q
0.79701 w
0 -113.38724 m
0 112.67987 l
S
q
[0 1 -1 0 0 112.67987] cm
q
0.6376 w
[] 0 d
1 J
1 j
-1.55415 2.0722 m
-1.42464 1.29512 0 0.1295 0.38852 0 c
0 -0.1295 -1.42464 -1.29512 -1.55415 -2.0722 c
S
Q
Q
Q
q
0.79701 w
-113.38724 0 m
112.67987 0 l
S
q
[1 0 0 1 112.67987 0] cm
q
0.6376 w
[] 0 d
1 J
1 j
-1.55415 2.0722 m
-1.42464 1.29512 0 0.1295 0.38852 0 c
0 -0.1295 -1.42464 -1.29512 -1.55415 -2.0722 c
S
Q
Q
Q
q
/DeviceGray {} cs
[0] sc
1.99255 0 m
1.99255 1.10046 1.10046 1.99255 0 1.99255 c
-1.10046 1.99255 -1.99255 1.10046 -1.99255 0 c
-1.99255 -1.10046 -1.10046 -1.99255 0 -1.99255 c
1.10046 -1.99255 1.99255 -1.10046 1.99255 0 c
h
f
1.99255 0 m
1.99255 1.10046 1.10046 1.99255 0 1.99255 c
-1.10046 1.99255 -1.99255 1.10046 -1.99255 0 c
-1.99255 -1.10046 -1.10046 -1.99255 0 -1.99255 c
1.10046 -1.99255 1.99255 -1.10046 1.99255 0 c
h
S
Q
q
/DeviceGray {} cs
[0] sc
1.99255 28.3468 m
1.99255 29.44728 1.10046 30.33936 0 30.33936 c
-1.10046 30.33936 -1.99255 29.44728 -1.99255 28.3468 c
-1.99255 27.24634 -1.10046 26.35425 0 26.35425 c
1.10046 26.35425 1.99255 27.24634 1.99255 28.3468 c
h
f
1.99255 28.3468 m
1.99255 29.44728 1.10046 30.33936 0 30.33936 c
-1.10046 30.33936 -1.99255 29.44728 -1.99255 28.3468 c
-1.99255 27.24634 -1.10046 26.35425 0 26.35425 c
1.10046 26.35425 1.99255 27.24634 1.99255 28.3468 c
h
S
Q
q
/DeviceGray {} cs
[0] sc
1.99255 56.69362 m
1.99255 57.79408 1.10046 58.68617 0 58.68617 c
-1.10046 58.68617 -1.99255 57.79408 -1.99255 56.69362 c
-1.99255 55.59314 -1.10046 54.70107 0 54.70107 c
1.10046 54.70107 1.99255 55.59314 1.99255 56.69362 c
h
f
1.99255 56.69362 m
1.99255 57.79408 1.10046 58.68617 0 58.68617 c
-1.10046 58.68617 -1.99255 57.79408 -1.99255 56.69362 c
-1.99255 55.59314 -1.10046 54.70107 0 54.70107 c
1.10046 54.70107 1.99255 55.59314 1.99255 56.69362 c
h
S
Q
q
/DeviceGray {} cs
[0] sc
1.99255 -28.3468 m
1.99255 -27.24634 1.10046 -26.35425 0 -26.35425 c
-1.10046 -26.35425 -1.99255 -27.24634 -1.99255 -28.3468 c
-1.99255 -29.44728 -1.10046 -30.33936 0 -30.33936 c
1.10046 -30.33936 1.99255 -29.44728 1.99255 -28.3468 c
h
f
1.99255 -28.3468 m
1.99255 -27.24634 1.10046 -26.35425 0 -26.35425 c
-1.10046 -26.35425 -1.99255 -27.24634 -1.99255 -28.3468 c
-1.99255 -29.44728 -1.10046 -30.33936 0 -30.33936 c
1.10046 -30.33936 1.99255 -29.44728 1.99255 -28.3468 c
h
S
Q
q
/DeviceGray {} cs
[0] sc
1.99255 -56.69362 m
1.99255 -55.59314 1.10046 -54.70107 0 -54.70107 c
-1.10046 -54.70107 -1.99255 -55.59314 -1.99255 -56.69362 c
-1.99255 -57.79408 -1.10046 -58.68617 0 -58.68617 c
1.10046 -58.68617 1.99255 -57.79408 1.99255 -56.69362 c
h
f
1.99255 -56.69362 m
1.99255 -55.59314 1.10046 -54.70107 0 -54.70107 c
-1.10046 -54.70107 -1.99255 -55.59314 -1.99255 -56.69362 c
-1.99255 -57.79408 -1.10046 -58.68617 0 -58.68617 c
1.10046 -58.68617 1.99255 -57.79408 1.99255 -56.69362 c
h
S
Q
q
/DeviceGray {} cs
[0] sc
30.33936 0 m
30.33936 1.10046 29.44728 1.99255 28.3468 1.99255 c
27.24634 1.99255 26.35425 1.10046 26.35425 0 c
26.35425 -1.10046 27.24634 -1.99255 28.3468 -1.99255 c
29.44728 -1.99255 30.33936 -1.10046 30.33936 0 c
h
f
30.33936 0 m
30.33936 1.10046 29.44728 1.99255 28.3468 1.99255 c
27.24634 1.99255 26.35425 1.10046 26.35425 0 c
26.35425 -1.10046 27.24634 -1.99255 28.3468 -1.99255 c
29.44728 -1.99255 30.33936 -1.10046 30.33936 0 c
h
S
Q
q
/DeviceGray {} cs
[0] sc
58.68617 0 m
58.68617 1.10046 57.79408 1.99255 56.69362 1.99255 c
55.59314 1.99255 54.70107 1.10046 54.70107 0 c
54.70107 -1.10046 55.59314 -1.99255 56.69362 -1.99255 c
57.79408 -1.99255 58.68617 -1.10046 58.68617 0 c
h
f
58.68617 0 m
58.68617 1.10046 57.79408 1.99255 56.69362 1.99255 c
55.59314 1.99255 54.70107 1.10046 54.70107 0 c
54.70107 -1.10046 55.59314 -1.99255 56.69362 -1.99255 c
57.79408 -1.99255 58.68617 -1.10046 58.68617 0 c
h
S
Q
q
/DeviceGray {} cs
[0] sc
87.03297 0 m
87.03297 1.10046 86.1409 1.99255 85.04042 1.99255 c
83.93996 1.99255 83.04787 1.10046 83.04787 0 c
83.04787 -1.10046 83.93996 -1.99255 85.04042 -1.99255 c
86.1409 -1.99255 87.03297 -1.10046 87.03297 0 c
h
f
87.03297 0 m
87.03297 1.10046 86.1409 1.99255 85.04042 1.99255 c
83.93996 1.99255 83.04787 1.10046 83.04787 0 c
83.04787 -1.10046 83.93996 -1.99255 85.04042 -1.99255 c
86.1409 -1.99255 87.03297 -1.10046 87.03297 0 c
h
S
Q
q
/DeviceGray {} cs
[0] sc
-26.35425 0 m
-26.35425 1.10046 -27.24634 1.99255 -28.3468 1.99255 c
-29.44728 1.99255 -30.33936 1.10046 -30.33936 0 c
-30.33936 -1.10046 -29.44728 -1.99255 -28.3468 -1.99255 c
-27.24634 -1.99255 -26.35425 -1.10046 -26.35425 0 c
h
f
-26.35425 0 m
-26.35425 1.10046 -27.24634 1.99255 -28.3468 1.99255 c
-29.44728 1.99255 -30.33936 1.10046 -30.33936 0 c
-30.33936 -1.10046 -29.44728 -1.99255 -28.3468 -1.99255 c
-27.24634 -1.99255 -26.35425 -1.10046 -26.35425 0 c
h
S
Q
q
/DeviceGray {} cs
[0] sc
-54.70107 0 m
-54.70107 1.10046 -55.59314 1.99255 -56.69362 1.99255 c
-57.79408 1.99255 -58.68617 1.10046 -58.68617 0 c
-58.68617 -1.10046 -57.79408 -1.99255 -56.69362 -1.99255 c
-55.59314 -1.99255 -54.70107 -1.10046 -54.70107 0 c
h
f
-54.70107 0 m
-54.70107 1.10046 -55.59314 1.99255 -56.69362 1.99255 c
-57.79408 1.99255 -58.68617 1.10046 -58.68617 0 c
-58.68617 -1.10046 -57.79408 -1.99255 -56.69362 -1.99255 c
-55.59314 -1.99255 -54.70107 -1.10046 -54.70107 0 c
h
S
Q
q
/DeviceGray {} cs
[0] sc
-83.04787 0 m
-83.04787 1.10046 -83.93996 1.99255 -85.04042 1.99255 c
-86.1409 1.99255 -87.03297 1.10046 -87.03297 0 c
-87.03297 -1.10046 -86.1409 -1.99255 -85.04042 -1.99255 c
-83.93996 -1.99255 -83.04787 -1.10046 -83.04787 0 c
h
f
-83.04787 0 m
-83.04787 1.10046 -83.93996 1.99255 -85.04042 1.99255 c
-86.1409 1.99255 -87.03297 1.10046 -87.03297 0 c
-87.03297 -1.10046 -86.1409 -1.99255 -85.04042 -1.99255 c
-83.93996 -1.99255 -83.04787 -1.10046 -83.04787 0 c
h
S
Q
q
/DeviceGray {} cs
[0] sc
30.33936 28.3468 m
30.33936 29.44728 29.44728 30.33936 28.3468 30.33936 c
27.24634 30.33936 26.35425 29.44728 26.35425 28.3468 c
26.35425 27.24634 27.24634 26.35425 28.3468 26.35425 c
29.44728 26.35425 30.33936 27.24634 30.33936 28.3468 c
h
f
30.33936 28.3468 m
30.33936 29.44728 29.44728 30.33936 28.3468 30.33936 c
27.24634 30.33936 26.35425 29.44728 26.35425 28.3468 c
26.35425 27.24634 27.24634 26.35425 28.3468 26.35425 c
29.44728 26.35425 30.33936 27.24634 30.33936 28.3468 c
h
S
Q
q
/DeviceGray {} cs
[0] sc
30.33936 56.69362 m
30.33936 57.79408 29.44728 58.68617 28.3468 58.68617 c
27.24634 58.68617 26.35425 57.79408 26.35425 56.69362 c
26.35425 55.59314 27.24634 54.70107 28.3468 54.70107 c
29.44728 54.70107 30.33936 55.59314 30.33936 56.69362 c
h
f
30.33936 56.69362 m
30.33936 57.79408 29.44728 58.68617 28.3468 58.68617 c
27.24634 58.68617 26.35425 57.79408 26.35425 56.69362 c
26.35425 55.59314 27.24634 54.70107 28.3468 54.70107 c
29.44728 54.70107 30.33936 55.59314 30.33936 56.69362 c
h
S
Q
q
/DeviceGray {} cs
[0] sc
58.68617 28.3468 m
58.68617 29.44728 57.79408 30.33936 56.69362 30.33936 c
55.59314 30.33936 54.70107 29.44728 54.70107 28.3468 c
54.70107 27.24634 55.59314 26.35425 56.69362 26.35425 c
57.79408 26.35425 58.68617 27.24634 58.68617 28.3468 c
h
f
58.68617 28.3468 m
58.68617 29.44728 57.79408 30.33936 56.69362 30.33936 c
55.59314 30.33936 54.70107 29.44728 54.70107 28.3468 c
54.70107 27.24634 55.59314 26.35425 56.69362 26.35425 c
57.79408 26.35425 58.68617 27.24634 58.68617 28.3468 c
h
S
Q
q
/DeviceGray {} cs
[0] sc
58.68617 56.69362 m
58.68617 57.79408 57.79408 58.68617 56.69362 58.68617 c
55.59314 58.68617 54.70107 57.79408 54.70107 56.69362 c
54.70107 55.59314 55.59314 54.70107 56.69362 54.70107 c
57.79408 54.70107 58.68617 55.59314 58.68617 56.69362 c
h
f
58.68617 56.69362 m
58.68617 57.79408 57.79408 58.68617 56.69362 58.68617 c
55.59314 58.68617 54.70107 57.79408 54.70107 56.69362 c
54.70107 55.59314 55.59314 54.70107 56.69362 54.70107 c
57.79408 54.70107 58.68617 55.59314 58.68617 56.69362 c
h
S
Q
q
/DeviceGray {} cs
[0] sc
87.03297 28.3468 m
87.03297 29.44728 86.1409 30.33936 85.04042 30.33936 c
83.93996 30.33936 83.04787 29.44728 83.04787 28.3468 c
83.04787 27.24634 83.93996 26.35425 85.04042 26.35425 c
86.1409 26.35425 87.03297 27.24634 87.03297 28.3468 c
h
f
87.03297 28.3468 m
87.03297 29.44728 86.1409 30.33936 85.04042 30.33936 c
83.93996 30.33936 83.04787 29.44728 83.04787 28.3468 c
83.04787 27.24634 83.93996 26.35425 85.04042 26.35425 c
86.1409 26.35425 87.03297 27.24634 87.03297 28.3468 c
h
S
Q
q
/DeviceGray {} cs
[0] sc
87.03297 56.69362 m
87.03297 57.79408 86.1409 58.68617 85.04042 58.68617 c
83.93996 58.68617 83.04787 57.79408 83.04787 56.69362 c
83.04787 55.59314 83.93996 54.70107 85.04042 54.70107 c
86.1409 54.70107 87.03297 55.59314 87.03297 56.69362 c
h
f
87.03297 56.69362 m
87.03297 57.79408 86.1409 58.68617 85.04042 58.68617 c
83.93996 58.68617 83.04787 57.79408 83.04787 56.69362 c
83.04787 55.59314 83.93996 54.70107 85.04042 54.70107 c
86.1409 54.70107 87.03297 55.59314 87.03297 56.69362 c
h
S
Q
q
/DeviceGray {} cs
[0] sc
30.33936 -28.3468 m
30.33936 -27.24634 29.44728 -26.35425 28.3468 -26.35425 c
27.24634 -26.35425 26.35425 -27.24634 26.35425 -28.3468 c
26.35425 -29.44728 27.24634 -30.33936 28.3468 -30.33936 c
29.44728 -30.33936 30.33936 -29.44728 30.33936 -28.3468 c
h
f
30.33936 -28.3468 m
30.33936 -27.24634 29.44728 -26.35425 28.3468 -26.35425 c
27.24634 -26.35425 26.35425 -27.24634 26.35425 -28.3468 c
26.35425 -29.44728 27.24634 -30.33936 28.3468 -30.33936 c
29.44728 -30.33936 30.33936 -29.44728 30.33936 -28.3468 c
h
S
Q
q
/DeviceGray {} cs
[0] sc
30.33936 -56.69362 m
30.33936 -55.59314 29.44728 -54.70107 28.3468 -54.70107 c
27.24634 -54.70107 26.35425 -55.59314 26.35425 -56.69362 c
26.35425 -57.79408 27.24634 -58.68617 28.3468 -58.68617 c
29.44728 -58.68617 30.33936 -57.79408 30.33936 -56.69362 c
h
f
30.33936 -56.69362 m
30.33936 -55.59314 29.44728 -54.70107 28.3468 -54.70107 c
27.24634 -54.70107 26.35425 -55.59314 26.35425 -56.69362 c
26.35425 -57.79408 27.24634 -58.68617 28.3468 -58.68617 c
29.44728 -58.68617 30.33936 -57.79408 30.33936 -56.69362 c
h
S
Q
q
/DeviceGray {} cs
[0] sc
58.68617 -28.3468 m
58.68617 -27.24634 57.79408 -26.35425 56.69362 -26.35425 c
55.59314 -26.35425 54.70107 -27.24634 54.70107 -28.3468 c
54.70107 -29.44728 55.59314 -30.33936 56.69362 -30.33936 c
57.79408 -30.33936 58.68617 -29.44728 58.68617 -28.3468 c
h
f
58.68617 -28.3468 m
58.68617 -27.24634 57.79408 -26.35425 56.69362 -26.35425 c
55.59314 -26.35425 54.70107 -27.24634 54.70107 -28.3468 c
54.70107 -29.44728 55.59314 -30.33936 56.69362 -30.33936 c
57.79408 -30.33936 58.68617 -29.44728 58.68617 -28.3468 c
h
S
Q
q
/DeviceGray {} cs
[0] sc
58.68617 -56.69362 m
58.68617 -55.59314 57.79408 -54.70107 56.69362 -54.70107 c
55.59314 -54.70107 54.70107 -55.59314 54.70107 -56.69362 c
54.70107 -57.79408 55.59314 -58.68617 56.69362 -58.68617 c
57.79408 -58.68617 58.68617 -57.79408 58.68617 -56.69362 c
h
f
58.68617 -56.69362 m
58.68617 -55.59314 57.79408 -54.70107 56.69362 -54.70107 c
55.59314 -54.70107 54.70107 -55.59314 54.70107 -56.69362 c
54.70107 -57.79408 55.59314 -58.68617 56.69362 -58.68617 c
57.79408 -58.68617 58.68617 -57.79408 58.68617 -56.69362 c
h
S
Q
q
/DeviceGray {} cs
[0] sc
87.03297 -28.3468 m
87.03297 -27.24634 86.1409 -26.35425 85.04042 -26.35425 c
83.93996 -26.35425 83.04787 -27.24634 83.04787 -28.3468 c
83.04787 -29.44728 83.93996 -30.33936 85.04042 -30.33936 c
86.1409 -30.33936 87.03297 -29.44728 87.03297 -28.3468 c
h
f
87.03297 -28.3468 m
87.03297 -27.24634 86.1409 -26.35425 85.04042 -26.35425 c
83.93996 -26.35425 83.04787 -27.24634 83.04787 -28.3468 c
83.04787 -29.44728 83.93996 -30.33936 85.04042 -30.33936 c
86.1409 -30.33936 87.03297 -29.44728 87.03297 -28.3468 c
h
S
Q
q
/DeviceGray {} cs
[0] sc
87.03297 -56.69362 m
87.03297 -55.59314 86.1409 -54.70107 85.04042 -54.70107 c
83.93996 -54.70107 83.04787 -55.59314 83.04787 -56.69362 c
83.04787 -57.79408 83.93996 -58.68617 85.04042 -58.68617 c
86.1409 -58.68617 87.03297 -57.79408 87.03297 -56.69362 c
h
f
87.03297 -56.69362 m
87.03297 -55.59314 86.1409 -54.70107 85.04042 -54.70107 c
83.93996 -54.70107 83.04787 -55.59314 83.04787 -56.69362 c
83.04787 -57.79408 83.93996 -58.68617 85.04042 -58.68617 c
86.1409 -58.68617 87.03297 -57.79408 87.03297 -56.69362 c
h
S
Q
q
/DeviceGray {} cs
[0] sc
-26.35425 28.3468 m
-26.35425 29.44728 -27.24634 30.33936 -28.3468 30.33936 c
-29.44728 30.33936 -30.33936 29.44728 -30.33936 28.3468 c
-30.33936 27.24634 -29.44728 26.35425 -28.3468 26.35425 c
-27.24634 26.35425 -26.35425 27.24634 -26.35425 28.3468 c
h
f
-26.35425 28.3468 m
-26.35425 29.44728 -27.24634 30.33936 -28.3468 30.33936 c
-29.44728 30.33936 -30.33936 29.44728 -30.33936 28.3468 c
-30.33936 27.24634 -29.44728 26.35425 -28.3468 26.35425 c
-27.24634 26.35425 -26.35425 27.24634 -26.35425 28.3468 c
h
S
Q
q
/DeviceGray {} cs
[0] sc
-26.35425 56.69362 m
-26.35425 57.79408 -27.24634 58.68617 -28.3468 58.68617 c
-29.44728 58.68617 -30.33936 57.79408 -30.33936 56.69362 c
-30.33936 55.59314 -29.44728 54.70107 -28.3468 54.70107 c
-27.24634 54.70107 -26.35425 55.59314 -26.35425 56.69362 c
h
f
-26.35425 56.69362 m
-26.35425 57.79408 -27.24634 58.68617 -28.3468 58.68617 c
-29.44728 58.68617 -30.33936 57.79408 -30.33936 56.69362 c
-30.33936 55.59314 -29.44728 54.70107 -28.3468 54.70107 c
-27.24634 54.70107 -26.35425 55.59314 -26.35425 56.69362 c
h
S
Q
q
/DeviceGray {} cs
[0] sc
-54.70107 28.3468 m
-54.70107 29.44728 -55.59314 30.33936 -56.69362 30.33936 c
-57.79408 30.33936 -58.68617 29.44728 -58.68617 28.3468 c
-58.68617 27.24634 -57.79408 26.35425 -56.69362 26.35425 c
-55.59314 26.35425 -54.70107 27.24634 -54.70107 28.3468 c
h
f
-54.70107 28.3468 m
-54.70107 29.44728 -55.59314 30.33936 -56.69362 30.33936 c
-57.79408 30.33936 -58.68617 29.44728 -58.68617 28.3468 c
-58.68617 27.24634 -57.79408 26.35425 -56.69362 26.35425 c
-55.59314 26.35425 -54.70107 27.24634 -54.70107 28.3468 c
h
S
Q
q
/DeviceGray {} cs
[0] sc
-54.70107 56.69362 m
-54.70107 57.79408 -55.59314 58.68617 -56.69362 58.68617 c
-57.79408 58.68617 -58.68617 57.79408 -58.68617 56.69362 c
-58.68617 55.59314 -57.79408 54.70107 -56.69362 54.70107 c
-55.59314 54.70107 -54.70107 55.59314 -54.70107 56.69362 c
h
f
-54.70107 56.69362 m
-54.70107 57.79408 -55.59314 58.68617 -56.69362 58.68617 c
-57.79408 58.68617 -58.68617 57.79408 -58.68617 56.69362 c
-58.68617 55.59314 -57.79408 54.70107 -56.69362 54.70107 c
-55.59314 54.70107 -54.70107 55.59314 -54.70107 56.69362 c
h
S
Q
q
/DeviceGray {} cs
[0] sc
-83.04787 28.3468 m
-83.04787 29.44728 -83.93996 30.33936 -85.04042 30.33936 c
-86.1409 30.33936 -87.03297 29.44728 -87.03297 28.3468 c
-87.03297 27.24634 -86.1409 26.35425 -85.04042 26.35425 c
-83.93996 26.35425 -83.04787 27.24634 -83.04787 28.3468 c
h
f
-83.04787 28.3468 m
-83.04787 29.44728 -83.93996 30.33936 -85.04042 30.33936 c
-86.1409 30.33936 -87.03297 29.44728 -87.03297 28.3468 c
-87.03297 27.24634 -86.1409 26.35425 -85.04042 26.35425 c
-83.93996 26.35425 -83.04787 27.24634 -83.04787 28.3468 c
h
S
Q
q
/DeviceGray {} cs
[0] sc
-83.04787 56.69362 m
-83.04787 57.79408 -83.93996 58.68617 -85.04042 58.68617 c
-86.1409 58.68617 -87.03297 57.79408 -87.03297 56.69362 c
-87.03297 55.59314 -86.1409 54.70107 -85.04042 54.70107 c
-83.93996 54.70107 -83.04787 55.59314 -83.04787 56.69362 c
h
f
-83.04787 56.69362 m
-83.04787 57.79408 -83.93996 58.68617 -85.04042 58.68617 c
-86.1409 58.68617 -87.03297 57.79408 -87.03297 56.69362 c
-87.03297 55.59314 -86.1409 54.70107 -85.04042 54.70107 c
-83.93996 54.70107 -83.04787 55.59314 -83.04787 56.69362 c
h
S
Q
q
/DeviceGray {} cs
[0] sc
-26.35425 -28.3468 m
-26.35425 -27.24634 -27.24634 -26.35425 -28.3468 -26.35425 c
-29.44728 -26.35425 -30.33936 -27.24634 -30.33936 -28.3468 c
-30.33936 -29.44728 -29.44728 -30.33936 -28.3468 -30.33936 c
-27.24634 -30.33936 -26.35425 -29.44728 -26.35425 -28.3468 c
h
f
-26.35425 -28.3468 m
-26.35425 -27.24634 -27.24634 -26.35425 -28.3468 -26.35425 c
-29.44728 -26.35425 -30.33936 -27.24634 -30.33936 -28.3468 c
-30.33936 -29.44728 -29.44728 -30.33936 -28.3468 -30.33936 c
-27.24634 -30.33936 -26.35425 -29.44728 -26.35425 -28.3468 c
h
S
Q
q
/DeviceGray {} cs
[0] sc
-26.35425 -56.69362 m
-26.35425 -55.59314 -27.24634 -54.70107 -28.3468 -54.70107 c
-29.44728 -54.70107 -30.33936 -55.59314 -30.33936 -56.69362 c
-30.33936 -57.79408 -29.44728 -58.68617 -28.3468 -58.68617 c
-27.24634 -58.68617 -26.35425 -57.79408 -26.35425 -56.69362 c
h
f
-26.35425 -56.69362 m
-26.35425 -55.59314 -27.24634 -54.70107 -28.3468 -54.70107 c
-29.44728 -54.70107 -30.33936 -55.59314 -30.33936 -56.69362 c
-30.33936 -57.79408 -29.44728 -58.68617 -28.3468 -58.68617 c
-27.24634 -58.68617 -26.35425 -57.79408 -26.35425 -56.69362 c
h
S
Q
q
/DeviceGray {} cs
[0] sc
-54.70107 -28.3468 m
-54.70107 -27.24634 -55.59314 -26.35425 -56.69362 -26.35425 c
-57.79408 -26.35425 -58.68617 -27.24634 -58.68617 -28.3468 c
-58.68617 -29.44728 -57.79408 -30.33936 -56.69362 -30.33936 c
-55.59314 -30.33936 -54.70107 -29.44728 -54.70107 -28.3468 c
h
f
-54.70107 -28.3468 m
-54.70107 -27.24634 -55.59314 -26.35425 -56.69362 -26.35425 c
-57.79408 -26.35425 -58.68617 -27.24634 -58.68617 -28.3468 c
-58.68617 -29.44728 -57.79408 -30.33936 -56.69362 -30.33936 c
-55.59314 -30.33936 -54.70107 -29.44728 -54.70107 -28.3468 c
h
S
Q
q
/DeviceGray {} cs
[0] sc
-54.70107 -56.69362 m
-54.70107 -55.59314 -55.59314 -54.70107 -56.69362 -54.70107 c
-57.79408 -54.70107 -58.68617 -55.59314 -58.68617 -56.69362 c
-58.68617 -57.79408 -57.79408 -58.68617 -56.69362 -58.68617 c
-55.59314 -58.68617 -54.70107 -57.79408 -54.70107 -56.69362 c
h
f
-54.70107 -56.69362 m
-54.70107 -55.59314 -55.59314 -54.70107 -56.69362 -54.70107 c
-57.79408 -54.70107 -58.68617 -55.59314 -58.68617 -56.69362 c
-58.68617 -57.79408 -57.79408 -58.68617 -56.69362 -58.68617 c
-55.59314 -58.68617 -54.70107 -57.79408 -54.70107 -56.69362 c
h
S
Q
q
/DeviceGray {} cs
[0] sc
-83.04787 -28.3468 m
-83.04787 -27.24634 -83.93996 -26.35425 -85.04042 -26.35425 c
-86.1409 -26.35425 -87.03297 -27.24634 -87.03297 -28.3468 c
-87.03297 -29.44728 -86.1409 -30.33936 -85.04042 -30.33936 c
-83.93996 -30.33936 -83.04787 -29.44728 -83.04787 -28.3468 c
h
f
-83.04787 -28.3468 m
-83.04787 -27.24634 -83.93996 -26.35425 -85.04042 -26.35425 c
-86.1409 -26.35425 -87.03297 -27.24634 -87.03297 -28.3468 c
-87.03297 -29.44728 -86.1409 -30.33936 -85.04042 -30.33936 c
-83.93996 -30.33936 -83.04787 -29.44728 -83.04787 -28.3468 c
h
S
Q
q
/DeviceGray {} cs
[0] sc
-83.04787 -56.69362 m
-83.04787 -55.59314 -83.93996 -54.70107 -85.04042 -54.70107 c
-86.1409 -54.70107 -87.03297 -55.59314 -87.03297 -56.69362 c
-87.03297 -57.79408 -86.1409 -58.68617 -85.04042 -58.68617 c
-83.93996 -58.68617 -83.04787 -57.79408 -83.04787 -56.69362 c
h
f
-83.04787 -56.69362 m
-83.04787 -55.59314 -83.93996 -54.70107 -85.04042 -54.70107 c
-86.1409 -54.70107 -87.03297 -55.59314 -87.03297 -56.69362 c
-87.03297 -57.79408 -86.1409 -58.68617 -85.04042 -58.68617 c
-83.93996 -58.68617 -83.04787 -57.79408 -83.04787 -56.69362 c
h
S
Q
q
[2.98883 2.98883] 0 d
99.21382 42.5202 m
70.867 70.867 l
S
Q
q
[2.98883 2.98883] 0 d
85.04042 28.3468 m
56.69362 56.69362 l
S
Q
q
[2.98883 2.98883] 0 d
85.04042 0 m
28.3468 56.69362 l
S
Q
q
[2.98883 2.98883] 0 d
85.04042 -28.3468 m
0 56.69362 l
S
Q
q
[2.98883 2.98883] 0 d
85.04042 -56.69362 m
-28.3468 56.69362 l
S
Q
q
[2.98883 2.98883] 0 d
56.69362 -56.69362 m
-56.69362 56.69362 l
S
Q
q
[2.98883 2.98883] 0 d
28.3468 -56.69362 m
-85.04042 56.69362 l
S
Q
q
[2.98883 2.98883] 0 d
0 -56.69362 m
-85.04042 28.3468 l
S
Q
q
[2.98883 2.98883] 0 d
-28.3468 -56.69362 m
-85.04042 0 l
S
Q
q
[2.98883 2.98883] 0 d
-56.69362 -56.69362 m
-85.04042 -28.3468 l
S
Q
q
[2.98883 2.98883] 0 d
-70.867 -70.867 m
-99.21382 -42.5202 l
S
Q
Q
Q
Q
showpage
%%PageTrailer
pdfEndPage
%%Trailer
end
%%DocumentSuppliedResources:
%%EOF
