%!PS-Adobe-3.0 EPSF-3.0
%%Title: perturbazioni.eps
%%Creator: matplotlib version 1.5.0, http://matplotlib.org/
%%CreationDate: Sun Jan 24 11:24:08 2016
%%Orientation: portrait
%%BoundingBox: 23 190 588 601
%%EndComments
%%BeginProlog
/mpldict 10 dict def
mpldict begin
/m { moveto } bind def
/l { lineto } bind def
/r { rlineto } bind def
/c { curveto } bind def
/cl { closepath } bind def
/box {
m
1 index 0 r
0 exch r
neg 0 r
cl
} bind def
/clipbox {
box
clip
newpath
} bind def
%!PS-Adobe-3.0 Resource-Font
%%Title: cmr10
%%Copyright: Copyright (C) 1994, Basil K. Malyshev. All Rights Reserved.012BaKoMa Fonts Collection, Level-B.
%%Creator: Converted from TrueType to type 3 by PPR
25 dict begin
/_d{bind def}bind def
/_m{moveto}_d
/_l{lineto}_d
/_cl{closepath eofill}_d
/_c{curveto}_d
/_sc{7 -1 roll{setcachedevice}{pop pop pop pop pop pop}ifelse}_d
/_e{exec}_d
/FontName /Cmr10 def
/PaintType 0 def
/FontMatrix[.001 0 0 .001 0 0]def
/FontBBox[-44 -250 1009 750]def
/FontType 3 def
/Encoding [ /Delta /two /four /parenright /six /one /parenleft ] def
/FontInfo 10 dict dup begin
/FamilyName (cmr10) def
/FullName (cmr10) def
/Notice (Copyright (C) 1994, Basil K. Malyshev. All Rights Reserved.012BaKoMa Fonts Collection, Level-B. ) def
/Weight (Regular) def
/Version (1.1/12-Nov-94) def
/ItalicAngle 0.0 def
/isFixedPitch false def
/UnderlinePosition -133 def
/UnderlineThickness 20 def
end readonly def
/CharStrings 7 dict dup begin
/Delta{833 0 46 0 786 716 _sc
54 0 _m
48 0 46 2 46 8 _c
46 8 46 9 46 9 _c
46 9 47 10 47 11 _c
391 705 _l
394 712 400 716 409 716 _c
423 716 _l
432 716 438 712 441 705 _c
785 11 _l
785 10 786 9 786 9 _c
786 9 786 8 786 8 _c
786 2 783 0 778 0 _c
54 0 _l
120 80 _m
647 80 _l
384 611 _l
120 80 _l
_cl}_d
/two{{500 0 50 0 449 666 _sc
50 0 _m
50 27 _l
50 28 50 30 52 32 _c
207 204 _l
230 229 249 250 264 268 _c
278 285 293 305 307 327 _c
321 349 333 372 341 396 _c
349 419 354 444 354 470 _c
354 497 349 523 339 548 _c
329 573 314 593 294 608 _c
274 623 249 631 221 631 _c
192 631 166 622 143 605 _c
119 587 103 565 94 537 _c
96 537 100 538 105 538 _c
}_e{119 538 132 533 143 523 _c
153 513 159 500 159 484 _c
159 468 153 455 143 445 _c
132 434 119 429 105 429 _c
89 429 76 434 66 445 _c
55 456 50 469 50 484 _c
50 508 54 532 64 554 _c
73 576 86 595 104 613 _c
122 630 142 643 164 652 _c
186 661 210 666 236 666 _c
274 666 309 658 342 642 _c
375 626 401 603 420 573 _c
439 543 449 509 449 470 _c
}_e{449 441 442 414 430 388 _c
417 362 401 338 381 317 _c
361 295 336 271 305 244 _c
274 217 254 199 244 190 _c
131 81 _l
227 81 _l
274 81 313 81 345 82 _c
377 82 394 84 396 86 _c
404 94 412 125 420 178 _c
449 178 _l
421 0 _l
50 0 _l
_cl}_e}_d
/four{{500 0 28 0 471 666 _sc
28 165 _m
28 200 _l
337 661 _l
339 664 342 666 347 666 _c
362 666 _l
369 666 373 662 373 655 _c
373 200 _l
471 200 _l
471 165 _l
373 165 _l
373 67 _l
373 53 382 44 402 40 _c
422 36 444 35 470 35 _c
470 0 _l
195 0 _l
195 35 _l
220 35 242 36 262 40 _c
282 44 292 53 292 67 _c
292 165 _l
28 165 _l
61 200 _m
298 200 _l
}_e{298 554 _l
61 200 _l
_cl}_e}_d
/parenright{{388 0 56 -249 291 750 _sc
65 -249 _m
59 -249 56 -246 56 -240 _c
56 -237 56 -235 58 -234 _c
172 -122 229 38 229 250 _c
229 462 172 623 60 733 _c
57 734 56 737 56 741 _c
56 743 57 745 59 747 _c
61 749 63 750 65 750 _c
74 750 _l
76 750 77 749 79 748 _c
127 710 167 664 199 610 _c
231 556 254 498 269 437 _c
283 376 291 314 291 250 _c
291 202 287 156 279 110 _c
}_e{271 64 258 20 241 -24 _c
223 -68 201 -108 175 -146 _c
148 -184 116 -217 79 -247 _c
77 -248 76 -249 74 -249 _c
65 -249 _l
_cl}_e}_d
/six{{500 0 42 -21 457 666 _sc
250 -21 _m
208 -21 174 -10 146 11 _c
118 33 97 61 82 96 _c
67 131 57 168 51 206 _c
45 244 42 283 42 323 _c
42 375 52 428 73 482 _c
93 535 123 579 163 614 _c
203 648 250 666 305 666 _c
327 666 348 661 368 653 _c
388 644 403 631 415 615 _c
426 598 432 578 432 554 _c
432 540 427 529 418 520 _c
408 510 397 506 384 506 _c
}_e{370 506 359 510 350 520 _c
340 529 336 540 336 554 _c
336 567 340 578 350 588 _c
359 597 370 602 384 602 _c
389 602 _l
380 614 368 622 353 628 _c
337 634 321 637 305 637 _c
285 637 266 632 249 624 _c
232 615 217 603 203 588 _c
189 573 178 557 169 539 _c
159 521 152 500 147 477 _c
142 453 139 432 138 412 _c
136 392 136 366 136 336 _c
148 363 164 385 186 403 _c
}_e{207 420 231 429 259 429 _c
288 429 315 423 339 411 _c
363 399 384 382 402 361 _c
420 339 433 315 443 288 _c
452 260 457 233 457 205 _c
457 165 448 128 431 93 _c
413 58 389 30 357 10 _c
325 -10 290 -21 250 -21 _c
250 10 _m
276 10 296 15 312 27 _c
327 39 338 54 346 74 _c
353 93 358 112 360 132 _c
362 152 363 176 363 205 _c
363 243 361 275 357 302 _c
}_e{353 328 344 352 328 372 _c
312 392 287 403 255 403 _c
227 403 205 393 188 375 _c
170 357 158 334 150 306 _c
142 278 138 252 138 226 _c
138 217 138 210 139 206 _c
139 205 139 204 139 204 _c
139 203 138 202 138 201 _c
138 172 141 143 147 114 _c
153 84 164 60 181 40 _c
197 20 220 10 250 10 _c
_cl}_e}_d
/one{500 0 87 0 421 666 _sc
93 0 _m
93 35 _l
176 35 218 45 218 67 _c
218 592 _l
183 575 139 567 87 567 _c
87 602 _l
168 602 230 623 272 666 _c
286 666 _l
288 666 291 665 293 663 _c
295 661 296 659 296 657 _c
296 67 _l
296 45 337 35 421 35 _c
421 0 _l
93 0 _l
_cl}_d
/parenleft{{388 0 97 -249 332 750 _sc
310 -247 _m
272 -217 240 -184 214 -146 _c
187 -108 165 -67 148 -25 _c
131 17 118 62 110 109 _c
101 155 97 202 97 250 _c
97 298 101 345 110 392 _c
118 438 131 483 149 527 _c
166 570 188 611 215 649 _c
242 687 274 720 310 748 _c
310 749 311 750 315 750 _c
324 750 _l
326 750 327 749 329 747 _c
331 745 332 743 332 741 _c
332 738 331 736 330 735 _c
}_e{297 703 270 668 248 632 _c
226 596 209 557 196 516 _c
183 474 174 432 168 388 _c
162 344 159 298 159 250 _c
159 38 215 -122 329 -232 _c
331 -234 332 -236 332 -240 _c
332 -242 331 -244 329 -246 _c
327 -248 326 -249 324 -249 _c
315 -249 _l
311 -249 310 -248 310 -247 _c
_cl}_e}_d
end readonly def

/BuildGlyph
 {exch begin
 CharStrings exch
 2 copy known not{pop /.notdef}if
 true 3 1 roll get exec
 end}_d

/BuildChar {
 1 index /Encoding get exch get
 1 index /BuildGlyph get exec
}_d

FontName currentdict end definefont pop
%!PS-Adobe-3.0 Resource-Font
%%Title: cmsy10
%%Copyright: Copyright (C) 1994, Basil K. Malyshev. All Rights Reserved.012BaKoMa Fonts Collection, Level-B.
%%Creator: Converted from TrueType to type 3 by PPR
25 dict begin
/_d{bind def}bind def
/_m{moveto}_d
/_l{lineto}_d
/_cl{closepath eofill}_d
/_c{curveto}_d
/_sc{7 -1 roll{setcachedevice}{pop pop pop pop pop pop}ifelse}_d
/_e{exec}_d
/FontName /Cmsy10 def
/PaintType 0 def
/FontMatrix[.001 0 0 .001 0 0]def
/FontBBox[-29 -960 1123 779]def
/FontType 3 def
/Encoding [ /minus ] def
/FontInfo 10 dict dup begin
/FamilyName (cmsy10) def
/FullName (cmsy10) def
/Notice (Copyright (C) 1994, Basil K. Malyshev. All Rights Reserved.012BaKoMa Fonts Collection, Level-B. ) def
/Weight (Regular) def
/Version (1.1/12-Nov-94) def
/ItalicAngle 0.0 def
/isFixedPitch false def
/UnderlinePosition -133 def
/UnderlineThickness 20 def
end readonly def
/CharStrings 1 dict dup begin
/minus{777 0 83 230 694 270 _sc
102 230 _m
96 230 92 232 88 236 _c
84 240 83 245 83 250 _c
83 254 84 259 88 263 _c
92 267 96 270 102 270 _c
676 270 _l
681 270 685 267 689 263 _c
692 259 694 254 694 250 _c
694 245 692 240 689 236 _c
685 232 681 230 676 230 _c
102 230 _l
_cl}_d
end readonly def

/BuildGlyph
 {exch begin
 CharStrings exch
 2 copy known not{pop /.notdef}if
 true 3 1 roll get exec
 end}_d

/BuildChar {
 1 index /Encoding get exch get
 1 index /BuildGlyph get exec
}_d

FontName currentdict end definefont pop
%!PS-Adobe-3.0 Resource-Font
%%Title: cmmi10
%%Copyright: Copyright (C) 1994, Basil K. Malyshev. All Rights Reserved.012BaKoMa Fonts Collection, Level-B.
%%Creator: Converted from TrueType to type 3 by PPR
25 dict begin
/_d{bind def}bind def
/_m{moveto}_d
/_l{lineto}_d
/_cl{closepath eofill}_d
/_c{curveto}_d
/_sc{7 -1 roll{setcachedevice}{pop pop pop pop pop pop}ifelse}_d
/_e{exec}_d
/FontName /Cmmi10 def
/PaintType 0 def
/FontMatrix[.001 0 0 .001 0 0]def
/FontBBox[-34 -250 1048 750]def
/FontType 3 def
/Encoding [ /pi /t /f ] def
/FontInfo 10 dict dup begin
/FamilyName (cmmi10) def
/FullName (cmmi10) def
/Notice (Copyright (C) 1994, Basil K. Malyshev. All Rights Reserved.012BaKoMa Fonts Collection, Level-B. ) def
/Weight (Regular) def
/Version (1.1/12-Nov-94) def
/ItalicAngle 0.0 def
/isFixedPitch false def
/UnderlinePosition -133 def
/UnderlineThickness 20 def
end readonly def
/CharStrings 3 dict dup begin
/pi{{570 0 24 -10 568 431 _sc
101 17 _m
101 20 102 25 105 33 _c
123 71 141 109 157 147 _c
173 184 187 220 200 256 _c
213 291 225 329 236 369 _c
172 369 _l
147 369 124 361 103 346 _c
82 330 65 311 51 288 _c
49 285 47 284 45 284 _c
33 284 _l
27 284 24 287 24 294 _c
24 295 24 297 26 300 _c
48 336 71 367 96 393 _c
120 418 148 431 180 431 _c
543 431 _l
}_e{549 431 555 428 560 424 _c
565 419 568 413 568 406 _c
568 396 564 387 557 380 _c
550 372 542 369 532 369 _c
405 369 _l
394 317 388 266 387 216 _c
387 152 398 94 421 42 _c
423 38 424 34 424 30 _c
424 22 421 15 417 9 _c
413 3 407 -1 401 -5 _c
394 -8 387 -10 380 -10 _c
362 -10 350 4 344 32 _c
337 60 334 88 334 115 _c
334 153 337 189 344 225 _c
}_e{350 260 361 308 375 369 _c
266 369 _l
213 155 181 38 171 16 _c
161 -1 148 -10 132 -10 _c
124 -10 116 -7 110 -2 _c
104 2 101 9 101 17 _c
_cl}_e}_d
/t{{361 0 22 -10 330 626 _sc
62 81 _m
62 91 63 100 65 109 _c
137 396 _l
32 396 _l
25 396 22 400 22 409 _c
24 423 29 431 35 431 _c
146 431 _l
186 594 _l
188 602 193 610 201 616 _c
209 622 218 626 228 626 _c
236 626 243 623 249 618 _c
255 613 258 606 258 598 _c
258 596 257 594 257 593 _c
257 592 257 591 257 590 _c
217 431 _l
320 431 _l
326 431 330 426 330 418 _c
}_e{330 416 329 414 328 410 _c
327 406 326 402 324 400 _c
322 397 320 396 317 396 _c
208 396 _l
136 107 _l
131 88 129 72 129 58 _c
129 29 138 15 158 15 _c
187 15 213 28 236 56 _c
258 84 276 114 288 147 _c
290 151 293 153 296 153 _c
308 153 _l
310 153 312 152 314 150 _c
316 148 317 146 317 144 _c
317 142 316 141 316 141 _c
301 101 280 65 252 35 _c
}_e{224 5 192 -10 156 -10 _c
129 -10 107 -1 89 15 _c
71 32 62 54 62 81 _c
_cl}_e}_d
/f{{489 0 53 -204 552 705 _sc
97 -164 _m
109 -173 124 -178 142 -178 _c
166 -178 185 -151 200 -99 _c
206 -73 223 9 251 151 _c
297 396 _l
211 396 _l
204 396 201 400 201 409 _c
203 423 208 431 214 431 _c
303 431 _l
315 496 _l
319 516 322 533 326 548 _c
329 562 332 576 336 588 _c
340 600 345 614 353 630 _c
364 652 379 670 399 684 _c
418 698 439 705 462 705 _c
476 705 490 702 504 697 _c
}_e{518 691 529 683 538 673 _c
547 662 552 649 552 635 _c
552 617 546 602 535 590 _c
523 578 510 572 494 572 _c
483 572 474 575 466 582 _c
458 588 455 597 455 608 _c
455 622 460 635 470 646 _c
480 657 492 663 507 665 _c
494 674 479 679 461 679 _c
451 679 441 674 432 665 _c
423 655 417 645 415 635 _c
411 617 401 571 387 497 _c
375 431 _l
478 431 _l
484 431 488 426 488 418 _c
}_e{487 416 486 413 485 409 _c
484 405 483 401 481 399 _c
479 397 477 396 475 396 _c
368 396 _l
322 152 _l
316 116 309 80 301 44 _c
293 8 283 -29 269 -68 _c
255 -106 238 -139 216 -165 _c
194 -191 169 -204 140 -204 _c
117 -204 97 -197 79 -185 _c
61 -172 53 -155 53 -134 _c
53 -116 58 -101 69 -89 _c
80 -77 94 -71 111 -71 _c
121 -71 130 -74 138 -81 _c
146 -87 150 -96 150 -107 _c
}_e{150 -121 144 -134 134 -146 _c
123 -158 111 -164 97 -164 _c
_cl}_e}_d
end readonly def

/BuildGlyph
 {exch begin
 CharStrings exch
 2 copy known not{pop /.notdef}if
 true 3 1 roll get exec
 end}_d

/BuildChar {
 1 index /Encoding get exch get
 1 index /BuildGlyph get exec
}_d

FontName currentdict end definefont pop
end
%%EndProlog
mpldict begin
23.946 190.102 translate
564.108 411.796 0 0 clipbox
100000 setmiterlimit
gsave
0 0 m
564.108125 0 l
564.108125 411.796125 l
0 411.796125 l
cl
1.000 setgray
fill
grestore
gsave
7.2 17.211919 m
534.908125 17.211919 l
534.908125 380.596125 l
7.2 380.596125 l
cl
1.000 setgray
fill
grestore
1.000 setlinewidth
1 setlinejoin
2 setlinecap
[] 0 setdash
0.000 setgray
gsave
527.7 363.4 7.2 17.21 clipbox
17.348233 25.234277 m
25.34063 24.446596 l
31.297887 24.202521 l
34.367509 24.23659 l
39.076874 24.521969 l
46.398847 25.49717 l
52.272386 26.624609 l
60.485281 28.330211 l
66.356993 29.325581 l
70.577222 29.78391 l
74.805696 29.958635 l
80.010812 29.738965 l
84.270861 29.209868 l
87.887121 28.549846 l
93.230818 27.334178 l
101.718888 25.340979 l
105.807115 24.628662 l
111.106429 24.203976 l
115.171954 24.377652 l
117.175805 24.644205 l
120.991214 25.495111 l
124.496844 26.664847 l
126.753136 27.598457 l
130.520275 29.423145 l
137.157535 33.14717 l
141.227855 35.475651 l
146.19196 38.006023 l
150.027222 39.505319 l
152.464667 40.17143 l
155.98306 40.662304 l
157.323849 40.689597 l
162.044465 40.042458 l
164.791054 39.134285 l
168.045451 37.589398 l
170.661326 36.029691 l
174.913062 33.063265 l
179.738053 29.467237 l
184.167076 26.525232 l
187.307287 25.007498 l
191.387256 24.200076 l
193.785807 24.546214 l
196.975701 26.182633 l
199.538837 28.625026 l
201.161929 30.75079 l
202.990184 33.723566 l
206.517004 41.308717 l
207.380032 43.553816 l
209.344337 49.254351 l
211.308642 55.789431 l
213.439926 63.834515 l
215.923025 74.457919 l
218.799498 88.411404 l
220.530929 97.630254 l
222.702168 110.012762 l
224.873407 123.246088 l
227.011775 137.030158 l
231.472956 167.76242 l
238.358855 218.320113 l
243.707966 257.641525 l
246.214518 275.337947 l
249.783154 299.083863 l
252.4457 315.325563 l
254.824923 328.525683 l
257.218488 340.367998 l
258.457937 345.879339 l
260.621189 354.406674 l
262.78444 361.463862 l
264.489781 365.937284 l
266.202349 369.426945 l
267.914917 371.886512 l
270.389665 373.586384 l
271.621644 373.607967 l
274.331894 371.726138 l
276.552882 368.228223 l
278.527553 363.674379 l
280.502223 357.806664 l
282.606888 350.169694 l
284.268612 343.184581 l
285.913799 335.488194 l
287.558986 327.065345 l
289.478551 316.392537 l
291.398116 304.898499 l
294.446744 285.201841 l
299.351128 250.767942 l
311.163841 164.004381 l
315.660882 133.32376 l
317.963856 118.712048 l
322.082022 94.88068 l
325.68497 76.75863 l
328.031547 66.430562 l
330.071578 58.425194 l
332.111609 51.330906 l
334.099516 45.28813 l
335.915506 40.505203 l
339.092664 33.769119 l
342.066932 29.233056 l
344.101102 27.036396 l
345.105234 26.202995 l
347.814715 24.711532 l
350.684969 24.200295 l
354.886173 25.03993 l
357.606622 26.335329 l
359.06565 27.203956 l
363.421408 30.240773 l
369.649597 34.827202 l
373.619706 37.343484 l
376.907672 38.966806 l
379.232332 39.807948 l
382.240816 40.486069 l
384.980592 40.69133 l
386.901701 40.605126 l
389.667755 40.166039 l
392.343176 39.419291 l
393.804825 38.893091 l
396.017098 37.960244 l
398.892935 36.548229 l
414.614225 27.932857 l
416.993213 26.9073 l
421.665968 25.34499 l
425.320525 24.582919 l
429.38706 24.216102 l
433.188431 24.29843 l
435.699739 24.548651 l
439.51175 25.166465 l
448.762445 27.306229 l
453.730983 28.448203 l
457.440744 29.146099 l
462.467406 29.770556 l
465.352557 29.933376 l
469.166676 29.919436 l
471.323597 29.799493 l
475.234847 29.395123 l
481.205711 28.410898 l
496.853423 25.307294 l
502.26044 24.595537 l
507.478979 24.244977 l
511.864362 24.217353 l
515.886572 24.387563 l
524.759892 25.234277 l
524.759892 25.234277 l
stroke
grestore
0.800 setlinewidth
0 setlinejoin
gsave
7.2 24.2 m
534.908125 24.2 l
stroke
grestore
gsave
271.054063 17.211919 m
271.054063 380.596125 l
stroke
grestore
0.500 setlinewidth
1 setlinejoin
0 setlinecap
gsave
/o {
gsave
newpath
translate
0.5 setlinewidth
1 setlinejoin
0 setlinecap
0 0 m
0 4 l

gsave
0.000 setgray
fill
grestore
stroke
grestore
} bind def
31.942 24.2 o
grestore
gsave
24.441952 11.200000 translate
0.000000 rotate
/Cmsy10 findfont
7.0 scalefont
setfont
0.000000 4.340625 moveto
/minus glyphshow

/Cmr10 findfont
7.0 scalefont
setfont
5.437988 4.340625 moveto
/six glyphshow

/Cmmi10 findfont
7.0 scalefont
setfont
8.937988 4.340625 moveto
/pi glyphshow

0.000000 1.687500 12.926758 0.625000 rectfill
5.000000 -3.323438 moveto
/t glyphshow


grestore
gsave
/o {
gsave
newpath
translate
0.5 setlinewidth
1 setlinejoin
0 setlinecap
0 0 m
0 4 l

gsave
0.000 setgray
fill
grestore
stroke
grestore
} bind def
111.646 24.2 o
grestore
gsave
104.145989 11.200000 translate
0.000000 rotate
/Cmsy10 findfont
7.0 scalefont
setfont
0.000000 4.340625 moveto
/minus glyphshow

/Cmr10 findfont
7.0 scalefont
setfont
5.437988 4.340625 moveto
/four glyphshow

/Cmmi10 findfont
7.0 scalefont
setfont
8.937988 4.340625 moveto
/pi glyphshow

0.000000 1.764062 12.926758 0.625000 rectfill
5.000000 -3.246875 moveto
/t glyphshow


grestore
gsave
/o {
gsave
newpath
translate
0.5 setlinewidth
1 setlinejoin
0 setlinecap
0 0 m
0 4 l

gsave
0.000 setgray
fill
grestore
stroke
grestore
} bind def
191.35 24.2 o
grestore
gsave
183.850026 11.200000 translate
0.000000 rotate
/Cmsy10 findfont
7.0 scalefont
setfont
0.000000 4.340625 moveto
/minus glyphshow

/Cmr10 findfont
7.0 scalefont
setfont
5.437988 4.340625 moveto
/two glyphshow

/Cmmi10 findfont
7.0 scalefont
setfont
8.937988 4.340625 moveto
/pi glyphshow

0.000000 1.764062 12.926758 0.625000 rectfill
5.000000 -3.246875 moveto
/t glyphshow


grestore
gsave
/o {
gsave
newpath
translate
0.5 setlinewidth
1 setlinejoin
0 setlinecap
0 0 m
0 4 l

gsave
0.000 setgray
fill
grestore
stroke
grestore
} bind def
350.758 24.2 o
grestore
gsave
346.258099 11.200000 translate
0.000000 rotate
/Cmr10 findfont
7.0 scalefont
setfont
0.000000 4.340625 moveto
/two glyphshow

/Cmmi10 findfont
7.0 scalefont
setfont
3.500000 4.340625 moveto
/pi glyphshow

0.000000 1.764062 7.488770 0.625000 rectfill
2.000000 -3.246875 moveto
/t glyphshow


grestore
gsave
/o {
gsave
newpath
translate
0.5 setlinewidth
1 setlinejoin
0 setlinecap
0 0 m
0 4 l

gsave
0.000 setgray
fill
grestore
stroke
grestore
} bind def
430.462 24.2 o
grestore
gsave
425.962136 11.200000 translate
0.000000 rotate
/Cmr10 findfont
7.0 scalefont
setfont
0.000000 4.340625 moveto
/four glyphshow

/Cmmi10 findfont
7.0 scalefont
setfont
3.500000 4.340625 moveto
/pi glyphshow

0.000000 1.764062 7.488770 0.625000 rectfill
2.000000 -3.246875 moveto
/t glyphshow


grestore
gsave
/o {
gsave
newpath
translate
0.5 setlinewidth
1 setlinejoin
0 setlinecap
0 0 m
0 4 l

gsave
0.000 setgray
fill
grestore
stroke
grestore
} bind def
510.166 24.2 o
grestore
gsave
505.666173 11.200000 translate
0.000000 rotate
/Cmr10 findfont
7.0 scalefont
setfont
0.000000 4.340625 moveto
/six glyphshow

/Cmmi10 findfont
7.0 scalefont
setfont
3.500000 4.340625 moveto
/pi glyphshow

0.000000 1.687500 7.488770 0.625000 rectfill
2.000000 -3.323438 moveto
/t glyphshow


grestore
gsave
542.908125 24.200000 translate
0.000000 rotate
/Cmr10 findfont
16.0 scalefont
setfont
0.000000 0.546875 moveto
/Delta glyphshow


grestore
gsave
/o {
gsave
newpath
translate
0.5 setlinewidth
1 setlinejoin
0 setlinecap
0 0 m
4 0 l

gsave
0.000 setgray
fill
grestore
stroke
grestore
} bind def
271.054 373.666 o
grestore
gsave
253.054063 371.666265 translate
0.000000 rotate
/Cmr10 findfont
7.0 scalefont
setfont
0.000000 4.264219 moveto
/one glyphshow

0.000000 1.764219 3.500000 0.625000 rectfill
0.000000 -3.520156 moveto
/four glyphshow

/Cmmi10 findfont
10.0 scalefont
setfont
4.750000 0.514219 moveto
/t glyphshow

/Cmr10 findfont
7.0 scalefont
setfont
9.376570 4.340625 moveto
/two glyphshow


grestore
gsave
254.054063 392.596125 translate
0.000000 rotate
/Cmmi10 findfont
16.0 scalefont
setfont
0.000000 0.000000 moveto
/f glyphshow

/Cmr10 findfont
16.0 scalefont
setfont
7.820312 0.000000 moveto
/parenleft glyphshow

14.031250 0.000000 moveto
/Delta glyphshow

27.359375 0.000000 moveto
/parenright glyphshow


grestore

end
showpage
