<?xml version="1.0" encoding="iso-8859-1"?>
<!-- Generator: Adobe Illustrator 19.0.0, SVG Export Plug-In . SVG Version: 6.00 Build 0)  -->
<svg version="1.1" id="Layer_1" xmlns="http://www.w3.org/2000/svg" xmlns:xlink="http://www.w3.org/1999/xlink" x="0px" y="0px"
	 viewBox="0 0 266.229 266.229" style="enable-background:new 0 0 266.229 266.229;" xml:space="preserve">
<g>
	<g>
		<path style="fill:#F59D00;" d="M249.815,65.155l-42.05,42.05c-5.63,5.63-21.1-0.72-34.56-14.18
			c-13.46-13.46-19.81-28.93-14.18-34.56l42.05-42.05c-5.63,5.63,0.72,21.1,14.18,34.56
			C228.715,64.435,244.185,70.785,249.815,65.155z"/>
		<path style="fill:#F59D00;" d="M249.815,65.155c-5.63,5.63-21.1-0.72-34.56-14.18c-13.46-13.46-19.81-28.93-14.18-34.56
			c5.62-5.62,21.09,0.73,34.55,14.19C249.085,44.065,255.435,59.535,249.815,65.155z"/>
	</g>
	<g>
		<path style="fill:#FF7876;" d="M152.465,162.495l-42.04,42.05c-5.63,5.63-21.1-0.72-34.56-14.18s-19.81-28.93-14.18-34.56
			l42.05-42.04c-5.63,5.62,0.72,21.09,14.18,34.55C131.375,161.775,146.845,168.125,152.465,162.495z"/>
		<path style="fill:#FF7876;" d="M152.465,162.495c-5.62,5.63-21.09-0.72-34.55-14.18c-13.46-13.46-19.81-28.93-14.18-34.55
			c5.62-5.63,21.09,0.72,34.55,14.18S158.095,156.875,152.465,162.495z"/>
	</g>
	<path style="fill:#30BAA1;" d="M188.981,157.388l-80.139-80.139c-3.775-3.775-3.775-9.896,0-13.671l0,0
		c3.775-3.775,9.896-3.775,13.671,0l80.139,80.139c3.775,3.775,3.775,9.896,0,13.671l0,0
		C198.876,161.163,192.756,161.163,188.981,157.388z"/>
	<g>
		<path style="fill:#30BAA1;" d="M100.946,245.423l-80.139-80.139c-3.775-3.775-3.775-9.896,0-13.671l0,0
			c3.775-3.775,9.896-3.775,13.671,0l80.139,80.139c3.775,3.775,3.775,9.896,0,13.671l0,0
			C110.841,249.198,104.721,249.198,100.946,245.423z"/>
		<path style="fill:#414042;" d="M264.033,2.197c-2.929-2.929-7.678-2.929-10.607,0L235.403,20.22
			c-11.073-9.345-29.407-19.33-39.632-9.109c-0.005,0.006-0.011,0.011-0.017,0.017l-42.033,42.033
			c-10.225,10.225-0.264,28.548,9.098,39.642l-0.238,0.238l-34.766-34.766c-6.692-6.693-17.583-6.693-24.277,0
			c-6.708,6.708-6.711,17.568,0,24.277l34.766,34.766l-0.242,0.242c-11.117-9.382-29.435-19.311-39.627-9.104
			c-0.003,0.003-0.005,0.006-0.008,0.008L56.38,150.5c-1.555,1.555-3.436,4.241-4.042,8.368L39.779,146.31
			c-6.708-6.71-17.567-6.711-24.278-0.001c-6.693,6.693-6.693,17.583,0,24.277l34.766,34.766l-48.07,48.074
			c-2.929,2.929-2.929,7.678,0,10.606c2.929,2.929,7.678,2.929,10.606,0l48.073-48.073l34.766,34.766
			c6.693,6.693,17.583,6.694,24.277,0c6.708-6.708,6.711-17.568,0-24.277l-12.567-12.567c4.126-0.606,6.822-2.479,8.377-4.034
			l42.033-42.043c0.002-0.002,0.004-0.004,0.006-0.006c0.001-0.001,0.002-0.002,0.003-0.003s0.001-0.001,0.001-0.001
			c0.003-0.003,0.005-0.005,0.007-0.008c10.196-10.213,0.267-28.509-9.11-39.62l0.242-0.242l34.766,34.766l0,0
			c6.709,6.709,17.567,6.71,24.277,0c6.693-6.693,6.693-17.583,0-24.277l-34.766-34.766l0.238-0.238
			c5.651,4.769,11.576,8.516,17.147,10.803c7.707,3.162,16.615,4.176,22.494-1.705l42.034-42.033
			c0.005-0.006,0.011-0.011,0.017-0.017c0,0,0,0,0.001,0c10.221-10.222,0.24-28.553-9.11-39.631l18.024-18.024
			C266.962,9.875,266.962,5.125,264.033,2.197z M106.249,240.12l-40.065-40.065c-0.002-0.002-0.003-0.003-0.005-0.005
			s-0.003-0.003-0.005-0.005L26.11,159.98c-2.025-2.025,1.048-5.08,3.065-3.064l80.139,80.139
			C111.335,239.077,108.271,242.141,106.249,240.12z M105.312,199.052c-2.407,0.644-12.577-2.423-24.144-13.99
			s-14.638-21.741-13.99-24.144l29.675-29.668c6.33,15.114,22.937,31.765,38.126,38.126L105.312,199.052z M147.031,157.047
			c-6.434,0.777-18.48-8.703-23.813-14.036c-5.59-5.59-14.804-17.532-14.036-23.813c2.409-0.263,9.548,1.956,18.226,9.017
			l-0.082,0.082c-2.929,2.929-2.929,7.678,0,10.606c2.929,2.929,7.678,2.929,10.606,0l0.082-0.083
			C145.076,147.501,147.295,154.644,147.031,157.047z M194.284,152.085L194.284,152.085l-80.14-80.14
			c-2.03-2.03,1.043-5.085,3.064-3.064l40.065,40.065c0.002,0.002,0.003,0.003,0.005,0.005s0.003,0.003,0.005,0.005l40.065,40.065
			C199.373,151.045,196.301,154.102,194.284,152.085z M202.651,101.711c-2.403,0.645-12.555-2.418-24.107-13.955
			c-0.012-0.012-0.022-0.025-0.033-0.037c-0.012-0.012-0.025-0.022-0.037-0.033c-11.538-11.553-14.603-21.708-13.955-24.107
			l29.673-29.674c6.353,15.175,23.001,31.798,38.133,38.133L202.651,101.711z M244.376,59.708
			c-6.625,0.812-18.927-9.146-23.818-14.037c-5.668-5.668-14.793-17.564-14.036-23.818c2.414-0.26,9.554,1.965,18.227,9.022
			l-0.081,0.081c-2.929,2.929-2.929,7.678,0,10.606c2.929,2.929,7.678,2.929,10.607,0l0.081-0.081
			C242.411,50.156,244.635,57.298,244.376,59.708z"/>
	</g>
</g>
<g>
</g>
<g>
</g>
<g>
</g>
<g>
</g>
<g>
</g>
<g>
</g>
<g>
</g>
<g>
</g>
<g>
</g>
<g>
</g>
<g>
</g>
<g>
</g>
<g>
</g>
<g>
</g>
<g>
</g>
</svg>
