<?xml version="1.0" encoding="UTF-8" standalone="no"?>
<!-- Generator: Adobe Illustrator 19.0.0, SVG Export Plug-In . SVG Version: 6.00 Build 0)  -->

<svg
   xmlns:dc="http://purl.org/dc/elements/1.1/"
   xmlns:cc="http://creativecommons.org/ns#"
   xmlns:rdf="http://www.w3.org/1999/02/22-rdf-syntax-ns#"
   xmlns:svg="http://www.w3.org/2000/svg"
   xmlns="http://www.w3.org/2000/svg"
   xmlns:sodipodi="http://sodipodi.sourceforge.net/DTD/sodipodi-0.dtd"
   xmlns:inkscape="http://www.inkscape.org/namespaces/inkscape"
   version="1.1"
   id="Layer_1"
   x="0px"
   y="0px"
   viewBox="0 0 418.135 418.135"
   style="enable-background:new 0 0 418.135 418.135;"
   xml:space="preserve"
   inkscape:version="0.91 r13725"
   sodipodi:docname="whatsapp.svg"><metadata
     id="metadata43"><rdf:RDF><cc:Work
         rdf:about=""><dc:format>image/svg+xml</dc:format><dc:type
           rdf:resource="http://purl.org/dc/dcmitype/StillImage" /></cc:Work></rdf:RDF></metadata><defs
     id="defs41" /><sodipodi:namedview
     pagecolor="#ffffff"
     bordercolor="#666666"
     borderopacity="1"
     objecttolerance="10"
     gridtolerance="10"
     guidetolerance="10"
     inkscape:pageopacity="0"
     inkscape:pageshadow="2"
     inkscape:window-width="1920"
     inkscape:window-height="1006"
     id="namedview39"
     showgrid="false"
     inkscape:zoom="0.564411"
     inkscape:cx="-75.299737"
     inkscape:cy="209.0675"
     inkscape:window-x="0"
     inkscape:window-y="0"
     inkscape:window-maximized="1"
     inkscape:current-layer="g3" /><g
     id="g3"><path
       style="fill:#7AD06D;"
       d="M198.929,0.242C88.5,5.5,1.356,97.466,1.691,208.02c0.102,33.672,8.231,65.454,22.571,93.536   L2.245,408.429c-1.191,5.781,4.023,10.843,9.766,9.483l104.723-24.811c26.905,13.402,57.125,21.143,89.108,21.631   c112.869,1.724,206.982-87.897,210.5-200.724C420.113,93.065,320.295-5.538,198.929,0.242z M323.886,322.197   c-30.669,30.669-71.446,47.559-114.818,47.559c-25.396,0-49.71-5.698-72.269-16.935l-14.584-7.265l-64.206,15.212l13.515-65.607   l-7.185-14.07c-11.711-22.935-17.649-47.736-17.649-73.713c0-43.373,16.89-84.149,47.559-114.819   c30.395-30.395,71.837-47.56,114.822-47.56C252.443,45,293.218,61.89,323.887,92.558c30.669,30.669,47.559,71.445,47.56,114.817   C371.446,250.361,354.281,291.803,323.886,322.197z"
       id="path5" /><path
       style="fill:#7AD06D;"
       d="M309.712,252.351l-40.169-11.534c-5.281-1.516-10.968-0.018-14.816,3.903l-9.823,10.008   c-4.142,4.22-10.427,5.576-15.909,3.358c-19.002-7.69-58.974-43.23-69.182-61.007c-2.945-5.128-2.458-11.539,1.158-16.218   l8.576-11.095c3.36-4.347,4.069-10.185,1.847-15.21l-16.9-38.223c-4.048-9.155-15.747-11.82-23.39-5.356   c-11.211,9.482-24.513,23.891-26.13,39.854c-2.851,28.144,9.219,63.622,54.862,106.222c52.73,49.215,94.956,55.717,122.449,49.057   c15.594-3.777,28.056-18.919,35.921-31.317C323.568,266.34,319.334,255.114,309.712,252.351z"
       id="path7" /><path
       style="opacity:1;fill:#1e88e5;fill-opacity:1;fill-rule:nonzero;stroke:#000000;stroke-width:0;stroke-miterlimit:4;stroke-dasharray:none;stroke-dashoffset:0;stroke-opacity:1"
       d="M 4.3210134,414.4972 C 2.6204758,412.44818 4.5179847,400.63514 13.614093,356.6426 L 25.044025,301.36276 20.159591,290.56172 C -8.4063168,227.39335 -1.8305046,152.05293 37.394145,93.10192 94.833103,6.776493 205.96854,-23.422256 299.36766,21.916052 359.7406,51.222618 401.54449,107.45445 412.74185,174.41955 c 3.88305,23.22233 2.6966,59.27198 -2.66793,81.06344 -17.0134,69.11082 -68.99031,125.43643 -136.68951,148.12578 -23.20856,7.77834 -43.61616,10.42905 -72.46699,9.41263 -28.26178,-0.99566 -48.57824,-5.30201 -71.91318,-15.24294 l -12.55927,-5.35039 -51.911986,12.32194 c -28.551591,6.77707 -53.298689,12.32194 -54.9935518,12.32194 -1.6948626,0 -4.043151,-1.15864 -5.2184188,-2.57475 z M 228.37967,369.1071 c 35.02248,-4.14919 68.81913,-20.37324 94.05292,-45.15002 32.81527,-32.22097 49.1776,-71.15836 49.09803,-116.83851 -0.0918,-52.71176 -23.93348,-99.97334 -66.07945,-130.989985 -28.65573,-21.088724 -59.56955,-31.125919 -95.86548,-31.125919 -43.85177,0 -81.13618,14.687705 -111.923396,44.090751 -34.828055,33.262213 -50.887869,70.519063 -50.887869,118.053763 0,28.82437 3.62994,44.76657 16.464817,72.31123 l 7.289376,15.64358 -5.69185,28.65038 c -3.130517,15.75772 -6.176326,30.4443 -6.768463,32.63686 -1.451974,5.37633 -0.146613,5.26166 34.415884,-3.02316 l 28.878061,-6.92224 15.4159,7.09081 c 17.26949,7.94339 35.65609,13.43423 52.17933,15.58247 16.1081,2.09428 21.67233,2.09288 39.42219,-0.0106 l 0,6.2e-4 z"
       id="path3371"
       inkscape:connector-curvature="0" /><path
       style="opacity:1;fill:#997177;fill-opacity:0.0627451;fill-rule:nonzero;stroke:#000000;stroke-width:0;stroke-miterlimit:4;stroke-dasharray:none;stroke-dashoffset:0;stroke-opacity:1"
       d="m 240.48535,304.52245 c -28.48662,-7.67682 -57.28329,-25.78023 -85.56991,-53.79468 -30.95557,-30.6577 -46.71073,-58.22498 -49.04263,-85.8114 -1.59936,-18.92037 1.98902,-28.40156 16.61871,-43.9098 10.24602,-10.86132 12.26215,-12.2206 18.12611,-12.2206 8.67394,0 10.68213,2.46357 21.24839,26.06671 12.11957,27.07299 12.05768,26.57667 4.60497,36.92754 -9.20846,12.7894 -10.31916,16.12277 -7.875,23.63419 2.80703,8.62662 37.19326,42.64348 55.31511,54.72091 18.3835,12.25181 22.58214,12.2978 35.72967,0.39133 12.0072,-10.87377 13.70845,-10.97755 42.36257,-2.58433 22.75087,6.66408 27.6219,9.91286 27.6219,18.42268 0,11.55341 -20.89171,33.71721 -36.01551,38.20849 -10.99228,3.26436 -30.90928,3.24078 -43.12438,-0.051 l 0,-2e-5 z"
       id="path3373"
       inkscape:connector-curvature="0" /><path
       style="opacity:1;fill:#997177;fill-opacity:0.0627451;fill-rule:nonzero;stroke:#000000;stroke-width:0;stroke-miterlimit:4;stroke-dasharray:none;stroke-dashoffset:0;stroke-opacity:1"
       d="M 3.9938424,415.40625 C 1.011962,412.1113 1.3582621,409.67476 12.345949,356.64119 l 11.46297,-55.32761 -5.000397,-10.77645 C -11.199662,225.86587 -1.8562576,143.02956 42.099395,84.046005 111.4756,-9.0490777 242.02205,-27.883335 334.56658,41.85105 c 90.5814,68.25515 108.98737,199.02205 40.758,289.56928 -57.29956,76.04223 -155.29556,103.63802 -243.50064,68.57003 l -15.58636,-6.19673 -52.837909,12.52504 c -29.060849,6.88878 -53.6157451,12.52504 -54.5664355,12.52504 -0.9506904,0 -3.1284172,-1.54685 -4.8393931,-3.43746 z M 249.12294,364.02324 c 58.34509,-15.14083 103.00191,-60.7836 117.32532,-119.91568 5.26739,-21.74561 5.26739,-52.23237 0,-73.97798 C 348.69519,96.838612 284.35674,46.088921 209.42186,46.268322 c -24.60783,0.05891 -40.9086,3.169536 -62.28977,11.886551 -47.05528,19.184247 -83.033293,61.287417 -95.757441,112.059907 -2.197457,8.76839 -3.006191,19.1715 -2.937755,37.78967 0.11194,30.45237 3.308522,44.81644 15.706207,70.5769 l 7.959336,16.53827 -6.197088,30.08763 c -3.408398,16.54821 -6.197087,31.10437 -6.197087,32.34707 0,1.63583 8.679639,0.19882 31.448714,-5.20669 l 31.448714,-7.46612 10.60735,5.32685 c 16.02672,8.04833 31.60887,13.51074 46.68154,16.36444 18.88376,3.57523 50.04941,2.42747 69.22836,-2.54956 z"
       id="path4175"
       inkscape:connector-curvature="0" /><path
       style="opacity:1;fill:#997177;fill-opacity:0.0627451;fill-rule:nonzero;stroke:#000000;stroke-width:0;stroke-miterlimit:4;stroke-dasharray:none;stroke-dashoffset:0;stroke-opacity:1"
       d="m 4.0147536,415.42936 c -2.9540005,-3.26415 -2.5866328,-5.84863 8.3495424,-58.74048 l 11.439498,-55.32612 -5.070887,-11.1836 C -5.7071409,236.27778 -3.8916186,167.97272 23.414659,114.03849 40.850882,79.599178 71.596765,47.245651 105.96121,27.175734 141.63777,6.3395015 188.10177,-3.7668755 228.31453,0.56269013 278.04819,5.9173398 320.08883,25.692178 354.80937,60.062614 438.79813,143.20452 437.05705,278.04527 350.95652,358.4537 290.85319,414.58357 208.01101,430.28056 131.79802,399.98 l -15.6123,-6.20711 -52.98872,12.53542 c -29.143798,6.89446 -53.687027,12.5354 -54.5405082,12.5354 -0.8534814,0 -2.9422635,-1.53647 -4.6417382,-3.41435 z M 250.1723,363.96082 c 31.14954,-8.22479 64.74371,-29.94697 84.32632,-54.52585 13.46086,-16.89524 25.71335,-41.30753 31.15779,-62.07982 6.08829,-23.2288 6.40926,-54.13773 0.80195,-77.22557 C 348.64882,96.799715 284.35555,46.088923 209.42186,46.268322 c -12.88997,0.03086 -26.31345,1.176216 -34.0931,2.908985 -61.26553,13.64574 -108.60424,59.868703 -123.959115,121.037473 -2.220362,8.84518 -3.016369,19.24669 -2.959765,38.67555 0.06878,23.60638 0.606376,28.31518 4.810615,42.13568 2.603252,8.55761 7.901593,21.86095 11.774088,29.56296 l 7.040901,14.00366 -6.163611,30.53386 c -3.389985,16.79363 -6.163611,31.46838 -6.163611,32.61057 0,1.3854 10.468591,-0.4079 31.448714,-5.38723 l 31.448714,-7.46392 13.28819,6.61018 c 27.06406,13.46294 48.11215,17.98358 78.84325,16.93367 13.88246,-0.4743 26.1802,-2.02523 35.43517,-4.46894 z"
       id="path4177"
       inkscape:connector-curvature="0" /><path
       style="opacity:1;fill:#997177;fill-opacity:0.0627451;fill-rule:nonzero;stroke:#000000;stroke-width:0;stroke-miterlimit:4;stroke-dasharray:none;stroke-dashoffset:0;stroke-opacity:1"
       d="m 3.9397388,414.72687 c -2.489951,-3.80014 -1.8275606,-8.31419 8.6107062,-58.68002 l 11.308163,-54.5632 -4.911841,-10.8615 C -9.2166726,228.3447 -2.9633194,152.4243 35.104966,94.4495 99.329478,-3.3590356 229.19369,-29.628639 325.62464,35.681675 c 62.00829,41.996683 97.20879,116.063295 90.2181,189.831135 -6.86398,72.43101 -50.94239,136.55019 -115.65926,168.24514 -30.85388,15.1106 -55.90539,20.66236 -92.53338,20.50662 -30.66032,-0.1304 -49.25199,-3.6028 -75.48582,-14.09877 l -16.01356,-6.40691 -53.047607,12.5424 c -29.176184,6.89834 -53.8167278,12.54242 -54.7567629,12.54242 -0.9400352,0 -2.9230104,-1.85258 -4.4066113,-4.11684 z M 250.1723,363.96082 c 31.23745,-8.24802 65.64281,-30.4805 84.53558,-54.62631 5.36171,-6.85249 13.50401,-19.7303 18.094,-28.61737 C 380.18072,227.70667 375.44536,161.90981 340.76682,113.49261 331.73887,100.88805 312.46187,81.939 300.08859,73.506439 269.53612,52.684496 228.03425,42.481367 191.35876,46.775479 135.48139,53.317818 88.613618,86.262705 64.073793,136.24823 c -12.582245,25.62896 -15.58101,39.42209 -15.600521,71.75622 -0.01488,24.76125 0.450457,28.99256 4.731919,43.02156 2.611669,8.55761 7.916897,21.86095 11.789392,29.56296 l 7.040901,14.00366 -6.163611,30.53386 c -3.389985,16.79363 -6.163611,31.49321 -6.163611,32.66568 0,1.47361 7.795456,0.23517 25.247559,-4.01099 37.118299,-9.03101 37.472739,-9.04343 51.929139,-1.8186 25.90289,12.94537 47.46164,17.50545 77.85217,16.46718 13.88246,-0.4743 26.1802,-2.02523 35.43517,-4.46894 z"
       id="path4179"
       inkscape:connector-curvature="0" /><path
       style="opacity:1;fill:#997177;fill-opacity:1;fill-rule:nonzero;stroke:#000000;stroke-width:0;stroke-miterlimit:4;stroke-dasharray:none;stroke-dashoffset:0;stroke-opacity:1"
       d="m 3.9397388,414.72687 c -2.489951,-3.80014 -1.8275606,-8.31419 8.6107062,-58.68002 l 11.308163,-54.5632 -4.911841,-10.8615 C 7.9903793,266.39443 1.2382039,234.46924 1.2857717,207.11857 1.4956376,86.449202 108.51179,-11.358128 227.13065,0.70781009 287.41291,6.8397334 339.34622,35.538829 374.29573,82.033346 422.05355,145.56719 430.04328,226.87106 395.48988,297.70596 347.58573,395.91005 232.96254,440.49446 132.11944,400.14785 L 116.0765,393.7292 62.644821,406.31577 c -29.387422,6.92261 -54.0112653,12.57339 -54.7196513,12.55727 -0.708386,-0.0159 -2.50183,-1.88191 -3.9854309,-4.14617 z M 250.07666,364.02896 c 37.26031,-9.75534 74.53051,-36.59675 94.29967,-67.91313 17.74096,-28.1035 25.73782,-55.33309 25.87678,-88.11138 C 370.44804,162.02937 353.72163,122.44381 320.79725,90.959694 314.11096,84.565876 305.05252,76.897369 300.66742,73.918568 267.5282,51.40709 224.99852,41.561027 186.24906,47.429531 122.28432,57.116828 72.196847,100.63068 53.320688,162.91204 c -4.354407,14.36723 -4.810314,18.52395 -4.848554,44.20653 -0.03841,25.79408 0.386818,29.74997 4.719669,43.90744 2.619033,8.55761 7.942057,21.88435 11.82894,29.61498 l 7.06706,14.05569 -6.18977,30.05211 c -3.404374,16.52866 -6.189771,31.19292 -6.189771,32.58725 0,2.02345 5.811276,1.15961 28.791076,-4.27974 15.835092,-3.74819 30.604882,-6.82384 32.821762,-6.83479 2.21688,-0.0106 9.3925,2.65909 15.94583,5.93343 25.4942,12.738 47.22869,17.30556 77.4702,16.28058 13.71743,-0.46493 26.25629,-2.02842 35.33953,-4.40656 z"
       id="path4181"
       inkscape:connector-curvature="0" /><path
       style="opacity:1;fill:#997177;fill-opacity:0.0627451;fill-rule:nonzero;stroke:#000000;stroke-width:0;stroke-miterlimit:4;stroke-dasharray:none;stroke-dashoffset:0;stroke-opacity:1"
       d="m 240.08824,304.48226 c -24.85799,-6.02817 -53.59811,-23.66362 -80.95474,-49.67525 -36.46074,-34.66813 -53.38866,-65.24157 -53.34221,-96.3411 0.0227,-15.16971 5.3321,-26.60418 18.43955,-39.71163 8.16301,-8.16301 11.04884,-9.96831 15.93467,-9.96831 3.28149,0 7.57772,1.39526 9.54718,3.10058 4.51924,3.91314 21.61636,42.76438 21.61636,49.1207 0,2.7079 -3.04456,8.99902 -7.08704,14.64427 -4.147,5.79122 -7.08703,11.91629 -7.08703,14.76467 0,14.75605 60.84402,68.96926 77.40488,68.96926 4.86578,0 7.95038,-1.76904 15.44675,-8.8588 11.42685,-10.80703 12.71565,-10.89365 40.97946,-2.75428 31.71637,9.13363 35.51563,15.82497 20.23276,35.63439 -7.9066,10.24843 -17.51414,17.61255 -27.73391,21.25785 -8.5957,3.06603 -30.37904,2.9745 -43.39668,-0.18235 z"
       id="path4183"
       inkscape:connector-curvature="0" /><path
       style="opacity:1;fill:#997177;fill-opacity:1;fill-rule:nonzero;stroke:#000000;stroke-width:0;stroke-miterlimit:4;stroke-dasharray:none;stroke-dashoffset:0;stroke-opacity:1"
       d="m 240.08824,304.48226 c -24.73956,-5.99945 -53.85908,-23.91177 -81.31955,-50.02213 -36.10731,-34.33208 -52.99471,-64.95208 -52.99471,-96.08929 0,-14.85633 5.63606,-26.79575 18.91962,-40.07932 7.72923,-7.72922 10.6205,-9.50555 15.47191,-9.50555 3.28149,0 7.57772,1.39526 9.54718,3.10058 4.51924,3.91314 21.61636,42.76438 21.61636,49.1207 0,2.7079 -3.04456,8.99902 -7.08704,14.64427 -4.147,5.79122 -7.08703,11.91629 -7.08703,14.76467 0,14.6763 60.83527,68.96926 77.28007,68.96926 4.66062,0 8.08141,-1.92563 15.73725,-8.8588 6.79379,-6.15248 11.28427,-8.85879 14.69909,-8.85879 2.70429,0 14.4559,2.74703 26.11468,6.10451 31.72738,9.1368 35.33601,15.42662 20.28658,35.35944 -7.89536,10.45733 -17.41213,17.83192 -27.78773,21.5328 -8.5957,3.06603 -30.37904,2.9745 -43.39668,-0.18235 z"
       id="path4185"
       inkscape:connector-curvature="0" /></g><g
     id="g9" /><g
     id="g11" /><g
     id="g13" /><g
     id="g15" /><g
     id="g17" /><g
     id="g19" /><g
     id="g21" /><g
     id="g23" /><g
     id="g25" /><g
     id="g27" /><g
     id="g29" /><g
     id="g31" /><g
     id="g33" /><g
     id="g35" /><g
     id="g37" /></svg>