{
  "projectType": "library",
  "root": "libs/learn-development/feature/approvement-issue",
  "sourceRoot": "libs/learn-development/feature/approvement-issue/src",
  "prefix": "hcm-mfe",
  "targets": {
    "test": {
      "executor": "@nrwl/jest:jest",
      "outputs": ["coverage/libs/learn-development/feature/approvement-issue"],
      "options": {
        "jestConfig": "libs/learn-development/feature/approvement-issue/jest.config.js",
        "passWithNoTests": true
      }
    },
    "lint": {
      "executor": "@nrwl/linter:eslint",
      "options": {
        "lintFilePatterns": [
          "libs/learn-development/feature/approvement-issue/src/**/*.ts",
          "libs/learn-development/feature/approvement-issue/src/**/*.html"
        ]
      }
    }
  },
  "tags": ["scope:learn-development", "type:feature"]
}
