{
  "projectType": "library",
  "root": "libs/goal-management/feature/form-set-of-indicators",
  "sourceRoot": "libs/goal-management/feature/form-set-of-indicators/src",
  "prefix": "hcm-mfe",
  "targets": {
    "test": {
      "executor": "@nrwl/jest:jest",
      "outputs": [
        "coverage/libs/goal-management/feature/form-set-of-indicators"
      ],
      "options": {
        "jestConfig": "libs/goal-management/feature/form-set-of-indicators/jest.config.js",
        "passWithNoTests": true
      }
    },
    "lint": {
      "executor": "@nrwl/linter:eslint",
      "options": {
        "lintFilePatterns": [
          "libs/goal-management/feature/form-set-of-indicators/src/**/*.ts",
          "libs/goal-management/feature/form-set-of-indicators/src/**/*.html"
        ]
      }
    }
  },
  "tags": ["scope:goal-management", "type:feature"]
}
