{
  "projectType": "library",
  "root": "libs/staff-manager/feature/categories/layout-categories",
  "sourceRoot": "libs/staff-manager/feature/categories/layout-categories/src",
  "prefix": "hcm-mfe",
  "targets": {
    "test": {
      "executor": "@nrwl/jest:jest",
      "outputs": [
        "coverage/libs/staff-manager/feature/categories/layout-categories"
      ],
      "options": {
        "jestConfig": "libs/staff-manager/feature/categories/layout-categories/jest.config.js",
        "passWithNoTests": true
      }
    },
    "lint": {
      "executor": "@nrwl/linter:eslint",
      "options": {
        "lintFilePatterns": [
          "libs/staff-manager/feature/categories/layout-categories/src/**/*.ts",
          "libs/staff-manager/feature/categories/layout-categories/src/**/*.html"
        ]
      }
    }
  },
  "tags": ["scope:staff-manager", "type:feature"]
}
