{
  "projectType": "library",
  "root": "libs/staff-abs/feature/timekeeping/timekeeping-saturday-form",
  "sourceRoot": "libs/staff-abs/feature/timekeeping/timekeeping-saturday-form/src",
  "prefix": "hcm-mfe",
  "targets": {
    "test": {
      "executor": "@nrwl/jest:jest",
      "outputs": [
        "coverage/libs/staff-abs/feature/timekeeping/timekeeping-saturday-form"
      ],
      "options": {
        "jestConfig": "libs/staff-abs/feature/timekeeping/timekeeping-saturday-form/jest.config.js",
        "passWithNoTests": true
      }
    },
    "lint": {
      "executor": "@nrwl/linter:eslint",
      "options": {
        "lintFilePatterns": [
          "libs/staff-abs/feature/timekeeping/timekeeping-saturday-form/src/**/*.ts",
          "libs/staff-abs/feature/timekeeping/timekeeping-saturday-form/src/**/*.html"
        ]
      }
    }
  },
  "tags": ["scope:staff-abs", "type:feature"]
}
