{
  "projectType": "library",
  "root": "libs/staff-manager/feature/info/bank-information",
  "sourceRoot": "libs/staff-manager/feature/info/bank-information/src",
  "prefix": "hcm-mfe",
  "targets": {
    "test": {
      "executor": "@nrwl/jest:jest",
      "outputs": ["coverage/libs/staff-manager/feature/info/bank-information"],
      "options": {
        "jestConfig": "libs/staff-manager/feature/info/bank-information/jest.config.js",
        "passWithNoTests": true
      }
    },
    "lint": {
      "executor": "@nrwl/linter:eslint",
      "options": {
        "lintFilePatterns": [
          "libs/staff-manager/feature/info/bank-information/src/**/*.ts",
          "libs/staff-manager/feature/info/bank-information/src/**/*.html"
        ]
      }
    }
  },
  "tags": ["scope:staff-manager", "type:feature"]
}
