<svg width="36" height="36" viewBox="0 0 36 36" fill="none" xmlns="http://www.w3.org/2000/svg">
<mask id="mask0" mask-type="alpha" maskUnits="userSpaceOnUse" x="0" y="0" width="36" height="36">
<path fill-rule="evenodd" clip-rule="evenodd" d="M36 0H0V36H36V0ZM16.82 18.93L17.5 21V33H33V17H19.9336C19.9336 17 19.0801 17.6372 18.5 18C17.8642 18.3976 16.82 18.93 16.82 18.93Z" fill="#C4C4C4"/>
</mask>
<g mask="url(#mask0)">
<path d="M15 3C13.5703 3 12.2461 3.35156 11.0273 4.05469C9.83203 4.75781 8.88281 5.71875 8.17969 6.9375C7.47656 8.13281 7.125 9.44531 7.125 10.875C7.125 12.1875 7.42969 13.418 8.03906 14.5664C8.64844 15.6914 9.48047 16.6172 10.5352 17.3438C8.98828 17.9531 7.61719 18.832 6.42188 19.9805C5.22656 21.1289 4.30078 22.4531 3.64453 23.9531C2.96484 25.5234 2.625 27.1641 2.625 28.875H4.875C4.875 27.2578 5.23828 25.7344 5.96484 24.3047C6.69141 22.8984 7.6875 21.7266 8.95312 20.7891C10.2188 19.8281 11.625 19.207 13.1719 18.9258L13.875 21H16.125L16.8281 18.9258C18.375 19.207 19.7812 19.8281 21.0469 20.7891C22.3125 21.7266 23.3086 22.8984 24.0352 24.3047C24.7617 25.7344 25.125 27.2578 25.125 28.875H27.375C27.375 27.1641 27.0352 25.5234 26.3555 23.9531C25.6992 22.4531 24.7734 21.1289 23.5781 19.9805C22.3828 18.832 21.0117 17.9531 19.4648 17.3438C20.5195 16.6172 21.3516 15.6914 21.9609 14.5664C22.5703 13.418 22.875 12.1875 22.875 10.875C22.875 9.44531 22.5234 8.13281 21.8203 6.9375C21.1172 5.71875 20.1562 4.75781 18.9375 4.05469C17.7422 3.35156 16.4297 3 15 3ZM15 5.25C16.0312 5.25 16.9688 5.50781 17.8125 6.02344C18.6797 6.51562 19.3594 7.19531 19.8516 8.0625C20.3672 8.90625 20.625 9.84375 20.625 10.875C20.625 11.9062 20.3672 12.8555 19.8516 13.7227C19.3594 14.5664 18.6797 15.2461 17.8125 15.7617C16.9688 16.2539 16.0312 16.5 15 16.5C13.9688 16.5 13.0195 16.2539 12.1523 15.7617C11.3086 15.2461 10.6289 14.5664 10.1133 13.7227C9.62109 12.8555 9.375 11.9062 9.375 10.875C9.375 9.84375 9.62109 8.90625 10.1133 8.0625C10.6289 7.19531 11.3086 6.51562 12.1523 6.02344C13.0195 5.50781 13.9688 5.25 15 5.25ZM13.875 22.125L12.75 28.875H17.25L16.125 22.125H13.875Z" fill="#8181A5"/>
</g>
<path d="M24.8164 25.3516C25.0508 25.1172 25.3203 25 25.625 25C25.9297 25 26.1875 25.1172 26.3984 25.3516C26.6328 25.5625 26.75 25.8203 26.75 26.125C26.75 26.4297 26.6328 26.6992 26.3984 26.9336C26.1875 27.1445 25.9297 27.25 25.625 27.25C25.3203 27.25 25.0508 27.1445 24.8164 26.9336C24.6055 26.6992 24.5 26.4297 24.5 26.125C24.5 25.8203 24.6055 25.5625 24.8164 25.3516Z" fill="#8181A5"/>
<path d="M25.5 19C24.6964 19 23.8537 19.2965 23.2328 19.8894C22.6118 20.4823 22.2009 21.2399 22 22.1622H18.2468V32H32.7532V22.1622H28.8695C28.6686 21.2399 28.2577 20.4823 27.6368 19.8894C27.0158 19.2965 26.3036 19 25.5 19ZM25.5 21.1081C25.847 21.1081 26.1483 21.2069 26.404 21.4046C26.678 21.5802 26.888 21.8328 27.0341 22.1622H23.8354C23.9815 21.8328 24.1824 21.5802 24.4381 21.4046C24.7121 21.2069 25.153 21.1081 25.5 21.1081ZM20 24.2703H31V30.009H20L20 26L20 24.2703Z" fill="#8181A5"/>
</svg>
