{
  "projectType": "application",
  "root": "apps/goal-management",
  "sourceRoot": "apps/goal-management/src",
  "prefix": "hcm-mfe",
  "targets": {
    "build": {
      "executor": "@nrwl/angular:webpack-browser",
      "outputs": ["{options.outputPath}"],
      "options": {
        "outputPath": "dist/apps/goal-management",
        "index": "apps/goal-management/src/index.html",
        "main": "apps/goal-management/src/main.ts",
        "polyfills": "apps/goal-management/src/polyfills.ts",
        "tsConfig": "apps/goal-management/tsconfig.app.json",
        "inlineStyleLanguage": "scss",
        "assets": [
          {
            "input": "apps/goal-management/src/assets",
            "glob": "**/*",
            "output": "assets"
          }
        ],
        "styles": [],
        "scripts": [],
        "customWebpackConfig": {
          "path": "apps/goal-management/webpack.config.js"
        }
      },
      "configurations": {
        "production": {
          "budgets": [
            {
              "type": "initial",
              "maximumWarning": "4mb",
              "maximumError": "5mb"
            },
            {
              "type": "anyComponentStyle",
              "maximumWarning": "10kb",
              "maximumError": "20kb"
            }
          ],
          "fileReplacements": [
            {
              "replace": "libs/shared/environment/src/lib/environment.ts",
              "with": "libs/shared/environment/src/lib/environment.prod.ts"
            }
          ],
          "outputHashing": "all",
          "customWebpackConfig": {
            "path": "apps/goal-management/webpack.prod.config.js"
          }
        },
        "uat": {
          "budgets": [
            {
              "type": "initial",
              "maximumWarning": "4mb",
              "maximumError": "5mb"
            },
            {
              "type": "anyComponentStyle",
              "maximumWarning": "10kb",
              "maximumError": "20kb"
            }
          ],
          "fileReplacements": [
            {
              "replace": "libs/shared/environment/src/lib/environment.ts",
              "with": "libs/shared/environment/src/lib/environment.uat.ts"
            }
          ],
          "outputHashing": "all",
          "customWebpackConfig": {
            "path": "apps/goal-management/webpack.prod.config.js"
          }
        },
        "dev": {
          "budgets": [
            {
              "type": "initial",
              "maximumWarning": "4mb",
              "maximumError": "5mb"
            },
            {
              "type": "anyComponentStyle",
              "maximumWarning": "10kb",
              "maximumError": "20kb"
            }
          ],
          "fileReplacements": [
            {
              "replace": "libs/shared/environment/src/lib/environment.ts",
              "with": "libs/shared/environment/src/lib/environment.dev.ts"
            }
          ],
          "outputHashing": "all",
          "customWebpackConfig": {
            "path": "apps/goal-management/webpack.prod.config.js"
          }
        },
        "development": {
          "buildOptimizer": false,
          "optimization": false,
          "vendorChunk": true,
          "extractLicenses": false,
          "sourceMap": true,
          "namedChunks": true
        }
      },
      "defaultConfiguration": "production"
    },
    "serve": {
      "executor": "@nrwl/angular:webpack-server",
      "configurations": {
        "production": {
          "browserTarget": "goal-management:build:production"
        },
        "development": {
          "browserTarget": "goal-management:build:development"
        }
      },
      "defaultConfiguration": "development",
      "options": {
        "port": 4206,
        "publicHost": "http://localhost:4206"
      }
    },
    "extract-i18n": {
      "executor": "@angular-devkit/build-angular:extract-i18n",
      "options": {
        "browserTarget": "goal-management:build"
      }
    },
    "lint": {
      "executor": "@nrwl/linter:eslint",
      "options": {
        "lintFilePatterns": [
          "apps/goal-management/src/**/*.ts",
          "apps/goal-management/src/**/*.html"
        ]
      }
    },
    "test": {
      "executor": "@nrwl/jest:jest",
      "outputs": ["coverage/apps/goal-management"],
      "options": {
        "jestConfig": "apps/goal-management/jest.config.js",
        "passWithNoTests": true
      }
    }
  },
  "tags": []
}
