{
  "projectType": "library",
  "root": "libs/policy-management/feature/detail-salary-evolution",
  "sourceRoot": "libs/policy-management/feature/detail-salary-evolution/src",
  "prefix": "hcm-mfe",
  "targets": {
    "test": {
      "executor": "@nrwl/jest:jest",
      "outputs": [
        "coverage/libs/policy-management/feature/detail-salary-evolution"
      ],
      "options": {
        "jestConfig": "libs/policy-management/feature/detail-salary-evolution/jest.config.js",
        "passWithNoTests": true
      }
    },
    "lint": {
      "executor": "@nrwl/linter:eslint",
      "options": {
        "lintFilePatterns": [
          "libs/policy-management/feature/detail-salary-evolution/src/**/*.ts",
          "libs/policy-management/feature/detail-salary-evolution/src/**/*.html"
        ]
      }
    }
  },
  "tags": ["scope:policy-management", "type:feature"]
}
