<svg width="44" height="37" viewBox="0 0 44 37" fill="none" xmlns="http://www.w3.org/2000/svg">
<path d="M0 0V31H20.5V34H13V37H31V34H23.5V31H44V0H0ZM3 3H41V28H3V3Z" fill="#8181A5"/>
<path d="M8.33301 22V9.11523H10.9346V14.8369L16.1904 9.11523H19.6885L14.8369 14.1338L19.9521 22H16.5859L13.0439 15.9531L10.9346 18.1064V22H8.33301Z" fill="#8181A5"/>
<path d="M21.3057 22V9.11523H25.4805C27.0625 9.11523 28.0938 9.17969 28.5742 9.30859C29.3125 9.50195 29.9307 9.92383 30.4287 10.5742C30.9268 11.2188 31.1758 12.0537 31.1758 13.0791C31.1758 13.8701 31.0322 14.5352 30.7451 15.0742C30.458 15.6133 30.0918 16.0381 29.6465 16.3486C29.207 16.6533 28.7588 16.8555 28.3018 16.9551C27.6807 17.0781 26.7812 17.1396 25.6035 17.1396H23.9072V22H21.3057ZM23.9072 11.2949V14.9512H25.3311C26.3564 14.9512 27.042 14.8838 27.3877 14.749C27.7334 14.6143 28.0029 14.4033 28.1963 14.1162C28.3955 13.8291 28.4951 13.4951 28.4951 13.1143C28.4951 12.6455 28.3574 12.2588 28.082 11.9541C27.8066 11.6494 27.458 11.459 27.0361 11.3828C26.7256 11.3242 26.1016 11.2949 25.1641 11.2949H23.9072Z" fill="#8181A5"/>
<path d="M33.2324 22V9.11523H35.834V22H33.2324Z" fill="#8181A5"/>
</svg>
