<svg width="40" height="40" viewBox="0 0 40 40" fill="none" xmlns="http://www.w3.org/2000/svg">
<path d="M0 8C0 3.58172 3.58172 0 8 0H32C36.4183 0 40 3.58172 40 8V32C40 36.4183 36.4183 40 32 40H8C3.58172 40 0 36.4183 0 32V8Z" fill="#141ED2"/>
<path d="M11.8708 23.4835H11.0966C10.0277 23.4835 9.16113 22.6169 9.16113 21.548C9.16113 20.9067 9.68107 20.3867 10.3224 20.3867H11.8708V23.4835H11.8708Z" fill="white"/>
<path d="M26.5807 8H12.2581L11.8594 8.77419V31.625H30.0645L30.8387 31.2258V12.2581L26.5807 8Z" fill="white"/>
<path d="M12.2586 30.0645V8C11.831 8 11.4844 8.34659 11.4844 8.77419V31.2258C11.4844 31.6534 11.831 32 12.2586 32H30.065C30.4926 32 30.8392 31.6534 30.8392 31.2258H13.4198C12.7785 31.2258 12.2586 30.7059 12.2586 30.0645Z" fill="#DAD8DB"/>
<path d="M30.8382 12.1916C30.8382 11.9863 30.7566 11.7894 30.6114 11.6442L27.1938 8.22673C27.0486 8.08156 26.8517 8 26.6464 8H26.5801V11.871C26.5801 12.0847 26.7534 12.2581 26.9672 12.2581H30.8382V12.1916Z" fill="white"/>
<path d="M22.3226 22.7097H10.3226C10.1868 22.7097 10.0565 22.6864 9.93534 22.6436L9.5625 23.2656V28.1562C9.5625 28.7976 10.0824 29.3175 10.7238 29.3175H22.3226L23.0968 28.9032V23.4839C23.0968 23.0563 22.7502 22.7097 22.3226 22.7097Z" fill="#141ED2"/>
<path d="M9.93532 22.644C9.48532 22.484 9.16113 22.0538 9.16113 21.5488V28.5166C9.16113 29.1579 9.68107 29.6778 10.3224 29.6778H22.3224C22.75 29.6778 23.0966 29.3312 23.0966 28.9037H11.0966C10.4553 28.9037 9.93532 28.3837 9.93532 27.7424V22.644Z" fill="white"/>
<path d="M20.2079 25.7775H19.448V25.0437H20.3069C20.5209 25.0437 20.694 24.8704 20.694 24.6566C20.694 24.4429 20.5208 24.2695 20.3069 24.2695H19.0609C18.8469 24.2695 18.6738 24.4429 18.6738 24.6566V27.7307C18.6738 27.9445 18.847 28.1178 19.0609 28.1178C19.2749 28.1178 19.448 27.9445 19.448 27.7307V26.5517H20.2079C20.4218 26.5517 20.595 26.3783 20.595 26.1646C20.595 25.9508 20.4218 25.7775 20.2079 25.7775Z" fill="white"/>
<path d="M13.1088 24.2578H12.2465C12.1437 24.2578 12.045 24.2988 11.9724 24.3716C11.9002 24.4442 11.8597 24.5425 11.8597 24.6449H11.8594V27.7417C11.8594 27.9555 12.0325 28.1288 12.2465 28.1288C12.4604 28.1288 12.6336 27.9555 12.6336 27.7417V26.7816C12.8072 26.7807 12.9982 26.7798 13.1087 26.7798C13.8134 26.7798 14.3868 26.2141 14.3868 25.5189C14.3869 24.8235 13.8134 24.2578 13.1088 24.2578ZM13.1088 26.0056C12.9991 26.0056 12.8101 26.0063 12.6374 26.0073C12.6367 25.8287 12.6348 25.032 12.6348 25.032H13.1088C13.3822 25.032 13.6127 25.255 13.6127 25.5189C13.6127 25.7828 13.3821 26.0056 13.1088 26.0056Z" fill="white"/>
<path d="M16.3552 24.3037H15.5043C15.4014 24.3037 15.3028 24.3445 15.2302 24.4173C15.1576 24.49 15.1168 24.5887 15.1172 24.6916L15.1194 26.1901C15.1194 26.6079 15.1232 27.6974 15.1232 27.6974C15.1236 27.8001 15.1648 27.8985 15.2378 27.9709C15.31 28.0427 15.4083 28.0832 15.5104 28.0832H15.5119C15.5119 28.0832 16.1428 28.0808 16.387 28.0766C17.2961 28.0605 17.9562 27.2686 17.9562 26.1935C17.9561 25.0631 17.3127 24.3037 16.3552 24.3037ZM16.3733 27.3024C16.2626 27.3042 16.0709 27.306 15.8963 27.3069C15.8952 26.9525 15.8937 26.4456 15.8937 26.19L15.8922 25.0779H16.3553C17.1423 25.0779 17.182 26.0071 17.182 26.1934C17.1819 26.7384 16.9321 27.2926 16.3733 27.3024Z" fill="white"/>
<path d="M17.2776 21.0946C16.9789 21.0946 16.709 20.9392 16.5193 20.6461C16.2373 20.211 16.3114 19.7182 16.7223 19.294C17.1366 18.8661 17.9845 18.4635 19.0048 18.1348C19.3231 17.5349 19.6471 16.8327 19.9499 16.0564C20.1287 15.5977 20.2731 15.1841 20.3888 14.8142C19.8788 13.8794 19.5756 13.009 19.6562 12.4438C19.7382 11.8704 20.1665 11.5475 20.8031 11.5827C20.9921 11.5929 21.4431 11.6916 21.552 12.386C21.6351 12.9169 21.4953 13.7752 21.2148 14.7505C21.7455 15.6459 22.4732 16.6049 23.185 17.3409C24.2609 17.2754 25.1726 17.3538 25.6312 17.6305C25.9903 17.8471 26.1313 18.2004 26.0084 18.5752C25.8073 19.1878 25.3216 19.4684 24.7076 19.3254C24.1909 19.2047 23.5505 18.7536 22.9011 18.1272C21.8566 18.2191 20.6273 18.4317 19.5488 18.7489C18.905 19.9043 18.209 20.8038 17.6246 21.0272C17.5067 21.0725 17.3903 21.0946 17.2776 21.0946ZM17.1687 20.2254C17.2334 20.3248 17.2689 20.3227 17.2856 20.3208C17.532 20.2957 17.9426 19.8702 18.4113 19.151C18.1013 19.2839 17.8235 19.4279 17.5899 19.5825C17.0039 19.9705 17.1283 20.1622 17.1687 20.2254ZM23.9883 18.0761C24.3191 18.3346 24.6264 18.5114 24.8835 18.5715C25.0842 18.6182 25.1874 18.5944 25.2728 18.3341C25.1587 18.1609 24.6729 18.0778 23.9883 18.0761ZM20.9138 15.6892C20.6617 16.4071 20.3532 17.1504 20.0164 17.8471C20.7418 17.6649 21.5066 17.5215 22.2369 17.4304C21.7647 16.8953 21.3085 16.2943 20.9138 15.6892ZM20.7274 12.3411C20.4526 12.3411 20.4383 12.4441 20.4224 12.5529C20.3819 12.8389 20.4825 13.2457 20.6809 13.7146C20.856 12.879 20.8204 12.4369 20.7354 12.3411C20.7327 12.3411 20.7301 12.3411 20.7274 12.3411Z" fill="#141ED2"/>
</svg>
