{
  "projectType": "library",
  "root": "libs/model-organization/ui/search-input",
  "sourceRoot": "libs/model-organization/ui/search-input/src",
  "prefix": "hcm-mfe",
  "targets": {
    "test": {
      "executor": "@nrwl/jest:jest",
      "outputs": ["coverage/libs/model-organization/ui/search-input"],
      "options": {
        "jestConfig": "libs/model-organization/ui/search-input/jest.config.js",
        "passWithNoTests": true
      }
    },
    "lint": {
      "executor": "@nrwl/linter:eslint",
      "options": {
        "lintFilePatterns": [
          "libs/model-organization/ui/search-input/src/**/*.ts",
          "libs/model-organization/ui/search-input/src/**/*.html"
        ]
      }
    }
  },
  "tags": ["scope:model-organization", "type:ui"]
}
