{
  "projectType": "library",
  "root": "libs/partnership/feature/pns-contract/contract-types",
  "sourceRoot": "libs/partnership/feature/pns-contract/contract-types/src",
  "prefix": "hcm-mfe",
  "targets": {
    "test": {
      "executor": "@nrwl/jest:jest",
      "outputs": [
        "coverage/libs/partnership/feature/pns-contract/contract-types"
      ],
      "options": {
        "jestConfig": "libs/partnership/feature/pns-contract/contract-types/jest.config.js",
        "passWithNoTests": true
      }
    },
    "lint": {
      "executor": "@nrwl/linter:eslint",
      "options": {
        "lintFilePatterns": [
          "libs/partnership/feature/pns-contract/contract-types/src/**/*.ts",
          "libs/partnership/feature/pns-contract/contract-types/src/**/*.html"
        ]
      }
    }
  },
  "tags": ["scope:partnership", "type:feature"]
}
