{
  "projectType": "library",
  "root": "libs/system/feature/role-category-list",
  "sourceRoot": "libs/system/feature/role-category-list/src",
  "prefix": "hcm-mfe",
  "targets": {
    "test": {
      "executor": "@nrwl/jest:jest",
      "outputs": ["coverage/libs/system/feature/role-category-list"],
      "options": {
        "jestConfig": "libs/system/feature/role-category-list/jest.config.js",
        "passWithNoTests": true
      }
    },
    "lint": {
      "executor": "@nrwl/linter:eslint",
      "options": {
        "lintFilePatterns": [
          "libs/system/feature/role-category-list/src/**/*.ts",
          "libs/system/feature/role-category-list/src/**/*.html"
        ]
      }
    }
  },
  "tags": ["scope:system", "type:feature"]
}
