{
  "projectType": "library",
  "root": "libs/personal-tax/feature/tax-registers",
  "sourceRoot": "libs/personal-tax/feature/tax-registers/src",
  "prefix": "hcm-mfe",
  "targets": {
    "test": {
      "executor": "@nrwl/jest:jest",
      "outputs": ["coverage/libs/personal-tax/feature/tax-registers"],
      "options": {
        "jestConfig": "libs/personal-tax/feature/tax-registers/jest.config.js",
        "passWithNoTests": true
      }
    },
    "lint": {
      "executor": "@nrwl/linter:eslint",
      "options": {
        "lintFilePatterns": [
          "libs/personal-tax/feature/tax-registers/src/**/*.ts",
          "libs/personal-tax/feature/tax-registers/src/**/*.html"
        ]
      }
    }
  },
  "tags": ["scope:personal-tax", "type:feature"]
}
