{
  "projectType": "library",
  "root": "libs/model-organization/feature/init-line",
  "sourceRoot": "libs/model-organization/feature/init-line/src",
  "prefix": "hcm-mfe",
  "targets": {
    "test": {
      "executor": "@nrwl/jest:jest",
      "outputs": ["coverage/libs/model-organization/feature/init-line"],
      "options": {
        "jestConfig": "libs/model-organization/feature/init-line/jest.config.js",
        "passWithNoTests": true
      }
    },
    "lint": {
      "executor": "@nrwl/linter:eslint",
      "options": {
        "lintFilePatterns": [
          "libs/model-organization/feature/init-line/src/**/*.ts",
          "libs/model-organization/feature/init-line/src/**/*.html"
        ]
      }
    }
  },
  "tags": ["scope:model-organization", "type:feature"]
}
