<svg width="36" height="36" viewBox="0 0 36 36" fill="none" xmlns="http://www.w3.org/2000/svg">
<path d="M4 3V9.75H5.125V24C5.125 24.4142 5.46079 24.75 5.875 24.75H29.125C29.5392 24.75 29.875 24.4142 29.875 24V9.75H31V3H4ZM6.25 5.25H28.75V7.5H6.25V5.25ZM7.375 9.75H27.625V21.75C27.625 22.1642 27.2892 22.5 26.875 22.5H8.125C7.71079 22.5 7.375 22.1642 7.375 21.75V9.75Z" fill="#8181A5"/>
<path fill-rule="evenodd" clip-rule="evenodd" d="M23.1368 19.7109C23.1602 20.0156 23.3009 20.2734 23.5587 20.4844C23.7931 20.6719 24.0626 20.7539 24.3673 20.7305C24.672 20.707 24.9298 20.5781 25.1407 20.3438C25.3282 20.0859 25.4102 19.8047 25.3868 19.5V12.75C25.3868 12.5391 25.3399 12.3516 25.2462 12.1875C25.1524 12 25.0235 11.8594 24.8595 11.7656C24.672 11.6719 24.4727 11.625 24.2618 11.625C24.0509 11.625 23.8634 11.6719 23.6993 11.7656C23.5118 11.8594 23.3712 12 23.2774 12.1875C23.1837 12.3516 23.1368 12.5391 23.1368 12.75V19.7109ZM18.6329 19.7109C18.6563 20.0156 18.7969 20.2734 19.0547 20.4844C19.2891 20.6719 19.5587 20.7539 19.8633 20.7305C20.168 20.707 20.4258 20.5781 20.6368 20.3438C20.8243 20.0859 20.9063 19.8047 20.8829 19.5V15C20.8829 14.7891 20.836 14.6016 20.7422 14.4375C20.6485 14.25 20.5196 14.1094 20.3555 14.0156C20.168 13.9219 19.9688 13.875 19.7579 13.875C19.5469 13.875 19.3594 13.9219 19.1954 14.0156C19.0079 14.1094 18.8672 14.25 18.7735 14.4375C18.6797 14.6016 18.6329 14.7891 18.6329 15V19.7109ZM14.5508 20.4844C14.293 20.2734 14.1524 20.0156 14.1289 19.7109V16.5C14.1289 16.2891 14.1758 16.1016 14.2696 15.9375C14.3633 15.75 14.5039 15.6094 14.6914 15.5156C14.8555 15.4219 15.043 15.375 15.2539 15.375C15.4649 15.375 15.6641 15.4219 15.8516 15.5156C16.0157 15.6094 16.1446 15.75 16.2383 15.9375C16.3321 16.1016 16.3789 16.2891 16.3789 16.5V19.5C16.4024 19.8047 16.3203 20.0859 16.1328 20.3438C15.9219 20.5781 15.6641 20.707 15.3594 20.7305C15.0547 20.7539 14.7852 20.6719 14.5508 20.4844ZM9.625 19.7109C9.64847 20.0156 9.78932 20.2734 10.0475 20.4844C10.2823 20.6719 10.5523 20.7539 10.8574 20.7305C11.1626 20.707 11.4208 20.5781 11.6321 20.3438C11.8199 20.0859 11.9021 19.8047 11.8786 19.5V18C11.8786 17.7891 11.8316 17.6016 11.7377 17.4375C11.6438 17.25 11.5147 17.1094 11.3504 17.0156C11.1626 16.9219 10.9631 16.875 10.7518 16.875C10.5405 16.875 10.3527 16.9219 10.1884 17.0156C10.0006 17.1094 9.85975 17.25 9.76585 17.4375C9.67195 17.6016 9.625 17.7891 9.625 18V19.7109Z" fill="#8181A5"/>
<path d="M16.7969 27.2344C16.5391 27.0234 16.3984 26.7656 16.375 26.4609V24C16.375 23.7891 16.4219 23.6016 16.5156 23.4375C16.6094 23.25 16.75 23.1094 16.9375 23.0156C17.1016 22.9219 17.2891 22.875 17.5 22.875C17.7109 22.875 17.9102 22.9219 18.0977 23.0156C18.2617 23.1094 18.3906 23.25 18.4844 23.4375C18.5781 23.6016 18.625 23.7891 18.625 24V26.25C18.6484 26.5547 18.5664 26.8359 18.3789 27.0938C18.168 27.3281 17.9102 27.457 17.6055 27.4805C17.3008 27.5039 17.0312 27.4219 16.7969 27.2344Z" fill="#8181A5"/>
<path fill-rule="evenodd" clip-rule="evenodd" d="M17.5 25.875C16.7969 25.875 16.1406 26.0508 15.5312 26.4023C14.9219 26.7539 14.4414 27.2344 14.0898 27.8438C13.7383 28.4531 13.5625 29.1094 13.5625 29.8125C13.5625 30.5156 13.7383 31.1719 14.0898 31.7812C14.4414 32.3906 14.9219 32.8711 15.5312 33.2227C16.1406 33.5742 16.7969 33.75 17.5 33.75C18.2031 33.75 18.8594 33.5742 19.4688 33.2227C20.0781 32.8711 20.5586 32.3906 20.9102 31.7812C21.2617 31.1719 21.4375 30.5156 21.4375 29.8125C21.4375 29.1094 21.2617 28.4531 20.9102 27.8438C20.5586 27.2344 20.0781 26.7539 19.4688 26.4023C18.8594 26.0508 18.2031 25.875 17.5 25.875ZM17.5 28.1252C17.9687 28.1252 18.3672 28.2893 18.6953 28.6174C19.0234 28.9455 19.1875 29.344 19.1875 29.8127C19.1875 30.2815 19.0234 30.6799 18.6953 31.008C18.3672 31.3362 17.9687 31.5002 17.5 31.5002C17.0312 31.5002 16.6328 31.3362 16.3047 31.008C15.9766 30.6799 15.8125 30.2815 15.8125 29.8127C15.8125 29.344 15.9766 28.9455 16.3047 28.6174C16.6328 28.2893 17.0312 28.1252 17.5 28.1252Z" fill="#8181A5"/>
</svg>
