{
  "projectType": "library",
  "root": "libs/policy-management/ui/modal-attack",
  "sourceRoot": "libs/policy-management/ui/modal-attack/src",
  "prefix": "hcm-mfe",
  "targets": {
    "test": {
      "executor": "@nrwl/jest:jest",
      "outputs": ["coverage/libs/policy-management/ui/modal-attack"],
      "options": {
        "jestConfig": "libs/policy-management/ui/modal-attack/jest.config.js",
        "passWithNoTests": true
      }
    },
    "lint": {
      "executor": "@nrwl/linter:eslint",
      "options": {
        "lintFilePatterns": [
          "libs/policy-management/ui/modal-attack/src/**/*.ts",
          "libs/policy-management/ui/modal-attack/src/**/*.html"
        ]
      }
    }
  },
  "tags": ["scope:policy-management", "type:ui"]
}
