<svg width="22" height="16" viewBox="0 0 22 16" fill="none" xmlns="http://www.w3.org/2000/svg">
<path d="M7.28741 15.6858L0.314203 8.71256C-0.104734 8.29362 -0.104734 7.61436 0.314203 7.19538L1.83134 5.67821C2.25027 5.25923 2.92957 5.25923 3.34851 5.67821L8.04599 10.3756L18.1075 0.314203C18.5264 -0.104734 19.2057 -0.104734 19.6247 0.314203L21.1418 1.83138C21.5607 2.25031 21.5607 2.92957 21.1418 3.34855L8.80458 15.6858C8.3856 16.1047 7.70634 16.1047 7.28741 15.6858Z" fill="white"/>
</svg>
