{
  "projectType": "library",
  "root": "libs/self-service/feature/self-staff-info/self-edit-party-info",
  "sourceRoot": "libs/self-service/feature/self-staff-info/self-edit-party-info/src",
  "prefix": "hcm-mfe",
  "targets": {
    "test": {
      "executor": "@nrwl/jest:jest",
      "outputs": [
        "coverage/libs/self-service/feature/self-staff-info/self-edit-party-info"
      ],
      "options": {
        "jestConfig": "libs/self-service/feature/self-staff-info/self-edit-party-info/jest.config.js",
        "passWithNoTests": true
      }
    },
    "lint": {
      "executor": "@nrwl/linter:eslint",
      "options": {
        "lintFilePatterns": [
          "libs/self-service/feature/self-staff-info/self-edit-party-info/src/**/*.ts",
          "libs/self-service/feature/self-staff-info/self-edit-party-info/src/**/*.html"
        ]
      }
    }
  },
  "tags": ["scope:self-service", "type:feature"]
}
