{
  "projectType": "library",
  "root": "libs/partnership/data-access/pns-contract/common",
  "sourceRoot": "libs/partnership/data-access/pns-contract/common/src",
  "prefix": "hcm-mfe",
  "targets": {
    "test": {
      "executor": "@nrwl/jest:jest",
      "outputs": ["coverage/libs/partnership/data-access/pns-contract/common"],
      "options": {
        "jestConfig": "libs/partnership/data-access/pns-contract/common/jest.config.js",
        "passWithNoTests": true
      }
    },
    "lint": {
      "executor": "@nrwl/linter:eslint",
      "options": {
        "lintFilePatterns": [
          "libs/partnership/data-access/pns-contract/common/src/**/*.ts",
          "libs/partnership/data-access/pns-contract/common/src/**/*.html"
        ]
      }
    }
  },
  "tags": ["scope:partnership", "type:common"]
}
