{
  "projectType": "library",
  "root": "libs/goal-management/feature/setup-assessment",
  "sourceRoot": "libs/goal-management/feature/setup-assessment/src",
  "prefix": "hcm-mfe",
  "targets": {
    "test": {
      "executor": "@nrwl/jest:jest",
      "outputs": ["coverage/libs/goal-management/feature/setup-assessment"],
      "options": {
        "jestConfig": "libs/goal-management/feature/setup-assessment/jest.config.js",
        "passWithNoTests": true
      }
    },
    "lint": {
      "executor": "@nrwl/linter:eslint",
      "options": {
        "lintFilePatterns": [
          "libs/goal-management/feature/setup-assessment/src/**/*.ts",
          "libs/goal-management/feature/setup-assessment/src/**/*.html"
        ]
      }
    }
  },
  "tags": ["scope:goal-management", "type:feature"]
}
