<svg width="16" height="13" viewBox="0 0 16 13" fill="none" xmlns="http://www.w3.org/2000/svg">
<path d="M0.666748 13H15.3334L8.00008 0.333332L0.666748 13ZM8.66675 11H7.33341V9.66667H8.66675V11ZM8.66675 8.33333H7.33341V5.66667H8.66675V8.33333Z" fill="#FFC122"/>
</svg>
