{
  "projectType": "library",
  "root": "libs/shared/directives/width",
  "sourceRoot": "libs/shared/directives/width/src",
  "prefix": "hcm-mfe",
  "targets": {
    "test": {
      "executor": "@nrwl/jest:jest",
      "outputs": ["coverage/libs/shared/directives/width"],
      "options": {
        "jestConfig": "libs/shared/directives/width/jest.config.js",
        "passWithNoTests": true
      }
    },
    "lint": {
      "executor": "@nrwl/linter:eslint",
      "options": {
        "lintFilePatterns": [
          "libs/shared/directives/width/src/**/*.ts",
          "libs/shared/directives/width/src/**/*.html"
        ]
      }
    }
  },
  "tags": ["scope:shared", "type:directive"]
}
