{
  "projectType": "library",
  "root": "libs/reports/data-access/services",
  "sourceRoot": "libs/reports/data-access/services/src",
  "prefix": "hcm-mfe",
  "targets": {
    "test": {
      "executor": "@nrwl/jest:jest",
      "outputs": ["coverage/libs/reports/data-access/services"],
      "options": {
        "jestConfig": "libs/reports/data-access/services/jest.config.js",
        "passWithNoTests": true
      }
    },
    "lint": {
      "executor": "@nrwl/linter:eslint",
      "options": {
        "lintFilePatterns": [
          "libs/reports/data-access/services/src/**/*.ts",
          "libs/reports/data-access/services/src/**/*.html"
        ]
      }
    }
  },
  "tags": ["scope:reports", "type:service"]
}
