{
  "projectType": "library",
  "root": "libs/model-organization/ui/deputy-search-custom-modal",
  "sourceRoot": "libs/model-organization/ui/deputy-search-custom-modal/src",
  "prefix": "hcm-mfe",
  "targets": {
    "test": {
      "executor": "@nrwl/jest:jest",
      "outputs": [
        "coverage/libs/model-organization/ui/deputy-search-custom-modal"
      ],
      "options": {
        "jestConfig": "libs/model-organization/ui/deputy-search-custom-modal/jest.config.js",
        "passWithNoTests": true
      }
    },
    "lint": {
      "executor": "@nrwl/linter:eslint",
      "options": {
        "lintFilePatterns": [
          "libs/model-organization/ui/deputy-search-custom-modal/src/**/*.ts",
          "libs/model-organization/ui/deputy-search-custom-modal/src/**/*.html"
        ]
      }
    }
  },
  "tags": ["scope:model-organization", "type:ui"]
}
