{
  "projectType": "library",
  "root": "libs/shell/data-access/models",
  "sourceRoot": "libs/shell/data-access/models/src",
  "prefix": "hcm-mfe",
  "targets": {
    "test": {
      "executor": "@nrwl/jest:jest",
      "outputs": ["coverage/libs/shell/data-access/models"],
      "options": {
        "jestConfig": "libs/shell/data-access/models/jest.config.js",
        "passWithNoTests": true
      }
    },
    "lint": {
      "executor": "@nrwl/linter:eslint",
      "options": {
        "lintFilePatterns": [
          "libs/shell/data-access/models/src/**/*.ts",
          "libs/shell/data-access/models/src/**/*.html"
        ]
      }
    }
  },
  "tags": ["scope:shell", "type:model"]
}
