[
  {
    "id": 1,
    "type": "Standard",
    "amount": 1000,
    "currency": "EUR",
    "active": true
  },
  {
    "id": 2,
    "type": "Loyalty",
    "amount": 2000,
    "currency": "EUR",
    "active": true
  },
  {
    "id": 3,
    "type": "Loyalty",
    "amount": 3000,
    "currency": "EUR",
    "active": true
  },
  {
    "id": 4,
    "type": "Loyalty",
    "amount": 4000,
    "currency": "EUR",
    "active": true
  },
  {
    "id": 5,
    "type": "Standard",
    "amount": 5000,
    "currency": "EUR",
    "active": true
  },
  {
    "id": 6,
    "type": "Standard",
    "amount": 6000,
    "currency": "EUR",
    "active": true
  },
  {
    "id": 7,
    "type": "Standard",
    "amount": 7000,
    "currency": "EUR",
    "active": true
  },
  {
    "id": 8,
    "type": "Loyalty",
    "amount": 8000,
    "currency": "EUR",
    "active": false
  },
  {
    "id": 9,
    "type": "Loyalty",
    "amount": 9000,
    "currency": "EUR",
    "active": false
  },
  {
    "id": 10,
    "type": "Standard",
    "amount": 10000,
    "currency": "EUR",
    "active": false
  }
]