%YAML 1.1
%TAG !u! tag:unity3d.com,2011:
--- !u!1 &4886704770867889605
GameObject:
  m_ObjectHideFlags: 0
  m_CorrespondingSourceObject: {fileID: 0}
  m_PrefabInstance: {fileID: 0}
  m_PrefabAsset: {fileID: 0}
  serializedVersion: 6
  m_Component:
  - component: {fileID: 4886704770867889607}
  - component: {fileID: 4886704770867889604}
  m_Layer: 0
  m_Name: UIManager
  m_TagString: UIManager
  m_Icon: {fileID: 0}
  m_NavMeshLayer: 0
  m_StaticEditorFlags: 0
  m_IsActive: 1
--- !u!4 &4886704770867889607
Transform:
  m_ObjectHideFlags: 0
  m_CorrespondingSourceObject: {fileID: 0}
  m_PrefabInstance: {fileID: 0}
  m_PrefabAsset: {fileID: 0}
  m_GameObject: {fileID: 4886704770867889605}
  m_LocalRotation: {x: 0, y: 0, z: 0, w: 1}
  m_LocalPosition: {x: 0, y: 0, z: 0}
  m_LocalScale: {x: 1, y: 1, z: 1}
  m_Children: []
  m_Father: {fileID: 0}
  m_RootOrder: 0
  m_LocalEulerAnglesHint: {x: 0, y: 0, z: 0}
--- !u!114 &4886704770867889604
MonoBehaviour:
  m_ObjectHideFlags: 0
  m_CorrespondingSourceObject: {fileID: 0}
  m_PrefabInstance: {fileID: 0}
  m_PrefabAsset: {fileID: 0}
  m_GameObject: {fileID: 4886704770867889605}
  m_Enabled: 1
  m_EditorHideFlags: 0
  m_Script: {fileID: 11500000, guid: 3f25247cc924d1e4297db64a485076b7, type: 3}
  m_Name: 
  m_EditorClassIdentifier: 
  tutorialBoom: {fileID: 0}
  tutorialEnd: {fileID: 0}
  startScreenE: 000000000100000002000000
  playScreenE: 03000000
  pauseScreenE: 04000000
  quitScreenE: 05000000
  winScreenE: 06000000
  lossScreenE: 07000000
  hotkeys:
  - {fileID: 0}
  - {fileID: 0}
  - {fileID: 0}
  - {fileID: 0}
  - {fileID: 0}
  - {fileID: 0}
  timer: {fileID: 0}
  score: {fileID: 0}
  winRound: {fileID: 0}
  lostRound: {fileID: 0}
  heartStamina: {fileID: 0}
  gameUIElementsList:
  - {fileID: 0}
  - {fileID: 0}
  - {fileID: 0}
  - {fileID: 0}
  - {fileID: 0}
  - {fileID: 0}
  - {fileID: 0}
  - {fileID: 0}
