%YAML 1.1
%TAG !u! tag:unity3d.com,2011:
--- !u!114 &-7528550355468757210
MonoBehaviour:
  m_ObjectHideFlags: 0
  m_CorrespondingSourceObject: {fileID: 0}
  m_PrefabInstance: {fileID: 0}
  m_PrefabAsset: {fileID: 0}
  m_GameObject: {fileID: 4229509260432548098}
  m_Enabled: 1
  m_EditorHideFlags: 0
  m_Script: {fileID: 11500000, guid: 8bddfd79a49100345923660be7b0f0ee, type: 3}
  m_Name: 
  m_EditorClassIdentifier: 
  addedTime: 40
  rotationSpeed: 180
--- !u!1001 &5564383222179554568
PrefabInstance:
  m_ObjectHideFlags: 0
  serializedVersion: 2
  m_Modification:
    m_TransformParent: {fileID: 0}
    m_Modifications:
    - target: {fileID: 8613861392466396170, guid: 22cefa433b7cc4848815d39f27e55890,
        type: 3}
      propertyPath: m_Name
      value: TimePUP
      objectReference: {fileID: 0}
    - target: {fileID: 8613861392466396168, guid: 22cefa433b7cc4848815d39f27e55890,
        type: 3}
      propertyPath: m_LocalPosition.x
      value: 0
      objectReference: {fileID: 0}
    - target: {fileID: 8613861392466396168, guid: 22cefa433b7cc4848815d39f27e55890,
        type: 3}
      propertyPath: m_LocalPosition.y
      value: 0
      objectReference: {fileID: 0}
    - target: {fileID: 8613861392466396168, guid: 22cefa433b7cc4848815d39f27e55890,
        type: 3}
      propertyPath: m_LocalPosition.z
      value: 0
      objectReference: {fileID: 0}
    - target: {fileID: 8613861392466396168, guid: 22cefa433b7cc4848815d39f27e55890,
        type: 3}
      propertyPath: m_LocalRotation.x
      value: 0
      objectReference: {fileID: 0}
    - target: {fileID: 8613861392466396168, guid: 22cefa433b7cc4848815d39f27e55890,
        type: 3}
      propertyPath: m_LocalRotation.y
      value: 0
      objectReference: {fileID: 0}
    - target: {fileID: 8613861392466396168, guid: 22cefa433b7cc4848815d39f27e55890,
        type: 3}
      propertyPath: m_LocalRotation.z
      value: 0
      objectReference: {fileID: 0}
    - target: {fileID: 8613861392466396168, guid: 22cefa433b7cc4848815d39f27e55890,
        type: 3}
      propertyPath: m_LocalRotation.w
      value: 1
      objectReference: {fileID: 0}
    - target: {fileID: 8613861392466396168, guid: 22cefa433b7cc4848815d39f27e55890,
        type: 3}
      propertyPath: m_RootOrder
      value: 0
      objectReference: {fileID: 0}
    - target: {fileID: 8613861392466396168, guid: 22cefa433b7cc4848815d39f27e55890,
        type: 3}
      propertyPath: m_LocalEulerAnglesHint.x
      value: 0
      objectReference: {fileID: 0}
    - target: {fileID: 8613861392466396168, guid: 22cefa433b7cc4848815d39f27e55890,
        type: 3}
      propertyPath: m_LocalEulerAnglesHint.y
      value: 0
      objectReference: {fileID: 0}
    - target: {fileID: 8613861392466396168, guid: 22cefa433b7cc4848815d39f27e55890,
        type: 3}
      propertyPath: m_LocalEulerAnglesHint.z
      value: 0
      objectReference: {fileID: 0}
    m_RemovedComponents: []
  m_SourcePrefab: {fileID: 100100000, guid: 22cefa433b7cc4848815d39f27e55890, type: 3}
--- !u!1 &4229509260432548098 stripped
GameObject:
  m_CorrespondingSourceObject: {fileID: 8613861392466396170, guid: 22cefa433b7cc4848815d39f27e55890,
    type: 3}
  m_PrefabInstance: {fileID: 5564383222179554568}
  m_PrefabAsset: {fileID: 0}
